##TITLE=1H_Ser XLF
 200.13MHz, ,
 8 sc
 
 4.4.2025
##JCAMPDX= 6.0         $$ Bruker NMR JCAMP-DX V2.0
##DATA TYPE= NMR FID
##DATA CLASS= NTUPLES
##ORIGIN= UXNMR, Bruker Analytische Messtechnik GmbH
##OWNER= pz
$$ XWIN-NMR		Version 3.5
$$ Fri Apr  4 16:34:45 2025 Russian Standard Time (UT+4h)  she@DPX200
##.OBSERVE FREQUENCY= 200.1313
##.OBSERVE NUCLEUS= ^1H
##.DELAY= (6, 6)
##.ACQUISITION MODE= SIMULTANEOUS
##.ACQUISITION SCHEME= undefined
##.AVERAGES= 8
##.DIGITISER RES= 18
##SPECTROMETER/DATA SYSTEM= spect
##.PULSE SEQUENCE= zg30
##.SOLVENT NAME= CDCl3
##.SHIFT REFERENCE= (INTERNAL, CDCl3, 0, 14.3821)
##AUDIT TRAIL= $$ (NUMBER, WHEN, WHO, WHERE, WHAT)
$$ ##TITLE= Audit trail, XWIN-NMR		Version 3.5
$$ ##JCAMPDX= 5.01
$$ ##ORIGIN= Bruker BioSpin GmbH
$$ ##OWNER= she
$$ F:/spectra/data/she/nmr/H-C/1/audita.txt
$$ ##AUDIT TRAIL=  $$ (NUMBER, WHEN, WHO, WHERE, WHAT)
(   1,<2025-04-04 16:33:28.50 +0400>,<she>,<DPX200>,
      <created by zg, POWCHK disabled, PULCHK disabled
       configuration hash MD5:
       00 E9 B6 7A A2 85 ED C7 34 08 36 98 17 FE 4E 26
       data hash MD5: 16K
       7A C8 59 03 7B 3D 4D EA 51 C8 EE FC 13 B6 25 A9>)
$$ ##END=
$$ 
$$ hash MD5
$$ 4B 3E DB EF 22 7C 5A CB A6 54 19 BD 76 CA 7D F3
##$RELAX= 
##$RELAX= 
##$RELAX= 
##$RELAX= 
##$RELAX= 
##$RELAX= 
$$ Bruker specific parameters
$$ --------------------------
##$DU= <F:/spectra>
##$EXPNO= 1
##$NAME= <H-C>
##$PROCNO= 1
##$TYPE= <nmr>
##$USER= <she>
##$AMP= (0..31)
100 100 100 100 100 100 100 100 100 100 100 100 100 100 100 100 100 100 
100 100 100 100 100 100 100 100 100 100 100 100 100 100 
##$AQSEQ= 0
##$AQ_mod= 1
##$AUNM= <au_zg>
##$AUTOPOS= <>
##$BF1= 200.13
##$BF2= 200.13
##$BF3= 200.13
##$BF4= 200.13
##$BF5= 200.13
##$BF6= 200.13
##$BF7= 200.13
##$BF8= 200.13
##$BYTORDA= 1
##$CFDGTYP= 0
##$CFRGTYP= 5
##$CHEMSTR= <none>
##$CNST= (0..31)
1 1 145 1 1 1 1 1 1 1 1 1 1 1 1 1 1 1 1 1 1 1 1 1 1 1 1 1 1 1 1 1 
##$CPDPRG= <>
##$CPDPRG1= <>
##$CPDPRG2= <>
##$CPDPRG3= <>
##$CPDPRG4= <mlev>
##$CPDPRG5= <mlev>
##$CPDPRG6= <mlev>
##$CPDPRG7= <mlev>
##$CPDPRG8= <mlev>
##$CPDPRGB= <>
##$CPDPRGT= <>
##$D= (0..31)
0 0.7 0 0 0 0 0 0 0 0 0 0.03 0 0 0 0 0 0 0 0 0 0 0 0 0 0 0 0 0 0 0 0 
##$DATE= 1743770008
##$DBL= (0..7)
120 120 120 120 120 120 120 120 
##$DBP= (0..7)
150 150 150 150 150 150 150 150 
##$DBP07= 0
##$DBPNAM0= <>
##$DBPNAM1= <>
##$DBPNAM2= <>
##$DBPNAM3= <>
##$DBPNAM4= <>
##$DBPNAM5= <>
##$DBPNAM6= <>
##$DBPNAM7= <>
##$DBPOAL= (0..7)
0.5 0.5 0.5 0.5 0.5 0.5 0.5 0.5 
##$DBPOFFS= (0..7)
0 0 0 0 0 0 0 0 
##$DE= 6
##$DECBNUC= <off>
##$DECIM= 32
##$DECNUC= <off>
##$DECSTAT= 4
##$DIGMOD= 1
##$DIGTYP= 9
##$DL= (0..7)
0 120 120 120 120 120 120 120 
##$DP= (0..7)
150 150 150 150 150 150 150 150 
##$DP07= 0
##$DPNAME0= <>
##$DPNAME1= <>
##$DPNAME2= <>
##$DPNAME3= <>
##$DPNAME4= <>
##$DPNAME5= <>
##$DPNAME6= <>
##$DPNAME7= <>
##$DPOAL= (0..7)
0.5 0.5 0.5 0.5 0.5 0.5 0.5 0.5 
##$DPOFFS= (0..7)
0 0 0 0 0 0 0 0 
##$DQDMODE= 0
##$DR= 18
##$DS= 0
##$DSLIST= <SSSSSSSSSSSSSSS>
##$DSPFIRM= 0
$$ [...]
##$SUBNAM0= <"">
##$SUBNAM1= <"">
##$SUBNAM2= <"">
##$SUBNAM3= <"">
##$SUBNAM4= <"">
##$SUBNAM5= <"">
##$SUBNAM6= <"">
##$SUBNAM7= <"">
##$SUBNAM8= <"">
##$SUBNAM9= <"">
##$SW= 18.0517328524113
##$SWIBOX= (0..15)
0 0 2 0 0 0 0 0 0 0 0 0 0 0 0 0 
##$SW_h= 3612.71676300578
##$TD= 16384
##$TD0= 1
##$TE= 0
##$TE2= 300
##$TE3= 300
##$TEG= 300
##$TL= (0..7)
0 120 120 120 120 120 120 120 
##$TP= (0..7)
150 150 150 150 150 150 150 150 
##$TP07= 0
##$TPNAME0= <>
##$TPNAME1= <>
##$TPNAME2= <>
##$TPNAME3= <>
##$TPNAME4= <>
##$TPNAME5= <>
##$TPNAME6= <>
##$TPNAME7= <>
##$TPOAL= (0..7)
0.5 0.5 0.5 0.5 0.5 0.5 0.5 0.5 
##$TPOFFS= (0..7)
0 0 0 0 0 0 0 0 
##$TUNHIN= 0
##$TUNHOUT= 0
##$TUNXOUT= 0
##$USERA1= <user>
##$USERA2= <user>
##$USERA3= <user>
##$USERA4= <user>
##$USERA5= <user>
##$V9= 5
##$VALIST= <valist>
##$VCLIST= <CCCCCCCCCCCCCCC>
##$VD= 0
##$VDLIST= <DDDDDDDDDDDDDDD>
##$VPLIST= <PPPPPPPPPPPPPPP>
##$VTLIST= <TTTTTTTTTTTTTTT>
##$WBST= 1024
##$WBSW= 4
##$XGAIN= (0..3)
0 0 0 0 
##$XL= 0
##$YL= 0
##$YMAX_a= 363013
##$YMIN_a= -393438
##$ZGOPTNS= <>
##$ZL1= 120
##$ZL2= 120
##$ZL3= 120
##$ZL4= 120
##$ABSF1= 10
##$ABSF2= 0
##$ABSG= 5
##$ABSL= 3
##$ALPHA= 0
##$AQORDER= 0
##$ASSFAC= 0
##$ASSFACI= 0
##$ASSFACX= 0
##$ASSWID= 0
##$AUNMP= <proc_1d>
##$AZFE= 0.1
##$AZFW= 0.1
##$BCFW= 1
##$BC_mod= 2
##$BYTORDP= 1
##$COROFFS= 0
##$CY= -3
##$DATMOD= 1
##$DC= 2
##$DFILT= <>
##$DTYPP= 0
##$F1P= 0
##$F2P= 0
##$FCOR= 0.5
##$FTSIZE= 0
##$FT_mod= 4
##$GAMMA= 1
##$GB= 0.15
##$INTBC= 1
##$INTSCL= 1
##$ISEN= 128
##$LB= 0.25
##$LEV0= 0
##$LPBIN= 0
##$MAXI= 10000
##$MC2= 0
##$MEAN= 0
##$ME_mod= 0
##$MI= 1.114404
##$NCOEF= 0
##$NC_proc= 0
##$NLEV= 6
##$NOISF1= 3.799351
##$NOISF2= 2.8
##$NSP= 1
##$NTH_PI= 0
##$NZP= 0
##$OFFSET= 14.38212
##$PC= 1
##$PHC0= -986.1262
##$PHC1= 9.792211
##$PH_mod= 1
##$PKNL= yes
##$PPARMOD= 0
##$PSCAL= 0
##$PSIGN= 0
##$REVERSE= no
##$SF= 200.129724274929
##$SI= 16384
##$SIGF1= 3
##$SIGF2= 2
##$SINO= 400
##$SIOLD= 16384
##$SREGLST= <1H.CDCl3>
##$SSB= 0
##$STSI= 0
##$STSR= 0
##$SW_p= 3205.1282051282
##$SYMM= 0
##$S_DEV= 0
##$TDeff= 0
##$TDoff= 0
##$TI= <>
##$TILT= no
##$TM1= 0
##$TM2= 0
##$TOPLEV= 0
##$USERP1= <user>
##$USERP2= <user>
##$USERP3= <user>
##$USERP4= <user>
##$USERP5= <user>
##$WDW= 1
##$XDIM= 8192
##$YMAX_p= 0
##$YMIN_p= 0
$$ End of Bruker specific parameters
$$ ---------------------------------
##NTUPLES= NMR FID
##VAR_NAME=  TIME,          FID/REAL,        FID/IMAG
##SYMBOL=    X,             R,               I
##VAR_TYPE=  INDEPENDENT,   DEPENDENT,       DEPENDENT
##VAR_FORM=  AFFN,          ASDF,            ASDF
##VAR_DIM=   8192,          8192,            8192
##UNITS=     SECONDS,       ARBITRARY UNITS, ARBITRARY UNITS
##FACTOR=    0.0002768,     1,               1
##FIRST=     0,             0,               0
##LAST=      2.2672688,     0,               0
##MIN=       0,             -393438,         0
##MAX=       2.2672688,     363013,          0
$$ Real data points
##PAGE= N=1
##DATA TABLE= (X++(R..R)), XYDATA
$$ [...]
$$ plain form
2706 4710 5186 4083 1096 -1160 -4252 -4733 -5433 -3915 -922 1118 4072 4860 5348 3607 848 -1039
2722 -1039 -4240 -4922 -5103 -3489 -982 1053 4402 4888 4993 3559 1054 -1302 -4444 -4792 -5069 -3750
2738 -3750 -1057 1411 4324 4749 5267 3680 893 -1478 -4191 -4894 -5330 -3493 -795 1381 4195 4985
2754 4985 5119 3264 835 -1431 -4266 -4931 -5001 -3221 -882 1565 4345 4848 4927 3300 860 -1750 -4266
2771 -4266 -4886 -5063 -3358 -825 1751 4229 4912 5148 3325 771 -1719 -4284 -4934 -5044 -3069 -723
2787 -723 1782 4244 4951 4859 2997 734 -1885 -4297 -4858 -4708 -2982 -670 1983 4319 4904 4809 3021
2804 3021 621 -1995 -4228 -4973 -4905 -3014 -545 2075 4293 5057 4852 2900 510 -2096 -4314 -5029
2820 -5029 -4707 -2808 -466 2190 4263 4944 4618 2747 364 -2304 -4260 -4868 -4582 -2721 -290 2288
$$ packed form
2706D710M76j103k987k256l092m81p00J518K993K040K954P88M88j741k759j887
2722a039l201o82j81J614K507K035L349M86J05j434k505k356l142l48k77J319
2738c750K693K468K913M25N18j587k787k371k713p03m36J837K698K176K814P90
2754D985J34j855k429k266k835o65p0J780K339K447K780N03P9j627k440k610k516
2771d266o20j77J705K533K576K478O83K36j823k554k490k565o50j10J975K346
2787g23K505K462P07r2j862k263k619k412n61J50J726K312K653K336N85r5j788
2804C021k400k616k233p45O8J891K469K620K218P64k05j952k390k606k218p15
2820e029L22J899K342K656K073O81l26j871k383k668j956o08K86J861K431K578
$$ plain form
2836 2288 4238 4934 4524 2693 284 -2345 -4331 -4986 -4554 -2740 -290 2378 4326 4991 4529 2563
2852 2563 208 -2431 -4333 -4978 -4340 -2499 -63 2443 4275 4874 4304 2351 -59 -2479 -4309 -4887
2868 -4887 -4157 -2401 140 2578 4343 4890 4246 2383 -119 -2608 -4360 -4979 -4228 -2357 189 2699
2884 2699 4400 4913 4126 2179 -271 -2677 -4395 -4781 -3997 -2041 319 2704 4317 4726 3922 2019
2900 2019 -398 -2730 -4342 -4742 -3933 -1975 449 2808 4418 4781 3953 2039 -433 -2817 -4417 -4678
2916 -4678 -3831 -1942 551 2944 4365 4662 3787 1780 -593 -2853 -4345 -4570 -3692 -1691 718 2977
2932 2977 4298 4540 3553 1610 -688 -3008 -4373 -4530 -3584 -1524 796 3050 4317 4539 3533 1460
2948 1460 -826 -3142 -4282 -4466 -3498 -1434 870 3160 4343 4431 3364 1303 -974 -3070 -4200 -4347
$$ packed form
2836B288J950O96m10j831k409k629j986o55M32J814K450K668J948O65m62j966
2852B563k355k639j902o45O38J841K436K506J832N99n70j953k410k420j830n78
2868d887P30J756K541K438J765N47o44j863k502k489j752o19P51J871K546K510
2884B699J701N13p87j947k450k406j718l86P84J956K360K385J613M09q04j903
2900B019k417k332j612m00Q09J958K424K359J610L63q28j914k472k384j600k61
2916d678Q47J889K493K393J421K97q75k007k373k260j492k25Q78K001K409K259
2932B977J321K42r87j943k298k320j365j57R46K060K320K254J267K22j006k073
2948A460k286k316j140j84R68K064K304K290J183Q8j067k061k277k096j130j47
$$ plain form
2964 -4347 -3294 -1222 974 3138 4127 4257 3086 1032 -1017 -3196 -4179 -4288 -3114 -1118 1079 3229
2980 3229 4195 4325 3107 1048 -1080 -3313 -4091 -4253 -3003 -901 1218 3324 4055 4171 2865 756
2996 756 -1196 -3221 -3991 -4039 -2684 -702 1213 3341 3909 4066 2575 692 -1288 -3376 -3994 -3914 -2596
3013 -2596 -681 1369 3462 3853 4007 2592 642 -1450 -3428 -3806 -3948 -2522 -493 1488 3261 3814
3029 3814 3913 2235 386 -1432 -3395 -3749 -3747 -2132 -413 1427 3387 3675 3661 1981 464 -1565 -3428
3046 -3428 -3614 -3686 -2046 -417 1711 3352 3502 3714 2025 233 -1742 -3256 -3499 -3735 -1875 -115 1657
3063 1657 3141 3423 3556 1601 154 -1607 -3289 -3494 -3331 -1506 -269 1782 3313 3274 3229 1526 295
3080 295 -1900 -3295 -3185 -3342 -1582 -124 1929 3102 3186 3375 1412 -28 -1857 -3018 -3274 -3284 -1120
$$ packed form
2964d347J053K072K196K164R89J30j171k054k049k179r83j09J174J996K197K150
2980C229R66J30j218k059k128k233p78j62J250K102K119K106P31J16j306k109
2996G56j952k025p70m8J355J982J915K128N68J57j491j883j980k088o18Q0J318
3013b596J915K050K093L91J54j415j950k092j978l78j42J426K029J981J773N53
3029C814R9j678j849j818j963l54KJ615J719J840J960K88j4j680j517k029j863
3046c428j86p2J640J629K128J641J50K12j689j792j975j514k43k36J860J760J772
3063A657J484K82J33j955j447j761j682k05J63J825J237K051J531l9m5j703j231
3080B95k195j395J10j57J760J458K053J173Q4J89j963j440j829j161k56j0K164
$$ plain form
3097 -1120 60 1781 3047 3249 3043 1014 81 -1816 -3057 -3155 -2846 -1057 -84 2012 3071 2924 2855
3114 2855 1181 -44 -2183 -2874 -2878 -2995 -1033 187 2059 2765 2971 2896 924 -148 -1935 -2734 -3025 -2727
3132 -2727 -751 62 1914 2758 2862 2442 669 -32 -2029 -2724 -2704 -2309 -843 33 2130 2607 2599 2419 879
3151 879 -231 -2139 -2521 -2672 -2508 -713 287 1967 2407 2794 2338 555 -274 -1891 -2438 -2701 -2021 -432
3169 -432 139 1929 2413 2540 1963 613 -207 -2031 -2318 -2367 -1922 -635 299 2008 2132 2364 2024 578
3187 578 -388 -1910 -2072 -2502 -1994 -448 358 1729 2066 2457 1767 385 -246 -1767 -2067 -2306 -1554 -429
3205 -429 289 1815 1975 2114 1479 520 -319 -1813 -1822 -2119 -1598 -530 433 1762 1829 2151 1626 419 -422
3224 -422 -1604 -1788 -2188 -1513 -425 379 1548 1869 2122 1353 404 -312 -1549 -1819 -1979 -1237 -459 312 1551
$$ packed form
3097a120J180J721J266K02k06k029r33j897j241r8L09J789R73K096J059j47o9
3114B855j674j225k139o91mj17J962J220J872P06K06p5j972j072j787p99k91K98
3132b727J976Q13J852Q44J04m20j773p01j997o95K0L95J466Q76K097M77qj80j540
3151H79j110j908l82j51J64J795J000J680M40L87m56j783q29j617n47k63O80J589
3169d32N71J790M84J27n77j350q20j824k87m9M45J287R34J709J24K32l40j446
3187E78r66j522j62m30N08J546Q06J371L37L91o90j382o31j521l00k39P52J125
3205d29P18J526J60J39o35r59q39j494rk97N21J068R63J329O7L22n25j207q41
3224d22j182j84m00O75J088Q04J169L21K53p69r49p16j237k70j60P42P78P71J239
$$ plain form
3243 1551 1653 1845 1212 500 -437 -1511 -1553 -1887 -1384 -396 444 1412 1525 1846 1228 433 -380 -1357 -1642 -1799
3263 -1799 -1107 -400 364 1291 1530 1658 1098 449 -297 -1296 -1445 -1603 -1077 -469 372 1230 1416 1540 1062 431
3283 431 -392 -1141 -1372 -1601 -1089 -402 367 1055 1389 1607 1039 342 -287 -1048 -1364 -1526 -1046 -451 316 989
3303 989 1284 1375 1005 480 -217 -979 -1236 -1344 -1021 -485 225 947 1201 1335 938 445 -257 -877 -1162 -1338
3323 -1338 -1047 -491 170 808 1191 1318 959 470 -135 -800 -1100 -1260 -975 -455 117 760 1098 1218 937 499
3343 499 -124 -701 -1068 -1157 -934 -510 147 686 1034 1192 942 523 -110 -650 -978 -1198 -946 -517 -10 654
3363 654 1007 1124 972 615 0 -554 -980 -1098 -963 -576 -56 522 929 1023 918 632 76 -514 -863 -1116
3383 -1116 -911 -609 -120 456 844 1006 991 686 59 -455 -833 -1043 -995 -616 -159 450 853 1045 1014 717 144
$$ packed form
3243A551J02J92o33p12r37j074m2l34N03R88Q40R68J13L21o18p95q13r77k85j57
3263a799O92P07P64R27K39J28n60o49p46r99j49j58N26O08Q41Q58J86J24m78o31
3283D31q23p49k31k29N12O87P69O88L34K18n68o97o29p61l16j62M80N95P67O73
3303I89K95R1l70n25o97p62k57j08L23N36P10P22K54J34l97m93p02o20k85j76
3323a338K91N56O61O38L83J27l59m89o05o65l00j60K85N20N72O43L38J20k81m38
3343D99o23n77l67q9K23M24O57N39L48J58k50m19o33n40l28k20K52M29N07O64
3363F54L53J17j52l57o15n54m26j18J35L87N20N78M07R4j05k86n56n90l49k53
3383a116K05L02M89N76L88J62j5l05o27n14l78k10M8L79M57O09M03J92l1k97n73
$$ plain form
3404 144 -402 -799 -1042 -984 -740 -170 388 777 1014 972 624 218 -295 -742 -1025 -1030 -730 -230 347 747 1035
3425 1035 958 748 221 -309 -762 -1063 -1012 -759 -249 294 784 1022 1059 782 329 -286 -688 -986 -999 -770 -324
3446 -324 252 715 1009 1055 832 348 -184 -719 -994 -1024 -786 -349 161 696 1089 1094 931 367 -189 -688 -1048
3467 -1048 -1098 -879 -349 190 705 1063 1064 846 397 -162 -718 -1009 -1092 -924 -419 174 660 1060 1077 929 414
3488 414 -123 -698 -1008 -1080 -979 -438 98 678 1079 1116 979 392 -142 -690 -1104 -1106 -972 -413 128 714 1129
3509 1129 1129 1072 475 -54 -690 -1104 -1101 -1035 -450 148 651 1029 1102 997 446 -75 -638 -1079 -1103 -1037 -440 78 731
3532 731 1100 1153 964 463 -45 -697 -1107 -1231 -983 -431 16 767 1108 1162 1068 501 -39 -682 -1009 -1157 -1098
3553 -1098 -482 6 726 1092 1153 1091 443 26 -661 -1098 -1170 -1073 -431 -48 731 1146 1158 1054 459 35 -762
$$ packed form
3404A44n46l97k43N8K44N70N58L89K37m2l48m06n13m47k83nL00N00N77M00K88
3425A035p7k10n27n30m53l01N1K53N10N43M90K38L7k77m53o15m02k98j3K29M46
3446c24N76M63K94M6k23m84n32n35k75l0K38M37N10N35L93Nj63n64n56m99l60
3467a048n0K19N30N39N15L58Jk18m49n59n56k91q3J68N05N93M86M00J7j48n15
3488D14n37n75l10p2J01N41N36N80M01L7j37n87n34n48m14kJ34N59N41N86M15
3509A129%n7n97n29o36m14LO6N85N98N03L78P3j05n51n21n63m41k4O6N97N18O53
3532G31L69N3j89n01n08o52m10j24K48N52M47P51L41N4r4n67n40o43l27j48N9
3553a098O16M88P20L66O1o2o48m17o87m37p2R7O42L83P79M15J2j04n95m24p97
$$ plain form
3574 -762 -1162 -1209 -1121 -514 50 759 1072 1196 1098 494 -25 -782 -1083 -1250 -1072 -467 -25 751 1083 1191 1116
3595 1116 509 44 -753 -1119 -1247 -1081 -480 -12 807 1114 1198 1076 465 54 -904 -1036 -1228 -1137 -482 -14
3615 -14 818 1007 1252 1159 496 -24 -751 -1024 -1263 -1099 -437 -62 740 1026 1250 1065 436 60 -788 -1111 -1212
3636 -1212 -1031 -499 -61 796 1067 1260 1075 562 23 -814 -1056 -1195 -1210 -519 25 738 966 1338 1074 484
3656 484 22 -757 -976 -1303 -1066 -470 -106 782 1111 1288 1023 547 103 -836 -1079 -1276 -1038 -576 -10 813
3676 813 1012 1249 1102 567 49 -790 -980 -1314 -1134 -538 -38 740 1012 1309 1029 464 87 -707 -1051 -1331
3696 -1331 -1023 -480 -160 751 1042 1261 1026 627 89 -795 -1014 -1294 -1063 -659 -23 781 1037 1278 1082 591
3716 591 39 -704 -968 -1353 -1129 -569 -132 694 971 1337 1053 643 124 -677 -1058 -1351 -1059 -736 -66 663
$$ packed form
3574g62m00m7Q8O07N64P09L13J24r8o04n19p57l01j67J78O05M42P76L32J08p5
3595A116o07m65p97l66j28J66O01M68Q19L07Q4j22o11m11r58j32j92R1O55M68
3615a4Q32J89K45r3o63n20p27k73k39J64O62L75Q02K86K24j85o29l76q48l23j01
3636a212J81N32M38Q57K71J93j85n13n39q37k42j39j5O91N44P13K28L72k64n90
3656D84m62p79k19l27K37N96L64Q88L29J77k65m76m44r39k43j97K38M62N66Q23
3676H13J99K37j47n35n18q39j90l34J80N96N00P78K72K97k80n65l77p94l44k80
3696a331L08N43L20R11K91K19k35l99n38q84k19k80K31M04O36Q04K56K41j96m91
3716E91n52p43k64l85K24N60M37Q26K77L66k84m10n19q01l81k93K92L23O70P29
$$ plain form
3736 663 1044 1295 1052 662 59 -690 -1012 -1298 -1171 -646 -51 711 956 1327 1130 632 54 -674 -993 -1393
3756 -1393 -1093 -657 -136 615 981 1336 1147 671 101 -648 -1051 -1375 -1181 -755 -91 653 1034 1353 1190 784
3776 784 30 -653 -1077 -1366 -1149 -770 -33 624 1019 1396 1130 778 194 -576 -1066 -1393 -1145 -748 -173 641
3796 641 1117 1315 1181 809 131 -625 -1047 -1392 -1159 -851 -98 661 1064 1404 1166 842 137 -635 -1162 -1478
3816 -1478 -1260 -827 -134 638 1091 1443 1206 827 118 -662 -1088 -1428 -1219 -821 -94 632 1135 1397 1278 787
3836 787 162 -592 -1191 -1462 -1312 -789 -170 662 1188 1567 1308 825 128 -673 -1194 -1552 -1302 -849 -201 682
3856 682 1235 1594 1334 819 74 -599 -1250 -1499 -1303 -859 -113 656 1269 1531 1413 879 126 -652 -1286 -1589
3876 -1589 -1369 -849 -170 728 1298 1605 1394 882 83 -700 -1342 -1612 -1414 -920 -43 760 1368 1598 1553 946
$$ packed form
3736F63L81K51k43l90o03p49l22k86J27N25N95P62K45L71j97m98n78p28l19m00
3756a393L00M36N21P51L66L55j89m76n70p49m03l24J94M26O64P44L81L19j63m06
3776G84p54o83m24k89K17L79P37O57L95L77k66l52n84p70m90l27K48L97N75Q14
3796F41M76J98j34l72o78p56m22l45K33L08P53P59M03L40k38l24p05p72n27l16
3816a478K18M33O93P72M53L52k37l79p09p80m26l40K09L98P27P26N03K62j19m91
3836G87o25p54n99k71J50N23O19Q32N26L79k59m83o97q01n21l58K50M53O48Q83
3856F82N53L59k60n15p45o73o51k49J96M44P46P69O13K62j18n34p53p78o34l03
3876a589K20N20O79Q98N70L07k11n12p99p83o42k70J98M94Q77Q03O08K30m5o07
$$ plain form
3896 946 111 -723 -1325 -1621 -1445 -870 -101 757 1327 1658 1430 874 68 -771 -1427 -1677 -1511 -939 -21 791
3916 791 1465 1743 1524 844 82 -891 -1484 -1740 -1479 -937 -44 831 1451 1718 1545 932 77 -844 -1475 -1741
3936 -1741 -1524 -914 -6 906 1519 1816 1568 908 8 -917 -1515 -1790 -1580 -953 105 920 1572 1817 1484
3955 1484 905 -43 -1006 -1535 -1871 -1558 -895 24 985 1582 1857 1570 841 -121 -983 -1658 -1853 -1526 -874 118
3975 118 1038 1697 1862 1575 884 -164 -1091 -1715 -1916 -1607 -873 218 1069 1793 1978 1543 842 -209 -1081
3994 -1081 -1823 -1967 -1610 -827 196 1100 1830 1891 1563 780 -288 -1144 -1798 -1924 -1574 -823 251 1157 1863
4013 1863 1953 1543 775 -377 -1318 -1913 -1988 -1538 -787 458 1277 1987 2053 1565 734 -395 -1230 -1920 -2004 -1544
4033 -1544 -755 364 1308 1970 1951 1478 706 -447 -1312 -2050 -1958 -1559 -705 545 1357 2070 1952 1572 630
$$ packed form
3896I46q35q34o02k96J76N75P69Q58N70L31k28n56q06q39o56k50J66N72R18Q12
3916G91O74K78k19o80p62r73n93k56K61N42Q93Q75O20K67j73o13q55r21o31k66
3936a741K17O10R08R12O13K97k48o60r00r25n98k75K10O27J058Q15O52K45l33
3955A484n79r48r63n29l36L13O63R19R61N97K75k87p29r62q62o75j95L27O52R92
3975A18R20O59J65k87o91j048r27o24k01L09P34J091Q51P24J85m35p01j051q72
3994a081p42j44L57P83J023R04P30O1l28p83j068q56o54j26L50P51J074R06P06
4013A863R0m10p68j152r41n95p5M50P51J245Q19P10O6m88q31j129q35o90q4M60
4033a544P89J119R44O62j9m73p72j153q65p38R2L99Q54J250Q12P13j18l80r42
$$ plain form
4052 630 -598 -1407 -2114 -2000 -1566 -561 622 1396 2141 2058 1505 523 -588 -1347 -2216 -1960 -1477 -464 595
4071 595 1364 2187 1940 1486 544 -713 -1481 -2274 -1903 -1493 -439 756 1537 2225 1920 1554 337 -779
4089 -779 -1542 -2292 -2014 -1430 -344 733 1545 2315 1978 1427 251 -822 -1618 -2306 -1920 -1351 -346 774
4107 774 1636 2308 1864 1445 295 -918 -1731 -2235 -1849 -1446 -159 976 1663 2237 1880 1478 126 -973
4125 -973 -1655 -2347 -1853 -1384 -31 974 1677 2391 1769 1339 102 -921 -1785 -2337 -1721 -1317 -59 964
4143 964 1876 2256 1685 1354 27 -1098 -1779 -2210 -1810 -1294 134 1096 1834 2230 1788 1261 -212 -1050 -1887
4162 -1887 -2357 -1687 -1156 192 1063 1955 2338 1677 1183 -251 -1117 -2035 -2285 -1624 -1190 196 1110 1974 2172
4181 2172 1634 1201 -332 -1243 -1929 -2202 -1720 -1061 467 1168 1970 2245 1699 979 -418 -1142 -2002 -2253 -1548
$$ packed form
4052F30j228q09p07J14M34J005J183P74P45q3n53r82j111p59q69K56M83J013J059
4071E95P69Q23k47m54r42j257p68p93L71M10J054J195P81O88l05l66j217j116
4089g79p63p50K78N84J086J077Q12P70l37n51j176j073p96o88L86N69J005J120
4107G74Q62O72m44m19j150j213q13n04L86M03J287J135O87N74l57m02j352j099
4125i73o82o92M94M69J353J005P03P14o22m30j237j023q64n52O16M04J258J023
4143I64R12L80n71l31j327j125o81m31M00N16J428R62P38L96m42n27j473q38q37
4162a887m70O70N31J348Q71Q92L83o61m94j434q66r18k50O61M34J386R14Q64J98
4181B172n38m33j533r11o86k73M82O59J528P01Q02K75n46p20j397p24q60k51P05
$$ plain form
4200 -1548 -944 434 1147 2051 2184 1498 983 -429 -1272 -2097 -2085 -1517 -999 505 1224 2057 2058 1562 897 -617
4220 -617 -1298 -2027 -2076 -1555 -751 625 1285 2122 2176 1453 705 -613 -1238 -2193 -2031 -1429 -718 583 1346 2160
4240 2160 1972 1416 785 -677 -1401 -2128 -1841 -1411 -666 653 1325 2089 1947 1422 563 -751 -1387 -2098 -1968
4259 -1968 -1423 -459 770 1320 2177 2006 1321 417 -758 -1420 -2113 -1813 -1298 -480 799 1474 2129 1806 1306
4278 1306 414 -804 -1451 -1980 -1805 -1280 -342 849 1454 2024 1774 1290 286 -832 -1456 -2043 -1867 -1237
4296 -1237 -230 846 1514 2083 1749 1178 208 -870 -1516 -2042 -1655 -1218 -213 845 1512 1941 1644 1123
4314 1123 152 -892 -1515 -1969 -1659 -1100 -78 943 1540 2001 1677 1045 20 -957 -1564 -1951 -1635 -984
4332 -984 4 930 1560 1903 1556 919 -26 -964 -1599 -1840 -1579 -961 30 953 1554 1853 1497 865 -63 -987
$$ packed form
4200a548O04J378P13R04J33o86n15j412q43q25J2N68N18J504P19Q33Jm96o65j514
4220f17o81p29m9N21Q04J376O60Q37N4p23p48j318o25r55J62O02P11J301P63Q14
4240B160j88n56o31j462p24p27K87M30P45J319O72P64j42n25q59j314o36p11J30
4259a968N45R64J229N50Q57j71o85r04j175o62o93L00N15Q18J279O75O55l23n00
4278A306q92j218o47n29J75N25R38J191O05N70k50m84j004j118o24n87J76O30
4296a237J007J076O68N69l34n71r70j078o46n26L87M37J005J058O67M29k97n21
4314A123r71j044o23m54L10N59J022J021N97M61l24o32j025r77o07l87L16O51
4332i84R88R26O30L43l47o37r45r38o35k41K61O18R91R23O01K99l56o32r28r24
$$ plain form
4352 -987 -1513 -1809 -1539 -938 98 965 1599 1807 1462 810 -94 -1055 -1543 -1836 -1430 -793 106 1024 1581 1775
4372 1775 1377 788 -174 -1008 -1536 -1683 -1364 -718 129 955 1512 1660 1355 724 -157 -1008 -1522 -1695 -1295 -650
4392 -650 200 1019 1603 1643 1324 628 -284 -1047 -1498 -1653 -1256 -566 302 1005 1512 1642 1270 572 -306 -1047
4412 -1047 -1479 -1560 -1174 -542 231 1026 1460 1517 1236 570 -296 -972 -1492 -1524 -1117 -449 342 1054 1438 1554 1149
4433 1149 475 -354 -1097 -1489 -1467 -1085 -433 316 1064 1456 1440 1122 445 -325 -960 -1360 -1400 -1037 -479 337 1049
4454 1049 1357 1384 1041 408 -360 -1017 -1381 -1366 -982 -450 356 1010 1333 1379 986 386 -406 -998 -1340 -1378 -952
4475 -952 -337 362 951 1342 1340 908 285 -412 -977 -1357 -1298 -898 -361 424 934 1299 1278 860 295 -402 -977
4496 -977 -1337 -1226 -910 -240 396 974 1280 1203 835 251 -387 -920 -1239 -1213 -871 -210 433 869 1308 1149 786
$$ packed form
4352i87n26k96K70O01J036Q67O34K08l45o52r04r61m88k93M06O37Q99R18N57J94
4372A775l98n89r62q34n28j47L19O46Q47Q26N57J48l05o31q81q51n14j73M00O45
4392f50Q50Q19N84M0l19o96r12p63m51j55L97O90Q68P03N07J30l72o98q78p41
4412a047m32q1L86O32P73P95M34N7k81o66q66o76n20l2M07O68P91P12L84J16m05
4433A149o74q29p43l92K2L82O52P49P48L92j6l18o77p70o35m00m0L63N58Q16P12
4454A049L08K7l43o33p68o57l64J5L84N32Q06O54L23M6l93o00p92n92l42l8M26
4475i52O15O99N89L91km32o23o97n65l80N9M00N37P85N10L65k1m18n65o97n75
4496i77l60J11L16O70O36N78L06p7l68n84o38n33l19K6L42O61O43M36M39j59l63
$$ plain form
4517 786 259 -423 -918 -1259 -1207 -855 -275 409 894 1344 1178 866 287 -421 -892 -1240 -1167 -813 -247 510 871
4538 871 1201 1106 771 199 -458 -868 -1246 -1080 -776 -228 420 829 1246 1094 778 225 -389 -865 -1166 -1055
4558 -1055 -767 -235 409 834 1202 1090 739 265 -418 -812 -1154 -1058 -796 -168 400 829 1214 1032 754 191
4578 191 -373 -867 -1152 -1049 -785 -193 370 842 1179 949 804 239 -427 -795 -1162 -975 -817 -219 448 844
4598 844 1152 1039 767 150 -438 -768 -1138 -961 -766 -109 389 804 1179 959 742 163 -297 -812 -1176 -977
4618 -977 -755 -197 332 829 1118 913 769 205 -348 -755 -1059 -931 -865 -196 424 749 1145 922 838 123 -350
4639 -350 -788 -1110 -943 -717 -136 309 779 1177 904 763 173 -248 -850 -1104 -926 -803 -170 331 767 1092
4659 1092 966 814 152 -379 -790 -1091 -892 -814 -34 293 780 1150 1013 784 60 -362 -859 -1146 -951 -782
$$ packed form
4517G86n27o82m95l41N2L52N80O84M85M50j66l12n79p08m71l48P3L54N66P57L61
4538H71L30r5l35n72o57m10l78J66L04N48O48M09M17j52l16n53o14m76l01J11
4558a055K88N32O44M25L68j12l51m74o83l94l42R6K62O28N68M29L85j82k78n63
4578A91n64m94k85J03K64N92N63M72L37k30j45n65o66l68l67J87J58N98O67L96
4598H44L08j13k72o17n88l30l70J77J95O57M98M15L75k20k17n79m60n15l64J99
4618i77K22N58N29M97K89k05j44n64n53m07l04J28O6O69O20L25L96k23q4p15m73
4639c50m38l22J67K26N81M45M70L98k73j41n90m21o02k54J78J23O33N01M36L25
4659A092j26j52o62n31m11l01J99P8P80L27M87L70j37k29p24m22m97k87J95J69
$$ plain form
4679 -782 -83 334 846 1172 929 744 157 -287 -914 -1042 -915 -819 -112 401 852 1063 938 779 81 -373
4699 -373 -839 -1070 -970 -824 -13 333 833 1128 946 773 86 -289 -923 -1172 -953 -770 -131 312 921 1154
4719 1154 950 785 71 -415 -914 -1044 -924 -767 -102 344 882 1069 968 743 15 -360 -895 -1140 -956 -725
4739 -725 21 362 966 1102 902 705 60 -316 -1007 -1169 -995 -698 -30 405 981 1095 975 660 29 -389
4759 -389 -965 -1031 -1041 -658 63 434 1003 1137 1016 692 -19 -445 -978 -1058 -966 -620 7 394 1050 1122 957 636
4781 636 29 -458 -994 -1068 -919 -687 -17 534 1020 1060 1020 654 -6 -474 -1008 -1102 -967 -685 3 521 1023
4802 1023 1138 1012 574 -67 -492 -1048 -1154 -1000 -549 4 523 1080 1117 1004 584 -7 -526 -1070 -1065 -998 -528
4823 -528 88 574 1069 1064 980 551 -108 -553 -1078 -1085 -1005 -508 92 595 1089 1140 1022 496 -150 -600 -1101 -1100 -910
$$ packed form
4679g82O99M17N12L26k43j85n87m44o27j28J27R6P07N13M51K11j25j59o98m54
4699c73m66k31J00J46Q11L46N00K95j82j73o87l75o34k49K19J83O39M43O09K33
4719A154k04j65p14m86m99j30J20J57O65M46N38J87j01k25p28l75n35k45J84K31
4739g25P46L41O04J36k00j97o45l76o91j62J74K97O68M35N76J14j20l15o31m18
4759c89n76o6j0L83P21L71N69J34j21l24p11m26n33q0R2L46O27L87O56P2j65l21
4781F36o07m87n36p4J49K32O70N51M86M0m0l66o60m68n34r4J35K82O88N18N02
4802A023J15j26m38o41m25n56j06J54M51N53N19N57L7j13m20n91n19n44NO7M70
4823e28O16M86M95nq4m29o59m45n25pQ0M97O00N03M94N1j18n26o46m50n01JJ90
$$ plain form
4846 -910 -465 178 662 1147 1122 930 451 -172 -654 -1071 -1066 -889 -475 136 680 1109 1088 943 420 -127 -715
4867 -715 -1100 -1110 -947 -413 216 699 1062 1126 918 368 -236 -745 -1122 -1086 -888 -307 237 766 1121 1108 818
4888 818 350 -259 -687 -1114 -1173 -849 -317 219 807 1116 1091 907 302 -299 -773 -1067 -1046 -769 -274 281 810
4909 810 1079 1076 846 255 -343 -784 -1141 -1094 -771 -223 367 847 1111 1034 752 189 -367 -834 -1064 -1044 -726 -216
4931 -216 383 821 1063 1069 713 189 -333 -791 -1052 -1010 -663 -142 368 861 1078 957 666 156 -428 -914 -1079
4952 -1079 -934 -626 -92 390 839 1031 985 633 83 -472 -880 -1075 -960 -615 -78 452 854 1017 898 586
4972 586 35 -473 -903 -1086 -911 -578 -52 510 932 1087 983 558 31 -528 -854 -977 -912 -501 -7 499
4992 499 896 983 849 541 52 -477 -838 -1014 -854 -548 -51 449 853 989 846 432 -8 -495 -874 -1019
$$ packed form
4846i10M45O43M84M85k5j92m79o23m82m17NJ77M14O11N44M29k1j45n23n47n88
4867g15l85j0J63N34O29M83L63O4k08n50o04n09l77L6J98N81N44N29L55j3k90
4888H18m68o09m28m27n9L24N32N36N88L09k5j84o05o01m74k94K1K77M95N55N29
4909H10K69lk30n91n98m41l57M7L23N48N90M80K64p7k82n63n56m67k30K0L18N10
4931b16N99M38K42Ol56n24n22m58k61M2L47N21N10M93K17j21k91n10n84m86j65
4952a079J45L08N34M82M49J92m6l52n50n55m08j95J15L45N37N30M02J63j19l12
4972E86n51n08m30j83J75L33N26N62M22J55j04m25n27n59l26j23O5M11M94N06
4992D99L97Q7j34l08m89n29l61j76J60L06M97N00M04J36j43m14m40m87l79j45
$$ plain form
5012 -1019 -805 -438 64 505 829 918 797 415 -92 -505 -828 -902 -778 -460 76 491 766 935 804 380
5032 380 -77 -511 -835 -922 -769 -382 166 452 845 876 723 391 -179 -523 -842 -904 -728 -334 122 545 785
5053 785 800 692 346 -71 -453 -826 -830 -681 -297 151 516 836 781 643 343 -118 -505 -765 -734 -617 -311 145
5075 145 434 781 772 574 273 -163 -440 -812 -693 -662 -213 165 472 724 671 579 204 -169 -481 -800 -710 -561
5097 -561 -217 147 445 691 615 634 224 -149 -500 -699 -650 -578 -183 161 425 681 597 594 177 -171 -404 -721
5119 -721 -610 -555 -136 93 397 635 677 512 124 -118 -471 -645 -571 -458 -187 142 398 596 584 493 143 -161
5141 -161 -372 -540 -508 -477 -147 144 344 582 536 484 136 -111 -428 -551 -484 -519 -99 89 397 582 539 465 126
5164 126 -91 -334 -530 -462 -473 -140 53 351 498 427 469 138 3 -307 -446 -500 -402 -156 -26 278 418 519
$$ packed form
5012a019K14L67N02M41L24Q9j21l82n07m13l23p4J24L18N36M15K75J69j31m24
5032C80m57m34l24q7J53L87N48K86L93L1j53l32n70l44l19o2J76L94M56M23K40
5053G85J5j08l46m17l82l73mJ49L84M48L65L20n5j38l00m61l87k60L1J17L06M56
5075A45K89L47rj98l01m36k77l72J19L1M49L78L07K52n3r2l75l73l12l19R0J49
5097e61L44L64K98K46p6J9m10l73l51j99M9P2L95L44K64K56q4lm17l48k33l17
5119g21J11N5M19K29L04K38M2j65l88k42l53j74P4J13K71L29K56J98j2r1l50l04
5141a61k11j68L2L1L30K91K00K38m6n2l48k47l17j23O7l5M20J88L08J85m3p4l39
5164A26k17k43j96O8j1L33J93K98J47p1M2l31j35l10j39n4R8K46J30L04J40J01
$$ plain form
5186 519 413 96 -28 -283 -479 -398 -399 -128 8 286 438 405 469 220 11 -262 -417 -401 -428 -201 0 196
5208 196 447 395 408 238 37 -229 -383 -400 -454 -235 -60 191 378 441 457 202 83 -189 -363 -383 -394 -261 -94
5231 -94 224 357 325 441 222 56 -143 -348 -399 -443 -199 -119 149 326 420 478 243 165 -167 -328 -415 -415 -286 -184
5255 -184 149 325 396 410 312 160 -152 -327 -319 -499 -289 -214 142 290 393 513 386 188 -61 -285 -427 -491
5277 -491 -287 -145 47 260 439 463 346 272 -96 -307 -437 -497 -374 -253 63 264 419 551 364 209 -63
5298 -63 -305 -462 -534 -412 -283 60 222 453 504 355 254 -75 -245 -514 -563 -518 -319 2 246 477 610 505
5320 505 294 -1 -272 -482 -564 -475 -311 24 321 443 604 450 321 -34 -258 -512 -612 -499 -300 -22 292
5341 292 536 636 513 371 40 -301 -490 -598 -516 -357 -5 300 532 686 583 389 -15 -301 -562 -671
$$ packed form
5186E19j06l17j24k55j96Q1jK71J36K78J52l3O4k49k09k73j55J6k7K27K01J96
5208A96K51n2J3j70k01k66j54j7n4K19J75K51J87O3J6k55j19k72j74k0j1J33J67
5231i4L18J33l2J16k19j66j99k05n1m4K44Q0K68J77R4N8k35p8l32j61q7%J29J02
5255a84L33J76P1J4r8j52l12j75Qj80K10P5L56J48J03J20j27j98k49k24j42o4
5277d91K04J42J92K13J79K4j17p4l68k11j30o0J23J21L16K01J55J32j87j55k72
5298f3k42j57p2J22J29L43J62K31N1j49j01l29j70k69m9M5J99L21K44K31J33j05
5320E05k11k95k71k10q2Q9J64L35K97J22J61j54j29l55k24k54j00J13J99K78L14
5341B92K44J00j23j42l31l41j89j08Q2J59L52L05K32J54j03j94m04k86k61j09
$$ plain form
5361 -671 -621 -364 -6 310 623 722 577 342 20 -313 -616 -649 -583 -390 33 314 613 665 610 403 -8 -364
5383 -364 -672 -770 -590 -443 51 377 686 722 685 383 24 -352 -675 -784 -599 -369 28 403 734 782 670
5404 670 336 -26 -447 -716 -774 -643 -406 21 419 731 816 706 420 -48 -404 -718 -855 -703 -420 121 453
5425 453 746 848 701 408 -108 -468 -778 -892 -729 -314 20 485 786 858 719 344 -187 -492 -858 -861 -807
5446 -807 -411 76 532 836 900 717 380 -120 -551 -903 -902 -758 -398 95 550 837 931 769 307 -144 -570
5467 -570 -858 -948 -722 -334 164 616 886 969 733 252 -172 -616 -921 -899 -697 -333 192 618 960 967 783 331
5489 331 -237 -631 -932 -964 -714 -289 223 672 952 964 716 249 -252 -745 -941 -985 -744 -323 271 750 976
5510 976 919 674 261 -264 -716 -968 -942 -718 -283 303 742 1074 951 738 240 -286 -740 -1079 -979 -700 -220
$$ packed form
5361f71N0K57L58L16L13R9j45k35l22l33l03l3O6J93M23K81K99N2n5k07m11l56
5383c64l08r8J80J47M94L26L09L6l7l02l59l76l23j09J85K30L97L75L31M8j12
5404F70l34l62m21k69n8J31K37M27L98L12Q5j10k86m68l56l14j37J52K83N41L32
5425D53K93J02j47k93n16l60l10j14J63M15L34M65L01P2j39l75n31l05l66lN4
5446h07L96M87M56L04O4j83l37n00m31l52JJ44L60M93M55K87R4j62m62m51m26
5467e70k88r0K26L88M98M52K70Q3k36m81m24m44l05K2K02L64N25M26L42Pj84m52
5489C31n68l94l01l2K50M25N12M49K80J2k48m67n01m93j96m4K41M21N94M79K26
5510I76n7k45m13n25m52k52K6K24M35N86M39L32j23k13m98n26m54l39J00K79M80
$$ plain form
5531 -220 365 749 1074 958 692 169 -380 -824 -1072 -964 -642 -169 386 806 1044 996 672 202 -379 -857
5551 -857 -1104 -1012 -714 -177 418 786 1095 981 655 160 -413 -866 -1079 -944 -662 -109 509 914 1105 939
5571 939 632 77 -417 -927 -1177 -935 -631 -14 480 888 1150 926 610 1 -553 -862 -1106 -957 -616 16
5591 16 475 924 1128 957 597 11 -491 -971 -1132 -898 -589 68 581 939 1153 967 592 -88 -509 -952
5611 -952 -1132 -907 -600 89 492 1014 1155 947 607 -110 -549 -996 -1147 -940 -557 83 593 985 1138 938
5631 938 567 -156 -620 -1027 -1136 -860 -543 211 597 1008 1191 860 559 -231 -606 -1034 -1205 -861 -488 229
5651 229 594 1121 1095 858 499 -222 -653 -1113 -1107 -835 -436 152 648 1150 1033 810 520 -247 -687 -1132 -1020
5672 -1020 -795 -456 317 661 1061 1029 843 352 -270 -617 -1068 -1060 -836 -407 304 610 1118 1054 837 357 -307
$$ packed form
5531b20N85L84L25j16k66n23n49m44k48J08L22M73N55M20K38m8l24m70n81m78
5551h57k47R2K98N37N95L68L09j14l26m95n73m53k13J35K82N53O18M05J91j66
5571I39l07n55m94n10k50K42L04O17M94M08K62k24l16o09n54l09k44J49L41O32
5591A6M59M49K04j71l60n86n02m80j61K34L09O57N13L58K14j86l75o80m21m43
5611i52j80K25L07O89M03N22J41k08l40p17m39m47j51K07L83O40N10L92J53k00
5631I38l71p23m64m07j09K76L17P54L86M11J83l31l01p90l75m28j71L44L73P17
5651B29L65N27k6k37l59p21m31m60OK72L99N88M96N02j17k23k90p67m40m45J12
5672a020K25L39P73L44M00l2j86m91o22l47m51QK24M29P11L06N08o4k17m80o64
$$ plain form
5693 -307 -680 -1132 -1071 -772 -376 332 702 1086 979 852 291 -460 -689 -1127 -1061 -831 -300 396 748 1134 1008
5714 1008 771 235 -385 -668 -1198 -1046 -721 -254 349 725 1241 1018 809 258 -378 -714 -1195 -938 -817 -286
5734 -286 384 789 1133 955 745 240 -398 -665 -1066 -971 -741 -141 386 674 1113 922 688 146 -355 -803
5754 -803 -1108 -930 -732 -173 413 754 1093 942 692 227 -345 -777 -1060 -920 -783 -189 501 796 1067 905
5774 905 707 154 -438 -770 -1128 -879 -683 -105 410 785 1102 914 652 82 -423 -785 -1079 -823 -647 -145
5794 -145 402 823 1105 843 712 83 -402 -827 -1018 -851 -648 -101 399 789 1050 862 623 60 -459 -785
5814 -785 -1030 -806 -589 -77 419 817 1084 869 615 100 -409 -893 -1048 -857 -687 -111 418 838 993 843
5834 843 671 12 -448 -817 -1024 -833 -583 -31 406 812 1009 810 586 19 -427 -802 -1001 -852 -583 -60
$$ packed form
5693c07l73m52O1K99L96P08L70L84j07j27n61p51k29m38O6K30N31O96L52L86j26
5714A008k37n36o20k83n30J52L25M67O03L76N16k23k09n51o36l36m81K57J21N31
5734b86O70M05L44j78k10n05o38k67m01R5K30O00N27K88M39j91k34n42n01m48
5754h03l05J78J98N59N86L41L39j51k50m65n72m32k83J40J37N94O90K95K71j62
5774I05j98n53n92l32l58K49J96N78N15L75L17j88k62n70n05l62k94K56J76N02
5794a45N47M21K82k62j31o29m85m25j91J67K03N47N00L90K61j88k39n63n19l26
5814g85k45K24K17N12M96L98K67k15k54n15n09m84j55J91J70N76N29M20J55j50
5834H43j72o59m60l69k07J91K50N52M37M06J97j99k24n67m46l75j99J49K69N23
$$ plain form
5854 -60 420 827 995 838 600 26 -473 -779 -1015 -885 -607 -25 382 830 1017 839 594 54 -450 -838
5874 -838 -986 -830 -621 8 400 797 968 864 504 13 -346 -880 -959 -832 -528 -42 459 852 970 825
5894 825 574 34 -425 -814 -926 -911 -577 -21 402 827 998 866 521 -40 -454 -870 -1003 -833 -506 3
5914 3 400 845 928 788 505 4 -493 -817 -971 -815 -582 -1 406 834 957 853 500 13 -468 -869 -1028
5935 -1028 -827 -528 -30 498 893 998 830 553 39 -488 -781 -916 -823 -457 2 467 861 978 853 526
5955 526 12 -480 -900 -982 -840 -467 -7 488 825 925 859 489 2 -440 -817 -985 -880 -542 -3 432 850
5976 850 955 799 511 -41 -481 -789 -932 -826 -543 31 473 848 962 784 471 -34 -508 -859 -1036 -830
5996 -830 -480 -19 487 851 966 903 459 61 -459 -888 -1036 -863 -577 27 498 838 1008 914 471 -35 -527
$$ packed form
5854f0M80M07J68j57k38n74m99l06k36J30K78N82M07M48J87j78k45n40n04l88
5874h38j48J56K09O29L92L97J71j04l60m91l59n34p9J27L04M86N01L93J18j45
5894H25k51n40m59l89j12J5L34N56M23M25J71j32l45n61m14m16j33J70L27N09
5914CL97M45Q3j40k83n01m97l24j54J56K33N81M07M28J23j04l53m87m81m01j59
5935a028K01K99M98N28L95J05j68k77n14n27k93j35R3L66M59M65L94J17j25l27
5955E26n14m92m20q2J42L73M60M95L37J00o6l70m87m42l77j68J05L38N39M35M18
5976H50J05j56k88n52m40l08j43J06K83N74M42L75J14j78l13n05m74l51j77K06
5996h30L50M61N06L64J15o3m44l98n20m29j48J73K86O04M71L40J70r4m43n06m92
$$ plain form
6017 -527 -883 -956 -815 -413 89 533 861 1005 827 496 -111 -607 -871 -979 -841 -445 1 503 926 1000 838
6038 838 467 -88 -499 -904 -1019 -908 -534 46 582 961 993 842 473 -77 -557 -961 -1016 -848 -417 98 599
6059 599 927 987 872 461 -81 -503 -984 -983 -904 -406 68 586 1010 1045 871 412 -87 -602 -960 -1060 -923 -424
6081 -424 148 634 981 985 855 383 -143 -668 -966 -1068 -905 -391 171 626 1046 1020 858 385 -115 -610 -995
6102 -995 -1015 -869 -395 101 685 1005 1064 892 358 -98 -678 -1028 -1033 -925 -325 171 692 1061 1034 872 281 -250
6124 -250 -743 -1043 -1034 -836 -281 168 778 1086 1016 871 304 -145 -738 -1091 -1051 -874 -279 199 776 1163 970
6145 970 917 254 -202 -759 -1107 -1014 -845 -235 255 804 1060 1062 837 232 -304 -839 -1074 -1060 -786 -128 243 847
6167 847 1186 1014 789 210 -255 -872 -1065 -1063 -799 -214 320 930 1132 1052 835 192 -329 -951 -1136 -1086 -827
$$ packed form
6017e27l56p3J41M02N02M44L28J44j78l31o07m96k64j08J38L96M46N02M23P4j62
6038H38l71n55m11m05j15J11L74N80N36L79L2j51l69n50m80m04n5J68M31N15N01
6059E99L28O0j15m11n42m22m81JP9M98M74N18M24L5j74m59m99n15l58j00J37M99
6081d24N72M86L47Mj30m72n26n25k98j02J63N14N62M55M20k6j62m73n00m95l85
6102i95k0J46M74M96N84L20N9j72n34m56n80l50nJ08O00M96N21L69k7j62n91n31
6124b50m93l00RJ98N55M49O10L08p0j45n67m49n93l53M0J77N95M78N77L87j93
6145I70n3o63m56n57l48R3J69O10M90N49K56Kk25o05n36n35k35J4K74O58L71O04
6167H47L39j72k25n79m65o17j93KK64N85N34O10K02q0k17o43n21o22j85N0K59
$$ plain form
6188 -827 -81 293 953 1083 1097 806 68 -324 -961 -1102 -1032 -753 -124 331 978 1164 1042 734 106 -364 -1017
6209 -1017 -1089 -1067 -738 -90 362 993 1072 1113 746 73 -419 -967 -1121 -1091 -680 -30 450 1045 1186 1030 641
6230 641 -18 -447 -1103 -1111 -1037 -628 -88 419 1021 1113 1014 649 21 -521 -1083 -1160 -1098 -673 42 500 1044 1132 1138
6253 1138 660 -37 -504 -1098 -1058 -1065 -590 136 563 1111 1106 1037 575 -19 -545 -1182 -1149 -1041 -536 122 623 1094
6275 1094 1099 1069 520 -185 -679 -1095 -1106 -1051 -476 147 647 1146 1121 1075 414 -167 -598 -1099 -1118 -1023 -401 123 671
6298 671 1133 1102 920 445 -140 -666 -1108 -1068 -1032 -417 120 754 1137 1052 971 412 -245 -739 -1127 -1181 -956 -356
6320 -356 186 669 1096 1065 941 351 -238 -832 -1151 -1107 -881 -286 288 795 1133 1101 895 268 -222 -813 -1176
6341 -1176 -1064 -864 -242 266 832 1121 1058 941 280 -241 -898 -1165 -1062 -918 -212 323 814 1096 1086 826
$$ packed form
6188h27P46L74O60J30J4k91p38l92o37j41P0K79O29M55O47J86j22l08o28m70o53
6209a017p2K2L29O48M52O31P9M1l67o73m92n48j54L0M11O50M80N95J41j56l89
6230F41o59m29o56qP4M09N40N07O02R2r9l65o28n42n62p7O2M25P15M58N44Q8O
6253A138m78o97m67n94M0pM75P26M27N48no9m62n94n26o37L3J08N05O58N01M71
6275A094Nl0n49p05m94m16j1N5N75O23N00M99k5m6o61n81m31n01j9R5O22N24N48
6298F71M62l1j82m75n85n26m42M0L6O15N37O34L83q5q1n59o57m94l88n4K25O00
6320c56N42M83M27l1j24n90n89n94l19M4K26N95N74N07L38l2k06o27m90n91l63
6341a176J12K00O22N08N66K89o3j17o61n21o57k67J03J44P06N35M91K82j0k60
$$ plain form
6361 826 224 -289 -824 -1161 -1031 -791 -140 262 814 1170 1001 793 228 -369 -822 -1105 -1073 -788 -203 344
6381 344 886 1203 1011 810 183 -330 -874 -1096 -997 -793 -160 387 880 1140 1050 681 72 -328 -854 -1064 -987
6402 -987 -681 -85 411 849 1097 995 657 57 -429 -902 -1021 -963 -666 -72 432 877 1058 988 623 79 -471
6423 -471 -820 -1046 -958 -635 -19 513 893 1109 953 592 53 -471 -868 -1005 -896 -540 -19 492 897 1107
6443 1107 925 560 -7 -503 -929 -1079 -869 -517 -28 480 949 1094 907 539 6 -482 -945 -1026 -868 -505
6463 -505 0 516 887 1007 845 457 -58 -565 -926 -1012 -867 -403 45 551 957 1012 853 480 -90 -506 -912
6484 -912 -1043 -817 -448 82 579 946 1014 821 451 -53 -628 -927 -1017 -783 -411 95 541 888 939 842 379
6505 379 -125 -498 -913 -966 -759 -356 124 581 923 997 786 373 -92 -496 -833 -938 -777 -318 134 585 898
$$ packed form
6361H26o02n13n35l37J30K40O51M02N52L56j69k08n65n97m53k83L2K85N85N47
6381C44N42L17j92k01o27n13n44k22R9K04O33N47M93K60r0l69o09m00n26k10P7
6402i87L06N96M96M38K48j02l38o00m86m73j19N8K97N94N04M45J81p0l65n44n50
6423d71l49k26Q8L23O16N32L80K16j56l61n39n24l97j37J09L56N21N11M05K10
6443A107j82l65n67m96m26j50K10L52M89N08M69J45j87l68n33m88m63q1J58L63
6463e05N05N16L71J20j62l88n15n07l61q6J45M64M48N06M06N5j59l73n70m16m06
6484i12j31K26L69N30M97L67O8j93l70n04n75k99r0K34L72N06M46L47N1r7m63
6505C79n04l73m15n3K07M03M80M57L42P4k11m13m65m04l37j05J61M59M52M51L13
$$ plain form
6526 898 941 755 409 -141 -555 -872 -892 -708 -390 131 541 909 887 672 349 -146 -551 -815 -893 -703 -321
6547 -321 146 560 824 919 715 358 -181 -578 -827 -874 -677 -309 191 572 876 822 728 342 -185 -589 -883
6568 -883 -804 -611 -259 168 554 828 853 665 236 -244 -579 -848 -818 -655 -271 162 598 838 776 715 265 -175
6590 -175 -591 -862 -828 -698 -232 196 586 830 853 644 264 -202 -595 -842 -776 -682 -207 190 546 806 749 607
6612 607 171 -211 -575 -815 -746 -621 -190 148 603 872 765 715 220 -169 -587 -832 -801 -665 -208 185 609
6633 609 798 734 660 172 -149 -581 -764 -739 -603 -176 242 596 744 731 599 186 -127 -654 -807 -814 -649 -200
6655 -200 168 619 806 744 638 204 -198 -594 -784 -801 -611 -151 150 586 723 796 602 198 -205 -619 -785
6676 -785 -781 -555 -202 176 649 770 753 595 211 -145 -681 -745 -809 -629 -213 136 580 771 852 638 121 -195
$$ packed form
6526H98M3j86l46n50m14l17k0J84L18N21M10L68k2k15l23m95m05k64p8J90L82
6547c21M67M14K64R5k04l57n39l97k49m7J97L68N00L81L04n4r4l86n27m04k94
6568h83P9J93L52M27L86K74K5j88m29m80l35k69L0J63L84M33M36K40o2o1m50m40
6590a75m16k71L4J30M66M28L90K44K3k09l80m66l93k47O6R4M75L97L56K60n7j42
6612F07m36l82l64k40O9J25M31L38M55K69j07n0m95l89m18k45L1J36M57L93M24
6633F09J89o4p4m88l21m32j83K5J36M27M18L54J48j3j32m13l13n27j53pJ65M49
6655b00L68M51J87o2j06m34m02l96j90j7J90M60L01M36J37P3j94m04m03m14j66
6676g85MK26L53L78M73J21j7j58l84l56n36o4o4J80M16L49M44J91Q1k14n17l16
$$ plain form
6698 -195 -576 -775 -833 -620 -192 140 632 771 752 586 135 -121 -632 -795 -741 -571 -164 170 689 826 830 534
6720 534 172 -226 -659 -752 -839 -604 -169 187 647 810 881 591 142 -198 -702 -811 -797 -557 -139 146 683
6741 683 771 825 582 136 -233 -668 -763 -816 -505 -156 171 683 771 815 595 163 -226 -711 -771 -879 -619 -122
6763 -122 251 712 852 941 572 167 -304 -721 -841 -865 -550 -123 244 699 801 865 537 149 -285 -707 -730
6784 -730 -901 -518 -131 259 703 808 892 575 186 -223 -735 -791 -937 -499 -122 277 755 861 929 562 155
6805 155 -263 -766 -835 -890 -497 -154 350 752 858 865 521 132 -350 -723 -784 -923 -560 -81 329 753 876 952
6827 952 530 116 -380 -769 -967 -920 -508 -61 367 797 880 895 490 87 -409 -792 -890 -920 -542 -116 379 815
6849 815 935 874 543 62 -436 -789 -906 -877 -509 -100 466 871 924 887 476 84 -440 -851 -939 -926 -514 -74
$$ packed form
6698a95l81j99n8K13M28L32M92J39j9j66m51k56n11j63N4J70M07L34N19J37Mk96
6720E34l62l98m33r3q7K35M35L56M60J63P1k90m49l40n04j09J4K40M18K85N37
6741F83Q8N4k43m46l69m35r5n3L11L49L27N12Q8M4k20m32l89m85o0j08K60M97
6763a22L73M61J40Q9l69m05m71m17j20k4L15M27L67M55J02O4l28l88m34m22k3
6784g30j71L83L87L90M44J05Q4l17l89m09n12n6j46M38L77L99M78J06O8l67m07
6805A55m18n03o9n5L93L43N04M02J06Pl44l89m82l73o1j39L63M79M10M24J23P6
6827I52m22m14m96l89j98M7M12M47M28M30Q3J5m05m03m96l83r8l0L78M26M95M36
6849H15J20o1l31m81m98l53j17K9L68M09N66M05N3l7m11l92n24m11q8J3M12M40
$$ plain form
6871 -74 461 816 910 910 447 36 -531 -836 -938 -856 -464 -5 522 855 915 876 441 84 -505 -805 -917 -829 -422
6894 -422 62 534 869 971 907 432 13 -483 -927 -928 -879 -483 -3 569 913 1019 808 485 -49 -556 -861
6915 -861 -933 -832 -433 50 566 891 968 808 448 -46 -609 -908 -1031 -809 -347 97 645 904 1005 876 429
6936 429 -97 -631 -969 -948 -843 -304 118 632 900 976 802 365 -144 -628 -942 -972 -759 -379 161 628 984
6957 984 1017 791 316 -182 -709 -964 -1019 -760 -316 199 739 1033 1049 842 351 -217 -702 -997 -1001 -788 -268 174
6979 174 716 993 1037 747 258 -206 -742 -977 -992 -756 -252 247 660 1001 913 703 247 -257 -761 -981 -983 -727
7001 -727 -248 296 747 1018 1018 711 220 -286 -791 -1035 -1039 -712 -227 334 816 979 982 665 215 -324 -806 -1050
7023 -1050 -933 -682 -202 283 768 972 1002 645 188 -373 -836 -997 -912 -663 -101 410 878 1015 975 641 159
$$ packed form
6871g4N35L55R4%m63m11n67l05j02Q2L92M59N27L33O0l9m35l57n89l00j12Q8M07
6894d22M84M72L35J02o4m75m19m96m44jM9L96M80N72L44J06k11l23n34n07l05
6915h61p2J01L99M83N16L25P7j60l60m94n63k99j23K22M62M44N48K59J01j29m47
6936D29n26n34l38K1J05N39M22N14K68P6j74m37n09m84l14l0K13L80N40M67L56
6957I84L3k26m75m98n27k55n5K59M44N15N40K94J6k07m91n68m85k95mK13N20M42
6979A74N42K77M4k90m89m64n36k35j5K36N04M99M13L41q8k10m56n04n04k20kK56
7001g27M79N44M51K71%l07m91n06n05k44mL27M85N61M82J63Ll17m50n39m82k44
7023a050J17K51M80M85M85K04L0l57m57n61m63j61Q5K49N62N11M68J37m0l34m82
$$ plain form
7044 159 -423 -879 -997 -965 -611 -151 440 865 1021 978 637 101 -415 -823 -1039 -911 -619 -95 400 899 1068
7065 1068 912 591 81 -520 -881 -1047 -946 -492 -41 463 915 1013 881 556 48 -524 -907 -984 -918 -493 37
7086 37 519 866 1034 879 443 6 -491 -913 -946 -829 -484 17 542 891 954 875 478 -27 -544 -944 -1020 -907
7108 -907 -482 57 547 981 1032 901 416 -104 -595 -910 -950 -826 -390 6 514 917 916 846 347 -85 -559 -914
7130 -914 -935 -826 -340 82 579 924 984 792 373 -124 -571 -926 -966 -795 -332 140 603 915 935 776 338
7151 338 -85 -647 -911 -940 -790 -277 139 605 897 922 747 262 -112 -702 -898 -908 -784 -302 212 706 837
7172 837 935 789 208 -168 -668 -948 -980 -759 -258 144 645 893 920 675 253 -158 -655 -890 -887 -715 -242 194
7194 194 688 871 878 679 240 -195 -729 -861 -877 -651 -212 167 720 818 965 652 189 -272 -745 -836 -916 -676
$$ packed form
7044A59n82m56j18L2L54M60N91M25J56m3l41n36n16m08k16J28K92N24M95M99J69
7065A068j56l21n10o01l61j66J01M54M51N04M52R8j32l25n08n72l83p7O6M25N30
7086C7M82L47J68j55m36m37m97m22l3J17L45N01N25L49O3p9l97n05n17m00p6J13
7108i07M25N39M90M34N1j31m85n20m91l15m0J24M36L96N08M03jp0m99m32m74l55
7130i14k1J09M86M22M97L45O0j92m19m97m47l55m0J71M63M72M63L12K0j59m38
7151C38m23n62k64k9J50N13M16M66K92K5j75m85l74n90j96j0J24M82N14M94J31
7172H37R8j46n81l76n00k80l2K21N01M02N01K48K7k45m22m11m97k35LJ72M73M36
7194A94M94J83Pj99m39m35n34j32j6K26M39L79N53R8J47l13m63m61m73r1q0K40
$$ plain form
7216 -676 -167 139 669 881 919 586 162 -165 -721 -856 -828 -600 -211 212 754 779 866 665 132 -277 -710
7237 -710 -844 -863 -572 -128 267 673 819 901 567 142 -285 -713 -813 -842 -528 -133 250 732 821 820 529 56
7259 56 -276 -801 -769 -791 -562 -172 288 703 797 813 526 113 -331 -727 -768 -851 -445 -116 284 705 824 842 440
7282 440 75 -285 -753 -832 -861 -467 -107 292 702 755 826 446 145 -295 -711 -773 -751 -468 -154 346 684 712
7304 712 795 477 64 -344 -670 -789 -819 -405 -66 331 687 789 794 397 85 -351 -756 -735 -739 -433 -117 306
7326 306 639 729 772 437 128 -348 -734 -704 -736 -362 -56 333 633 747 761 386 98 -347 -683 -751 -731 -366
7348 -366 -54 372 681 783 773 448 69 -328 -677 -726 -777 -386 -57 413 693 760 779 401 99 -341 -670 -715
7370 -715 -747 -430 -14 314 654 791 734 391 80 -332 -670 -735 -716 -369 2 373 687 734 736 427 37 -420
$$ packed form
7216f76N09L06N30K12L8l33m24l27n56j35K8K28L89M23N42K5Q7k01n33m09m33
7237g10j34j9K91M44L95M06J46Q2l34m25m27m28j00k9L14L95L83M82Q9jk91m73
7259E6l32n25L2k2K29L90M60M15R4J6k87m13m44l96m1q3M06L29M00M21J19J8m02
7282D40l65l60m68p9k9L94L60L99M10N3P1l80l01m40m16o2K2K83L14N00L38K8
7304G12Q3l18m13m08l26j19l0M14L39L97L56J02Nl97l12m36m05K1mL06L16M23
7326C06L33R0M3l35l09m76l86L0l2L74L06L89L00J14J4l75k88m45l36o8K0L65
7348c66L12M26L09J02j0l25l79l97l49m9n1L91L29M70K80O7J9l78l02m40l29m5
7370g15l2L17M16L28L40J37n7l43l11m12l38o5J9L47L71L71L14M7Kl09l90m57
$$ plain form
7392 -420 -657 -764 -716 -407 -20 340 630 726 713 371 8 -391 -675 -710 -705 -360 -21 348 602 810 679 296
7414 296 69 -318 -632 -763 -677 -375 -38 400 642 789 749 331 9 -438 -712 -702 -680 -348 -78 396 635
7435 635 776 655 356 11 -363 -624 -732 -673 -368 3 358 619 790 733 381 45 -433 -670 -803 -692 -343
7456 -343 -77 359 670 766 706 338 -13 -418 -647 -744 -658 -369 36 397 681 785 695 290 53 -359 -638 -772
7478 -772 -687 -354 9 416 672 779 691 343 -44 -405 -749 -786 -670 -295 80 415 692 799 614 351 -15
7499 -15 -431 -688 -799 -641 -327 42 433 717 764 630 361 -82 -435 -677 -749 -647 -300 9 491 767 808
7520 808 638 302 -87 -483 -700 -796 -697 -332 106 432 711 787 663 304 -81 -430 -698 -749 -635 -318 18
7541 18 470 684 797 653 326 -36 -512 -712 -768 -615 -345 118 500 752 794 663 241 -118 -497 -778 -847
$$ packed form
7392d20k37j07M8L09L87L60K90R6j3l42l63l99k84l5NL45L39L69K54K08j31l83
7414B96k27l87l14j31Q6L02L37M38K42J47m0m18l22m47k74J0K2L32K70M74K39
7435F35J41j21k99l45l74k61j08N9L05L71L55K61J71n7l52l36m78k37j33J11L49
7456c43K66M36L11R6o0l68l51m05k29r7Q6K89M05L61K84J04r0m05k37m12k79j34
7478g72Q5L33L63M07K56J07q8l48l87l61l44l7J16L75L75L35K77J07j85k63l66
7499a5m16k57j11J58L14L69L91K84M7j34k69m43l53k42p2J02L47L09M82K76M1
7520H08j70l36l89l96k17r6R9L65M38L26K79P6j24l59l85l49k68n1J14L17L36
7541A8M52K14J13j44l27l62m76k00n6J53K70M63L82K52M2j31m22l59l79k81o9
$$ plain form
7562 -847 -580 -266 102 523 721 815 612 268 -121 -512 -732 -788 -647 -255 138 526 775 783 577 328 -102
7583 -102 -543 -770 -807 -595 -240 139 596 750 838 612 244 -200 -534 -784 -801 -607 -248 115 563 827 826 609
7605 609 312 -205 -614 -754 -791 -586 -229 174 581 813 807 595 249 -176 -622 -791 -840 -562 -249 208 693
7626 693 795 780 570 211 -184 -593 -799 -812 -575 -181 283 648 794 806 519 168 -223 -600 -838 -797 -533
7647 -533 -182 301 604 817 744 542 178 -244 -634 -842 -802 -532 -133 295 686 803 807 474 159 -406 -680
7668 -680 -820 -761 -486 -223 302 657 786 821 431 135 -381 -706 -823 -811 -477 -156 412 732 824 873 505 152
7690 152 -345 -696 -861 -736 -445 -104 443 675 849 723 398 73 -450 -643 -841 -750 -466 -88 406 713
7710 713 842 688 403 96 -429 -690 -854 -775 -401 -41 482 735 872 780 427 -37 -420 -746 -868 -667 -414
$$ packed form
7562h47K67L14L68M21J98R4k03l44l89l91k20n6J41L92L93L88K49Qk06k49m30
7583a02m41k27l7K12L55L79M57J54Q8k26l68m44l34k50j7J94L59L63M48K64jk17
7605F09k97n17m09j40l7K05L57M03M07K32ok12l46m25m46j69m9K78L13M57M85
7626F93J02j5k10l59l95m09k06j3K37L94M64L65J46J2k87l51l91l77k38M1K64
7647e33L51M83L03K13p3k02l64m22l90k08M0K70L99M28L91J17Ml33l15n65k74
7668f80j40N9K75K63N25L55J29L5l90k96n16l25j17J2L34L21N68L20R2M9l68l53
7690A52m97l51j65J25K91L41N47K32J74j26l25l25n23j93j98R1K84L78M94L07
7710G13J29j54k85l07n25k61j64P9L74L60N23K53J37r2l53m64l83l26j22K01K53
$$ plain form
7731 -414 -6 508 705 889 682 366 -6 -514 -731 -825 -745 -359 -31 494 725 811 677 327 -3 -548 -675
7752 -675 -886 -687 -323 26 522 698 891 636 265 -109 -541 -757 -914 -648 -337 60 593 705 803 619
7772 619 285 -96 -555 -681 -808 -630 -310 96 555 676 756 595 288 -116 -565 -710 -874 -565 -229 116
7792 116 575 721 844 613 267 -157 -559 -732 -846 -532 -283 178 636 703 788 494 200 -178 -603 -754 -822
7813 -822 -557 -245 246 604 654 829 482 198 -258 -616 -726 -831 -544 -173 227 625 666 748 506 130 -268
7834 -268 -560 -764 -754 -428 -227 265 620 735 779 519 131 -297 -656 -710 -744 -449 -129 319 583 722 735 399
7856 399 122 -297 -583 -769 -713 -442 -112 351 629 729 700 371 20 -452 -646 -729 -691 -370 -90 344 623
7877 623 669 706 424 42 -317 -630 -699 -650 -365 -81 334 629 695 616 326 27 -355 -611 -691 -676 -325 1 411
$$ packed form
7731d14M08N14J97J84k07l16l72n08k17r4Q0L86L28N25K31Q6j34l50l30n45j27
7752f75k11J99L64L49M96J76J93k55l71l74m32k16j57K66L11L97N33J12R8j84
7772F19l34l81m59j26j27J78L20M06M59J21Q0j61l07m04m49j45j64L09L36L45
7792A16M59J46J23k31l46m24m02j73j14L14K49M61M58O7Q5k94k94l78m25j51o8
7813h22K65L12M91L58N0J75l47k84m56l58j10j05K87L71M00L98M1Q2k42l76l98
7834b68k92k04J0L26K01M92L55J15M4k60l88m28l59n4l4K95L20M48K64J39J3l36
7856C99k77m19k86j86N6K71L30M63K78J00k9l29l51m72j94q3L8L21K80M34K79
7877F23M6L7k82l82l59l13o9M9K85K84M15K95O6p9k90k99l82k56q0J5L51L26M10
$$ plain form
7900 411 595 684 609 318 8 -414 -655 -756 -618 -345 15 392 578 727 575 323 -7 -318 -631 -642 -553
7921 -553 -293 31 349 569 668 571 321 -76 -408 -572 -709 -592 -289 46 344 608 615 576 232 -68 -481 -587
7943 -587 -676 -507 -304 91 366 573 686 534 273 -56 -360 -555 -687 -510 -256 73 436 567 615 503 229
7964 229 -55 -412 -556 -656 -468 -188 23 391 576 667 430 160 -115 -454 -608 -639 -465 -200 89 369 596
7985 596 576 441 209 -131 -400 -540 -581 -436 -199 96 347 579 580 425 239 -121 -396 -525 -618 -396 -119 80
8007 80 427 527 568 402 166 -118 -437 -453 -588 -414 -141 88 350 534 558 432 168 -143 -391 -543 -532 -454
8029 -454 -124 150 353 555 473 391 158 -154 -320 -560 -472 -369 -152 126 465 499 490 345 109 -87 -355 -479
8051 -479 -530 -365 -116 131 385 491 495 306 108 -171 -395 -470 -449 -301 -110 120 394 516 459 326 124 -61
$$ packed form
7900D11J84Q9p5k91l10m22k41j01J38K73L60L77J86J49j52k52l30l11l13j1Q9
7921e53K60L24L18K20R9r7k50l97l32j64j37J17L03L35K98K64Pl9l44l00m13j06
7943e87q9J69K03L95K75K07J13j52k61l29l04j95j32J77K54L29L63J31M8j12k74
7964B29k84l57j44j00J88K80K11L68J85R1k37k70k75l39j54l1J74K65K89K80K27
7985E96k0j35k32l40k69j40m1J45K37K95K51K32Jj55j86l60k75j29r3K22K77J99
8007H0L47J00M1j66k36k84l19j6j35J74K73K29K62J84K4j26k64l11k48j52J1P8
8029d54L30K74K03K02q2q2k33l12j66k40Q8J03K17K78L39L4rj45k36j96k68j24
8051d79n1J65K49K47K54J06Mj89j98k79k24p5K1J48J91K30K74J22n7j33k02j85
$$ plain form
8073 -61 -384 -432 -478 -290 -86 142 342 449 494 320 122 -96 -314 -450 -453 -329 -130 107 325 406 470 333 140
8096 140 -116 -294 -436 -463 -269 -129 99 339 426 430 299 119 -156 -362 -441 -415 -293 -171 116 313 433 352
8118 352 285 128 -70 -326 -426 -470 -264 -128 109 354 371 443 284 118 -84 -303 -413 -429 -261 -110 131 292
8140 292 389 423 243 166 -151 -297 -391 -402 -331 -146 88 292 403 455 289 127 -75 -307 -445 -448 -277 -148 84
8163 84 289 369 400 261 127 -90 -295 -445 -420 -286 -166 136 230 404 362 325 118 -99 -286 -452 -384 -260 -117
8186 -117 84 290 391 369 322
$$ packed form
8073f1l23m8m6J88K04K28K00J07M5j74j98k18k18j36lJ24J99K37K18Q1O4j37j93
8096A40k56j78j42k7J94J40K28K40Q7Mj31j80k75k06p9K6J22J22K87J97J20q1
8118C52o7j57j98k56j00m4K06J36K37K45J7P2j59j66k02k19j10j6J68J51K41J61
8140B92R7L4j80p7l17j46r4j1P1J85K34K04J11N2j66j62k02k32j38lJ71J29K32
8163H4K05Q0L1j39j34k17k05j50K5J34J20L02R4J74m2l7k07k17j87j66O8J24J43
8186a17K01K06J01k2m7
8191C22
$$ Imaginary data points
##PAGE= N=2
##DATA TABLE= (X++(I..I)), XYDATA
$$ plain form
0 0 0 0 0 0 0 0 0 0 0 0 -3 8 -8 9 -16 16 -24 24 -32 35 -44 54 -65 75 -87 103 -117 138 -159 182 -208 237 -270
33 -270 307 -343 389 -435 489 -545 608 -677 751 -834 922 -1020 1128 -1243 1373 -1511 1667
50 1667 -1833 2019 -2227 2456 -2713 3002 -3331 3713 -4151 4672 -5294 6057 -7018 8271 -9977
65 -9977 12454 -16403 23729 -42108 192528 350855 201574 116208 -138092 -226656 -393438
76 -393438 -290653 -224920 -97086 134890 259419 337536 294125 232749 67103 -145552 -240870
87 -240870 -329650 -286963 -241546 -21907 136842 219487 349541 282767 214791 16516 -134368
98 -134368 -213594 -370787 -266758 -184210 -34062 136084 236230 354222 251588 173110 42257
109 42257 -144547 -254902 -316913 -241058 -185410 -19014 149066 247594 295296 237353 192121
$$ packed form
0@%%%%%%%%%%lJ1j6J7k5L2m0M8n6O7p9R8j19J40j62J90k20K55k97L41l90M45n07
33b70N77o50P32q24R24j034J153j285J428j585J756j942K148k371K616k884L178
50A667l500L852m246M683n169N715o333P044p864Q823r966J1351j3075J5289j8248
65i977K2431k8857M0132o5837K34636J58327j49281q5366k54300q8564j66782
76c93438J02785O5733J27834K31976J24529P8117m3411o1376j65646k12655r5318
87b40870q8780M2687M5417K19639J58749Q2645J30054o6774o7976j98275j50884
98a34368p9226j57193J04029Q2548J50148J70146J00146J17992j02634p8478j30853
109D2257j86804j10355o2011P5855N5648J66396J68080R8528M7702n7943m5232
$$ plain form
120 192121 -13875 -146395 -223669 -304904 -233617 -175096 25150 140911 213790 320443 225510
131 225510 147254 -12550 -139946 -228199 -313383 -215047 -133906 2236 143263 246223 285826
142 285826 206288 140350 -13311 -145873 -244163 -263934 -200524 -147404 35127 144435 224366
153 224366 262681 196495 137575 -45309 -140623 -209753 -270723 -192108 -115810 38034 138081
164 138081 215248 267921 186469 101616 -29158 -138231 -229490 -250875 -179842 -103434 33394
175 33394 139049 231425 233718 173162 109562 -46446 -138515 -216964 -228131 -167461 -104565 53272
187 53272 136666 201470 229325 163578 88721 -49232 -134749 -199426 -225952 -160669 -75141 43520
199 43520 133830 207815 215318 156552 72555 -45520 -133315 -211668 -204468 -150362 -75784 52990
$$ packed form
120A92121k05996j32520p7274q1235P1287N8521K00246J15761P2879J06653r4933
131B25510p8256j59804j27396q8253q5184R8336Q1141J36142J41027J02960L9603
142B85826p9538o5938j53661j32562r8290j9771O3410N3120J82531J09308P9931
153B24366L8315o6186n8920j82884r5314o9130o0970P8615P6298J53844J00047
164A38081P7167N2673q1452q4853j30774j09073r1259k1385P1033P6408J36828
175C3394J05655R2376K293o0556o3600j56008r2069p8449j1167O0670O2896J57837
187E3272Q3394O4804K7855o5747p4857j37953q5517o4677k6526O5283Q5528J18661
199D3520R0310P3985P503n8766q3997j18075q7795p8353P200N4106P4578J28774
$$ plain form
211 52990 133153 203152 198996 143650 73782 -56738 -132658 -189695 -196447 -138980 -63695 53612
223 53612 131332 183216 191439 136489 53066 -49866 -129279 -185722 -183565 -133863 -49061 51521
235 51521 127610 188735 177100 129008 50299 -56334 -127068 -184434 -174150 -122650 -49593 57949
247 57949 127322 174506 171309 117621 43698 -54740 -126494 -166733 -165245 -115164 -36324 51486
259 51486 123805 164936 157783 113160 32602 -52578 -120841 -165748 -153115 -109194 -32683 56192
271 56192 119726 163508 151933 103808 32306 -57419 -120382 -157308 -150189 -99140 -28806 54974
283 54974 120120 150643 144860 96605 23911 -52083 -117103 -146938 -137512 -94530 -20943 52346
295 52346 113172 145646 132791 91036 20559 -55138 -111320 -143960 -131722 -86507 -20234 56504
$$ packed form
211E2990Q0163O9999m156n5346o9868j30520p5920n7037o752N7467P5285J17307
223E3612P7720N1884Q223n4950q3423j02932p9413n6443K157M9702Q4802J00582
235E1521P6089O1125j1635m8092p8709j06633p0734n7366J0284N1500P3057J07542
247E7949O9373M7184l197n3688p3923r8438p1754m0239J488N0081P8840Q7810
259E1486P2319M1131p153m4623q0558q5180o8263m4907J2633M3921P6511Q8875
271E6192O3534M3782j1575m8125p1502q9725o2963l6926P119N1049P0334Q3780
283E4974O5146L0523n783m8255p2694p5994o5020k9835R426M2982P3587P3289
295E2346O0826L2474j2855m1755p0477p5697n6182l2640J2238M5215O6273P6738
$$ plain form
307 56504 111875 140217 131069 82860 17880 -55069 -112182 -135597 -127227 -80818 -14526 52744
319 52744 109520 131904 120956 79007 12474 -52067 -105073 -129406 -115891 -75776 -12194 53378
331 53378 101997 127075 114025 71927 11995 -54473 -102033 -124342 -113421 -69132 -10180 53903
343 53903 102798 121603 110973 67777 7481 -52415 -101186 -119091 -106132 -66439 -5915 51500
355 51500 96997 116399 101247 64020 6029 -51535 -93125 -113462 -98525 -60851 -6078 51720
367 51720 91978 110591 97658 58622 4612 -51193 -92514 -108701 -96141 -57603 -2340 50073
379 50073 91956 107546 92741 56805 1082 -49246 -89180 -105620 -88496 -55224 -1404 48799
391 48799 85713 102170 85406 53076 1627 -48503 -83457 -98710 -84160 -51257 -141 47624
$$ packed form
307E6504N5371K8342r148m8209o4980p2949n7113k3415Q370M6409O6292O7270
319E2744N6776K2384j0948m1949o6533o4541n3006k4333J3515M0115O3582O5572
331E3378M8619K5078j3050m2098n9932o6468m7560k2309J0921M4289N8952O4083
343E3903M8895J8805j0630m3196o0296n9896m8771j7905J2959L9693O0524N7415
355E1500M5497J9402j5152l7227n7991n7564m1590k0337J4937L7674N4773N7798
367E1720M0258J8613j2933l9036n4010n5805m1321j6187J2560L8538N5263N2413
379E0073M1883J5590j4805l5936n5723n0328l9934j6440J7124L3272N3820N0203
391D8799L6914J6457j6764l2330n1449n0130l4954j5253J4550L2903N1116M7765
$$ plain form
403 47624 82901 97000 83169 50069 -2246 -46453 -82860 -96798 -80714 -49049 3388 45679
415 45679 82066 96104 77051 47907 -2875 -45606 -80095 -92862 -74054 -46849 2408 45427
427 45427 77609 88452 72845 45748 -3898 -44238 -75499 -86040 -72542 -44446 6341 42229
439 42229 74750 86431 71092 42783 -7361 -40827 -75187 -86949 -67930 -41557 6108 40759
451 40759 75338 84550 64888 41622 -4995 -41358 -73641 -79571 -63947 -42053 6225 40579
463 40579 70505 76075 64561 41223 -8963 -37950 -68088 -76401 -64262 -38706 10090 35222
475 35222 68496 78211 61593 36639 -8297 -34707 -70497 -77014 -58354 -36771 6101 36309
487 36309 70856 72240 57307 38396 -6744 -37203 -67686 -67586 -58566 -38489 9866 35223 63716
$$ packed form
403D7624L5277J4099j3831l3100n2315m4207l6407j3938J6084L1665N2437M2291
415D5679L6387J4038j9053k9144n0782m2731l4489j2767J8808K7205M9257M3019
427D5427L2182J0843j5607k7097m9646m0340l1261j0541J3498K8096N0787L5888
439D2229L2521J1681j5339k8309n0144l3466l4360j1762J9019K6373M7665L4651
451D0759L4579R212j9662k3266m6617l6363l2283n930J5624K1894M8278L4354
463D0579K9926N570j1514k3338n0186k8987l0138q313J2139K5556M8796K5132
475C5222L3274R715j6618k4954m4936k6410l5790o517J8660K1583M2872L0208
487C6309L4547J384j4933j8911m5140l0459l0483J00R020K0077M8355K5357K8493
$$ plain form
500 63716 67173 59573 35652 -11822 -31635 -62805 -69642 -57788 -32172 10139 29731 65625 70044
513 70044 54204 31472 -7006 -31424 -68232 -66130 -52303 -33767 6588 34023 66511 60872
525 60872 53788 35494 -9702 -33546 -61544 -59208 -56284 -33231 12427 29741 58715 61653 55856
538 55856 28927 -11211 -26417 -60688 -63526 -52457 -26767 7443 27205 64470 61289 49516
550 49516 28697 -5618 -30782 -64955 -56275 -50221 -31551 7879 32549 60685 53495 53216 30815
563 30815 -11270 -29982 -56176 -55075 -54396 -26389 11546 25779 56365 57836 51681 22846 -8003
576 -8003 -24863 -60410 -57196 -47998 -23495 5104 28430 62818 52991 47383 26647 -6255 -31954
589 -31954 -60135 -49684 -50228 -27404 9845 31332 55279 50292 52475 24000 -11145 -27489 -53439
$$ packed form
500F3716L457p600k3921m7474j9813l1170o837J1854K5616M2311J9592L5894M419
513G0044j5840k2732l8478k4418l6808K102J3827J8536M0355K7435L2488n639
525F0872p084j8294m5196k3844k7998K336K924K3053M5658J7314K8974K938n797
538E5856k6929m0138j5206l4271k838J1069K5690L4210J9762L7265l181j1773
550D9516k0819l4315k5164l4173Q680O054J8670L9430K4670K8136p190k79k2401
563C0815m2085j8712k6194J101O79K8007L7935J4233L0586J471o155k8835l0849
576h003j6860l5547L214R198K4503K8599K3326L4388r827n608k0736l2902k5699
589c1954k8181J0451n44K2824L7249K1487K3947m987K183k8475l5145j6344k5950
$$ plain form
602 -53439 -53081 -50974 -19871 8510 25162 55958 53859 47327 19118 -5072 -27348 -59086 -51240
615 -51240 -45384 -21663 4888 31454 58469 47917 47082 23459 -7941 -32819 -54474 -47473 -49632
628 -49632 -21591 10152 30210 51442 49693 49483 17768 -8806 -27107 -52225 -51163 -46445 -16007
641 -16007 5645 27547 54899 49694 43848 17521 -4571 -30944 -55562 -47122 -44137 -19447 6660
654 6660 33536 53167 46285 46068 18922 -9067 -32693 -50219 -47726 -46602 -16214 9090 30117
667 30117 49532 49136 44514 14098 -6957 -29237 -51016 -48631 -41876 -14458 5550 31267 52098
680 52098 46769 40964 15882 -6813 -33911 -51099 -45873 -41863 -15834 9207 34631 49040 46617
693 46617 42520 14098 -10013 -33176 -48008 -47575 -41354 -12381 8925 31915 48285 47400 39209
$$ packed form
602e3439L58K107L1103K8381J6652L0796k099o532k8209k4190k2276l1738P846
615e1240N856K3721K6551K6566K7015j0552q35k3623l1400k4878k1655P001k159
628d9632K8041L1743K0058K1232j749k10l1715k6574j8301k5118J062M718L0438
641a6007K1652K1902K7352n205n846k6327k2092k6373k4618Q440K985K4690K6107
654F660K6876J9631o882k17k7146k7989k3626j7526K493J124L0388K5304K1027
667C0117J9415l96m622l0416k1055k2280k1779K385O755K7418K0008K5717K0831
680E2098n329n805k5082k2695k7098j7188N226M010K6029K5041K5424J4409k423
693D6617m097k8422k4111k3163j4832M33O221K8973K1306K2990J6370q85q191
$$ plain form
706 39209 12109 -7714 -32359 -48820 -46239 -37780 -12926 8281 34111 48600 45485 37730 13118
719 13118 -9995 -35245 -47677 -45752 -38080 -12190 11279 34907 46897 46396 37454 11015 -11122
732 -11122 -33856 -46597 -46230 -35985 -10604 10349 33505 46599 45358 34666 10887 -10454 -34021
745 -34021 -46355 -44651 -34103 -10893 11557 34968 46047 44579 33815 10180 -12889 -35413
757 -35413 -45947 -44859 -33374 -9207 13458 35193 45690 44588 32429 8847 -13333 -34733
769 -34733 -45267 -43871 -31418 -8850 13242 34413 44781 43139 30657 8693 -13746 -34666
781 -34666 -44549 -42791 -30048 -8006 14851 35218 44686 42778 29554 7150 -15662 -35642 -44852
794 -44852 -42540 -28878 -6562 16078 35450 44477 41841 28162 6512 -15997 -34877 -43832 -41138
$$ packed form
706C9209k7100j9823k4645j6461K581Q459K4854K1207K5830J4489l115p755k4612
719A3118k3113k5250j2432J925P672K5890K3469K3628J1990n01q942k6439k2137
732a1122k2734j2741L67J0245K5381K0953K3156J3094j241j0692k3779k1341k3567
745c4021j2334J704J0548K3210K2450K3411J1079j468j0764k3635k3069k2524
757c5413j0534J088J1485K4167K2665K1735J0497j102j2159k3582k2180k1400
769c4733j0534J396J2453K2568K2092K1171J0368j642j2482k1964k2439k0920
781c4666r883J758J2743K2042K2857K0367R468j908j3224k2404k2812j9980r210
794d4852K312J3662K2316K2640J9372R027k636j3679k1650k2509j8880q955K694
$$ plain form
807 -41138 -27492 -6307 16045 34519 43291 40607 26940 5889 -16537 -34832 -43312 -40275 -26247
820 -26247 -5057 17358 35359 43565 40008 25651 4215 -18058 -35690 -43448 -39512 -25017 -3716
833 -3716 18324 35416 42915 38816 24356 3483 -18191 -34876 -42128 -38096 -23764 -3147 18300
846 18300 34755 41706 37580 23083 2458 -18824 -35134 -41694 -37169 -22333 -1478 19701 35710
859 35710 41845 36661 21684 710 -20171 -35814 -41462 -36152 -20968 -369 20204 35489 40717
872 40717 35535 20426 241 -19968 -35017 -40004 -34955 -19906 154 19980 34856 39609 34483
885 34483 19160 -795 -20493 -35288 -39513 -34000 -18364 1535 21183 35747 39278 33596 17658
898 17658 -2094 -21581 -35671 -38652 -33086 -17076 2385 21423 35123 37817 32704 16590 -2586
$$ packed form
807d1138J3646K1185K2352J8474Q772k684j3667k1051k2426j8295q480L037J4028
820b6247K1190K2415J8001Q206l557j4357k1436k2273j7632p758L936J4495K1301
833c716K2040J7092P499m099j4460k0873k1674j6685p252M032J4332K0617K1447
846A8300J6455O951m126j4497k0625k1282j6310o560M525J4836K0855K1179J6009
859C5710O135n184j4977k0974k0881j5643n648N310J5184K0599K0573J5285N228
872D0717n182j5109k0185k0209j5049m987N049J5049K0060J9826J4876M753n126
885C4483j5323j9955j9698j4795m225N513J5636J9899J9648J4564L531n682j5938
898A7658j9752j9487j4090k981N566J6010J9461J9038J3700K694n113j6114j9176
$$ plain form
911 -2586 -21056 -34524 -37274 -32200 -15774 2873 21130 34595 36997 31521 14777 -3279 -21744
924 -21744 -35197 -36807 -30912 -14089 3800 22694 35445 36122 30466 13581 -4328 -23147 -34896
937 -34896 -35289 -30354 -12997 4910 22803 33873 34809 30054 12027 -4864 -22135 -33528 -34687
950 -34687 -29224 -11022 4734 22192 33977 34331 28190 10435 -4718 -23257 -34453 -33501 -27724
963 -27724 -10267 5332 24388 33995 32579 27809 9879 -6217 -24344 -32643 -32298 -27838 -8839
976 -8839 6488 23281 31742 32535 27174 7612 -5838 -22616 -32063 -32398 -25671 -6919 5071 23470
990 23470 32676 31338 24589 7131 -5494 -25200 -32365 -30059 -24659 -7123 6916 25865 30868
1003 30868 29722 25198 6120 -7905 -24854 -29534 -30466 -24855 -4592 7319 23421 29537 30818
$$ packed form
911b586j8470j3468k750N074J6426J8647J8257J3465K402n476j6744j8056j8465
924b1744j3453j610N895J6823J7889J8894J2751O77n656j6885j7909j8819j1749
937c4896l93M935J7357J7907J7893J1070R36m755j8027j6891j7271j1393j159
950c4687N463J8202J5756J7458J1785L54o141j7755j5153j8539j1196R52N777
963b7724J7457J5599J9056R607j416m770j7930j6096j8127q299L45M460J8999
976h839J5327J6793Q461P93n361j9562j3450j6778r447l35O727J8752J1990J8399
990B3470R206j338o749j7458j2625j9706p165K306N400J7536J4039J8949N003
1003C0868j146m524j9078j4025j6949m680r32N611K0263J1911J6102O116J281
$$ plain form
1016 30818 23115 3838 -5880 -23422 -30376 -29792 -21349 -4416 5516 25266 30351 28124 21135 5012
1030 5012 -6977 -26696 -28768 -27481 -21920 -4343 8748 26012 27037 28393 22063 2641 -8770
1043 -8770 -24150 -26713 -29501 -20431 -1541 7001 23395 27658 28827 18317 2267 -5773 -24626
1056 -24626 -27995 -26962 -17585 -3536 6715 26280 26742 25787 18467 3600 -8872 -26356 -24881 -26300
1070 -26300 -19075 -1909 9926 24528 24143 27726 18027 460 -8559 -22996 -25073 -27840 -15767
1083 -15767 -754 6767 23519 25806 26048 14485 2284 -6930 -25139 -24899 -24362 -14886 -3072 8995
1097 8995 25692 23023 24329 15766 1825 -10753 -24331 -22042 -25705 -15274 -95 10317 22535
1110 22535 22713 26381 13467 -78 -8469 -22173 -23715 -25094 -11940 -1287 7712 23283 23474 23187
$$ packed form
1016C0818p703j9277r718j7542o954N84Q443J6933R932J9750N085k227o989j6123
1030E012j1989j9719k072J287N561J7577J3091J7264J025J356o330j9422j1411
1043h770j5380k563k788R070J8890Q542J6394M263J169j0510j6050q040j8853
1056b4626l369J033R377J4049J0251J9565M62r55p320j4867j2472j7484J475j419
1070b6300P225J7166J1835J4602l85L583r699j7567r019j4437k077k767J2073
1083a5767J5013P521J6752K287K42j1563j2201r214j8209K40N37R476J1814J2067
1097H995J6697k669J306q563j3941j2578j3578K289l663J0431J5179J0412J2218
1110B2535J78L668j2914j3545q391j3704j542j379J3154J0653Q999J5571J91k87
$$ plain form
1124 23187 12003 2584 -9004 -23995 -21939 -22524 -13007 -2048 10949 23206 20739 23411 13096
1137 13096 440 -11265 -21651 -21033 -24305 -11756 380 10116 20827 22019 23709 10250 543
1150 543 -8893 -21304 -22156 -22078 -9884 -1951 9334 21920 21126 21020 10685 2097 -10802 -21601 -20017
1165 -20017 -21283 -11082 -910 11638 20463 19855 21977 10396 -240 -11217 -19588 -20669 -21794
1178 -21794 -9189 8 10167 19693 21109 20602 8811 1093 -9815 -19928 -20534 -19531 -9185 -1600
1192 -1600 10651 19828 19588 19352 9717 978 -11511 -19122 -19231 -19672 -9412 28 11457 18424 19727
1207 19727 19689 8555 -345 -10882 -18238 -20164 -19046 -8151 -177 10498 18328 19954 18119 8315
1221 8315 854 -10567 -18209 -19287 -17725 -8809 -693 11009 17816 18866 17673 8767 8 -11214
$$ packed form
1124B3187j1184r419j1588j4991K056n85R517J0959J2997J2257k467K672j0315
1137A3096j2656j1705j0386O18l272J2549J2136R736J0711J192J690j3459r707
1150E43r436j2411q52P8J2194P933J1285J2586p94j06j0335q588j2899j0799J584
1165b0017j266J0201J0172J2548Q825o08K122j1581j0636j0977q371j081j125
1178b1794J2605R197J0159R526J416n07j1791p718j0908j0113o06J003J0346P585
1192a600J2251R177k40k36r635q739j2489p611j09m41J0260R440J1429O967J303
1207A9727l8j1134q900j0537p356j926J118J0895P974J0675P830J626j835r804
1221H315p461j1421p642j078J562Q916Q116J1702O807J050j193q906q759j1222
$$ plain form
1235 -11214 -17372 -18954 -17747 -8287 548 10997 17279 19326 17370 7866 -447 -10650 -17291 -19232
1249 -19232 -16846 -7978 16 10395 17034 18837 16440 8298 113 -10427 -16716 -18432 -16349 -8428
1263 -8428 88 10466 16417 18400 16255 8191 -546 -10502 -16420 -18499 -15981 -7802 850 10491 16484
1278 16484 18401 15708 7746 -757 -10288 -16329 -18268 -15455 -7937 544 10024 16055 17959 15295 8042
1293 8042 -493 -9847 -15836 -17832 -15206 -8029 738 9936 15871 17762 15001 7741 -1025 -10023 -15884
1308 -15884 -17722 -14814 -7541 1170 10091 15914 17631 14666 7557 -1112 -9851 -15677 -17441 -14483 -7605
1323 -7605 949 9672 15465 17274 14453 7670 -888 -9523 -15375 -17215 -14338 -7615 1180 9606 15489
1338 15489 17116 14181 7312 -1398 -9803 -15555 -17111 -14054 -7230 1405 9785 15445 16999 14012 7249
$$ packed form
1235a1214o158j582J207R460Q835J0449O282K047j956r504q313j0203o641j941
1249a9232K386Q868P994J0379O639J803k397q142q185j0540o289j716K083P921
1263h428Q516J0378N951J983k145q064q737r956n918k079K518Q179Q652R641N993
1278A6484J917k693p962q503r531o041j939K813P518Q481R480O031J904k664p253
1293H042q535r354n989j996K626P177Q767R198N935J891k761p260q766q998n861
1308a5884j838K908P273Q711Q921N823J717k965p109q669q739n826j764K958O878
1323g605Q554Q723N793J809k821o783q558q635n852j840K877O723Q795Q426N883
1338A5489J627k935o869q710q405n752j556L057O824Q635Q380N660J554k987o763
$$ plain form
1353 7249 -1359 -9531 -15256 -16774 -13982 -7349 1104 9319 15080 16753 13939 7382 -1094 -9361 -15071
1368 -15071 -16729 -13785 -7192 1300 9548 15118 16643 13638 6906 -1548 -9722 -15166 -16631 -13548 -6818
1383 -6818 1587 9717 15045 16598 13442 6829 -1483 -9535 -14831 -16449 -13448 -6939 1326 9495 14740
1398 14740 16444 13400 6870 -1434 -9574 -14795 -16389 -13131 -6631 1648 9884 14829 16379 12998 6381
1413 6381 -1984 -10061 -14832 -16405 -12951 -6333 1956 9999 14655 16439 12781 6357 -1811 -9772 -14483
1428 -14483 -16379 -12695 -6481 1659 9806 14547 16304 12554 6455 -1794 -9992 -14445 -16251 -12321 -6303
1443 -6303 2176 10269 14504 16277 12341 6087 -2504 -10301 -14345 -16438 -12142 -5943 2444 10074 14330
1458 14330 16541 11904 6036 -2171 -9948 -14417 -16363 -11648 -6245 2083 10212 14350 16080 11627 6363
$$ packed form
1353G249q608q172n725j518K792O633Q453Q215N761J673k814o557q476q267n710
1368a5071j658K944O593Q492Q248N570J525l005o732q454q174n444j465L083O730
1383f818Q405Q130N328J553l156o613q312q052n296j618L001O509Q265Q169N245
1398A4740J704l044o530q304q140n221j594L258O500Q279Q236M945J550l381o617
1413F381q365q077m771j573L454O618Q289Q043M656J784l658o424q168p961m711
1428a4483j896L684O214Q140Q147M741J757l750o099q249q198m453j806L930O018
1443f303Q479Q093M235J773l936o254q591p797m044k093M296O199Q387P630M256
1458A4330K211m637n868q207p777m469j946M715N403Q328Q129M138J730m453n264
$$ plain form
1473 6363 -2494 -10494 -14115 -16077 -11639 -6002 3109 10497 13991 16305 11468 5594 -3354 -10212 -14072
1488 -14072 -16515 -11090 -5447 2990 10014 14346 16473 10723 5815 -2700 -10145 -14440 -16002 -10500 -6334
1503 -6334 3042 10516 14083 15729 10811 6227 -3812 -10609 -13765 -15973 -10863 -5611 4294 10221 13849
1518 13849 16328 10444 5047 -4108 -9785 -14332 -16369 -9805 -5250 3549 9999 14687 15835 9534 5966
1533 5966 -3616 -10431 -14423 -15182 -9915 -6389 4290 10456 13794 15173 10316 5658 -5171 -9996 -13720
1548 -13720 -15830 -10066 -4844 5188 9467 14287 16028 9249 4652 -4555 -9521 -14966 -15443 -8690 -5382
1563 -5382 4277 10028 14881 14615 8993 5994 -4860 -10349 -14220 -14244 -9729 -5647 5797 9925 13730
1578 13730 14804 9732 4604 -6103 -9238 -14174 -15239 -9029 -3880 5533 9151 15075 14824 8176 4238
$$ packed form
1473F363q857q000l621j962M438N637R111P388L494K314m837n874q948o858l860
1488a4072k443N425N643Q437P024M332K127n750m908q515p445m295j562N502M166
1503f334R376P474L567J646m918m584j0039o797l156k208N110N252R905N927L628
1518A3849K479n884n397r155n677m547k037O564M555Q799O450M688J148o301l568
1533E966r582o815l992p59N267L526J0679O166L338J379m857m658j0829m825l724
1548a3720k110N764N222J0032M279M820J741o779m597r207m966n445m77O753L308
1563e382R659N751M853k66n622k999j0854n489l871k4M515M082J1444M128L805
1578A3730J074n072n128j0707l135m936j065O210N149R413L618N924k51o648l938
$$ plain form
1593 4238 -4983 -9767 -15334 -13850 -8280 -5116 5292 10282 14771 13219 9141 5212 -6126 -9899
1607 -9899 -13949 -13524 -9596 -4291 6623 9175 14053 14169 9089 3230 -6202 -8750 -14976 -14075 -8139
1622 -8139 -3274 5590 9277 15519 13191 7863 3998 -5481 -9934 -15181 -12421 -8602 -4529 6140 9950
1637 9950 14268 12510 9354 3954 -6576 -9256 -13929 -13119 -9217 -2897 6353 8663 14499 13309 8346
1652 8346 2446 -5747 -8994 -15161 -12642 -7782 -2807 5535 9697 15124 11827 8117 3364 -5948 -10025
1667 -10025 -14367 -11641 -8908 -3206 6366 9467 13850 12019 9112 2458 -6290 -8964 -14033 -12357 -8566
1682 -8566 -1755 5910 8990 14595 12078 7806 1778 -5536 -9643 -14692 -11338 -7714 -2249 5699 10044
1697 10044 14216 11027 8300 2307 -6019 -9900 -13668 -11260 -8674 -1915 5993 9396 13546 11684 8420
$$ packed form
1593D238r221m784n567J484N570L164J0408M990M489j552m078l929j1338l773
1607i899m050M25L928N305J0914K552M878J16n080n859r432k548o226R01N936
1622h139M865Q864L687O242k328n328l865r479m453n247K760L819M073J0669L810
1637I950M318j758l156n400j0530k680m673Q10L902O320R250K310N836j190m963
1652H346n900q193l247o167K519M860M975Q342M162N427l297l710m753r312m077
1667a0025m342K726K733N702R572L101M383j831k907o654q748k674n069J676L791
1682h566O811P665L080N605k517m272o028p314m107n049L354L624N465P948M345
1697A0044M172l189k727n993q326l881l768K408K586O759P908L403M150j862l264
$$ plain form
1712 8420 1401 -5686 -9247 -13863 -11585 -7833 -1199 5447 9644 14027 11089 7441 1334 -5548 -10155
1727 -10155 -13792 -10753 -7667 -1403 5719 10100 13314 10813 8021 1283 -5746 -9813 -13129 -11121 -8131
1742 -8131 -1098 5575 9588 13193 11171 7628 889 -5313 -9817 -13269 -10952 -7335 -799 5446 10097
1757 10097 13238 10697 7199 831 -5531 -10239 -12853 -10586 -7307 -740 5619 10137 12747 10779 7440
1772 7440 707 -5435 -9941 -12607 -10940 -7353 -682 5330 9945 12653 10858 7047 652 -5433 -10057
1787 -10057 -12546 -10688 -6859 -543 5586 10263 12443 10574 6704 425 -5637 -10206 -12331 -10563 -6784
1802 -6784 -503 5511 10101 12281 10696 6838 591 -5401 -10022 -12248 -10717 -6817 -541 5363 10021
1817 10021 12187 10631 6574 455 -5524 -10185 -12086 -10509 -6421 -257 5695 10256 11992 10442 6240
$$ packed form
1712H420p019p087l561m616K278L752O634O646M197M383k938l648o107o882m607
1727a0155l637L039L086O264P122M381L214k501k792o738p029m067l316K008K990
1742h131P033O673M013L605k022l543o739o202m504l452K317L617O536O245M651
1757A0097L141k541l498o368o362m708k614K267L279O567O359M518K610j968l339
1772G440o733o142m506k666J667L587O671O012M615K708j795l811o395o085m624
1787a0057k489J858L829O316O129M677K180j869l870o279o062m569k125J768L779
1802f784O281O014M590K180j585l858o247n992m621k226J531L900O276N904M658
1817A0021K166j556m057o119n979m661j901J577M088O164N952M561J736j550m202
$$ plain form
1832 6240 197 -5699 -10146 -11988 -10518 -6382 -372 5549 10116 11917 10526 6466 485 -5498 -10046
1847 -10046 -11900 -10522 -6383 -386 5584 10128 11964 10396 6245 238 -5674 -10189 -11871 -10253 -6025
1862 -6025 -48 5813 10129 11842 10253 5933 98 -5794 -10123 -11858 -10263 -6089 -222 5728 10121
1877 10121 11873 10347 6138 228 -5681 -10119 -11790 -10324 -6066 -56 5789 10198 11798 10173 5838
1892 5838 -99 -5929 -10271 -11724 -10057 -5721 308 6012 10303 11720 10017 5681 -263 -6039 -10313
1907 -10313 -11750 -10070 -5781 210 5952 10279 11728 10129 5876 -254 -5904 -10362 -11749 -10082 -5742
1922 -5742 455 6004 10405 11700 9880 5521 -639 -6106 -10500 -11674 -9863 -5369 769 6159 10637
1937 10637 11696 9827 5472 -669 -6175 -10707 -11599 -9826 -5595 721 6166 10691 11558 9957 5520
$$ packed form
1832F240o043n896m447j842J470M136O010N921M567J801j391m060n981n983m548
1847a0046j854J378M139N997N970M544J836j568m151o007n912m515j682J618M228
1862f025N977N861M316J713j589m320n835n892m329j735J595M174N867N950M393
1877A0121J752j526m209n910n909m438j671J466M258O010N845M409J600j625m335
1892E838n937n830m342j453J667M336O029N704M291J417j703m336n944n776m274
1907a0313j437J680M289N991N742M327J449j599m253o130n650m458j387J667M340
1922e742O197N549M401J295j820m359o160n467m394j174J811M494O138N390M478
1937A0637J059j869m355o141n506m532q92J773M231O316N445M525Q67j601m437
$$ plain form
1952 5520 -852 -6183 -10679 -11546 -9944 -5266 1150 6247 10784 11670 9729 4938 -1286 -6260 -10990
1967 -10990 -11467 -9555 -4837 1324 6422 11173 11371 9582 5054 -1209 -6489 -11149 -11175 -9790 -5092 1402
1983 1402 6506 11099 11252 9937 4927 -1697 -6483 -11134 -11325 -9836 -4525 1803 6419 11332 11235 9504
1999 9504 4160 -1788 -6657 -11678 -11053 -9279 -4283 1665 6902 11688 10761 9583 4531 -1923 -6999
2014 -6999 -11472 -10751 -9959 -4348 2144 6833 11362 10952 10012 3810 -2209 -6691 -11511 -11081 -9642 -3337
2030 -3337 2039 6850 12008 10833 9137 3336 -1997 -7334 -12132 -10366 -9189 -3587 2115 7670 11836
2045 11836 10187 9607 3536 -2551 -7537 -11471 -10520 -9973 -3066 2690 7244 11571 10875 9620 2425 -2483
2061 -2483 -7276 -12059 -10689 -8932 -2221 2210 7760 12355 10120 8672 2504 -2397 -8417 -12013 -9770
$$ packed form
1952E520o372n331m496q67J602M678O416N097M537Q86j941m791o224m974m730
1967a0990m77J912M718O161N098M751J98j789m528o263n280m660k6J385M698O494
1983A402N104M593J53j315n010o624m786m651j91J489N311O328M616M913r7j731
1999I504n344n948m869n021O25J774M996N948N237M786r27j178n052o454n076
2014f999m473P21P92N611O492M689M529m10r40o202o019m482m820M30J439O305
2030c337N376M811N158j175j696n801n333n337m798J766J177N602N702N555M166
2045A1836j649n80o071o087m986l934R51N47O907N756M554M327o96j255p195m908
2061b483m793m783J370J757O711M431N550M595k235j448o168m901o020l596K243
$$ plain form
2076 -9770 -9130 -2608 2851 8497 11514 9972 9650 2120 -3120 -8109 -11380 -10557 -9554 -1546 2881 7824
2092 7824 11772 10654 8768 1248 -2455 -8266 -12234 -10100 -8182 -1466 2515 9025 12030 9543 8388
2107 8388 1647 -3083 -9385 -11383 -9501 -8898 -1360 3608 9022 11052 10194 9000 720 -3399 -8529
2122 -8529 -11317 -10629 -8337 -323 2929 8752 11822 10226 7548 474 -2805 -9547 -11826 -9495 -7383
2137 -7383 -740 3347 10134 11104 9239 7843 635 -3959 -9909 -10591 -9818 -8025 -19 4097 9380 10741
2153 10741 10366 7584 -367 -3611 -9287 -11255 -10215 -6805 316 3333 9857 11299 9590 6399 -3
2168 -3 -3712 -10395 -10842 -9116 -6569 74 4422 10400 10306 9278 6765 -465 -4735 -10039 -10217 -9894 -6497
2185 -6497 935 4474 9730 10595 9984 5957 -903 -4102 -9950 -10800 -9666 -5455 621 4283 10423 10556
$$ packed form
2076i770O40O522N459N646L017j542l22p530n240m989l271Q23J003Q008M427M943
2092G824L948j118j886p520l703n811l968K134J918O716L981O510L005k487j155
2107H388o741m730o302j998J882O03P538M968N414K030q58j194q280m119n130
2122h529k788O88K292Q014L252N823L070j596k678p074l279o742k279K331K112
2137g383O643M087O787R70j865j396p208m594n950o82P73J793Q006M116N283J361
2153A0741l75k782p951l244n676j968J040L410P121L017O524J442j709l191o402
2168cl709o683m47J726K547O643M348N978r4j028k513p230m270n304j78L23L397
2185f497P432L539N256Q65o11m027o860l199n848q50J134M211O076L662O140J33
$$ plain form
2201 10556 9051 5366 -514 -4873 -10538 -10062 -8915 -5463 915 5344 10296 9757 9201 5359 -1286
2216 -1286 -5294 -9885 -10012 -9442 -4943 1360 5030 9951 10303 9237 4545 -1076 -5029 -10275 -10208 -8748
2232 -8748 -4411 1058 5419 10399 9851 8519 4285 -1272 -5859 -10192 -9545 -8506 -4134 1680 6014
2247 6014 9906 9642 8613 3894 -1775 -5830 -9814 -9791 -8637 -3657 1645 5797 9994 9842 8221 3501
2263 3501 -1536 -5976 -10083 -9599 -7939 -3382 1738 6312 9936 9353 7728 3200 -2050 -6446 -9702
2278 -9702 -9197 -7613 -3000 2185 6494 9571 9321 7567 2727 -2186 -6407 -9591 -9424 -7420 -2699 2149
2294 2149 6528 9656 9329 7274 2638 -2199 -6645 -9539 -9073 -6949 -2397 2484 6740 9319 8843 6766
2310 6766 2134 -2630 -6731 -9223 -8791 -6608 -1989 2729 6792 9189 8817 6511 1968 -2706 -6758
$$ packed form
2201A0556j505l685n880m359n665M76J147L452O378M429M952n39n56l842o645
2216a286m008m591j27N70M499O303L670M921L52j066m692n621l953n246O7J460
2232h748M337N469M361M980n48j332m234n557m587m333O47J039M372N814M334
2247F014L892k64j029m719n669m055l984K3J154M980N302M152M197j52j621m720
2263C501n037m440m107M84J660M557N120M574L624n83j625m528n250m396l256
2278i702N05J584M613N185M309L077k50j754m840m913m221l184J67K004M721M848
2294B149M379L128l27k055m636m837m446k894M66K124M552M881M256K579m76k077
2310F766m632m764m101k492M32K183M619M718M063K397l72k306m543m674m052
$$ plain form
2325 -6758 -9173 -8806 -6409 -1996 2727 6842 9114 8707 6240 1826 -2829 -6828 -9030 -8542 -5986 -1549
2341 -1549 3032 6821 8910 8336 5706 1410 -3209 -6848 -8773 -8205 -5601 -1272 3244 6917 8795
2356 8795 8183 5594 1404 -3217 -6778 -8725 -8149 -5531 -1312 3232 6829 8684 7960 5244 1046 -3383
2372 -3383 -6887 -8520 -7823 -4965 -861 3541 6861 8394 7590 4870 688 -3567 -6799 -8350 -7480 -4793
2388 -4793 -685 3603 6856 8321 7496 4747 767 -3532 -6811 -8228 -7450 -4689 -613 3549 6822
2403 6822 8124 7246 4548 515 -3631 -6708 -8004 -7110 -4318 -276 3673 6767 7838 6927 4193 232
2419 232 -3689 -6733 -7829 -6853 -4155 -161 3721 6752 7869 6858 4178 155 -3596 -6674 -7729
2434 -7729 -6763 -4062 -10 3687 6655 7570 6623 3783 -152 -3769 -6618 -7457 -6440 -3662 236 3809
$$ packed form
2325f758k415L67K397M413M723M115K272m07k467m414m655l999k202M88K556M437
2341a549M581L789K089n74k630m296m619l639j925N68K604M329M516L673J878
2356H795o12k589m190m621l561j947N76K618M219M544L597J855p24k716m198m429
2372c383l504j633O97K858M104M402L320J533q04k720m182m255l232j551Q70K687
2388d793M108M288L253J465q25k749l980m299l279j417P78K761M076M162L273
2403F822J302q78k698m033m146l077j296Q94K792M042L949L094J071r11k734l961
2419B32l921l044j096R76K698L994L882L031J117j011k680m023l751l078j055
2434g729R66K701M052L697K968R15r47k840l935l617k849q39J017K778L898L573
$$ plain form
2450 3809 6662 7304 6255 3543 -306 -3801 -6665 -7209 -6308 -3525 366 3768 6611 7191 6321 3515
2466 3515 -397 -3721 -6515 -7110 -6230 -3375 479 3676 6603 7018 6039 3140 -490 -3739 -6526 -6788
2482 -6788 -5830 -3012 568 3790 6604 6599 5786 3011 -692 -3841 -6567 -6491 -5852 -2983 668 3713 6424
2499 6424 6560 5972 2837 -715 -3611 -6416 -6508 -5832 -2650 662 3642 6452 6404 5530 2579 -675 -3677
2516 -3677 -6463 -6118 -5404 -2473 769 3843 6405 5906 5557 2538 -789 -3827 -6216 -5981 -5679 -2403
2532 -2403 922 3679 6129 6057 5644 2205 -777 -3553 -6212 -6062 -5434 -1948 723 3653 6314 5745
2548 5745 5166 2036 -580 -3876 -6209 -5482 -5134 -2047 867 4001 5969 5456 5381 1966 -976 -3796
2564 -3796 -5835 -5628 -5488 -1746 864 3582 5866 5806 5257 1632 -663 -3588 -6060 -5595 -4963 -1629 492
$$ packed form
2450C809K853O42j049k712l849l495k864n44R01K783L891L402K843N80q70k806
2466C515l912l324k794n95Q80K855L854L197K927M15r79k899l630l249k787k62
2482f788R58K818L580L222K814nq13k775l703l149k726P6O39K869L651L045K711
2499F424J36n88l135l552k896k805r2O76L182L312K980K810m8q74k951l254l002
2516c677k786L45P14K931L242L074K562m99l49l019l327l038k389K35L02L276
2532b403L325K757K450p2m13l439k982k776k659J50O28L486K671K930K661n69
2548E745n79l130k616l296k333P27L48L087K914L134J968n13p5l415k942k820
2564c796k039K07J40L742K610K718K284o0n49l625k295k925k472M65O32L334K121
$$ plain form
2581 492 3836 6073 5218 4861 1806 -636 -4146 -5810 -5049 -5075 -1668 966 3996 5405 5293 5280 1413
2598 1413 -909 -3747 -5492 -5604 -5125 -1274 680 3667 5704 5582 4799 1265 -384 -3934 -5841 -5240
2614 -5240 -4646 -1498 499 4179 5518 4968 4723 1499 -885 -4270 -5222 -4980 -4925 -1240 984 3980 5167
2631 5167 5393 4897 1001 -790 -3790 -5379 -5517 -4572 -980 497 3973 5536 5323 4377 1193 -436
2647 -436 -4238 -5400 -4986 -4361 -1307 684 4441 4997 4907 4512 1149 -936 -4188 -4803 -5199 -4533 -929
2664 -929 928 4001 4992 5475 4323 882 -726 -3986 -5244 -5458 -4129 -1088 536 4252 5295 5131
2680 5131 4053 1240 -718 -4393 -4978 -4975 -4208 -1158 1067 4358 4686 5183 4177 900 -1127 -4123 -4719
2697 -4719 -5331 -4050 -816 975 4046 4956 5390 3835 939 -812 -4241 -5046 -5271 -3741 -1190 898
$$ packed form
2581D92L344K237q55l57l055k442l510j664P61k6L407K634L030J409j12j3l867
2598A413k322k838j745j12M79L851J954K987K037j22p83l534j649l550j907O01
2614e240N94L148J997L680J339n50k45l224k384l385r52K42N5L685K224K996J187
2631E167K26m96l896j791l000j589j38R45L592J477L476J563k13r46l184j629
2647d36l802j162M14O25L054J991L757N56r0l95l363k085l252o15l96O66L604
2664i29J857L073R91M83j152l441j608l260j258k14J329L041J624L716J043j64
2680E131j078k813j958l675n85LP67L050K225L291L28M97j006l277k027k996n96
2697d719o12J281L234J791L071R10M34j555k896j751l429q05k25J530K551K088
$$ plain form
2713 898 4425 4989 5074 3783 1176 -1146 -4441 -4708 -5032 -3816 -954 1379 4294 4652 5202 3699 788
2730 788 -1293 -4132 -4818 -5274 -3518 -837 1197 4090 5022 5197 3462 982 -1209 -4332 -4946 -5082 -3476
2747 -3476 -1089 1399 4375 4816 5034 3471 982 -1542 -4264 -4696 -4987 -3373 -754 1639 4180 4763
2763 4763 5137 3314 792 -1573 -4138 -4866 -5130 -3171 -836 1580 4266 5014 5028 3230 961 -1695
2779 -1695 -4358 -4912 -4999 -3211 -871 1808 4315 4889 4963 3153 661 -1882 -4232 -4834 -4829 -2989 -565
2796 -565 1936 4172 4894 4843 2930 527 -1929 -4230 -5026 -4832 -2919 -551 1998 4298 5066 4788 2903
2813 2903 639 -2111 -4304 -4928 -4817 -2930 -499 2160 4269 4909 4635 2824 371 -2200 -4206 -4859
2829 -4859 -4635 -2658 -311 2207 4252 4928 4572 2662 291 -2313 -4215 -5005 -4536 -2620 -241 2366
$$ packed form
2713H98L527N64Q5j291k607k322l295k67l24J216K862K333K915L58N50j503k911
2730G88k081k839o86m56J756K681K034K893R32J75j735k480k191l123o14j36J606
2747c476K387K488K976M41K18j563k489k524k722m32k91J614K619K393K541N83
2763D763L74j823k522k365k565p28k64J959K335K416K686P48J4j798k269k656
2779a695k663n54q7J788K340K679K507N74P4j810k492k543k350o02NJ840K424
2796e65K501K236P22n1j913k403k456k301p96J94J913K368K549K300P68k78j885
2813B903k264k750k193o24J11J887K431K659K109O40k74j811k453k571k006o53
2829d859K24J977K347K518K045O76l56j910k371k604j902p90M69J916K379K607
$$ plain form
2845 2366 4349 5018 4566 2733 225 -2375 -4321 -5008 -4468 -2550 -95 2456 4318 4969 4364 2411
2861 2411 23 -2529 -4273 -4882 -4254 -2471 58 2516 4282 4811 4202 2368 -61 -2598 -4313 -4891
2877 -4891 -4233 -2383 135 2638 4415 4946 4226 2324 -193 -2707 -4388 -4850 -4081 -2193 374 2703
2893 2703 4329 4805 3955 2090 -406 -2764 -4320 -4765 -3892 -1989 485 2784 4318 4727 3898 1967
2909 1967 -484 -2783 -4399 -4745 -3933 -1937 501 2787 4434 4763 3820 1923 -594 -2860 -4366 -4630
2925 -4630 -3702 -1705 697 2986 4272 4534 3664 1632 -703 -2958 -4287 -4458 -3555 -1535 782 3022
2941 3022 4349 4530 3550 1551 -745 -3057 -4331 -4583 -3504 -1495 855 3108 4417 4494 3438 1409
2957 1409 -909 -3142 -4268 -4380 -3336 -1204 987 3119 4204 4303 3185 1147 -1049 -3194 -4152 -4188
$$ packed form
2845B366J983O69m52j833k508k600j946o87N40J918K455K551J862O51o05j953
2861B411k388k552j744o09O28J783K529K458J766N29o09j834k429k537j715n78
2877d891O58J850K518K503J777N31p20j902k517k514j681m62P69J888K567K329
2893B703J626M76q50j865k496k358j556m45Q73J903K474K299J534M09q29j931
2909A967k451k299j616l46Q12J996K438K286J647L29r43j897k517k266j506k64
2925d630R28J997K402K289J286K62q70k032k335k255j329j71R03K020K317K240
2941C022J327J81r80j999k296k312j274k52J079K009K350K253J309P7j056k029
2957A409k318k233j126j12J044K132K191K132J085R9j118k038k196k145r58l6
$$ plain form
2973 -4188 -3149 -1083 1121 3187 4155 4333 3083 1019 -1060 -3299 -4237 -4260 -3064 -1026 1099 3318
2989 3318 4144 4195 2902 892 -1186 -3381 -4020 -4107 -2812 -884 1241 3341 3845 4042 2735 725 -1339
3006 -1339 -3369 -3853 -4039 -2657 -663 1350 3335 3946 4083 2568 618 -1310 -3396 -3970 -3973 -2415 -669
3023 -669 1362 3425 3862 3869 2343 578 -1460 -3478 -3710 -3748 -2292 -433 1597 3404 3625 3728 2183
3040 2183 349 -1655 -3301 -3612 -3802 -2027 -306 1528 3300 3677 3698 1909 379 -1603 -3378 -3688
3056 -3688 -3572 -1802 -381 1671 3459 3497 3463 1835 329 -1804 -3286 -3241 -3459 -1703 -121 1816 3189
3073 3189 3246 3503 1577 37 -1763 -3090 -3363 -3428 -1404 -80 1718 3191 3413 3265 1383 186 -1777
3090 -1777 -3319 -3224 -3130 -1325 -186 2047 3274 3080 3092 1348 30 -2038 -2945 -2907 -3083 -1141 148 1959
$$ packed form
2973d188J039K066K204K066R68J78j250k064k079k239r38k3J196K038K125K219
2989C318Q26N1j293k010k078k195o39q7J295J928K125K100N04J97j307k010k064
3006a339k030m84j86J382J994K013J985O11J37j515j950j928k086n74lJ558J746
3023f69K031K063M37Pj526j765k038k018k32l8J456J859K030J807K21J03j545
3040B183j834k004j646l11j90J775J721J834J772L77K1j789j530j982j775l10
3056c688J16J770J421K052J788L8l4j628j506k133j482M5k18J756J582J937J373
3073C189N7K57j926j540j800j327k73o5K024J324J798J473K22j48j882j197j963
3090a777j542R5R4J805J139K233J227j94J2j744j318k068r07L8j76J942J289J811
$$ plain form
3108 1959 2840 3069 3127 1014 -53 -1871 -2861 -3205 -2942 -873 -14 1846 3004 3077 2745 941 65 -2027
3126 -2027 -2926 -2825 -2615 -975 -49 2101 2716 2708 2645 936 -163 -2080 -2519 -2728 -2652 -697 314 1933
3144 1933 2495 2894 2555 624 -157 -1871 -2636 -2878 -2251 -621 -8 1996 2678 2687 2147 796 -143 -2131
3162 -2131 -2474 -2543 -2202 -736 303 2099 2254 2471 2231 710 -326 -1935 -2149 -2544 -2055 -414 267 1861
3180 1861 2290 2583 1890 446 -243 -1812 -2297 -2446 -1761 -548 218 1944 2254 2301 1818 621 -338 -1970
3198 -1970 -2052 -2260 -1819 -562 388 1837 1928 2249 1715 386 -430 -1682 -1864 -2284 -1556 -370 306 1663
3216 1663 1982 2232 1446 495 -306 -1733 -1933 -2072 -1360 -557 316 1773 1853 2015 1411 486 -424 -1727 -1685
3235 -1685 -1975 -1408 -414 493 1515 1567 1986 1329 361 -341 -1414 -1705 -1950 -1192 -382 357 1416 1640 1811
$$ packed form
3108A959Q81K29N8k113j067j818r90l44K63K069Q59J860J158P3l32j804q76k092
3126b027q99J01K10J640R26K150O15qo3j709j099j917m39k09P6J955J011J619
3144A933N62L99l39j931p81j714p65k42O27J630O13K004O82Rn40j351r39j988
3162b131l43o9L41J466J039J796J55K17k40j521j036j609k14l95M89J641O81J594
3180A861M29K93o93j444o89j569m85j49O85J213P66J726L10M7m83j197r59j632
3198a970q2k08M41J257R50J449R1L21n34j329q16j252j82m20P28J186O76J357
3216A663L19K50p86r51q01j427k00j39P12Q03Q73J457Q0J62o04r25r10j303M2
3235a685k90N67R94R07J022N2M19o57r68p02j073k91k45P58Q10P39J059K24J71
$$ plain form
3254 1811 1218 477 -329 -1442 -1598 -1750 -1194 -489 402 1432 1510 1778 1253 435 -392 -1240 -1452 -1712 -1086
3273 -1086 -418 388 1180 1395 1652 1017 386 -314 -1165 -1372 -1588 -1053 -509 317 1107 1390 1514 1042 444 -271
3293 -271 -1155 -1287 -1457 -1048 -386 327 1102 1318 1444 1057 428 -294 -992 -1260 -1382 -965 -423 282 880 1203
3313 1203 1368 975 487 -263 -922 -1171 -1317 -881 -449 226 927 1148 1328 930 498 -238 -858 -1135 -1267 -958
3333 -958 -470 144 769 1126 1244 974 520 -85 -724 -1081 -1184 -910 -532 129 723 1032 1233 914 574 -30
3353 -30 -611 -988 -1130 -957 -534 48 613 1026 1161 973 589 -10 -570 -954 -1133 -957 -535 22 546 930
3373 930 1093 949 547 57 -514 -904 -1063 -959 -583 -71 521 842 1052 980 689 118 -448 -851 -1078 -1022 -591
3394 -591 -150 418 880 1078 965 663 171 -420 -879 -1061 -1014 -681 -220 387 740 1026 991 699 208 -265 -758
$$ packed form
3254A811n93p41q06j113j56j52N56P05Q91J030P8K68n25q18q27q48k12k60O26
3273a086O68Q06P92K15K57o35o31p00q51k07k16N35N44Q26P90K83J24m72n98p15
3293b71q84j32j70M09O62P13P75K16J26l87o29p22o98k68j22M17N42P05N98L23
3313A203J65l93m88p50o59k49j46M36M32O75P01K21J80l98m32p36o20k77j32L09
3333i58M88O14O25L57J18k70m54o05o39l57j03K74L78O61N94L09K01l19l40o04
3353c0n81l77j42J73M23N82N65M13J35j88l84n99n60l84j79J76M22N57N24L84
3373I30J63j44m02m90n71l90j59J04L76N12N92L21K10p2k91n71n66m03k27N6M31
3394e91M41N68M62J98j13l02m92n91m59j82M7L33M61O07L53K86l5k92m91m73m93
$$ plain form
3415 -758 -1012 -1009 -690 -274 354 764 1016 1027 776 281 -274 -736 -974 -981 -741 -250 245 755 1026 1057 820 263
3437 263 -340 -769 -1008 -994 -784 -313 228 751 1008 1028 758 341 -229 -692 -966 -1026 -796 -377 195 658 1009
3458 1009 1057 810 371 -222 -696 -998 -1055 -814 -388 213 725 1032 1140 879 394 -172 -709 -987 -1161 -883
3478 -883 -452 204 693 1024 1106 931 445 -115 -731 -996 -1126 -936 -404 91 676 1061 1071 940 403 -62 -683
3499 -683 -1098 -1072 -993 -440 134 697 1024 1192 1023 426 -119 -673 -1054 -1157 -1014 -401 131 668 1124 1167 1011
3520 1011 474 -43 -748 -1038 -1136 -986 -492 82 720 1066 1076 980 494 -97 -710 -1125 -1206 -1063 -423 112 688
3541 688 1094 1207 1120 475 -16 -691 -1112 -1138 -1034 -491 -20 739 1133 1143 1060 521 26 -726 -1109 -1166 -1059 -540
3563 -540 -9 758 1006 1115 1090 480 -81 -745 -1104 -1210 -1098 -478 -58 736 1104 1200 1065 416 29 -708 -1103
$$ packed form
3415g58k54LL19M16O28M10K52J1k51m95n55m62k38pK40M91M95N10K71L1k37n57
3437B63o03m29k39J4K10M71N41N23K57K0k70m17n70m63k74o0K30M19N72M63L51
3458A009M8k47m39n93m74l02n7K41M26O01N12L07J08k61m85n66n37k78j74K78
3478h83M31O56M89L31Q2j75m86n60o16k65j30J90N32M95N85L85J0j31n37m65o21
3499f83m15K6P9N53N74N63L27J68j69n97n45n54l81j03J43O13N32N37M56M3j56
3520A011n37n17p05k90r8J50M94N74O38L46J0r6m86n91o13m15q1J43O40N35N76
3541F88M06J13q7o45m91o75m21k6J04N43M71P59L94J0q3n39m95p52l83n7J07N19
3563e40N31P67K48J09k5o10n61o64l59j06J12O20M20P94L68R6j35o49l87p37l95
$$ plain form
3584 -1103 -1235 -1017 -403 -11 747 1076 1221 1096 566 59 -733 -1052 -1208 -1125 -502 0 749 1080 1256 1124
3604 1124 456 -21 -726 -1037 -1270 -1084 -446 -85 754 1058 1237 1008 507 109 -789 -1117 -1226 -1022 -470 -69
3624 -69 868 1033 1196 1067 511 11 -776 -980 -1240 -1075 -505 -10 752 1009 1322 1073 429 1 -777 -1130
3644 -1130 -1307 -1039 -482 -110 739 1064 1236 980 554 140 -876 -1040 -1274 -1114 -552 -41 848 1015 1221
3663 1221 1118 499 25 -825 -925 -1320 -1135 -476 -35 785 1051 1359 1056 529 71 -735 -1023 -1291 -1078 -560
3683 -560 -115 799 971 1285 1083 609 91 -830 -979 -1293 -1090 -590 -31 790 998 1295 1109 563 -53 -727
3703 -727 -966 -1339 -1101 -519 -68 660 1025 1322 1115 566 115 -688 -984 -1288 -1031 -651 -130 729 982 1287
3723 1287 1094 681 97 -747 -985 -1313 -1110 -633 -43 657 987 1358 1104 643 24 -688 -1018 -1403 -1096 -624
$$ packed form
3584a103j32K18O14L92P58L29J45j25n30n07p92l19j56Q3O23N02P49L31J76j32
3604A124o68m77p05l11k33J86O38L61Q39L04J79k29n01l98q98l28j09K04N52M01
3624f9R37J65J63j29n56n00p87k04k60J65N70M95P62K57L13k49o44m28p78l53
3644a130j77K68N57L72Q49L25J72k56m26m14j016j64k34J60N62N11Q89J67K06
3663A221j03o19m74q50j00l95J85O59M41Q20K66L08l03n27m58q06k88k68K13N18
3683e60M45R14J72L14k02m74n18r21j49l14K03N00N59Q21K08K97j86n46o16o74
3703g27k39l73K38N82M51P28L65K97k07n49m51q03k96l04K57L80N21Q59K53L05
3723A287j93m13n84q44k38l28K03M77N90P00L30L71k54m61o19p12l30l85L07M72
$$ plain form
3743 -624 -39 661 1057 1368 1019 725 74 -668 -1031 -1352 -1064 -718 -35 679 1009 1363 1099 713 99 -610
3763 -610 -1012 -1353 -1114 -698 -62 635 996 1346 1144 732 80 -636 -1084 -1406 -1113 -775 -139 675 1074 1390
3783 1390 1116 776 75 -643 -994 -1367 -1152 -774 -105 639 1089 1338 1198 750 102 -577 -1079 -1437 -1212 -771
3803 -771 -162 592 1072 1412 1200 829 104 -617 -1138 -1448 -1246 -813 -127 636 1155 1500 1267 855 141 -635
3823 -635 -1110 -1407 -1270 -863 -159 638 1183 1430 1228 820 168 -620 -1095 -1473 -1299 -818 -120 626 1205 1530
3843 1530 1322 871 112 -636 -1189 -1513 -1362 -849 -117 635 1208 1470 1367 881 102 -660 -1206 -1573 -1399 -889
3863 -889 -180 672 1194 1500 1379 870 125 -641 -1254 -1550 -1351 -869 -120 659 1270 1599 1458 864 104 -704
3883 -704 -1364 -1670 -1469 -855 -104 736 1439 1604 1456 937 117 -697 -1341 -1661 -1420 -863 -108 768 1350 1654
$$ packed form
3743f24N85P00L96L11l49k94o51p42l63l21K88L46O83P14L30L54k64l86o14p09
3763f10m02l41K39M16O36O97L61L50k02m12o52p16m48l22K93L38O36Q14L99L16
3783A390k74l40p01p18l51l73K15L78O69P44M50K49j40m48o48o79n02l58K25M41
3803g71O09P54M80L40k12l71p25p21n21l10K02M33O86P63N19L45k33m12p14p76
3823f35m75k97J37M07P04P97N45K47k02m08o52p88m75l78J74M81O98P46N79L25
3843A530k08m51p59p48n53l24J51N13P32P52N73K62j03m86p79p62n46l67J74N10
3863h89P09Q52N22L06j21n09p45p66o13k96J99M82P49P79O11L29j41n94p60q08
3883g04o60l06K01O14P51Q40P03J65j48n19q20q14o44l20K41N57P55Q76N82L04
$$ plain form
3903 1654 1435 860 105 -796 -1374 -1691 -1434 -953 -80 782 1420 1689 1521 929 35 -775 -1462 -1745 -1479 -886
3923 -886 -81 862 1476 1742 1526 929 54 -811 -1486 -1788 -1557 -939 -27 862 1529 1758 1530 886 9 -908
3943 -908 -1594 -1779 -1593 -954 23 972 1600 1845 1565 915 -38 -944 -1570 -1840 -1560 -954 38 1008 1660 1869
3963 1869 1555 906 -73 -935 -1619 -1884 -1554 -858 104 982 1683 1915 1558 896 -111 -1019 -1701 -1940 -1557
3982 -1557 -850 161 1121 1757 1946 1610 892 -191 -1086 -1777 -1966 -1548 -822 289 1053 1819 1953 1550 820
4001 820 -263 -1128 -1797 -1974 -1543 -749 311 1173 1806 1961 1574 831 -350 -1155 -1894 -2032 -1588 -734 372
4020 372 1178 1979 2005 1554 706 -436 -1253 -1992 -2016 -1563 -759 397 1289 1977 1916 1616 728 -493 -1278 -1986
4040 -1986 -2002 -1568 -654 480 1326 2016 1967 1548 602 -553 -1425 -2105 -1993 -1539 -614 525 1421 2108 1914
$$ packed form
3903A654k19n75p55r01n78l17K57M81Q73Q62O38K69j68n92q94q10o87k83K66N93
3923h86Q05R43O14K66k16n97q75q65o75l02K31O18R12Q89O67K29k28o44q77r17
3943i08o86j85J86O39R77R49O28K45k80o50r53r06o26k70K80O06R92R70O52K09
3963A869l14o49r79q62o84k65L30O96R62Q78P01K32l57o62j007r08o82k39L83
3982a557P07J011R60O36J89l36p18j083q95o91j89M18P26J111P64P66J34m03p30
4001H20j083q65o69j77M31P94J060Q62O33J55l87p43j181q05p39j38M44Q54J106
4020C72Q06Q01K6m51q48j142q17p39k4M53Q04J156Q92O88o1l00q88j221p85p08
4040a986j6M34R14J134Q46O90m9m19r46j155q72o80J12M54R25J139Q96O87j94
$$ plain form
4059 1914 1489 591 -610 -1440 -2207 -1934 -1572 -583 640 1422 2125 1951 1541 498 -695 -1474 -2120 -1970
4077 -1970 -1516 -445 688 1476 2220 2015 1435 430 -700 -1525 -2320 -1984 -1470 -435 808 1621 2300 1904
4095 1904 1472 425 -786 -1632 -2254 -1798 -1513 -293 871 1586 2224 1927 1502 204 -906 -1626 -2288 -1940
4113 -1940 -1400 -230 870 1688 2308 1882 1334 117 -880 -1768 -2316 -1803 -1391 -167 996 1807 2264 1808
4131 1808 1464 103 -1037 -1782 -2248 -1814 -1403 42 1034 1707 2287 1801 1317 -55 -976 -1759 -2386 -1781
4149 -1781 -1224 74 1000 1909 2392 1706 1224 -81 -1035 -1962 -2299 -1698 -1267 185 1149 1921 2270 1771 1231
4168 1231 -276 -1149 -1829 -2238 -1772 -1135 323 1077 1897 2273 1723 1052 -316 -1044 -2017 -2340 -1595 -1046 278
4187 278 1147 2101 2249 1586 1057 -346 -1304 -2153 -2141 -1560 -1040 468 1251 2066 2105 1611 1041 -542 -1214 -1922
$$ packed form
4059A914m25q98j201q30p67K73L62R89J223P82P03j74m10j043j193p79o46J50
4077a970M54J071J133P88P44k05n80j005j130q25p95L36N14J035J243Q13O79l96
4095A904m32j047j211q46o22M56K85J220J164P15O38k97m25j298j110p20o62L48
4113a940N40J170J100Q18O20m26n48j217r97q88n48N13M12J224J163Q11M57m56
4131A808l44j361j140p45m66M34M11J445R92O73N80m86m84j372r21p83o27O05
4149a781N57J298R26R09M83o86m82j305r54r27l37O01M31J452R64P72L49m99n40
4168A231j507q73o80m09M66O37J458P54Q20L76n50o71j368p28r73l23P45N49J324
4187B78Q69R54J48o63n29j403r58q49J2N81N20J508P83Q15L9m94n70j583o72p08
$$ plain form
4207 -1922 -2151 -1656 -938 542 1165 2041 2217 1571 864 -540 -1159 -2092 -2116 -1474 -828 554 1331 2148 2047
4226 2047 1530 860 -623 -1341 -2110 -1995 -1492 -836 675 1376 2039 1993 1504 647 -706 -1304 -2042 -2086 -1475
4245 -1475 -616 643 1322 2082 1984 1373 533 -641 -1356 -2152 -1951 -1393 -539 725 1417 2150 1892 1375 578
4264 578 -769 -1476 -2094 -1891 -1424 -431 827 1423 2094 1809 1323 386 -846 -1406 -2074 -1841 -1320 -367 727
4283 727 1426 2086 1813 1215 348 -782 -1503 -2105 -1783 -1218 -378 874 1589 2059 1735 1247 265 -884 -1539
4302 -1539 -2007 -1682 -1141 -190 870 1481 2028 1697 1192 158 -813 -1453 -2035 -1690 -1081 -167 887 1587 2021
4321 2021 1619 1068 129 -904 -1569 -1948 -1596 -1017 -56 966 1613 1868 1598 1043 -8 -928 -1607 -1874 -1546
4340 -1546 -928 40 979 1539 1921 1516 912 -40 -923 -1587 -1875 -1445 -867 63 956 1553 1823 1413 869 -107
$$ packed form
4207a922k29M95P18J480O23Q76J76o46p07j404o19r33k4O42O46J382P77Q17j01
4226B047n17o70j483p18p69J15N03O56J511P01O63m6m89q57j353n98p38m4O11
4245a475Q59J259O79P60r8o11q40j174p15p96K01N58Q54J264O92P33k58n17p97
4264E78j347p07o18K03M67R93J258N96O71k85m86r37j232n60o68K33N21R53J094
4283G27O99O60k73n98q67j130p21o02L22N65Q40J252P15M70l24m88r82j149o55
4302a539m68L25N41R51J060O11N47l31n05j034r71o40n82L45O09R14J054P00M34
4321B021m02n51r39j033o65l79L52N79R61J022O47K55k70n55j051r20o79k67L28
4340a546O18R68R39N60L82m05o04r52q83o64k88M30N78R30Q93N97K70m10n44r76
$$ plain form
4360 -107 -1009 -1576 -1848 -1428 -817 173 1005 1578 1815 1374 818 -164 -985 -1526 -1752 -1349 -673 156 977 1518
4380 1518 1685 1323 741 -180 -974 -1526 -1654 -1365 -686 259 1014 1564 1653 1281 639 -284 -1038 -1515 -1684 -1263
4400 -1263 -659 309 1065 1569 1632 1211 639 -255 -1017 -1536 -1612 -1209 -539 282 1025 1511 1562 1186 560 -288 -993
$$ packed form
4360a07r02n67k72M20O11R90Q32N73K37m41n56r82q21n41k26M03O76Q29Q21N41
4380A518J67l62n82r21p94n52j28K89O79R45P55N50Q9l72o42r23p54m77j69M21
4400a263O04R68P56N04O3m21n72q94p62n19p6M03O70Q21P43M86N1l76o26q48p05
$$ [...]
8191b82
##END NTUPLES=NMR FID
##END=
