##TITLE=1H_Ser Van-OH
 CDCl3, 8 sc, 
 3.7.2020
##JCAMPDX= 6.0         $$ Bruker NMR JCAMP-DX V2.0
##DATA TYPE= NMR FID
##DATA CLASS= NTUPLES
##ORIGIN= UXNMR, Bruker Analytische Messtechnik GmbH
##OWNER= root
$$ XWIN-NMR		Version 3.5
$$ Fri Jul  3 11:48:16 2020 Russian Standard Time (UT+4h)  she@DPX200
##.OBSERVE FREQUENCY= 200.1315
##.OBSERVE NUCLEUS= ^1H
##.DELAY= (6, 6)
##.ACQUISITION MODE= SIMULTANEOUS
##.ACQUISITION SCHEME= undefined
##.AVERAGES= 8
##.DIGITISER RES= 18
##SPECTROMETER/DATA SYSTEM= spect
##.PULSE SEQUENCE= zg30
##.SOLVENT NAME= CDCl3
##.SHIFT REFERENCE= (INTERNAL, CDCl3, 0, 15.7039)
##AUDIT TRAIL= $$ (NUMBER, WHEN, WHO, WHERE, WHAT)
$$ ##TITLE= Audit trail, XWIN-NMR		Version 3.5
$$ ##JCAMPDX= 5.01
$$ ##ORIGIN= Bruker BioSpin GmbH
$$ ##OWNER= she
$$ F:/spectra/data/she/nmr/H-F/1/audita.txt
$$ ##AUDIT TRAIL=  $$ (NUMBER, WHEN, WHO, WHERE, WHAT)
(   1,<2020-07-03 11:46:45.20 +0400>,<she>,<DPX200>,
      <created by zg, POWCHK disabled, PULCHK disabled
       configuration hash MD5:
       00 E9 B6 7A A2 85 ED C7 34 08 36 98 17 FE 4E 26
       data hash MD5: 16K
       19 43 AE F6 3F 24 3F 36 74 C0 2F E6 DB 93 A1 62>)
$$ ##END=
$$ 
$$ hash MD5
$$ 30 B7 21 1A 56 54 5A B3 0D 97 8E A2 2F D1 34 15
##$RELAX= 
##$RELAX= 
##$RELAX= 
##$RELAX= 
##$RELAX= 
##$RELAX= 
$$ Bruker specific parameters
$$ --------------------------
##$DU= <F:/spectra>
##$EXPNO= 1
##$NAME= <H-F>
##$PROCNO= 1
##$TYPE= <nmr>
##$USER= <she>
##$AMP= (0..31)
100 100 100 100 100 100 100 100 100 100 100 100 100 100 100 100 100 100 
100 100 100 100 100 100 100 100 100 100 100 100 100 100 
##$AQSEQ= 0
##$AQ_mod= 1
##$AUNM= <au_zg>
##$AUTOPOS= <>
##$BF1= 200.13
##$BF2= 200.13
##$BF3= 200.13
##$BF4= 200.13
##$BF5= 200.13
##$BF6= 200.13
##$BF7= 200.13
##$BF8= 200.13
##$BYTORDA= 1
##$CFDGTYP= 0
##$CFRGTYP= 5
##$CHEMSTR= <none>
##$CNST= (0..31)
1 1 145 1 1 1 1 1 1 1 1 1 1 1 1 1 1 1 1 1 1 1 1 1 1 1 1 1 1 1 1 1 
##$CPDPRG= <>
##$CPDPRG1= <>
##$CPDPRG2= <>
##$CPDPRG3= <>
##$CPDPRG4= <mlev>
##$CPDPRG5= <mlev>
##$CPDPRG6= <mlev>
##$CPDPRG7= <mlev>
##$CPDPRG8= <mlev>
##$CPDPRGB= <>
##$CPDPRGT= <>
##$D= (0..31)
0 1.2 0 0 0 0 0 0 0 0.06 0 0.03 0 0 0 0 0.0002 0 0 0 0 0 0 0 0 0 0 0 0 
0 0 0 
##$DATE= 1593762404
##$DBL= (0..7)
120 120 120 120 120 120 120 120 
##$DBP= (0..7)
150 150 150 150 150 150 150 150 
##$DBP07= 0
##$DBPNAM0= <>
##$DBPNAM1= <>
##$DBPNAM2= <>
##$DBPNAM3= <>
##$DBPNAM4= <>
##$DBPNAM5= <>
##$DBPNAM6= <>
##$DBPNAM7= <>
##$DBPOAL= (0..7)
0.5 0.5 0.5 0.5 0.5 0.5 0.5 0.5 
##$DBPOFFS= (0..7)
0 0 0 0 0 0 0 0 
##$DE= 6
##$DECBNUC= <off>
##$DECIM= 24
##$DECNUC= <off>
##$DECSTAT= 4
##$DIGMOD= 1
##$DIGTYP= 9
##$DL= (0..7)
0 120 120 120 120 120 120 120 
##$DP= (0..7)
150 150 150 150 150 150 150 150 
##$DP07= 0
##$DPNAME0= <>
##$DPNAME1= <>
##$DPNAME2= <>
##$DPNAME3= <>
##$DPNAME4= <>
##$DPNAME5= <>
##$DPNAME6= <>
##$DPNAME7= <>
##$DPOAL= (0..7)
0.5 0.5 0.5 0.5 0.5 0.5 0.5 0.5 
##$DPOFFS= (0..7)
0 0 0 0 0 0 0 0 
##$DQDMODE= 0
##$DR= 18
##$DS= 0
##$DSLIST= <SSSSSSSSSSSSSSS>
$$ [...]
##$SUBNAM2= <"">
##$SUBNAM3= <"">
##$SUBNAM4= <"">
##$SUBNAM5= <"">
##$SUBNAM6= <"">
##$SUBNAM7= <"">
##$SUBNAM8= <"">
##$SUBNAM9= <"">
##$SW= 24.9337058887773
##$SWIBOX= (0..15)
0 0 2 0 0 0 0 0 0 0 0 0 0 0 0 0 
##$SW_h= 4990.01996007984
##$TD= 16384
##$TD0= 1
##$TE= 0
##$TE2= 300
##$TE3= 300
##$TEG= 300
##$TL= (0..7)
0 120 120 120 120 120 120 120 
##$TP= (0..7)
150 150 150 150 150 150 150 150 
##$TP07= 0
##$TPNAME0= <>
##$TPNAME1= <>
##$TPNAME2= <>
##$TPNAME3= <>
##$TPNAME4= <>
##$TPNAME5= <>
##$TPNAME6= <>
##$TPNAME7= <>
##$TPOAL= (0..7)
0.5 0.5 0.5 0.5 0.5 0.5 0.5 0.5 
##$TPOFFS= (0..7)
0 0 0 0 0 0 0 0 
##$TUNHIN= 0
##$TUNHOUT= 0
##$TUNXOUT= 0
##$USERA1= <user>
##$USERA2= <user>
##$USERA3= <user>
##$USERA4= <user>
##$USERA5= <user>
##$V9= 5
##$VALIST= <valist>
##$VCLIST= <CCCCCCCCCCCCCCC>
##$VD= 0
##$VDLIST= <DDDDDDDDDDDDDDD>
##$VPLIST= <PPPPPPPPPPPPPPP>
##$VTLIST= <TTTTTTTTTTTTTTT>
##$WBST= 1024
##$WBSW= 4
##$XGAIN= (0..3)
0 0 0 0 
##$XL= 0
##$YL= 0
##$YMAX_a= 103371
##$YMIN_a= -52801
##$ZGOPTNS= <>
##$ZL1= 120
##$ZL2= 120
##$ZL3= 120
##$ZL4= 120
##$ABSF1= 10
##$ABSF2= 0
##$ABSG= 5
##$ABSL= 3
##$ALPHA= 0
##$AQORDER= 0
##$ASSFAC= 0
##$ASSFACI= 0
##$ASSFACX= 0
##$ASSWID= 0
##$AUNMP= <proc_1d>
##$AZFE= 0.1
##$AZFW= 0.1
##$BCFW= 1
##$BC_mod= 2
##$BYTORDP= 1
##$COROFFS= 0
##$CY= 11.3945322036743
##$DATMOD= 1
##$DC= 2
##$DFILT= <>
##$DTYPP= 0
##$F1P= 16.9975609425685
##$F2P= -3.02152046262296
##$FCOR= 0.5
##$FTSIZE= 0
##$FT_mod= 4
##$GAMMA= 1
##$GB= 0.15
##$INTBC= 1
##$INTSCL= 1
##$ISEN= 128
##$LB= 0.24
##$LEV0= 0
##$LPBIN= 0
##$MAXI= 10000
##$MC2= 0
##$MEAN= 0
##$ME_mod= 0
##$MI= 1.114404
##$NCOEF= 0
##$NC_proc= 0
##$NLEV= 6
##$NOISF1= 3.799351
##$NOISF2= 2.8
##$NSP= 1
##$NTH_PI= 0
##$NZP= 0
##$OFFSET= 15.70392
##$PC= 1
##$PHC0= -9804.031
##$PHC1= 29.60087
##$PH_mod= 1
##$PKNL= yes
##$PPARMOD= 0
##$PSCAL= 0
##$PSIGN= 0
##$REVERSE= no
##$SF= 200.130013532006
##$SI= 16384
##$SIGF1= 3
##$SIGF2= 2
##$SINO= 400
##$SIOLD= 16384
##$SREGLST= <1H.CDCl3>
##$SSB= 0
##$STSI= 0
##$STSR= 0
##$SW_p= 3612.71676300578
##$SYMM= 0
##$S_DEV= 0
##$TDeff= 0
##$TDoff= 0
##$TI= <>
##$TILT= no
##$TM1= 0
##$TM2= 0
##$TOPLEV= 0
##$USERP1= <user>
##$USERP2= <user>
##$USERP3= <user>
##$USERP4= <user>
##$USERP5= <user>
##$WDW= 1
##$XDIM= 8192
##$YMAX_p= 0
##$YMIN_p= 0
$$ End of Bruker specific parameters
$$ ---------------------------------
##NTUPLES= NMR FID
##VAR_NAME=  TIME,          FID/REAL,        FID/IMAG
##SYMBOL=    X,             R,               I
##VAR_TYPE=  INDEPENDENT,   DEPENDENT,       DEPENDENT
##VAR_FORM=  AFFN,          ASDF,            ASDF
##VAR_DIM=   8192,          8192,            8192
##UNITS=     SECONDS,       ARBITRARY UNITS, ARBITRARY UNITS
##FACTOR=    0.0002004,     1,               1
##FIRST=     0,             0,               0
##LAST=      1.6414764,     0,               0
##MIN=       0,             -52801,          0
##MAX=       1.6414764,     103371,          0
$$ Real data points
##PAGE= N=1
##DATA TABLE= (X++(R..R)), XYDATA
$$ [...]
1955c03K22l20M74M9K12p4m84R4J91L8p3J36m36J51L62k7m2J00l82j53m35N85
1977a15J42K18k69K85m67k70J06L06M56j72j57j07k30j55M2K89K64m31J81k57
1997c41M29r1K59j10k4m22m8P07l16M74R5k24m43l62J44L11M64j91j03l49k21
2018c62J43J54P5N62m10j04l08K8M18k10k2M1k83j38K42J11l1L27k63k17m8j1
2040c06K80N38k9n79QJ14j28J25J92K66j75l98r6m9L37J62L20l19m87j89K84L05
2062A76j24K04k90J16j35O5J66k12J85j05l24l9J09K21J79j93j16j73j53q5M79
2083d9K66j04m6k62p9k25N50O5J91j95k39R8J62o62M19M30m49K85k77J25l37N51
2105B18J14l47k1oj19J07M06P2k55j91l74l9M34K87Q6n04K05k62j09J06L18O7
$$ y = [-303, -81, -401, 73, 122, 334, 260, -224, -130, 61, 99, 26, 162, -274, -123, 239, 212, 170, 270, -112, -265, -700, -115, 27, 245, -24, 261, -206, -476, -370, -64, 392, 220, 63, -44, -274, -429, -387, -98, 166, -265, -84, -341, 88, -3, 256, 146, 122, -300, -348, 359, 43, 517, 612, 388, -55, -417, -273, 38, 502, 311, 208, -141, -362, -219, -65, 10, 572, 162, 58, -250, -222, 196, -14, -36, 5, -278, -416, -174, -63, -94, 233, -30, -247, -295, -306, -26, 512, 483, -96, -88, 26, -102, 23, 215, 481, 306, -92, -188, -237, 100, 262, 582, 263, -224, -413, -129, 176, 52, 256, -34, 82, -53, 12, 178, -34, 151, 46, -278, -317, -208, 13, 192, -1, -117, -290, -443, -528, -49, 217, 113, 67, -195, -274, -499, 51, 116, 307, 112, -127, -29, 133, -529, -110, 320, -129, 156, -121, 4, -333, 218, 332, -15, -36, -42, -161, -54, 352, 424, 169, -22, -396, -435, -1, 286, 372, -132, 73, -189, -298, -192, 126, 193]
2127A93k41J54k56r6M39J3j02J57m47M4lK23J80J5j88j32l40M10Q2M01k63q3J25
2150B85l31N8L6N83k28k66m56J64R7j67N56m0p2j54j28r9P0K54j21k15j44N1Q3
2173a84J57M00N2l68j00l60J37N51P2K5j88J8p11M42L10J32R7m11m2k52j49M01
2195B9r6J14J14k01L1J43l24R8L63j86rOo53M07J29J64Q0o02j72P03l06L75j2
2218A95N5m26k52K70j51K79K44L50p44j18j19M88k6KL63%p60K37m8K11J90N1l56
2241f5M0l52K1J99K60j56K2k94K51J71J38K58l56p8k44k01M57R8K39j30j77j81
2263h0l96K69L30J57O8l06k45L05m27O59J6p3k36m14Q9K78n0K58l12J89m1J1Q0
2286A29O9R0k1n9n70L08k4L33j1K92n41l88J11J07MN24n7k56J19j05j61N13l17
$$ y = [193, -48, 106, -150, -246, 193, 206, 104, 261, -186, -142, -145, 78, 258, 273, 85, -47, -387, 23, 105, 506, 243, 160, 285, -46, 12, 48, 631, 403, 137, -319, -155, -58, -225, 331, 291, 219, 65, -63, -162, -92, 162, 41, -174, -318, -267, -184, -27, 373, 425, 57, -43, -403, -266, 285, 357, 382, 194, 212, -499, -57, 253, 385, 482, 71, 29, -223, -372, 29, -67, 47, 161, -40, -9, 134, -190, -92, 271, 85, 76, 82, -571, -164, -35, 129, 209, -393, -565, 138, -168, 207, 195, 250, -176, -428, -158, -309, -30, 214, 564, -180, -298, -417, 71, 45, 47, 410, 410, -350, -113, -161, 50, 240, 291, -65, -25, -377, -356, -157, 103, -53, -31, -325, -74, 97, 235, 493, 137, 59, -185, -386, 71, 169, 408, 278, 101, -80, -476, -207, 123, 280, 348, 42, -203, 102, -325, 334, 350, 277, 41, -373, -284, -6, -56, 202, -110, 79, 38, 49, 129, 198, 288, 267, 208, -362, -54, -78, 255, 244, 536, -5, -393, -282, -175, -171, 353, 296, 40, 159, 54, -107, 406, 89]
2309H9K37k45j86q6J92J3k61N22l29k4j39L2K34j01L18m06P7k80L98m9L07l2m5
2332B36l43k93K98R9L22l07J95k81k87J7J17K38M3R1k48j31J45p2Q9M00j20n51
2354c43l1J98L32K25l72k17J29l58K81L33j19L36J37p54J29k50P1N18N5o57K34
2375a23n5K36r9k9L36j57j25k3P2K05Jk43j26P9k01L87j45J80K8n5l24K74j77
2398h4J48K91k2j04j86o5J76k03M14j98J61m36j32m6L32J17k08P0J07k92j16R8
2420a78L76P8l3k87r3k14N75J22j50n2k99p3j02K65M24l4p9l11k48K13O7L45r3
2443B19J1l50K34j11j36M75n9k07j78K5k37L13K90k40P6k50L1M7j22L21k58n2
2465a58j81K98j89R3L11l87M53l71p9r8J85L19K12k81k6q3j03R1M6K67l54J22
$$ y = [89, 326, 81, -105, -191, 1, 14, -247, 275, -54, -78, -217, -185, 49, -52, 266, -140, -63, -343, 55, 6, 313, 281, 236, -107, -400, -102, -3, 319, 12, 207, -74, -361, -344, -227, 11, 54, 145, -103, -234, -89, -161, -72, 328, 208, -343, -374, -176, 156, 381, 9, -208, -79, -437, -156, 177, 58, 394, 531, -223, -94, -344, -273, 245, 300, -357, -123, -178, 58, -41, -70, 266, 109, -16, -39, 33, 238, 239, -4, -130, -51, -252, 135, -10, 170, 198, 143, -181, 93, -84, 64, 355, 333, 229, 43, -22, 154, -49, 365, 167, 328, -108, -240, -286, 46, 163, -45, 25, 132, -160, -276, -178, 198, 276, 243, -44, -137, -351, 224, 346, 196, 144, -155, -228, -330, -65, 359, 325, 246, -65, -313, -100, -33, 312, 219, 230, -120, 114, 3, -133, 342, 283, 76, -102, -77, -314, -1, 289, 49, 125, -125, -94, -47, -169, 152, -106, -158, -339, -41, -230, -137, 174, -213, 240, -131, -210, -308, -123, 196, 408, 127, 101, 18, -85, 6, 52, 319, -35, 87]
2487H7l75J62O6L24k18J02m47K29k9K81N9rj53n13L41k36qK51N38k21n80o6J63
2510b52Q9K91K4k70k94M48l87N5L03L6LM55n80j55J85R1j0L14m23j96lJ19M38
2533B81q5j79Rj05l04M14M10o5j40j83j56J58j97K84O8R8j91k90M6j48J88J65
2555G8l7j8k87K17J6K20K2j30k08Q3K34k50K20K10P6k84m78L51J2J66L96m9m01
2578A59o00J76k8M87p0J32m35J6mQ8j26J97OQ2P4n71L74K84K0k34l04o6N0K12
2602h1K06J39k23j21l16j09L03J28N01k34j36j69J0J2M52j28o4j31J79l07k64
2623c53K24M07N1o16L50l02K0K34m7L20%m50k17M28j13M00m25j68J16j67L1J41
2645a36M31k6k57l48J65K7M45J86J01m55q1j19K9L0L02l97J18J12j81M6J95n1
$$ y = [87, -288, -126, -60, 264, 46, 148, -299, -70, -99, 182, 241, 232, 79, -434, -93, -329, -337, -86, 452, 231, -349, -415, -252, -163, 128, 152, -118, -412, 36, -351, -296, 7, 43, 46, 501, -79, -234, -49, 42, 32, 346, -77, -273, -276, -157, 281, 196, 17, 26, -79, -383, 31, 441, 376, 236, 53, -103, 55, -142, 142, 210, 308, 117, -173, -127, -275, -87, 78, 41, 23, -264, -47, -31, 189, 211, 81, -127, -44, 190, -60, 160, 370, 446, 162, -316, 35, 47, 213, 609, 560, 159, -441, -265, -293, 194, 124, 256, -179, -163, -167, -79, -205, -8, -2, 80, 154, -417, -43, 241, 261, 27, -277, -343, -293, -81, 125, 264, 41, -80, -396, -505, -202, -74, 427, 193, 57, -112, -102, -90, 362, 234, 170, 39, 218, -89, -353, -129, 278, 329, -287, 63, -239, -219, 15, -32, 288, 288, -162, -379, 49, -64, 336, -89, -257, -141, -308, -277, -136, 295, 269, 12, -336, -171, -144, 301, 487, 588, 133, 52, -67, -38, -8, 294, -103, 15, 127, -54, -8, 187, 136]
2667A36k2j67n7j02J59N36p5J13p01o6j93K38L04j2J11j27m28J66o0L71Q0J12
2689C16k92m4K01k35l6P9J79K37n27j82N74M4K4j00o2k41j83L96m2L0o1j11J16
2712H0l16r5M37j44K85j18n26J46L10k52O66j95n62J57j75J44l2K60J70l19l9
2733a18L18k09k34M55J01l81M53n25K76k0J91Nj14j45l39J49L41L8j36L2j25l18
2755c05L43o3J09M30q2n53j28L14j15j86K75M3O6l88q1L99P0j2J02n19K57J34
2777A10P8K99l68p1K2k95J0J85K34J35l37pJ84m24J72K77k68M54l69p4p1j2J94
2800E8K98k48J80n92K02L71l55L05m1j84n16L22M93j26K44l92j19k90J01O2O24
2821C97j01k76j34m26N31M4m0K94M7m20K90j00J97k85j28J19M9l27m2L88j8J13
$$ y = [136, 114, -53, -110, -212, -53, 483, 408, 521, -180, -246, -439, -201, 103, 91, 202, 75, -353, -187, -247, 124, 204, 316, 24, -20, 181, -54, -90, -11, 168, 405, -122, -304, 270, 314, 338, 238, 176, -65, -248, 148, 106, 136, 75, -36, 80, -236, -331, 106, -38, 247, 129, -397, -251, 59, -193, 473, 278, -284, -127, -302, -158, -190, 70, 240, -79, -118, 200, -9, -243, 212, 313, -68, 385, -140, 136, 116, 307, 312, 198, 53, -286, -137, 204, 242, 106, 138, 13, -305, 38, -25, 84, 514, 432, -121, -249, 65, -50, -236, 39, 82, 148, -240, -321, 78, 148, 136, 238, -281, -24, 110, 188, 487, 119, 48, 70, -225, -215, -30, 204, 339, 2, -5, 179, -245, -73, 204, -64, 390, 21, -53, -124, -136, 58, 356, 108, 288, -304, -102, 269, -86, 219, 178, -6, -522, -200, 293, 167, 411, 19, -100, -390, -289, -227, 397, 296, 20, -114, -540, -9, 35, -5, 289, 336, -84, 206, 106, 303, 18, -110, 9, 58, -269, -311, 77, 59, 172]
2843A72L0l61j07r2J42M44o3n94N09q1j73qN8M80n10l76m0K99K04o3J99j52J20
2866C7k15o5L6K69k7J15jj82j24J03K33q7j5n5n30N35K01q5l16L3J75rm94L54
2890a14J96N8O6m94K14k30L73J34l2k16m5o8L35k31n1L33J04l67l78J62L53J02
2912B04R2mj15k56m01N54J19J24l29K09m67M50j11O4r9o8J37n63L87oN28l65p9
2935EK67m17k31K52k17N77l97L83q7k45L62k79L07l86o1L09k53m6J23r2L13J6
2957B03k36k35K81R8O2lJ91m40M2oL55j78J3l81P8L9K64m05O53k73j72n5j90Q1
2981b14pL76l7k51k52K53O6J2J20J98J2n57J77n1K06J10N3N3o05p8J73M66j27
3004I6P3j55n3n1j16Q1L15J4j83l07o0J8R3L46j32K10l48j13K40m6L75j77q2J87
$$ y = [172, 202, -159, -266, -358, -216, 228, 165, -429, 80, -1, -174, -182, -124, 356, -154, -530, -570, -271, -67, -130, 69, -83, 37, -178, -243, -207, 62, 35, 150, 149, -33, -157, -54, 179, 92, 77, 22, -508, 27, 228, 143, -173, -140, 35, 26, -468, -114, 82, 140, 206, -288, -74, -304, 69, 203, 171, -45, -90, -158, 177, -54, -105, 228, 332, -35, -413, -251, 102, 204, 296, 292, 177, -79, -480, 74, 193, 317, -12, 197, -270, 180, 69, 133, 34, -34, 103, -460, -73, -79, 449, 84, 5, 272, -145, -376, -124, -341, 236, -161, 222, 135, -110, 252, -27, 280, -106, -167, 142, -111, -157, -34, -126, 187, 203, -33, -268, 13, 111, 173, 170, 361, -79, -37, -43, 312, 134, 147, -234, -156, -117, 147, -258, 395, 122, -50, -105, -295, -214, -221, 155, 118, -133, -385, -132, -66, -54, 66, 264, 276, -281, -104, -155, 51, 161, 214, 267, -338, -416, -243, 223, 96, 169, 14, -39, -90, -206, -125, 190, 204, 21, -286, -346, -328, -235, 111, -21, 189, -159, -272, -32, -78, 297, 120, 38, 225]
3028B25m07j7j7K79j84Q8Q4j40J44%j55K61K71l73l77K57O3K58r6J47k65J03m91
3051c42M24P7K7r0k51l9K5q5O43l43J63m22J22j67K9K69K69l96Q8j95N3j29L65
3074I5J17j78q7L7M9j22J75L25n50K99k15j90M85J47m43J94k14O2j5M0N7q9K1
3097@n3l91K91J38O4J93k28J3p4j38m9K85k9m5p7R5p6L16k85J98k97J22k87M19
3121A05j9K98n62J39L9K8k51K08M3J44j75l4j05J57O1n5J49O4k55k0l27K19K38
3144H9L9j14k3k09L28k23k62N45m2o3r3j84K09j46J44J88j95j48m6K78p9K92k83
3167BP0k2J3j04m8L27k66M9j27P7j33J13J06k77K55k76J46L03q9J16j47o1l33
3190c06R2K57R6j20%O8j8N1m09K09K00j82nL52j65l56L75j21k3L00k29j79K32
$$ y = [225, -182, -199, -216, 63, -121, -33, 51, -89, 55, 55, -100, 161, 432, 59, -318, -61, 2, 260, 164, 311, 46, 149, -342, 82, 159, 186, 96, -155, -194, -169, -254, 389, 46, 209, -213, -91, -258, -229, 40, 309, -87, 1, -194, -141, -270, 95, 212, 34, -53, -16, 33, -89, 86, 411, -139, 160, -55, -245, 240, 387, -56, 138, -76, -14, -29, 11, 68, -21, 0, -53, -444, -153, -15, 49, 242, 14, 27, -47, -185, -234, 51, 22, -23, -100, -5, -81, 235, -50, 148, -149, -27, -314, 105, 86, 384, -178, -39, 0, 28, -223, -15, 28, 172, -3, -37, -142, 15, 76, 21, 170, 234, -21, -41, -368, -149, 89, 128, 14, -9, -218, 110, -113, -375, 170, 128, 65, -28, -212, -3, -149, -5, 183, -12, -160, -206, 72, -7, 285, 2, 72, 50, 63, -41, -89, 238, -28, 21, -106, -29, -162, -49, 57, -220, 35, -241, -95, 208, 119, 235, 88, 27, -306, -214, 43, 139, 19, 19, 87, 69, 120, -289, -80, 120, -62, -67, 285, 120, -236, 139, 18, -5, 295, 66, -113, 119]
3213A19k76M59j04n2P8j14m3k72L18O1k19P1j36J60j48J85j51j59K14J03m20L12
3235a4q8k15J17K5K56L5j21o6K16k83kj51K18K85O7l73L82n05P6K90j11K27k12
3258E3k40J35Lk74J30J00J1J13j03l5J58J84l97J81Lj77j4K5J15j76K56o4J95
3281A82l49M0M3q4L62l25N5p1J37q2J15R5L8k61q3K46k0J47j74J93k27j07L2N
3305i3L7R1O1j35o7P7K46N1l51L28k71j80J84K05oL9k5k34n3m1k74L69R0K2j8
3330E2Q5J9l25K40r2k27M12j01k03J64J01K6j0j23k32j34M98k17J1J70j75j79
3352b40L71p9J1K7ll69M24k9m29K47K27j86M6m7K33k70k17Q7p5L01j13P9k27K84
3376E3N6l41j54K54k61K00K39k05r3K57k13N10m17K90q9k37J63j50K69%k09k15
$$ y = [119, -157, 302, 198, 146, 224, 110, 67, -205, 113, 174, -45, 26, -110, 50, -98, 87, -64, -223, -9, 94, -326, -14, -102, -317, -200, -175, 81, 116, -5, -71, 145, -138, -140, -291, -73, 212, 279, -94, 288, -217, -141, 149, 38, 265, 53, -187, -52, -49, -323, -193, -93, -82, 31, -72, -107, 51, 235, -162, 19, 22, -155, -169, -144, -29, -205, 51, -13, 182, -167, -127, -84, -168, 194, -131, -76, -147, -10, -92, 23, 118, 156, -105, -188, 58, 38, 185, 11, 204, -23, -130, -98, -93, -56, 35, 96, -39, -106, -29, 217, 268, -83, 245, -26, -206, -22, 183, 177, 216, 191, -43, -96, -137, -411, -42, 48, 70, 52, 137, 156, -169, 71, -21, -248, 164, 63, -140, 24, 125, 151, 141, 18, -214, -348, 150, -67, -56, 114, -61, -240, 131, 52, 63, 90, 87, -282, 142, 113, -316, -69, 158, -28, 18, -29, 204, -66, -283, -196, -271, 30, -83, -4, -231, 53, 109, -232, -386, -132, -393, -193, 46, -159, -252, 5, -208, 302, -115, 175, 86, -151, 12, -138, 131, 131, -78, -293]
3398b93L02j49J02L78l94K69r3j45j44M6L7j9O0M5M22n27j37J86L43n21L15jP
3421H9l36L70L1k29O5o8K27j84J49j37Q1k46L85j40K16m05K18j08K75j61J17l18
3443a09J49Q4L4k27O7m1O0J98k98J71ol67K34j23N70o4m00J54J01j40j31N2L4
3466BJ82m94K79j36K92PQr4J69j23l28J67L78l43j26K70N2j13k80L07n4o7o7K00
3490H8N1J0m10K17M02j96R4m38L41m54M10l38K74j98k2k10M11K3n3j65K33j1J78
3513B37k92n89N20L14j55L2j49POJ19R4j45k76J01RL39j88p4J56m4j59K66k48
3536a19K63L79n99J58l02P2J65j7k76K73k7J78j75K0k00J50k96M95k81L72j56
3557G7m8J34j53n8J41K5l88L39Q7m14L27J85l34m2L18k00K22k92k01L99m4Kq8
$$ y = [-293, 9, -140, -38, 340, -54, 215, 122, -23, -167, -121, -84, -103, -43, 2, 424, -103, -240, -54, 289, -232, 83, 82, 89, -247, 123, 154, -75, -10, -78, 149, -35, 114, -23, 58, -188, 197, 57, 273, -132, 86, -22, 253, 92, 209, -109, 40, 124, 158, -69, -2, -43, 17, 215, -83, 88, 82, -285, -51, -174, 396, 332, -68, 86, 187, 47, -84, -32, 2, 184, -310, -31, -167, 125, 132, 140, 46, 215, 92, -236, -69, 309, -34, -160, 110, 162, 49, -231, 76, 22, -45, -112, 88, 139, 149, -261, -44, 358, 162, 256, -182, 159, -295, 115, -223, 51, -147, -169, -379, 32, 55, 2, -163, 70, 59, 237, -55, -644, -124, 190, 35, 67, -82, -75, -69, 50, 144, -1, -277, -176, -167, 172, -16, -90, 66, 22, -137, 129, -119, 144, 523, -76, 82, -220, -148, 17, 0, -276, -3, -30, 148, -27, -7, -207, -57, -353, 142, -139, 233, 77, 29, 163, 10, -48, 93, 118, -270, 69, 156, -258, 69, 254, -80, -122, 196, -4, 218, -74, -275, 124, 80, 82, -6]
3580fj87rK13k05L00k28j1J44K22m45M05o8p1k46M98l85J20q7j34N13k90K5j2
3603E6j77j03J24K34j52Q3oK3j60K56j19J68k92j70K65m30K62k38N49M0m30J02
3625a15Q8J80k88j51L92J46k10k75N1K39l28O9J42K10q7Kl2O3k8P5k06K3R6j99
3649a43J20l5j83K89M8k94Q8K47q4j50Q9j73K7J63K2J77L44n55m8n5l3L53k50
3672c6O8j46k3K64l39L59j15j02l1M4q2L5j25J53j26K41P2k03L05j51k4j78K24
3695H4N0j07j73J28J76N9n97L67P4j11N4q3J12k29M6NL03o5J31k30j60Q1r2L85
3719B08l35j55K56LL9q1J92j31J38j79J64J49j71l2K12k63R5K22m19M2K69m39
3741b16L34k45P26p30j92L55k56M47n3k42k6J87j43j3j54R7J68j61J36R8j85O1
$$ y = [-6, -193, -202, 11, -194, 106, -122, -133, 11, 233, -212, 193, 125, 54, -192, 306, -79, 41, -46, -180, 333, 43, 68, 56, -121, -224, -100, 134, -18, 65, 59, 82, -78, 178, 59, 227, -65, -235, 30, -400, -138, -376, 173, 213, -217, -115, -27, 153, -135, -286, 106, 252, 42, -233, -182, 57, -271, -202, -60, 150, 63, 65, 33, 96, 68, 143, -63, -40, 56, -143, -23, -58, -241, 48, 96, -198, -110, 137, 53, -97, -8, -181, -154, 9, 31, 208, 552, -3, -51, -106, -139, 214, -36, 32, -114, -137, 127, -212, 147, 32, -70, -101, -57, -139, -104, -229, -76, -202, 39, 111, -92, 213, 62, 38, -140, 84, 134, 27, -146, -18, 158, 217, -380, -13, 61, -50, 4, -79, 33, -196, -150, -145, 158, 93, 224, -6, -166, -85, -177, 208, -127, -282, -26, -23, 16, -65, 127, -4, 134, -45, 119, 268, 97, 65, 277, 14, 109, 331, -88, -46, 223, -216, 118, -127, 599, -131, -323, 32, -224, 223, 170, -72, -98, 89, -54, -67, -221, -124, 44, -117, 19, 117, -68, -7]
3763gQ3l0j99m2N3J65k8k58n2O8P7J13Q5K01l92K95O4k37J54n8M8o9N0J1P8r1
3789H2m1k19J62K91k17j53k07M53k68N0j08J45R0J85j32k19J30Jk10K3J93o9J41
3812A03q8K10r8q8L7j74J92m7M0k62J43m9m6K07l62L96l95M31j02j61J76k65Q5
3835a17L44j27o6J15k14L4J22n1K36k98J66j10J01q6k51L81k11j87J04J54j24
3856h5J08n3J61m47K01o9K12j36J93K36k13j54j79J30K15J9r6J17p0J3M0Q8j48
3879H3k86J91k82K80Q0J61j42j55M1K7K49j57p3j51J76r4L69l11L1j13J33j42
3901h5l4L2Q4J74k49R6J51m18L70R3l10p3Q7j34L21j24J47n7k83J32K0L99k25
3924A14J77j52l29R1J65k24J02J41j49J18J28n9l00R4j42J88KJ92l36J4J93j06
$$ y = [-7, 76, 46, -153, -195, -142, 23, -5, -263, -315, -247, -170, -57, 28, 229, -163, 132, 196, -41, 113, 55, 103, 34, 84, 95, 173, 82, 41, -178, -16, 275, 58, -95, -302, 151, -117, -67, -175, -30, 60, 245, 113, -106, 24, 25, -185, -162, 31, -38, 103, 15, 225, 127, 39, 76, -98, 94, 47, 87, -175, -32, -81, -127, 80, -282, 114, -281, 150, 48, -113, 63, -202, -117, 227, 100, 34, 149, -65, -31, 91, 40, 276, -22, 144, 34, 135, 49, -202, 179, -32, -219, -115, 39, -85, 23, -30, 131, -316, -115, -184, 28, -108, 85, 321, 108, -46, -225, -95, 120, 139, 43, 160, 90, 103, 143, 231, 83, -203, -12, -294, -14, 66, 227, 85, -70, -29, -2, 247, 90, 17, -134, 42, -52, 317, 6, 37, -76, 57, -85, -119, -87, -3, 171, -78, 18, 169, -249, 121, 214, -96, -169, -82, -216, 105, -19, 128, 71, -212, -80, -60, 339, 114, 291, 139, -190, -99, 66, -158, -56, 85, -64, 54, 182, 123, -177, -83, -225, -37, -35, 157, -179, -165, 28, -78]
3946g8j69J83J61M1M1j54M8n6l7j0O7Q7J56j61m8J48Nm21n5M34j00l0J73j98k28
3971b01J44RR7K6J39j40j96K28k11nj4j74L36j00k3j41M41k39l5K29R9k1l99L17
3995A66k56J12j35K23j95K24k77J50K78l20J04l31n5K93O2l6O1k14J11P9Nk8J26
4018A47j94K67k43K01k02N5J65J9k96j05K21R6J12m44P2L92k81M79k68N5k75l64
4040c91L32Q3kQ1l38m2M18k45O9J93j07J72l80R1p7K15l22K40j74K34J19j36j47
4063a14K33l45J58J35m07j86N97j43j8J03j9J19j69K7j33M6L2J87j75j07N02n87
4085b64K32M2R5J96l83p7K39j40J27jk6K44j45K04n77J01N4j66L65J16k16j01
4107h1k23M22j08l9K02k73N2K60k72M5J20k04m1k5L24l28K03R7k53lJ37K75l11
$$ y = [-78, -247, -64, 97, 138, 179, 25, 73, 17, -20, -30, 37, 124, 280, 119, 71, 219, 224, -197, -252, 182, 82, 52, 225, 27, -201, -57, -48, 49, 75, 214, 74, -122, 106, -105, -110, -124, -298, 38, -62, -85, -226, 215, -24, -59, 170, 269, 248, -151, 166, -90, 22, -113, 110, -85, 139, -138, 12, 290, -30, 74, -257, -312, -19, 43, 7, 68, -146, -35, 44, 49, 21, 147, -47, 220, -23, 178, -24, 31, 196, 215, -81, -186, 35, 131, 243, -201, -129, 263, -18, 461, 193, 248, -27, -391, -59, 24, 22, 103, -235, -277, 141, -104, -35, 158, 51, 223, -157, -66, -143, 72, -250, -10, -184, 50, 169, 33, -114, 119, -226, -68, 67, -340, -526, 71, -72, -90, 13, -6, 113, -56, -29, -162, -116, -84, 103, -72, -179, 323, -264, -32, 10, 105, 301, -82, -159, 80, -60, 67, 66, 40, 284, 139, 343, -234, -133, -79, -245, 120, 236, 20, -81, -304, 118, 10, -29, 173, -100, -48, 212, -60, -15, 105, -99, -140, -165, 159, -169, 34, 131, -122, -125, 12, 287, -24]
4130b4k6l30L33j67N4K68k89L7L57k46k5k20M76R0l48j66L79k57K1n9l2P0K1n0
4154a33N5J12K16j56m05L31j71l2K94j9j93Q5P4r9J38K22k86o7N4K07k20k35K16
4177a2k6P7J71m85M18l5PJ85l84m2j34l6K70M6K5J03q7k70L37l22K28j90Q7n1
4201a20O9K57k41J45k68R1r8L41j12L7k93K92o9K63l55j45j5M8P4L2O8J56o8L3
4225A22Kn6m3j44L04j63K15k02R1R1j31j12j76M10j71J44l48L1k6Q5J03j64J47
4248IK18k89L04j05k05jJ6j25K71J68j4k21K07l40K6L03l00K43k83J34Oj54M1
4271i1n5K22k96j82K94J43Lr2K3J34k84J35P2R2r4j38N1l10L91l5P3L0j65J23
4295D4n7J82PK1j15n02P14l52l9J34J4j97J92q3J15r4N3j12l8M06q8j88K4l3j92
$$ y = [-24, -50, -380, -47, -214, -160, 108, -181, -144, 213, -33, -58, -278, 198, 288, -60, -226, 153, -104, -83, -142, -174, -104, -83, -133, -78, 34, 250, 94, -311, 20, -151, -183, 111, 92, -101, -16, 58, -41, 97, 319, 33, -34, 20, 227, 7, -228, -12, -38, 39, 210, -275, 143, 108, 115, 300, -84, -126, -260, -296, -26, 20, 45, 148, 61, -209, 128, -194, 34, -156, -69, -120, -51, 206, -35, 110, -158, -67, -165, 176, 64, 101, -192, 100, 31, 294, -61, -206, -221, -173, -99, -67, 1, 157, 89, 122, 124, 68, 25, -119, 185, 22, 237, 35, 126, 217, 86, -26, -202, 208, 37, 181, -167, -136, -162, -77, 26, -138, 9, 227, -62, 242, 137, -68, -69, -53, -178, 93, 261, 247, 26, 233, -107, -81, 222, -78, 165, -118, 16, 22, -132, -91, -146, 76, -220, -402, -108, 35, 38, -54, -31, 103, -181, -46, 26, 118, 24, -114, -63, -373, 18, -17, 56, 86, -79, 44, -13, 169, 176, 197, 82, -420, 294, -58, -97, 37, 51, -146, 46, -37, 78, -16, 37, -75, -113, 293, 205, 17, 41, 8, -184]
4320a84rJ91n0k05Q7J89K60k99l53N50j98jJ79o8j16j71J45j28M70k26l00N36
4342B99k21l38O92n13k46L50r4lJ04R9j28K30j00l71J34O0L16l02n26L18K19J80
4364A59j39m7J99q1n6k06J56J37k52J61k46R9O6r1J28j37K2J45l3l8M46l15J1
4387H8Q4k94L70j53k69j48R4J60r7J46l1R7k08nj37N88k09K08j48k91L81k50o8
4410i2K61r8J25N0m38R2M8J98n6j30k46N57k79J93l02K14J84k77K43l22K03k78
4432a50r4J13J10QJ22j9n3k01r8N48l77J53L85k73j21J27m64J03J83nk11K59k90
4455b45Q0L60j92l5p6L3n4l4L98P7j24k35o9J15j19K67O7q2k70J35k38K60j4M2
4479D7j11n8P2J94j34M1j66K37l25K46k42J59R2k47Q6J88n6N7j40J20oj71J5J17
$$ y = [-184, -193, -2, -52, -257, -170, 19, 279, -20, -373, 177, -21, -22, 157, 89, -27, -198, -53, -181, 289, 63, -237, 299, 78, -260, 432, -81, -327, 23, -71, -74, 30, 129, 1, 231, 131, -240, -106, -46, 270, -32, -558, -240, -21, 159, 20, -27, 172, 91, 35, -171, -15, 122, -130, 31, -215, -116, -50, -141, -13, -150, -128, 17, -16, -54, 392, 77, 88, 172, -122, 248, 95, -174, -322, -228, -68, -165, -19, -50, 47, -161, -166, -303, 285, 76, 284, 136, -155, 226, -24, -92, 169, 71, 196, 246, -192, -100, -52, 146, 90, -40, -286, 271, -8, 185, -117, 97, 281, 4, 247, -75, 128, -150, -244, -131, -21, -13, 109, 90, 37, -164, -262, 286, -91, 62, 447, 174, 53, 180, -284, -181, 2, -3, -214, 45, -245, -165, 195, 3, -32, -108, -75, -129, -163, 235, 312, 188, -47, -116, -1, -120, 147, 214, 132, -138, -3, -241, 19, 5, 47, -64, -122, -50, 144, 10, 51, -115, 122, -203, 43, -199, -40, 52, -195, -109, 79, 23, 80, -60, 60, 54, -117, -102, 15]
4503A5J22O5l78K26j94J38K40q2l01l41M92k1K2P0o2Q3j52k59P07m87K15m15K32
4526f5J56k49j67K29M4M3k38K17K82l28k54j8M8K80K94j06Qj09n8L0P6r1p8L6
4550a8r2J63R4j68k41J46PJ37k58M35k19r1L48j25k46K08l04n0L31j25J60p8N1
4573F5J13k03P1j71K93J44j48m44K42q5N31m91O2j69K19l0kQ3P7j44k04L12j74
4596e3Rj96K43k40K33k18J25lK74o6k09k0J37J9l3j32k12M07j22J38rL3J16j36
4620H5%r0j24K13O3J09l34k10K29o9J35j86N3J50k82Q2M6j05L05J36j93K78k85
4643FJ47j73o8J68N2j46j69K00j88K64J15o34N36L4j92J32k46K95k15O6n7q4L31
4666A74j60Pn5N7k39M61mm20K48j22p9R3r0J65p9J38p0j90Pj2K40O4l0M5m23K40
$$ y = [15, 137, 202, -176, 50, -144, -6, 234, 152, -149, -490, 2, -19, 3, 73, 11, 94, -58, -317, 390, -97, 118, -297, -65, 91, -158, -325, -96, -52, -9, -247, -30, 252, -76, -330, -348, -300, -20, 274, 168, 176, 67, 9, 39, 115, 24, -54, -18, -110, 53, 147, -21, -262, -116, -109, 28, -230, 205, -14, -105, 243, 118, -128, 80, -224, -274, 57, -68, 92, 14, 65, 178, -25, 46, -125, 168, 312, 164, -280, -38, -123, 408, -83, -21, -190, 29, -1, -3, 80, 157, 13, -191, 121, -53, -44, -240, 3, -237, -4, -222, -97, -100, 174, 108, -101, -121, 16, 35, 2, -130, -342, 65, -57, 81, 72, 105, 221, 85, 85, -5, -129, 84, 147, 256, -78, -288, -59, -128, 7, -179, -126, 24, -258, -176, -130, -235, 70, 206, 13, 291, 6, 153, -20, -88, 80, 132, -14, -183, 17, -171, 93, 208, -426, 110, 144, -48, 84, -162, 133, -82, -16, -73, -157, 174, 14, 21, -34, 23, -216, 245, 241, -179, 69, -53, -132, -39, -129, 36, -43, 95, 25, -165, -158, -170, 70, 134, 104, 149, -274, -34]
4692c4P2l2j3k64M30j96J53Ok22J59j13J79j13j18j24J51K21J30j62Q1j7j03k48
4715a77J93O3j41j00K48j51R8N9M3J50n3j41m34K35L65k94J1n4j70L78l16J88
4737@L04j48j86J56l07K69lk81j24K65j0K26l02J69K69k32l5o1K06l4k36j62K72
4760A5j22L51n5l32O6R0r7K30m43K87J33m48M68r2K00m13K16L09m07J50r5L52
4782C63l16k12K94n4J49j36j7K36k68J9q7p3n3k1pK45k40K98J11l44J42l8p9R4
4806FL33k65j13J56l48O7O4l12N16j22K1r1l79O48j09J59rj94m72O99p0K05k92
4829I8J83k36r4l8pK80k11j63J14J2L9jk81L44k27k9JM13k76j4J54k27K74LKj51
4855c8L32j68J15j23m9k90O7O1N0K8J8j5k2p0J23K12j81J32j75Lm4K52p1o3O0
$$ y = [-34, 38, 6, -7, -271, 159, -37, 116, 122, -100, 59, -54, 125, 12, -106, -230, -79, 142, 272, 110, 191, 174, 71, -177, 16, 79, -62, -162, 86, -65, 33, 92, 135, 285, 232, 91, -343, -108, 257, -37, -26, -80, -250, 128, -188, 0, 304, 156, -30, 126, -181, 88, 85, -196, -320, -55, -65, 161, -141, 28, 297, 65, 30, -31, 175, 141, -95, -257, 15, -107, 244, 189, -143, -77, 13, -84, 146, -297, -10, 123, -325, 143, 51, 251, -162, 54, 363, -44, 106, 11, 363, 47, -165, 129, 75, 224, 88, 71, 307, 39, 58, -29, -102, -155, -176, -183, 62, -178, 120, 231, -113, 29, -9, -88, 6, 339, 74, -39, 117, -231, -164, -100, -412, 104, -18, 3, -88, -467, 181, 72, 231, 222, 28, -444, 255, 185, 390, 98, 281, 45, -49, -87, -94, 186, -25, -188, -74, -62, -23, -24, -305, 39, -188, -217, -216, 197, -79, -93, 61, -166, 108, 111, 113, -38, 294, 126, 241, 118, 69, -221, -154, -93, -43, -15, 3, -12, -34, -104, 19, 231, 50, 182, 7, 10, -34, 218, 147, 84, 144]
4880A44j48J27k31J28NR5j50l45K57Q3q8L38k38K32j87k8J9L7m31K28m1K28k01
4903a67M60m13M14n02N6k37N14O6k28R4l6K34r7p5l16L17o5j08K34l30L59r7j43
4926f6M9k76J69J03P7l1l79L22j13K34j17K76q9l58J78N9j28QJ53J2j75j5K09
4949A02p5K7L2q0j27O9Jp9n8L76q1l09L18m46N73k79l42K45K38j14J2L22l08J4
4973C1L01k43j20J00j23M01n28k25L34k24K69J67k06r9M18l32k08L80k63L3n8
4994a95K84m60K84J61k39K08j26Q8MJ09L9k26M5P7oj26j12R1K56p2Ok40j3J69
5018FJ01K37k92L1l77K54m2J47j06L2j96J55J49J44k24r2j6k01L56j10l2r7J36
5041c7j45j01L99j58n9K58k72K61j10Ml53L03k30K22L1j44M7pK80k29P5k39L20
$$ y = [144, -4, 123, -108, 20, 25, 120, -30, -375, -118, -35, -123, 215, -23, 209, 22, -6, 13, 50, -381, -153, -194, 34, -167, 293, -120, 294, -208, -152, -389, 125, 191, -37, 57, 21, 255, 158, 83, -233, 84, 19, -89, 145, -185, 174, 77, -66, -17, -293, -124, -21, 56, 25, -354, -32, -145, 89, -28, 248, 159, -199, -21, 38, -90, -82, 71, 83, -92, -107, 102, 27, 54, 86, 6, -121, -52, -51, -130, -188, 188, 107, -202, 116, -330, 243, -36, -378, -133, 105, -9, 3, 325, 17, 31, 332, 89, -31, 69, -54, 347, -181, -406, -72, -296, -27, 140, -66, -165, 253, -79, -287, 93, -170, -137, -195, 89, -371, -87, 74, -165, 43, -83, 5, 9, 118, 157, -69, -24, 53, 47, -79, -191, -100, 156, 84, 90, -150, -163, 6, 107, 344, 52, 83, -294, -40, -82, 65, -41, -9, -205, -50, 99, 243, 19, -73, -89, -290, 66, -44, -76, -173, -37, -182, -283, 116, -42, -101, 157, -115, 146, 36, 40, -313, -10, -240, -18, 13, -131, -84, -91, 189, -40, 35, -204, 116]
5064A16l63K17J17m3J29j22k01l00N95m63J33J49J0L05m08j9L11k04P9m2m13K64
5086a53k58M32k97K95j31r6L71j23j05Q8k36L84l42J60J89l42K97m65N5M09O6
5107A98j70OK41k47R2k95J83j16p4J28J76p2m57N23l38N6K4K63O4k32J18o2j23
5130a14L01j34j67Q0J85J54o11K21K7R3O5j48J1J01p9o7K92k21Q3q8r5J63K4o3
5154A3K27k20k21P6J71j44L45l56K81n9M2j62k13M04k72J33k03L28r3r1p8J01
5176IK04k77K06L3m13K15J49k21L14l06K58O8k02K6k3O5k22M7K50n6k89J51K05
5199A91k16J7L00k88O7L17n07MK60O8k13J8j30K49k69J67o0o2J37k02N0K14k0
5222I2k21K80L9j54j26o8OL19j90K02r6j60K00o5K99n44P4K3N6P0j5J01k72J7
$$ y = [116, -247, -30, 87, 44, 173, 51, -150, -450, 145, -318, -185, -36, -26, 279, -129, -148, 163, -41, 38, -4, -417, -153, -411, 21, -276, 19, -112, -208, 163, 40, -65, 23, -213, 171, -171, -11, 178, -164, 133, -332, -277, 132, 198, 28, 34, 275, 28, 120, -175, 8, -108, -182, -54, 122, 50, -407, 116, -222, -166, -142, 121, 185, -47, 71, 9, -114, 187, 53, -114, -34, 151, 305, -306, -85, -58, 35, 100, -48, -37, 64, -15, -82, 210, -11, 72, -16, -111, 52, 76, 13, 240, 20, -201, -125, 46, -98, 247, -109, 172, 113, 155, -7, -220, 184, -88, 45, -158, 170, 77, -14, -92, 9, 213, -64, 142, 175, -238, -23, 126, -95, 219, -87, 171, 239, 37, 63, 40, 105, -117, -70, 180, 124, -165, -14, 191, -25, -8, 292, 4, 71, 388, -119, -115, 145, 213, 0, 18, -112, 137, -132, 35, -25, -87, 50, -152, -102, 112, 92, -129, 151, 190, 36, -90, -158, -152, 167, -23, 179, 83, -77, 123, 58, 357, -187, -113, -90, -34, 36, 21, 122, -150, -133]
5246a33M1J52nj75K20n0J27j80j38J12k5M5L29m21R9J51j53J84q7k6j87L03k50
5269f7O2jj07J38O4k04M2M9o4M5P1j71l05L63L44r4p1k5p3R9k88j74M17j60K67
5294A57L6j3j13r7O2R0P4o1m3r6N8J34L0k93K7R2m6J4K73l64o3J79k14Q2M5j53
5320b03L37k24m7j32L20J54r3j68N6q1j30O3P8O0k46M24K7l03l8M89k77p3J92
5343A85m19M02q6l5j10L07j19j23R8k06K01j76K41j32N6k13J94p1K68k72kJ14
5365A02O8J22l23J26q6J26j94P4j31K39j87J83j77J35K20K4K11q03K71J38%q3
5387E5j16K10q0p5L71l89j88M36k83J19J33l17O4L12L1j81j09N9L38k25k07J77
5409A35j95Q1l8o6j26M28k53P8J44o4l24J72K14p0l1J09r4k3j20j08J9j32M17
$$ y = [-133, -92, 60, 55, -120, 100, 50, 177, -3, -141, -29, -54, -9, 320, -101, -2, 149, -4, 180, 93, 67, -120, 183, -67, -5, -6, -113, 25, 89, -115, -73, -24, -88, -43, 28, -143, -448, -85, 259, 165, 94, 69, -4, 95, -193, -367, 50, -110, 157, 193, 180, 67, -30, 32, 122, 196, 135, 92, -4, 54, 188, 218, -75, -48, 44, -2, 12, 285, -79, -142, 37, -177, -95, -50, -203, 134, -90, -137, -269, 51, 205, 112, -56, 0, -81, -211, -148, -70, -10, -256, 168, 195, -108, -146, 343, 66, -7, 185, -234, 168, 82, 47, -63, 244, 125, 2, 100, -106, 95, -81, 160, 28, 84, -129, 65, -6, 262, -10, -12, 102, 170, 292, -31, 95, 9, 135, -59, 15, -116, 123, -64, 119, -58, 77, 297, 321, 532, -271, 0, 138, 138, 55, -61, 149, 69, -6, 365, -24, -212, 224, -59, 60, 193, -124, -60, 252, 283, 102, -7, 52, 390, 165, -42, 135, -60, 21, -17, -83, -209, 219, -34, 44, 188, 124, -200, -28, 186, 116, 85, 194, 100, 77, -43, -151, -132, -264, 153]
5432A53l31K49k9k4J07L40l54j96K7j41K50j9J01j0k27%J04L5k60K03J18j05J76
5455A67k80J37k0j42J20L36n37J06K6J33Q1j08Q2p3j32K39K72n37J33Qq9J88k08
5478i8JJ10J55j73m3j18N6J8o7J34N61n55M8j90J67j60lK66j48k02K73L8j8k35
5502a83R6MQ3q0j31J46J26j5pq7J94p3l16L11j89J36k4K41q9RM0l5k47J78N5J49
5528B92q5l87L3L6J08O6N2j72j83K51L47l86pL24m00J86nk6k17J37Q4j94K19j64
5552i1Lj06K87Mn0Q8k76lL38j54j2l2J44j84J98J24l86k3j5kK07n0P5k42m3L77
5578A76k82O7K2N8ll99O02m99J66L82l65K96m74L57P5j35J07k43r1M58l73J47
5600D9N5k17J59J2k20K18j74O1J06j61L23o2j32o2P0J36K1l12K17j06J89L3n18
$$ y = [153, -178, 71, 42, 18, 125, 465, 111, -85, -58, -199, 51, 32, 133, 123, -104, -104, 0, 35, -225, -22, 96, -9, 167, -113, 24, 4, -138, -18, 318, -219, -113, -87, 46, 127, 19, 101, 28, -104, 135, 407, -130, 3, 11, -78, 110, -98, -97, 13, 168, -5, -48, -166, -110, -92, -159, -25, 536, -19, 29, -161, 6, -154, -157, 109, -39, -241, 32, 70, 52, -183, -87, -83, 0, -80, -211, -65, 61, 46, 39, -48, 146, 73, -243, 68, -121, 15, -9, 232, 143, 152, 192, 157, -90, 88, 143, 292, 207, -180, -147, -111, -3, 63, 115, -57, -240, 11, 358, -28, -35, 289, -111, 75, 70, 44, -173, -36, 48, -146, 73, -91, -88, -194, 93, 97, 47, 135, -141, -144, 194, 40, 28, -4, 140, -44, 154, 278, -108, -131, -146, -148, 59, 9, 84, -158, -201, 176, -106, -39, -17, 41, 38, -361, 241, -258, -92, 290, -75, 221, -253, 104, 179, 44, 151, -92, -183, 275, -98, 49, 104, -113, 46, 58, -162, 56, -118, -57, 49, -112, 211, 149, 17, -45, 25, 161, 182, -130, 87, -19, 170, 203, -315]
5623c15K56k99K92p6L66k42J03ol47J09q9K03j25M51l73K35J81l64Jl7J87N6l20
5646a53K77k64J80n3r0K09q7p1j75K74R0N7l85L00j26j66M4J93Q3p6k14k8K37
5669E6M9n1J56n0l4n4p1J1r1P1K22o7k14J5K90k84j09K86k23j96J6M25j47K89
5693B95j70j72l3p9J08p9K36K53k72j82L6K85r1q3l9m50K78J13j49j24K42jJ55
5716G7j21m7J9j12L70j77J03R1k02K76m30K90j72q4l5NK17k39L58m39J70r2J95
5739B1l2J23k31Q7k67J97K88j03O9k95L80l61o0K78j54J68J2j99K49k4n37L25
5761f6k08M88l20K87l41K2P3K03j69J88m31K24l69M89K07m04K38j22K0J33j79
5782c7P8l6L7L5k26J82k11J06J87j22K5J80k76L08m35K89qo5nk95N8L55j3K27
$$ y = [-315, -59, -358, -66, -142, 224, -18, 85, 79, -268, -159, -248, -45, -170, 281, -92, 143, 324, -40, -39, -76, 111, 167, -153, 124, -140, 40, -13, -103, 106, 19, -52, -227, 47, 137, 194, -191, 109, -17, -183, -139, 54, 137, 61, -153, -181, 56, 105, 54, 210, 160, 126, 72, 1, 12, -79, -8, 214, 147, -67, -52, 238, -46, -155, 131, -92, -288, -272, 153, 6, 295, 125, -47, -80, -159, -51, -130, 106, 359, 87, -95, -59, 226, 135, 52, 13, -437, -159, -46, -195, -319, -77, -78, 77, -44, -91, -72, -184, 186, 9, 112, 203, 1, 277, -153, 137, -35, -119, -154, -149, 68, -171, 187, -252, -82, -174, 21, -11, 112, -119, -32, -299, -102, 186, 83, 152, -143, 237, -124, -184, 94, -60, 108, 120, -79, 170, 146, -391, -66, -274, 214, -106, 181, -160, -138, -65, 138, -31, 157, -274, -50, -419, 70, 277, -127, 111, -11, 9, 142, -37, 41, 5, 42, 77, -149, 33, -178, -72, 115, -7, 18, 198, -78, 230, -205, 84, 76, 11, 6, -289, -231, 124, 111, 338]
5806C38j86k50J00O7J40l74N73l90k39L01O9K75n06K39j82J22J87l39o5K53M6
5827A79k22P1j06l7j17M20k95K86n46M80j52O7k23M20o80L70k7J52k19J19q7n0
5849a97K75k27M01k59J90l68K74J8rk47P5J52j15Q6l54M18j11n8O5K8l35O89n27
5872a36K01M1j56Q1j96Q2M03j56j13J24j31J98n18L94R1m08K79q7n0J8K53r7k65
5895a48J80j00j6J78j97K90j04l15R3K59j03j80K46r4K86j35J2k28J45j94L27
5916B02J11k56O1j86N3J14k6J01m04K88l78K46%l8L28n08L40K87m17q8L84m5q8
5939H1k8n2K4R2J69m32J89j09J11r3j60K94j33K48j43j23P2q2J50m8L3j07j28
5962a75J67K90j97J20k56j36L0K5K13l07N30m00K64j70j9p2j45K86r6j75R8o3
$$ y = [338, 152, -98, 2, 69, 209, -165, 408, 18, -221, 80, 149, 424, -82, 157, -25, 97, 284, -55, -120, 133, 179, -43, 28, -78, -115, -232, 188, -107, 179, -367, 113, -39, 28, -195, 225, -455, -85, -112, 40, -179, -60, -147, -197, 78, -149, 252, -7, 183, -185, 89, 107, 98, -149, -74, 78, -37, 49, -305, 113, 2, -56, 9, 37, -298, 391, -136, 65, 106, -50, 31, -165, -83, 320, 164, 51, 175, 44, 242, -276, 118, 209, -199, 80, -7, -57, -39, 214, 117, -148, 32, -68, -84, 94, -103, 187, 83, -232, -139, 120, 17, -163, 83, -11, 275, 140, 152, -76, 69, -125, 202, 313, 57, 118, -68, -15, 99, 73, 174, -230, 58, -320, -74, -74, -112, 216, -292, 48, 335, -82, -170, 214, 169, 81, 53, 1, 25, 117, 286, -146, 43, -66, 45, -48, -208, 86, -47, 201, 58, -65, 7, -75, 75, 27, 60, -47, -175, -8, 282, 85, 205, -51, -187, -157, -132, 81, -226, 304, -96, 168, -2, -21, -93, -238, 48, -48, -223, -125, -188]
5984a88J0O89n59Nj39Q9J70k30R6r8K68j72J9J76j99K10R6j15P6j96K98k85m8
6007b7K75k34l62J78J59k03K93N0k73J67J47k60N7K0J87n77L65J1K84k16R9l90
6029b50K82K34k8k62Q8N5k50J25r1ML59k27o4L9j83p2K95k20K70Q0k28J25m1J11
6053A51k53n0oJ48J8k0K19k44j01L62m3k38NL24K2k75M0l12N1K02K01q6qk6j11
6078c0K4Q8j21j61K44J57R7m8j99l80M76k26J91k04L71l02Nk92q6L24J3K03l47
6101b03K55p%M4l6N5n4j89L29j51j69J23j01J39j30K18j87P8O0l1J6J8J0j29J39
6126I7j09r9J73j85M91m34K90l48M0J98N1j46R2Rj65J69o85L92L88j73M1M5k9
6149A03Q0%k05R3k26j98K35pJ41l33L88k5l8j21l4L00p8lN8p6K42j23l29M41k27
$$ y = [-188, -178, 511, -48, -43, -182, -93, 77, -153, -57, -155, 113, -59, -40, 136, -63, 147, 243, 128, 204, 8, 306, 21, -27, 248, 14, -348, -170, -11, -214, 79, 129, -144, 23, 170, -90, -33, -13, 174, -403, -38, -27, 257, 41, 140, -250, 32, 266, 238, -24, 64, 119, -131, -6, -97, -93, 266, 39, -25, 14, -169, -241, 54, -166, 104, 184, -44, 81, 40, 151, -102, -152, -158, -10, 8, -12, 207, -37, -138, 224, 181, -57, -52, 272, 294, 19, 59, -253, -202, 0, 201, 115, 107, 81, -30, -6, 82, -39, -200, 44, 201, 298, 250, 51, -329, 147, -79, 112, -92, 279, -23, -18, -310, -396, -72, -59, 144, -203, 52, 45, 45, 89, 53, 108, 54, -135, 194, 43, -126, -3, -104, 35, -95, 123, -64, 14, 74, 43, 59, 77, 87, -42, 97, -12, -111, 62, -123, 368, -66, 224, -124, -84, 114, 165, 19, 111, 120, -45, 124, -561, -169, 219, 46, 87, 132, 103, 183, 183, -22, 71, -155, -353, -118, -125, 16, -317, 71, 46, 8, -113, -147, 153, 75, 72, 130, 54, 296, 173, -156, 285, 58]
6174E8k73P2J56k45M81m99J22R4Q0k24M86m17K81k8r9P9r4l33K57P9K5j36J93
6197A15k66N13k00k37L46l99J81J6K73l16K1M8n9q3l25L06P9J04J11j49j10j19
6219a50J84M0j7k39K33j44q5P5j66L37k50k6M32k40L49j77lq2j67j23K68L3J54
6242B36j89J11k43pJ35l0O9k60J41J39n0J5k52J90M7JJ77l15O6J25Mk1j12K13
6266A90j79N3j7KN4q1m2j81M23Jl55L53j25K7n04j3L08l9j71K87L6k12L85o4J5
6291A51n4j7k25L80m80K75k23J33l4k0O5n6OP5J81l3l05n7K0M77n53N57m58r3
6315b88M07k05J49K75m07J62m4o8J53q6k07K35J55j1k78K09j01N9K2j14n0j0J8
6338b5j0P8l17P0O8j57M61k81M3KJ00L1n4R0k96L46m2l79J90j19L68j47j71r9
$$ y = [58, -215, -143, 13, -232, 249, -250, -128, -34, 46, -178, 308, -109, 172, 144, 45, 124, 30, -303, -46, 33, 58, -78, 115, -151, 362, 162, -75, 271, -128, 53, 69, 342, 26, 47, 95, 36, -47, -372, -66, 13, 117, 228, 79, -31, -150, 34, 74, 57, -182, 51, -93, -178, -103, -269, 68, -182, -208, 224, -16, 333, 156, 153, 71, -96, -219, 49, 82, 236, 47, 158, -85, -92, 43, 13, 82, -178, -37, 102, 52, 67, -185, 5, 52, 53, 230, -85, -19, 106, 110, 89, -23, 190, 11, 64, 47, 49, 103, 22, -20, -201, 222, 223, -132, 221, 96, 123, -381, -394, -86, -125, -296, -9, 27, -185, 200, 136, 151, 97, 80, -145, 235, -245, 30, -193, -60, -94, -114, -49, -105, -99, -24, 157, 124, -181, -238, -218, 259, -294, 263, -195, -288, 119, -86, 63, 338, -69, 93, 49, -19, 134, 48, -159, 76, 231, 220, -58, 151, 50, 109, 131, 17, -33, -43, -25, -35, 43, -274, -204, -136, -293, 168, -113, -70, -68, 32, 63, 9, 99, -197, 149, 107, -272, -82, -201, 167, 20, -151, -250]
6362b50M89n26K33L6J50k49k01J45P6Q2p4j16J83K62j79J24k34r5M60m47K99j89
6384b1N8j24L43k88P7l5K18k68J3M5N5j58K73k93PR6J02k25N3K47n43K44P1L17
6408B64k44j2J61j90j26K10J63j27l61L43j79k91L29j7K67q2Qj12r7j35L97K6
6430A95l83o3L65j3k68K10R8k1K1rJ80k31k60J42j19j58L82m2M02j77j90J7k02
6453a24K5K35k04N2l1N5K7k08Q1nn5mj13K43M8k6l45M55j11n3o2K01J1L9J8l08
6479a59K63k45QQ5J57N1j09r2r9L82k19K03m87M20l43q7L48k74K59l34J45J29
6501BJ34k32j8J22k4j11L59l85%J82p4j34m4K80K72k61r7j42J60J0O7m51L47J01
6525F3k79K98K32k47j32rJ42j01l25K71P6J08j1J1l35K01j52L38l46J46j91J69
$$ y = [-250, 239, -287, -54, -18, 132, -117, -318, -173, -97, -15, -89, -205, -22, 240, 61, 185, -49, -144, 316, -131, 168, -21, 37, -87, 256, -32, 45, 10, 228, -40, -27, 18, 73, -85, 188, -105, -98, -2, 100, -125, -72, 175, -368, -124, -53, 264, 20, 8, 169, -21, -147, 63, 226, 99, -262, 81, -98, -389, -60, -77, 190, 108, 116, 4, -93, -228, 169, 195, -188, -251, 114, 101, -167, 43, 141, 120, 141, 132, 312, 81, -179, -37, -156, -314, 68, 26, 428, 251, 61, 78, -124, -99, 136, -68, -16, -47, 8, 35, -173, -92, -97, -152, -156, -269, -26, 22, -4, -349, 106, -5, -58, -120, 81, 92, 131, 149, -159, 104, -141, -133, -48, 109, 160, 51, -41, -140, 242, 23, 226, -261, 159, -184, -271, 77, -197, 62, -272, -127, 2, 136, -96, -114, 8, -16, -127, 232, -153, -153, 29, -45, -179, -223, 57, 329, 68, -29, -171, -11, -1, 66, -385, -38, 63, -216, 82, 314, 67, -65, -74, 68, -33, -358, -87, -11, 97, 86, 97, -238, -37, -189, 149, -197, -51, -242, -73]
6547g3Q1O4J75j73J4j10Lj22M34l06k5q5J77nj6k75P3j34L57p2J70l6j73j8O5
6572a0K5q1p1K43k16L87l62Q8j47J04j3j41Q9O8J40l30J37n8R3K6J44P9n6j11
6596B7n7O6J5P6L3k41J63j7j44M8J99k49K46k28J2q7K88J06l15m7o4R4r1R7m7
6621a17J88l26K55J05j27J59j72q0Q4j8k0K04k23R8J09q0K03m5R7m22J3J02k19
6644b32K30j0j32L12q2L4k92J8K01J62l00J74L26n36q3P1K39p5j22O6r5O0p4J6
6668a24Q6L3J77j24j16K2J58j35N8k74L90j98j19MK15%l8K2q9K40k17m1l6N3L1
6693b2k79K85Q9j2O5l34K92k73J88P4qP4k27J32j06J56k21M7N3P6j6k50K68l8
6717A3J47j17Mj2j45J22J79l60L27l54J78q5M9J65l48K96P8K6l30q0M07J95l45
$$ y = [-73, 8, 72, 247, 74, 88, -22, -19, -141, 293, -13, -38, -123, 54, 49, 33, -242, -169, -303, 54, -18, 152, 116, -57, -75, -10, 15, -66, -137, 106, -110, 277, -85, 3, -144, -40, -53, -194, -105, -37, 103, -227, -90, -148, -55, -29, 115, 194, 138, 27, -30, 36, 51, 127, 160, -81, 82, 65, -79, -31, 168, -81, 165, -63, -51, -138, 150, 256, -59, -106, -170, -76, -167, -70, -117, 71, -255, 0, 105, -22, 137, -35, -115, -31, -49, -69, 135, -88, 10, 119, 39, 242, 197, 294, -128, -115, -13, -232, -2, -12, -144, 168, 86, 120, -172, -154, 47, 209, -91, 83, 409, -127, -210, -139, 100, 25, -97, -31, -126, -66, -140, -124, -38, -5, 172, 48, -68, -46, 112, -23, 35, -239, 151, -47, -166, -162, 53, 53, 15, 37, -52, 188, -29, -70, -106, -53, -22, -301, -16, 73, 61, 126, -208, 84, -189, -1, 73, 65, 139, -88, 44, -62, 94, -127, -80, -27, 49, 33, -217, 51, 13, 160, 43, 47, 35, -110, 12, 191, -169, 158, -196, -18, -103, -54, 111, -237, 59, 137, 163, -167, -247, 160, 355, 10]
6740A0k93K13J61j59J54j22j69J72j45l7R5j41K46j8j21L08l90J71Q6j12L76l07
6762b2q5K12k23l1K45k85R3J39j8j68rN0K25j36P7n9j41O8j3K56q2j27k6L35k08
6787F7O9j28j57j90j73N10j17K57l48J57J36j82p9K47q2l16L02o6L37j64j0l2
6809C8j61K5L48n85J31L39k01j92K51M10m68M21k23m00K21J73r2m7j79L47J4K2
6831A92k63l6J46k20J54k10NK84l44L26o2J63j19J52l0j83M9Q6k97K54j26M5j3
6854d7K92k23K58j85q1K0p9k5l30M00r3J34j37J50q0n2K24j95P4m5Rj45j33K98
6878IJ46n70M58l29M8J07l61P08n17M28Q3k00l2P1r9j86K80J01k78p1M36q6R2
6901B38l27n7K21O6N3l97K63K02l02l18K76J74j71J2K34J6q7j02M9K21k51j12
$$ y = [10, -283, -70, 91, -68, 86, -36, -205, -33, -178, -215, -120, -261, -15, -33, -154, 154, -236, -65, 21, -91, 285, -22, -107, 105, -118, -149, 96, -189, -96, 43, 25, -143, -152, -102, 123, -13, 64, 5, -136, -68, -81, 175, 93, -34, -60, 275, 67, 136, 8, -149, -339, -512, -2, -119, 138, -210, -53, 83, -99, -178, 69, -13, -329, -27, -93, 244, 80, 70, 38, -123, -98, 250, -335, -204, 135, -66, -258, -7, 403, -65, 356, 133, -267, -46, 127, 35, -12, -191, 156, 170, 192, -71, -107, 39, -181, -27, -237, -232, 52, -292, 34, -28, 135, 16, 168, 138, -45, 4, 90, -207, 47, -79, -34, -47, 245, 22, 280, 95, 14, 34, -45, -70, -400, 0, -93, 41, -96, 54, -26, -78, 146, -49, 25, -20, -11, -156, -289, 9, 155, -415, 43, -286, -238, -131, -492, 216, -301, 127, 210, 10, -22, 49, -50, -236, 44, 145, -133, -204, 232, 146, 238, -89, -146, 75, 141, 194, -203, 60, 262, -40, -358, -82, 92, -79, -67, 167, 183, 96, -6, 43, 264, 13, -99]
6923i9J10J93j83J0N1k13M1L1K21j7m39O7n0M07m65K83K28l35pL6J15L33P3k97
6947I4l64K88n3o6K58k66J90m0Q9j20p4J51p4k50L51J60M1m30nP9r5J9J01J98
6971A82j61j28j41L61O5l10J93j35n2J70J40M8l11J11j80J88J13j81pk10R6Q1
6993f8K43k38r7K9R0o2K22m36M55o4n7j12j71K68P7r3J07m2k73J44J34j53J48
7016E1k74K4K24l73N93l74j80L04J12k7o9Q4j3j81J70q3J52j81J51R8j97l45K14
7039a20P8m5l0R6J30K6J19m61L80p8k90l57N91O8mj25J07q5J63j93n4k03N5K98
7063F6J99l53k7n3J59J62J66j46J3l02k11K61L3O8n7k7J15q0J25l0N4%k06n8J19
7088a0k49L77J88m57K86j91j11P3J44k34N03l33L5p8j49K80l16J72M5J48j48J75
$$ y = [-99, 11, 204, 21, 31, 82, -131, -90, -59, 162, 145, -294, -227, -277, 130, -335, -52, 176, -159, -166, -130, -15, 318, 391, 94, -270, 18, -35, -101, 157, -109, 81, 41, 130, 10, -64, 87, 13, -237, 114, 274, 315, -115, -120, -41, -136, -117, -16, 182, 21, -107, -248, 113, 178, -132, 61, -74, -126, 44, 184, 232, -79, 32, -148, 40, 153, -28, -35, -245, -149, -68, 175, -63, -160, -131, -41, -103, 119, -317, 138, 74, 17, -95, -266, 2, 79, -14, 93, 51, -222, -78, 56, -97, 51, -223, -199, 25, -348, 245, -129, -309, -5, 107, 80, 11, 95, 82, -99, 71, -12, 140, -41, 110, 208, 11, -334, -120, -42, -87, -117, -21, 109, 135, 254, -207, 173, 95, -195, -552, 39, 107, 103, -22, 85, 0, 163, -30, -84, -287, -232, 66, 265, -88, -115, -168, -9, 153, 319, 173, 186, -116, -327, -66, -33, 35, -22, -49, 66, -14, 111, 81, 135, 135, -71, -129, -10, -259, 118, 306, -151, 135, -56, -167, -94, 50, -184, 319, -14, 21, -57, -206, 74, -242, -70, -25, 123, -25, 150]
7110A50j51k85J91l2j86K44k07K02J6L54m01L0kn1l7L93k18N7k59K24Kr9J57j70
7134g8R7o1J46L50k12k00J24q8l24N23o0n09M20m48L14j29K7L83l57L08m82J85
7156g1n0K58Kk18J45m60L03o7K17o9R6j37j69l3J68K89j47N6M4j2m1j39m6j1L43
7181B51j20j52J17K0j74j72J61k57K85J35J71j52N2l48J74J30r4j18J90m0j69
7202a10K3J45J09j4j07j58L81l24N3J50R5m85M46j99k6j50M82j76j86ok19L91
7224A15j75J07p1K41m0l80J67l4N12k62l31J46j23j66K25k85L38p2J2L27k33Q4
7246A02N6q5j00j68L04K06o39J80N60m07k66L52l16K93P0P6k85n3k09L72j58K33
7268A18N4k57O2J64j96M8J62k92L48l14P9m2L7j22r1M98l5j93l01M58l01J33J7
$$ y = [150, -1, -286, -95, -127, -313, -69, -276, -74, -58, 296, -105, -75, -77, -128, -165, 228, 10, 67, -192, 32, 34, -65, 92, -78, 19, -42, 104, 454, 242, 42, 166, 78, -246, 277, 217, -292, 128, -320, -6, -135, -108, 275, -82, 226, -256, -71, -121, 137, 139, -79, 66, -394, -91, -158, 59, -10, 86, -51, -220, -253, -85, 204, 57, 113, 157, 145, 104, -35, -81, -92, 251, 131, -21, 96, 116, -58, -230, -69, -326, -41, 94, 265, 113, 165, -183, -9, 121, 27, -91, 99, 59, -110, -87, 58, 167, 153, 46, -112, 269, -55, -2, 148, 243, -242, 204, 5, -21, -171, 311, 135, -51, -57, -276, 115, -60, 47, -24, 217, 177, -203, -36, -70, 442, 180, -151, -5, -128, -294, -69, -354, -16, -88, -76, 251, 18, 102, 158, 73, -27, -195, 109, 315, -324, -144, 416, 9, -257, 95, -221, 72, 142, 218, -67, -120, -329, 43, -115, 118, 172, -85, -23, 141, -55, -7, 155, -137, 211, -103, -24, -66, -29, -151, -242, 256, 221, 28, -273, 185, -116, 17, 34]
7291C4J63m2q2m4J55k62K93k97j81M17k16K00Q1L5l50M08k46j89L93k84j27M13
7313B72l76N11l00j86R6J4M8l23K28k0j86j9J59L23k03J08k37K93j91K45m97M6
7335a95K92r9j74J97k6J9L9j98K06K3j58J70k12J55n5L6l89M26k01M35k65J59
7357A85k06q1K03o4J3r7L6J14j74m8J48P7l9J19k02K12k95J44J2j89K08j96L00
7380A80m11L98k04J05O6R9j86q5J12n4m9K49k77L2J3j67R1J79r6k06M2n8J36j02
7404a93K55k48J75j48J0O4J79j45J0j60K76P6j66k10L07N3k53J65o9J77k97J16
7426b6J59k97K71q4j15MJ35j6j39Q6J1pm9p6O0J23j21j60J47o2L1m6K49J05j2
7451A71k06m7o7k4O8K24k16J52j31J69j71K35r7j70L60j5k32K16l00K01p2k73
$$ y = [34, 197, 155, 73, 29, 184, -78, 215, -82, -263, 154, -62, 138, 219, 254, -96, 312, 66, -123, 270, -14, -141, 272, -104, 407, 107, -79, 17, 31, 79, -244, -16, -36, -222, -241, -82, 241, 38, 146, -91, 202, 11, 256, -241, -195, 97, -2, -176, 21, -5, 14, 53, -145, 61, 84, -74, 96, -116, 39, -16, 20, -369, 57, -144, 291, 26, 185, -21, -102, 101, 37, 50, -47, -11, 103, -71, -119, 29, 106, 67, 186, -16, 196, -99, 45, 57, -132, 76, -120, 180, -231, 167, -37, 68, 134, 233, 47, -38, 74, 20, -29, 220, -57, -25, -12, -179, -88, 91, -5, -211, -169, -227, -91, -193, 62, -186, -11, -159, -149, -85, 94, -51, -41, -201, 75, 151, -15, -225, 82, 135, -118, 47, -22, 155, -142, -26, 133, -164, 107, 23, -92, -88, 47, 31, -108, -22, -11, -18, -67, -143, -83, 40, -81, -241, -94, -156, -125, -171, 78, 183, 171, -35, -82, -149, -173, -105, 119, -97, 55, -76, 93, -78, 157, 60, -110, 250, 235, 3, 219, -81, 120, 48, -225]
7473b25N01j38j87P3J00j00m9J54q8k23J31J3J35P3m29J97j2j56J74L46k57M8
7495H1J62j46J80l38l5KJ09j83K47k62K21Mj64J21l04K59R5p9J89k93Q6Q6j18
7518h0j64J49L14l38K5j16Q8L32m20O03m62M44l69p9J25O4j73j06K46J40j26P3
7540A70l31K88l8P6l05J21q9K4qr6J58J28q2j85K79j69Q4P8M0l08K28j4j6j60
7564a27K66j98j55n6R1J16J6J13Q7j21P8r9j00j43N02l37J3J01k45K28j3J37j97
7587d3k25L91l83J30K06L5k60J94j82J15j9pL29j88J65n76L10m6L49k17j99J3
7609a08L2K12k24M8j1k70P13k97j10j69q1J58J96j67L0j73K72k54j53P9L68j08
7631a7J04j88j64J96Rl5J46q4o4L21o9j48o7K62q5j25mk17J03j01p4M32j04N6
$$ y = [-225, 276, 138, -49, 24, 124, 24, -25, 129, 41, -182, -51, -38, 97, 170, -259, -62, -74, -230, -56, 290, 33, 81, 243, 97, 277, -61, -96, -94, 15, -168, 79, -183, 38, 42, -122, -1, -305, -46, 49, -30, 159, -134, -48, 38, -80, -244, -95, 219, -119, -94, -210, -122, 210, -210, 393, -69, 375, 6, -73, 52, 116, -57, -163, 83, 223, 97, 170, -161, 127, 89, 165, -140, -19, -108, -84, -92, -188, -30, 98, 16, -169, 110, -59, 25, 103, 143, -165, 63, 49, 33, -127, 139, -59, -214, -270, -179, -63, -47, 66, 153, 32, 110, 11, -89, -232, 270, -67, -54, 47, -198, 30, 17, 154, -43, -268, 123, -260, -130, 76, 111, -149, 45, -137, -22, -41, -48, 281, 93, 258, -318, -8, -54, 295, 78, -121, -108, -76, 136, -88, -40, -51, -321, 392, 95, -15, -184, -265, -107, 89, -78, -48, -221, 51, -203, -356, -277, 91, -17, 87, -101, -265, -69, -60, -95, 51, -33, -97, 224, 155, 7, -60, 202, 117, -8, -12, -229, -126, -227, -301, 131, 27, 83]
7655H3o6j61L69k19J27J87j14k86p2R4L4k1J31j2j83L02J56n13J70L48k65n6j11
7678g8J05N2j47J90j95O3P4j48M42m45J55k21K34j32j46M01k90j47J59K00k51
7699a25k6K63l10K87j75J01k73J62o0L81m40K12n9K63m98K43J76j28k65J05J19
7720d7K70k45L9J66j29l1J54k12J2j29n2N22m88J87R0j3n3N4m35M84j43j33L25
7743A93k77qj7K24j61K27n8l75K03q8k90M74p8L55m41J20n7j48K71j7L5l8j06
7766e7j90M8R5J73j05L23l86P5L99n80L02k03Q7J18r3L29k11j54J03L2j5M26k74
7789B42m94J11L35k04J27m0J6j61k4M4l7J52l83J67O0J72Q2j08N1k04k0M34m37
7812a19P5P7k55L23P4k04l51L42J64k77J48j13P2j09O1k28K84J52k66M14m28R4
$$ y = [83, 17, -144, 225, 6, 133, 320, 206, -80, -152, -58, -24, -45, 86, 74, -109, 193, 349, -164, 6, 354, 89, 33, -78, 27, 79, -68, 122, -73, -10, 64, -84, 358, -87, 68, -153, 81, -51, -197, 204, -86, -233, -74, 126, -125, -151, 112, -198, 89, -86, 15, -258, -96, -156, 225, -215, -3, -62, 201, -297, -54, 122, -6, -271, -166, -47, 223, -22, 17, 183, 54, 23, 177, -35, -23, -152, -204, 318, -170, 17, 107, 94, 41, 95, -340, 144, 1, -132, 193, -84, -92, -109, 115, -46, 181, 123, -252, -49, -137, -427, 47, -31, 324, -117, 3, -54, -202, 69, 52, 87, 49, -57, -247, -199, -104, 69, -36, 287, -99, -24, 375, -205, 97, -106, -19, 99, 6, 335, 124, -30, 73, 105, 90, 516, 242, -252, -141, 194, -10, 117, 77, 93, -68, -92, -48, -85, 67, -316, -149, -89, 83, 165, 57, 108, -96, -116, 318, -119, -44, 33, -222, 101, 175, -29, -380, -38, 126, -151, -3, -116, -44, -153, -92, -320, -36, 116, -150, 264, -164, -70]
7834g0J93K18l59J56r3j72K13K68l85j13K47j55j31K43m0K7J6P4j10L4R2r7J43
7857A99m22K87n2ql29N26k0l50K18k43K24j96K73j86J78j38J21j2J73m40K05K1
7879B9j61K52j60L5J70l98K54j6j36J34j49J24J67k23K34k21j45K08N8j66j14
7900b24M05o8k08J29n59O96l36J1L77l27J06J00M8p6K22l30P4o7J60M4k74J28
7922C1n2pJ26K20k90qJ1J44j81o4N9j38K09j12R1k32L55m05N46m05K05o8k87K20
7946c2K4m3J22j80K02L20m75K2l3L49o77O67r7K01l36j12K81r1j36l5L7j52k8
7969b02J00J76n2j67J65mJ49l07K5J18R8k38L11j0l09K64j73J46J1P1j21k7k48
7992b24K87k24r6N7J56J79n9k0j9j5J59j8p2j73J55l0j13m0l7n6R5j5J82%j93
$$ y = [-70, 123, 341, -18, 138, 45, -127, 86, 354, -31, -144, 103, -52, -183, 60, 20, 47, 63, 137, 27, 61, 153, 56, 199, -223, 64, 12, 4, -325, 201, 181, -169, 49, -194, 30, -166, 107, -79, 99, -39, 82, 70, 243, -197, 8, 29, -132, 120, -40, -5, 165, -233, 21, 5, -131, 3, -146, -22, 145, -78, 156, -65, -210, -2, 56, -110, -224, 181, 113, -95, 34, -525, 171, -165, -154, 223, -104, 2, 102, 150, 74, 296, -34, 40, -27, 133, 177, -97, 31, -21, -28, 98, 318, 28, 20, 31, 175, -6, -70, -11, -149, 60, -52, 39, -193, 162, -243, 303, -102, 103, 35, -252, -32, -8, -51, 71, -109, 93, 413, -62, -40, -73, 276, -401, 266, 169, 370, 34, -78, 203, 112, -24, -59, -22, -174, -202, -102, 74, 22, -145, 20, 16, 165, -142, -117, 1, 99, -139, 172, 162, -147, 117, -56, 90, 101, 172, 51, 24, -224, 63, -161, -257, -200, -44, 135, 76, 56, 37, 22, 181, 163, 91, -82, 73, 43, -70, -110, -147, -203, -108, -123, 59, 59, -134]
8017a34j8K1j2K8R1pO7K95k12j64J79k45J97K66l24k15J38J05l07L73j71J39j50
8040f0j9lK15k90O5j28J77k25P32k34N5m2j22L8J11m0l77J30k38M91k65L06k92
8063a5OK38n18L59Rj63L6M1k7m9K45j95M32l96Q2Q9n77K23L53r5j70J06l64J45
8087b05K42j77J46J8M0J33l63j42K60o8J85O4k10K78m4k51J40L18m79n6p6J07
8109a40L47l71L15k27K09l5k82K23L89l52n3Pl80N88m00L36M9k04J5j07K32k06
8131d7J14m8k33J86K02q5pl88O5K12J7K98n9k77m0K92o21L21K62j25j81K94M3
8154A95l25K22J28k11P0j63O5l3j18J30j12j80L18j35j9J45j67L52j10j13J87
8175A26m2l43K00NJ50K3j86N8k7P9q1R2p8K41l20N8
$$ y = [-134, -152, -131, -143, -115, -24, -31, 36, 331, 119, -45, 134, -111, 86, 352, 28, -187, -49, 56, -251, 122, -49, 90, -60, -79, -82, 133, -157, -92, -220, -43, -268, 464, 230, 285, 243, 121, 159, 270, 230, -147, -17, -255, 236, -29, 277, -15, -9, 229, -289, 70, 79, -84, -48, -7, -34, -83, 162, -33, 399, 3, 85, 174, -403, -180, 173, 78, -92, 14, -350, -205, 37, -140, 6, 24, 64, 197, -166, -308, -48, -116, 69, 133, -77, 201, 157, -94, 46, 364, -115, -171, -247, -140, 207, -164, 151, -76, 133, 98, -184, 39, 428, 76, 23, 30, -350, 238, -162, 174, 223, 19, 34, -73, 159, -47, 67, 19, -214, -28, 174, 89, 82, -306, -241, -29, -12, 286, 227, -50, -90, 202, -419, -98, 164, 39, -142, 152, 195, -130, 92, 220, 9, 79, -84, -19, -52, -170, -40, -152, -332, -14, -149, -168, -23, -190, 162, 52, -61, 126, 84, -259, -59, -54, 96, 119, -67, -9, -36, 43, -38, 54, -24, 217, -103, -45]
8191d5
$$ Imaginary data points
##PAGE= N=2
##DATA TABLE= (X++(I..I)), XYDATA
0@%%%%%%%%%nJ3j6J6j6K1k9L2l9M7n4O3p3Q8j01J14j31J51j72J93k18K48k80L12
33A64l49L91m34M84n40N99o62P31q10Q98r95J103j222J356j511J687j889K125
51A126k409K755l185L742m490N559p228J0225j7326P0071M4531o9054k6677r729
65b089R399l919K0094K5665M586l9150l2172M401K9516O441j0508p148R94j3807
79g697j5303L210J7288k289k3928j9890Q335K4797J9484O380P67j1184k6156k2200
93d8386J0580L5924K6924k45j5337j4795q736j751J3962L0297K4818p702l0312
106A5241j7582M872P152j425L489R181j715j5598p739J5715J6858j0713k7918
119a0182j3208Q807N480j681O995J0729j2567l2042j5132K0465L1381J2428n276
$$ y = [0, 0, 0, 0, 0, 0, 0, 0, 0, 0, -5, 8, -8, 8, -8, 13, -16, 16, -23, 24, -30, 33, -40, 48, -53, 61, -70, 81, -91, 102, -116, 132, -148, 164, -185, 206, -228, 256, -284, 315, -347, 384, -426, 472, -523, 580, -642, 714, -797, 890, -999, 1126, -1283, 1472, -1713, 2029, -2461, 3098, -4130, 6095, -11231, 58840, 103371, 34317, 7640, -2089, 7310, 3391, 23485, 49150, 53736, 14586, -17586, -13185, 16331, 22772, 12264, 5116, 6110, -7697, -23000, -19790, -2502, -4791, -28719, -48609, -40274, -15477, 4007, 10387, 11154, -30, -26186, -48386, -37806, -1882, 25042, 24797, 9460, -5335, -14071, -15822, -1860, 28437, 53255, 45553, 15241, -2341, 2531, 9683, 8258, 11747, 20928, 19213, 3615, -4124, 11591, 28449, 17736, -10182, -23390, -14583, -9103, -10784, -3789, 6940, -5627, -37669, -52801, -32336, -955, 11473, 6197]
132F197p764j1581k0252j2699J6579L2626J4297j0775j2526j699Q96K442Q265
145D006J3319L461j1476j2800K431J3006M300o406o983k515j550K067J2217J4742
159B7819q34k0335k4277q804Q687J3847J0615O786j971j7923k2360l698J9176
172a3272K0673M440p609p967p322r155k858J2383J8852K281j2954n088R906R819
186A2129j248m280k86k665q570k340J4326J9035j80j7053j4594n20M935O373J2895
201A7957J1737o277k2348j9640r35J2012J2355P496J556n178j2716j0792K508
214a2265J2848O574m218o745k256q56R13L486N023K60p317o737N643J3487P890
229A5730m547r406p502o933j908R548J7072J1221p112j7344j1217K234P276N924
$$ y = [6197, -1567, -13148, -33400, -46099, -29520, 3106, 17403, 6628, -5898, -7597, -6701, -4259, 4006, 17325, 20786, 9310, -3490, -1059, 11947, 16247, 9841, 2858, 343, -1207, 860, 13077, 27819, 26985, 6650, -17627, -26431, -17744, -3897, 6718, 13504, 11533, -6390, -28750, -32448, -13272, 7401, 11841, 4232, -3735, -11057, -20212, -23070, -10687, 8165, 10446, -2508, -7596, 2310, 12129, 10881, 6601, 6315, 3650, -4920, -7260, 7066, 26101, 25921, 8868, -5726, -6246, -1311, 5062, 17957, 29694, 23417, 1069, -18571, -19506, -7494, 4861, 12357, 13913, 8735, -3981, -14773, -12265, 583, 7157, 2939, -3806, -6062, -6918, -6005, -2519, 2504, 2764, -4553, -11290, -5647, 7840, 15730, 11183, 1777, -5725, -12658, -14566, -5018, 12054, 23275, 16163, -1181, -12398, -10164, -2888, 3036]
243C036P726N355p288j7352r715P114J2532M086k678k107j12k465l635K862O603
258C962k872j1011n855O607J0695N048m94l931p172q511j886J0482J5267N481
272A5810p950j2454q789l170L567J2113J3536K540r582j1197m243L483M668L462
286A794K282l12n704n833K458P911L589m442o111r76L523M208L101K970j373r665
302b580j1212p5J2257J3045L231m228o317p781o682J171J0456J1690J285r609
316D651r743k114K182K852N309N003m31o986n010J765N100J350l901l969j100
331e042P04L289O375N414k910j0143p446J190P621P546N009n93p362j0209o162
346a2719M824J2015Q857J86n445n474n906l283L608Q269M194l954o643k154K935
$$ y = [3036, 10762, 16117, 8829, -8523, -18238, -11124, 1408, 5494, 2816, 709, 597, -1868, -5503, -2641, 3962, 1090, -9921, -15776, -9169, 1526, 6574, 6080, 2149, -5023, -13534, -15420, -4938, 10329, 15810, 7860, -4594, -13383, -16553, -12986, -873, 12663, 15203, 5621, -5576, -9819, -6336, -1668, 1794, 4076, 3764, -1940, -7773, -5315, 2596, 6185, 1743, -4368, -5344, -1821, 2387, 5488, 8458, 7085, -2580, -13792, -13867, -1610, 11435, 14666, 10438, 4121, -3660, -10342, -9171, 1285, 12975, 14260, 4651, -5092, -7206, -5024, -2172, 3137, 8140, 7709, 723, -4287, -2522, 2578, 3928, 27, -3942, -5042, -4338, -1049, 5326, 10740, 7830, -2313, -9759, -8569, -948, 6598, 11607, 11014, 3652, -6557, -12719, -7895, 4120, 12977, 13163, 7718, 2244, -3662, -6945, -3337, 4932, 9126, 5172, -1471, -3625, -690]
361f90L081m25j139n18k510l409J673O982L863m680r308n627J582N973O208N367
377F423K076o386j1169o170M520R498O757J607l272n761n654j271N085P804M100
392H187l113m467j852P4J162J945J533k048m542j244M557N467K189l472n941m566
408f131k511J833P736O813O2q500r010k654L043O009O272L698k141o941p785r76
424a1183O217O888J347j857j601j240q23J306L922K534k044m645j276M294N410
439G249R17k342l282m054k478K632P457O330n00p052p926l927J084M835N993L688
455H624k426p504o147L0L962M115K474J7l349l872j548K096L401J177k805k162
471c917J070K669K441K714N94l689n874k455L699P587M910n81m366n011l686l21
$$ y = [-690, 2391, 1966, 827, 309, -2201, -5610, -3937, 3045, 6908, 2228, -7080, -12707, -11125, -5152, 1056, 6423, 8499, 2113, -9056, -15226, -10706, -1208, 5549, 7156, 3884, -1877, -7531, -8802, -3717, 4087, 8187, 5074, 607, -1245, -1171, -9, 1936, 3469, 1421, -3121, -4365, 192, 5659, 7848, 4376, -1565, -6131, -8642, -6809, 927, 7740, 7802, -698, -9708, -12362, -9319, -3310, 2962, 6660, 4519, -2422, -10207, -11183, -4966, 1922, 3269, 1412, -189, -1429, -2252, -946, 2976, 5510, 3466, -1179, -2455, 1839, 7249, 8166, 5824, 2542, -1512, -3990, -1358, 6099, 12429, 11929, 4877, -3049, -6976, -5892, -1057, 4936, 8624, 6198, -1306, -7453, -7423, -3461, 654, 3128, 3145, -204, -4076, -5624, -3528, -127, 1050, -1755, -3917, -2847, -178, 2263, 4977, 5571, 1882, -3992, -6447, -2748, 4839, 9749, 9168, 4802, -209, -3895, -4216]
487d216M264P901L608l436o874n419n10K384L056K356J105k490m314k249J755
502c079L321j61k816k136l83J304K003K419K5k690m562k097L333N789M249L62
518D881k682n426m742j30N704O718K719r80m563l840k093J877M116M654J78m290
534B101l217r90J761P81P90N9j244k162k12K599K745l79l789n024q72K501L237
551a315M090J253k252n326m497k70N435O004K545j883m031l767j668J394M525
566B37M676P53k792l070r43J468K267P67j36j246k205MK293K921J84k980l159
583i61j563O41L172M019J483k743n973l891J86L614L748L146J45l023n877k847
599f724K309M754K566m75j541k207j626J09J874K427R60k438j529M96K433J766
$$ y = [-4216, 48, 7949, 11557, 8121, 1247, -4172, -4682, -2298, 758, 3114, 4219, 1729, -2585, -4834, -3079, 242, 81, -2735, -4871, -5254, -3950, -1947, 472, 497, -2193, -6755, -8852, -5519, 270, 4519, 4881, 2199, -3227, -7969, -8099, -2395, 4323, 7042, 6062, 1499, -2341, -4434, -2557, 1559, 6213, 6391, 2101, -1116, -2106, -345, 436, 1226, 1285, 41, -2121, -2333, 266, 3011, 2632, -1157, -6181, -7053, -4552, -1315, 2775, 4028, 1776, -3550, -8047, -8317, -2882, 3122, 5667, 3784, -247, -4014, -5682, -4288, 237, 4913, 5666, 2874, -196, -1139, 329, 2596, 3363, 3227, 1981, -224, -220, 2073, 4994, 5178, 2198, -961, -2524, -1883, 1289, 5308, 6791, 4048, -1925, -5816, -5630, -2016, 1732, 4878, 5023, 2000, -3877, -6724, -4415, 339, 2905, 2430, 889, -1318, -2944, -2835, -961, 1466, 2426, -12, -1541, -1045, 1388, 3154]
615C154j23k003k302j750N54K592M272J941j880m909l916K11L025M207K178n52
631D699k816m041l208J114L862L026J49j492k337k309J51J209J833Lj700j169
647c026K01J406J449L75m49k540k506N02L816L539N29k006k772k871p02J919M394
664A258L843K30l566l995j185R63K563K590J545p14l266k399J80K036J757M1j155
681G26j665P4Q87Q90P19q62k132k300L2K021L768J750j608l626l203o27J358M046
699B48L331O71l003l539j920N65L212L278J371o11k478k455Q4J946J302O28j61
716B469q98j378M81J753J534p97k590j931J23J915J683J113O2k521l988k003K184
733b789L759K336L3k256k839k600m74K486L023J798q78k488j653j13J508J330
$$ y = [3154, 3031, 1028, -1274, -3024, -2470, 122, 4394, 6335, 4455, -454, -4370, -4159, -1134, 3073, 5251, 4699, 1883, -2158, -5366, -4252, -390, 2636, 2785, 1293, -1044, -3353, -3202, -1993, -160, -157, -1857, -3026, -2825, -1419, 30, 405, -44, -2584, -5090, -4588, -772, 2767, 3296, 1290, -1482, -4353, -5055, -3136, 1258, 5101, 5331, 1765, -2230, -3415, -2452, 111, 2701, 4246, 3532, 266, -2133, -1953, 83, 1840, 1881, 726, -939, -865, 22, 912, 1631, 769, -1363, -3663, -3631, -1610, 2158, 3908, 2300, -1326, -4529, -5156, -3798, 248, 3579, 4250, 1247, -2292, -4212, -3647, -435, 2843, 4214, 3603, 1125, -1330, -1246, 700, 2002, 2630, 2469, 1571, 193, 674, 2427, 3961, 3164, 574, -1357, -1234, 681, 2364, 3477, 3539, 1018, -2970, -4973, -2789, 970, 3306, 3339, 1083, -1756, -4356, -4830, -2344, 679, 2477, 1599, -889, -2542, -2655, -1147, 183]
749A83Q42l38r18m76K34Q86J173M97k026j807N02J236K418J308k33k287l008j558
767c372J130K999K500L99j625l287k564l92K246K960J070j091j864j782p60N82
783b851J566J504m01j993o32R44J895M82n63j074r28p06J019K313K649p0k433
800G21k918j049J247K871K454P88j053k992k299o34K136K991J254l75k283k293
816a434n67O05J403P64L91j224j102l64Q89J009Q7j404r23m08J100J516J941J06
834B385j687k524j078O41J769K756J476q53k763j981J03J567J995J298M49j420
850B133j967j534M87K200N69l49p37n22k19J41P40K79n10j590q19O25J627J161
868A715K81j239k356j193J88J924K422Q97p50k427k056l94J444J874J811P6j280
$$ y = [183, 1025, 687, -231, -707, -473, 413, 1586, 2083, 57, -1750, -1248, -12, 2406, 3714, 3481, 1194, -1814, -3372, -2242, 757, 3257, 3656, 2031, -1256, -3820, -4212, -1966, 994, 2064, 973, -891, -2673, -3433, -2851, -1285, 219, -182, -2175, -2807, -1863, 32, 514, -49, -1123, -2051, -2757, -1738, 575, 3224, 3154, 721, -2197, -3246, -1999, 872, 3326, 4114, 3061, 69, -2230, -2864, -728, 2263, 3517, 3142, 859, -1434, -2001, -1396, 7, 771, 1162, -62, -1164, -1528, -639, 370, 457, -947, -1870, -2278, -1178, 338, 2279, 2385, 698, -1826, -2904, -2263, -494, 2262, 3738, 2885, 122, -1859, -1756, -189, 1806, 3104, 3553, 2133, 166, -1368, -881, 1319, 1888, 1539, 802, 280, 61, 202, 942, 1221, 711, -879, -1698, -1073, 554, 1715, 1996, 757, -1599, -2792, -2604, -680, 1742, 2639, 1889, -538, -2594, -2988, -1544, 330, 2141, 2217, 937]
885I37j760p19M28J130J115M63j142q64k05P74P29L40j050j256n64N60J001J467
903A384L62j022j661k115J67J700K552Q48r66j747j797p72O43K217K114k49j168
920D90j912o41P22J031R87N39q71m58p91N84J125q5J05j269j018M11J150J585
938A684K98q93j539j418k19J406J703J681p12j436k499l97O10J882J746n3p76
955A068j613q23j1J061J409J68n24r41l68P76N26K11Q9j022n62R4P24J271P91
974B324m83k006j404o5J376J469R32l27q86j922r68L37J997J453j69j199o25j053
992a219K06L26J089O51k00r48n90J55M67O72j36p86m25l9P91R24M92o3j456j039
1012a128m27P68J321J485r9j114k055o17M72J041J613L38o37j538j229M8Q07J234
$$ y = [937, -823, -1542, -1114, 16, 1131, 1594, 452, -412, -617, 157, 886, 1226, 176, -1080, -1644, -1084, -83, 1384, 1746, 724, -937, -3052, -2885, -1185, 1367, 2215, 1249, -498, -2295, -3067, -2424, -207, 1907, 1658, 490, -1422, -2063, -1341, -310, 677, 1216, 345, -113, -904, -320, 805, 720, 825, -444, -1462, -1051, 99, 1684, 1982, 1089, -450, -1868, -2087, -681, 1022, 2703, 1991, 555, -1944, -2341, -1731, 151, 1897, 1844, 1068, -545, -1368, -1379, -318, 1091, 1259, 735, -206, -574, 202, 728, 939, 1028, 6, -556, -462, 262, 1533, 2324, 1841, -165, -1569, -1634, -258, 1211, 2143, 1816, 930, -992, -1960, -1623, 374, 1827, 1658, 459, -166, -1219, -1013, -687, 402, 1053, 853, -95, -685, -530, -63, 609, 473, -313, -738, -777, 14, 938, 1430, 1367, -89, -1128, -1555, -787, 534, 2019, 1920, 806, -1249, -1866, -1394, -353, 1260, 1598, 961, -577, -1806, -1758, -951, 283]
1030B83N07p59m22m74l23P33L97L88p06o98r7P55J376J68n07q45r77k10M78J176
1050B43J508K87j238j582j119L92J261J429L53n21j018j064k89O71Q93R88l93
1067H01o54q91j36O20K40q9j1n63l82K62R34O79j73o06j409n89J041J383J158
1086A615j06p88j014r86K07J040J444P20m25j316j136J11N39Q62Q78j28o03p54
1104A60n36O85N97J7l65p87j45r0Q52M76J22j069j008n07L18R83J543m1n96j421
1124h12r58L11N57J471P44k71p77j032n77O55R99R50l05k19q26J50j40M52M98
1143H70l62k78l59k24R07Q47l4r69j014q03L52J084O53M18q11j176j218K90O91
1162a136J250M91k2j133p18m82L04Q69P19L45m50p45j43M29M28M3m3Rl03OM94
$$ y = [283, 790, 31, -391, -865, -1188, -455, -58, 330, -376, -1074, -1171, -416, 960, 1128, 621, -224, -1201, -1411, -933, 243, 1751, 2038, 800, -782, -1901, -1509, -248, 1181, 1534, 1013, -5, -1069, -1358, -687, 206, 1194, 801, 147, -744, -880, -260, -20, -109, -120, -683, -1065, -803, 131, 810, 637, 31, -1378, -1967, -926, 457, 1615, 1509, 721, -293, -1279, -1072, -32, 1412, 2132, 1707, 391, -745, -634, -95, 767, 1645, 1517, 914, 160, -376, 309, 906, 923, 558, -229, -374, -464, 388, 864, 986, -83, -1091, -1598, -1280, -297, 1246, 1205, 609, -812, -1770, -1459, -902, 569, 1313, 1042, 265, -767, -1344, -689, 310, 1260, 955, 736, -90, 60, -80, 372, 870, 508, 230, -129, -353, 554, 1401, 1367, 398, -616, -1419, -1067, 17, 670, 1088, 277, -899, -2117, -1827, -1136, 114, 605, 583, -550, -1268, -1750, -1446, -577, 142, 487, 37, -708, -851, -422, 6, 49, 6, 15, -288, -282, 212]
1183B12P70j80k17j220m6j92Q80J024L71n93j203m45m19O90O12J232p1j059j084
1202i38o84P98N15P86k85p8o24p7m76O84O68mm79l06P3N23M34M06m31n20n60k22
1224g97Q16J100N11m5j160j064k38Q09Q83P99k75j58j363n74n3Q01Q81K51o85
1243D39q02m9k59K84P19K29p11l63J8K64R3O65m46l66p71j36J290N69K17O8j074
1264a22m81l62L53R06J115j17q19p46m31P9Q84N30O3l7p95p06p3O29L18J84l12
1285F0o66l4L96K41K46k12m30p19l47Q84J054K0K15j361n57l32L83J088R22j50
1305G01l91n45r39L50Q11M87M92k05o36n18n5L27L17L41m74p1l78N82J57J49o8
1326D34p23k46k2M88K91M33O1r01q67J4J37J074N71K4l81j012k84k2N37P77J83
$$ y = [212, 982, 802, 585, -635, -681, -873, 7, 1031, 1402, 809, -394, -839, -1258, -568, 44, 1276, 1205, 146, -938, -1622, -824, -309, 477, 192, 114, -510, -587, -1063, -379, 289, 285, -194, -500, -427, 96, 530, 936, 505, -15, -575, -797, 19, 1119, 1630, 1585, 425, -639, -877, -68, 815, 1614, 1339, 1181, -182, -756, -809, -8, 873, 1124, 439, -363, -412, -671, -387, 332, 561, -150, -513, -495, -231, -138, 527, 81, -285, -1056, -1192, 98, 667, 884, 952, -122, -603, -965, -612, 294, 1409, 1292, 473, -273, -704, -625, 259, 789, 852, 815, 20, -686, -759, -130, 188, 372, 60, -606, -640, -244, -3, 243, 31, -399, -1118, -1465, -581, 473, 493, 708, -653, -1210, -1542, -1159, -71, 851, 701, 310, -235, -1174, -824, -13, 474, 966, 761, 125, -393, -448, -121, 196, 537, 63, -8, -386, 196, 353, 502, 434, -289, -535, -557, -69, 222, 655, 716, -185, -1052, -1038, -901, 173, 744, 768, 387, -625, -909, -931, -394, 383, 566]
1347E66q1j24p17J17L45O30l92M3J6j79L2M41m2J00l80r21j42Q33O76L1j3m65
1369C74q35k27L3R35M23K17j71j070l12k2L27P32L58j08q00k85j28k01J014K92
1389E46m75n34K42K37K31k39M23l34m51qn8P94M75j10o14n12l61L0R22N60J26
1410H90n56n25o01p2N58O93J51j80o78j38k17L41M44j9k07k42l67L26J66M80j54
1431I3m74l1r0K46M71M11k06j62o49o02M48R35J72K60o15k27o68J65K87O19L95
1452G78N0n98n99l64M59O29K7n13o6K15p09K36O51L87r36J62m70J50M09N81J83
1473F62m60l25o25L47N61M64M7L7n71n51O6J66P22n4L45l61p33j16Q2Q98p2P9
1495F08l52m82L56jJ49l41P6l80j26J05M76J68K17j91o36m75L26N51N91l54K7
$$ y = [566, 485, 361, -356, -239, 106, 736, 344, 387, 403, 224, 256, 697, 655, 755, 375, -546, -688, 145, 821, 852, 839, 374, -461, -688, -655, 280, 703, 920, 749, -321, -633, -655, -328, 404, 762, 654, -146, -431, -559, -760, 254, 546, 71, -463, -221, 16, 247, 8, 431, 97, -354, -362, -420, 374, 849, 739, 125, -387, -748, -718, 204, 764, 890, 334, -191, -792, -864, -306, 387, 538, 358, -320, -458, -675, -334, 110, 91, -116, -358, -725, -399, -233, 247, 93, -381, -412, -502, -256, 215, 626, 420, 258, -391, -993, -545, 390, 562, 822, 207, -20, -688, -523, -236, 383, 778, 828, 230, -369, -733, -274, 355, 382, -131, -197, 18, -691, -455, 196, 583, -353, -191, -661, -511, -102, 479, 662, 202, -123, -748, -401, 160, 624, 671, 708, 137, -414, -348, -182, 540, 486, 831, 470, -263, -379, -297, 601, 529, 608, 256, -226, 130, 129, 278, -63, 13, -367, -493, -388, 88, 256, 473, 282, -354, -829, -503, 48, 639, 285, 312]
1516C12n47k93K35N5N96LL46k98r85K16L09j01L95L39m66m24qL13J87Q7J6n27
1538b40k06L14k1N65pj07m87m79n9N11O70K68m96m76n98j27P55K58K0m6J05l70
1560b53j60l16Q00j10K92p1o59J92Q4M78j86J26m36k0K87O7N02k40m32j99l96
1581f50J30L92N17j3L6m15l81j78M62K16L85j85J60q84M7r6M10N27n56K40l96
1602b32k75N27J77L89k95l82R7j38J91K12J42k42l41k65J35M05L74M05m63j89
1622B32m48pj72O70L87j14j98o20OO5K17p0K66j69k47J47m23K26N61l74r8l07
1644d70L96J69K9L92m77j32j80J22L87m9M20l87l07l35k72L19O24M73m13m12j41
1665b44l52N9J80M82K16k70n25K90j20O03k32O2n94O4J46j51P04k24K53o39l05
$$ y = [312, -235, -528, -293, -238, 358, 361, 707, 409, -576, -360, -51, -152, 243, 582, 116, -308, -316, -3, 184, 271, 287, -240, -446, -132, -153, 412, 405, 298, -189, -668, -727, -216, 454, 722, 226, -250, -848, -975, -220, 38, 58, 12, 117, -253, -413, -729, 71, -39, 253, 182, -477, -285, -201, 277, 91, 217, -219, -239, 48, 115, 617, 377, -55, -254, -650, -520, -128, 389, 376, 412, -3, -384, -562, -100, 116, 501, 316, 476, -408, -361, -457, -47, 480, -76, 164, -232, -507, 20, 197, 586, 291, -91, 6, -132, 59, 271, 413, 171, -170, -435, -300, 105, 479, 884, 421, 232, -216, -223, -395, 275, 662, 548, 350, -270, -264, -199, 18, -52, 214, 45, -202, -55, -478, -252, 309, -65, -163, -470, -74, 95, 124, 516, 39, -93, -273, -151, 236, 187, 607, 220, -87, -422, -694, -375, 249, 722, 309, -103, -244, -596, -537, -357, 125, 341, 71, -454, -164, -284, 319, 87, 149, -445, -381, -235, -386, 318, 94, 347, -292, -597]
1686e97J25J80N59J02Q8k93j65o17L65L49L62J77m68l68j72L69QL63qk38k11r2
1708a82j4J11J00J75k77O7m24M84J55j94K71k99n21R2M22K23J64R8n18j84m05
1729f56L98K98L03Q1j40k11m63J30L74L09K30n91K5q3l49Q18j65j10o0j18Q0J49
1751B49j2J93l89l60m8j10N07M12k2K90q98m1l44P5M53O27k01j48n41j72M11L1
1773c8Q3M05l67j99K70j96K74j85J73k91k02J79o2L48j28K14m06p8k69L45K26
1794I6L67m33j50k70l40L69R4O63K07o44l93j89J45K37M05m2k76K11j75k88L60
1815d6K44k77M4k83M9%N29k30K13k76l96R7M82J54K15j88o85j49L63j02k8P78
1837E08k25l01k7j41j28J17L62j91j04j26j91l4J67O15k14n6o8j38K3L76N0R6
$$ y = [-597, -472, -292, 267, 369, 457, 164, -1, -618, -253, 96, 458, 635, 167, -201, -373, -4, 4, 367, 359, 121, -90, -182, -196, -85, 15, 190, -87, -20, -444, 40, 195, 1, 272, -27, -548, -456, -34, 189, 353, 451, -67, -251, -656, -258, 40, 343, 424, 284, 73, -390, -260, 114, 423, 653, 62, 87, 4, -345, 473, 308, 198, 138, 20, 100, 249, 237, 430, 41, -319, -367, -477, 30, 442, 420, 710, -188, -229, -573, -498, -45, 582, 381, 233, -308, -480, -69, -38, 45, 450, 83, -116, 154, -42, 232, 47, 220, -71, -273, -94, -156, 192, 64, 278, -128, -206, -475, -130, 96, 463, 30, -120, -390, -730, -361, -267, 396, 603, -41, -434, -623, -478, -241, 164, 122, -154, 57, -118, -406, -46, 198, -79, -35, -318, -269, -269, 260, 30, 243, -33, -429, -332, 150, 304, 519, 331, -354, -503, -140, -242, -270, 508, 283, -18, -45, -186, -314, -197, 165, -26, -130, -256, -447, -481, -314, 301, 87, 31, -37, -175, -152, 224, 274, 370]
1859C70l16l33O7K56K44K24j29m9m71k99L13J12N67l0j04j65m24n4K20K14R8j64
1881A47j51k47kJ16K64J31k63k29k02K89p1M55j42m62J97m12J29M55O25l4q15
1902b22L09j08m65N63M69m74N5m80J45k18K68N08J56k89l17p9K17j03K39k8k56
1923a10J39p1N0Q7r0M31n55j68k12K60J54M14k85j91k11q8M0K05L29J60m08k77
1945c97J50J30PK46K63m9j11l85K13Q2M21l25n8j87O2m2k74O62q1k42l31k33N
1968d74P50k24L90l90j61m52M69j47Q70n7m98k93K32k00k9K91J72J1l57j88qJ10
1990a83K42K20J66k52m89K74P5O2J63j28k40k16O5O83Q2qO7n06m33J13Q1K10M06
2013D54k21j31j68l58M02m1K95J62l65k6j30o9M3M20l12j68j45L40L21j53K89
$$ y = [370, 54, -279, -212, 44, 288, 512, 383, 334, -137, -436, -123, -11, 556, 526, 422, 257, -167, -221, -1, 213, 311, 147, -4, -251, -253, -137, 127, 258, -5, -234, -436, -147, -218, 237, 95, -367, -170, -582, -453, 2, 627, 593, -222, 87, -21, -486, 77, 546, 72, 127, -353, -208, -426, -158, 350, 506, 217, -100, -179, 38, -65, 174, 146, -110, 29, -42, 8, 95, 5, 436, -119, -287, -499, -239, -85, 329, 44, -147, -358, -446, -406, -201, 128, 288, -120, -397, -247, -117, -110, 136, 399, 350, 239, -146, 67, 149, 570, 245, 187, 0, 62, 20, -254, 408, 327, 85, -246, -479, -474, 276, 52, 442, 52, -109, -561, -92, -239, 631, 574, 76, -217, 15, -185, -214, 77, 249, 260, -97, -285, -293, -183, 59, 279, 445, 193, -296, -22, 53, 115, 278, 150, -90, -306, -241, 442, 524, 516, 583, 77, -356, -243, -162, 48, 454, 233, 102, -66, -424, -22, -63, 232, 394, 29, 3, -127, -196, -153, 267, -45, -213, -358, -18, 303, 150, 439]
2034D39m16l20j30K29L18K27k41J86m43pl88L39K59L53q6p15K99j23K21J15L17
2055D33k13M0n15J46J09j62K74j14k20J33R9q6j03J81o8R6j04l45L08K23n1Q0
2077A41m32K7k61L41K71O32m20m31j88M7P4M38J91l57J26k03r4k46L35N29j91
2098C29k63k9l13P1M05K76n82K45m99J16K08L88mk84o7l94l7L59M00r9k3P8n16
2121b35j2j19K73M77l69L21n18K48k49L72k2l60L09k42m3j4K71K80j1k48m50J03
2143b38K40L50j15Q6k11l86J67k11N18M0m6r1k79k11N30j34L15j33m7l25L5k8
2165a74Q9J15m3K99l38k02K09j18K66J76l84K15n44P08m17N34j36k91l22J40j00
2186c18N20K23j08k31m58J14Q5j0N15j85n6j62k10O0k9M52p2j40j88j16l5K22
$$ y = [439, 23, -297, -427, -198, 120, 347, 106, 292, -151, -158, -546, -207, 52, 405, 319, -396, -97, -220, 1, 116, 433, 220, 260, -255, -109, 0, -162, 112, -2, -222, -89, 10, -76, -179, 2, -66, 30, -74, -419, -111, 112, 61, 141, -291, -264, -525, -184, 87, 719, 299, -132, -320, -273, -199, 239, 430, 73, 199, -4, -98, -344, -9, 520, 329, 66, 37, -276, -205, 200, 476, -106, 139, -360, -244, -36, 352, 348, 64, -3, -397, -434, -75, 325, 226, 203, 281, -235, -247, -366, -93, 384, 15, 336, -182, 66, -183, 189, 167, -193, 116, -126, -169, -183, 88, 368, 357, 109, -341, -238, 2, 352, 237, 323, 112, -274, -107, -318, 200, 240, 194, 103, -176, -387, 143, 9, 324, 191, 144, -181, -146, -174, -85, 30, -13, 286, -52, -254, -45, -163, 103, 279, -105, 110, -434, 274, -143, 391, 255, -36, -358, -218, -318, 202, 425, 317, 86, -372, -258, -173, -183, 332, 147, 91, -71, -281, -221, -250, 202, 130, -10, -198, -314, -349, -127]
2208a27M14k9m76Q1r6M33J8J34j97l76L10k63L06l2L75n75K98l71JK95k77M77
2230C23n1J03p42L18l71K31M15j51J74l67k83K92K12R9p0L0k82k49L86K49m2j41
2252H3J36l47l18N07K91n1J76o62K35k28m5J59J78J93o2j46l34M93m46L55j45
2273B2J25N5n80J58L1L96J07m92M24m88K54J23L28l21N5n70k8J56J78L87J05l25
2295A00k07n23L96M65k61L59p7m29k83lJ78J67l3M11l03j39q7J38L1J49nk74J64
2318f6l13M90P4j46j56j1p3J27J32K94Pk34k00l95J25K39P06o15L40m43J7K0J88
2341A07K27m26K48m49J53O1J1K94O1o12K68l45L37K79K00L2k22j39k69k21M07
2362BJ02J66l15l42J92k02K61M06J16o8n84R4k3K16J41J34j35k97O7K84l73pL86
$$ y = [-127, 287, 258, -218, -137, -233, 200, 218, 352, 155, -221, 89, -174, 132, 100, 475, -100, 198, -173, -172, 123, -154, 323, 272, 375, -367, -49, -420, -189, 226, 75, 249, -118, -401, -109, 103, 202, 132, 162, -120, -369, 17, 266, 224, 83, 219, -128, -446, 61, 352, 301, 477, -185, 50, -178, -223, -64, 114, 307, 245, 99, -235, 258, -188, 167, 22, 147, 202, -378, -220, -189, 207, 314, -178, 246, -242, 12, 135, 463, 142, 197, -373, -401, -245, -67, 320, 425, 100, -107, -630, -234, 231, -30, 329, 252, -177, -460, -463, -285, -118, -151, 260, -43, -182, -269, -131, -100, 49, 44, -230, -66, -379, 111, 185, 39, -117, -128, -201, -74, 58, 352, 359, 125, -75, -470, -345, -106, 600, -15, 325, -118, -101, -81, 107, 334, -92, 156, -293, -140, -79, -68, 226, 287, -325, -57, -402, -65, 214, 414, 446, 224, 85, -184, -405, 2, 104, 270, -45, -387, -195, -397, -136, 270, 386, 318, -266, -172, -195, 21, 162, 296, 161, -136, -69, 215, -158, -165, 221]
2385B21P8k76J18L1L7j9o2k43J6JJ32P4M08j88p4n59J16M3j68O24J59k77l71J4
2409a65j45R3K95K82m15L54n93R1M9M18q1j54j70k0p8L65K35j60o8k71o6J83L1
2432A0p6M12j92k96J3j13K77k48N17k66K33n53m51k3O76NL56m42J10J74l84q7
2454c48L54l5k4j48K33K16r8K42l95r4k56J70P9L32J27k65j40l4j85L71J5K74
2476C91o7l64m27J57NM57J5k7P2m37NQ5K11N08k15o47Q4J36j18L55k79J86n20
2499d34K24o2K09M50N5l57K0l31p6K41N39j77k45N11m85jl66L60k5M41n43J12
2521F0j48j08L94J7j19j33l41L10L77m2j4o2k72N7j86K85k01K68Q7l19Nj42K51
2544B4r8L26j46j35l6k44L81j3lN34m73j48k9K54k33K38n4k07J1j79J38L96k58
$$ y = [221, 299, 23, 141, 172, 209, 190, 128, -115, -99, -98, 34, 108, 516, 328, 254, -305, -189, -146, -314, 310, 469, 192, -179, -165, -310, -217, 78, 360, -55, 299, -294, -203, -154, 264, 183, 29, -141, -161, -239, 126, 361, 201, 133, -138, -204, -21, 10, -66, 346, 154, -142, -129, -242, 35, -213, 304, 38, 271, -282, -733, -756, -80, -75, 281, -161, -51, 123, -261, -348, 6, -29, -53, -201, 32, 248, 150, 392, -3, -97, -353, -183, -104, 228, 355, 90, -50, -84, -269, 102, 117, 391, 324, -40, -467, -310, -305, 152, 167, 140, 212, -225, -220, -135, 76, 584, 369, -278, -194, -58, -176, 179, -100, 86, -434, -210, -272, -63, 387, 442, 85, 105, -226, -302, -61, 478, 301, 56, 567, 82, 81, -285, 75, 50, 491, -52, 60, -88, -196, 198, 215, 96, -37, -378, -68, 309, 267, 253, 191, -81, -24, -210, 75, -126, 142, 229, -90, -85, -227, 24, -74, 252, 106, -29, -65, -309, 72, 59, 56, 590, 117, -31, -60, 194, -39, 199, 145, -62, -51, -230, -92, 304, 46]
2567D6K80k72l13J55n5K25j19K25k69l7m95K46M00J79j01j58k74K4k1j7J84K05
2589C8J70k06m04M52l05L69J60m71J01l32M99q0K98R3k14j69j21K11L4J7O11o15
2611A36l63k0K6K41L21p6J80m77l3J16n4j16J43Q4k90l88M31J19K29m03M8J19
2633b7l36K52J24K38k18R4k99J39L52k01J50l9j41k40J11k36L04K31J46m79J13
2654C8k11%M14J09k83L66m06j55J52L3P8j73m6o2O9L6J7j81M25k57j38q6r0L59
2678HK45J89m70K0K2j01J59m2O15j34k79m48J42k45M1O15j54l09O4k58K10L27
2700B17j42j59J40m79K86L54O5k3j34j35j27j7p4N41m2m7m12j31k7J77L14K31
2722C76n9j87m47Q1K80l24L49q4k97R2L81l9j6j02K97l82j32O6O07o38K14K54
$$ y = [46, 326, 54, -259, -104, -159, 66, -53, 172, -97, -134, -629, -383, 17, 196, 95, -63, -337, -313, -334, -351, -167, 38, 208, 2, -402, 50, -255, 114, 274, -197, -96, -428, 71, -9, 289, 382, 168, -1, -122, 89, 123, 140, 751, 136, -227, -247, -221, 20, 341, 265, 445, -32, -65, 51, -3, -119, 24, 108, -182, -570, -139, -20, 209, -194, -146, -27, -363, -111, 13, 251, 33, 127, -172, -33, 319, 118, 268, 229, 88, -152, -41, -277, 27, 258, 404, -75, 38, -173, -173, 241, 350, 67, 433, 27, -128, 24, 57, 135, -38, -84, -146, -77, -41, -24, -205, 220, -37, -175, -261, -351, 8, 253, 442, -28, -8, 14, -87, 72, 30, 645, 511, 232, -216, -74, -319, -278, 337, 183, -126, -62, -320, -110, 217, 75, -84, 56, -423, -137, 217, 282, 259, 125, -10, -137, -154, -228, 313, 271, 224, -188, -319, -346, -169, 145, 376, 317, 130, -317, -236, 44, -280, 69, -15, -312, -220, 161, 122, 106, 4, 301, -81, -213, -147, 460, -178, 36, 290]
2744B90j45l48k57M80M84l49N5j19J12m83J04L68P3k00k03K58l62J74K94j51j34
2765e9J61k46J89j77O1M62n95K17Q9n68O52j91L28k82l64M31j19P6j63L69j25
2786A46j92j86k3M66o3M12o26L1j71J24j40K30L87m61q7K01l55k4N06j01K5k50
2808a51n7M53m81M37L7j3k56n1J54L3L36k00M9r3j33j67M19n8Q3k56J95l04k29
2831b53k70O26P6m4Mj41l63L0K78L98l21R2l82L51j94J22p9J34l76p6K26J27J81
2854A46M1k9k47J83q9OJ23p9nn5J2N9l18N65k80J93k56P4l5j29Q7O2J30q3k38
2879a62M1K59j18m1L55l39qj75l52O41K57j85m1q6j61J36J41j56K89k36j12O2
2901IOL18l87K12J12m57J50n1K29k04R4K61j71K11n20J03J27O8m1J14l98K9M8
$$ y = [290, 145, -203, -460, 20, 504, 155, 210, 91, 203, -280, -176, 192, 265, 65, -138, 120, -242, -68, 226, 75, -59, 102, -144, 45, -132, -71, 391, -204, 13, 102, -466, 186, -5, 323, 41, -323, 108, -11, 65, -98, 271, 146, -46, -232, -255, 211, 148, 560, -66, -35, -206, -82, -222, 8, 395, -66, -153, 48, -307, -331, 175, 74, 99, -151, -208, 245, -236, 201, 238, 225, -31, -82, 72, 105, 441, 241, 290, 197, 64, -103, 316, 258, 341, 85, 280, -24, -253, -523, 103, 179, 135, 139, -2, -365, -335, -57, 341, 20, 112, -270, 81, -113, 9, -70, 64, -312, -388, -162, -35, 146, 187, 158, -89, 94, 5, 11, 134, 55, 50, -5, 7, 66, -252, 313, 33, 226, -30, 44, 9, -120, -33, 29, 159, 76, -162, -121, 138, 20, -21, 334, -5, -13, -188, -540, 101, 358, 173, 132, 46, -115, 21, 162, 6, 295, 59, -53, 9, 15, 333, -54, 158, 270, -187, -37, -88, 141, -63, 31, 292, 121, 332, -188, -85, 42, 110, 69, 183, -215, -186, -138]
2924a38K47j12N8k91L3J05nK35j66j36k87N52j14l7N7J59j64j52j75K67K06k59
2946a17J3J45k62O9J03J20j83K40k79J37n8J08R4j43J87k26M4n86J27M19N9K79
2968B90k98M9p9j63P8L62nk97p8k78J73K78m0q1o9q5L3R1j26J38K92j61m5j13
2992a34j64L76m1j27L47l60j00P0O0J92K29j43j54m44J87K62K03r3L9Pm38K52
3014B6j46J96L41l30k58j86r7O20j63J37P3k53k29L04L41l85K74l52M4L7J0M3
3036D7M36N4k90l3k65J77LO9J59k30k07n3R1n3J95k70J16Q3j83L68l30Q0Q3j68
3060a21N4l04m7L17p0k8P1M08m28K3J02j98L73r1q6l1J77k38J13j9K6j51j28Q5
3084a91j01J71J45j32j38L8o5J59L04k45K24m44J44q9J13J84k44K01O9k22k1m7
$$ y = [-138, 109, -3, 55, -236, -203, -98, -103, 132, -34, -170, -457, 95, -19, -56, 1, 160, -4, -156, -331, -64, 142, -117, -104, 41, -221, -152, -49, 71, -112, 128, -151, -14, -72, 36, 130, -13, 174, -52, -8, -594, -467, -48, 11, 290, -8, 41, -38, -201, -123, 239, 234, -63, -141, -419, -246, 32, -8, -89, -158, -243, -210, -119, -245, -107, 185, 24, -21, -134, -298, 78, 37, -90, 257, -103, -203, -133, -73, 119, 348, 205, 51, -393, -206, 56, 259, 166, 205, 212, -226, 26, -120, 76, 417, 87, -171, -357, -454, 166, 3, 140, 213, -40, -269, 35, 376, -9, 265, -87, -43, -6, 4, 47, 483, 537, 247, 214, -51, 126, 129, 198, 357, 127, -80, -133, -42, -95, 100, -170, -54, 29, -154, 214, -116, -36, 47, -121, -67, -371, -418, -101, -171, -199, -128, 280, -148, -125, -23, -221, 152, 61, -25, -56, 121, -117, -4, -23, 3, -148, -276, -191, -292, -121, 24, -108, -246, -208, -273, -114, 190, -55, 169, -275, -131, -220, -107, 77, -167, 34, 103, -119, -140, -187]
3106a87J74J19k9p4j72l3J01j75L71k34L16k25K12l70N08l23L04l00K5q8k1J46
3128D5j36p2Q8n9O4Q6Q4K49l78k14J72j80N46m18j02L19l24Q1J0L66j36P5l26
3151a60J04j1K4K08k44L08J65o18J22pK36J9N6l83K01J49k38K42j64J17o7J14
3173A73l85J78r0J68j08n9J43n8J19j30K80l1p1K6l54n3L02O0n2P4k10L35k37
3196B0O5j6m9P8j99k25L11j66L49l0p4Oq8J1l64L00nL22k05J22l57Q2J70J07p9
3221H6l02K27q9N2k2J72m73J30N1L33o68Q24l74%l16M63n8k53L29P5j79J36p3
3244G1m82N69j97L84m49j46P7K6K37k31K23lj0k24J98j67n6k7N15O2n25K25Q4
3267A54O5k56J59l14J01J61l01K63P5K8j72k05M69n5o1J70k67o2q5J41m66N56
$$ y = [-187, -13, 106, 77, 3, -169, -202, -101, -276, 95, -139, 177, -48, 164, -206, 302, -21, 283, -17, 8, -80, -101, 45, -91, -163, -75, -134, -70, 16, 100, 349, -29, -243, -71, -251, 295, -123, -225, 94, -230, -149, -139, 227, 91, 166, -160, -56, -67, -43, 165, -79, 229, 394, -224, -102, -109, 127, 146, 202, -181, 20, 169, -69, 173, 9, 126, 59, 173, -212, -34, -124, 44, -64, -123, 20, -38, 81, -49, 231, 200, 129, 155, -199, -252, 50, 110, 58, 132, -78, 257, 20, 85, 69, 20, 98, -101, -326, -15, -181, 168, 138, 64, 70, -18, -7, -371, -71, -76, 246, 41, 163, -194, -112, 58, 165, 86, -216, 11, -78, -26, -48, 124, -349, -219, -168, 165, -503, 321, -53, -53, -369, 94, 36, -217, 112, 187, 8, 144, 71, -411, 158, -39, 345, -104, -250, -173, -147, 90, -141, 82, 79, 69, -155, 43, -124, -180, -207, 308, 370, -155, 70, 154, 219, -37, 122, -192, -91, 70, -231, 32, 107, 135, -37, -242, 227, 172, 111, 281, 14, -48, -133, 8, -458, 98]
3289I8j65L5%Q0j09N5K09k15K9Q0Mj10k0K64n18L49J90m20K08k19o2M16k38J33
3313G4j71J65j01j84K37j3J08J60k53K8k2O2Q4j12j2l27J73j98L28j32K23j92
3335g5R9m2m3J32M7P2k12j45Q0K18J8j12P9j53KR6n6J22j45J07r6l5K4Q5l5o7
3361c5J99p9l27L47k50K78j97J42N11q81j4K31p6l2N24j39j87k60J55l4j13L41
3383A04m5l3j49j01K23R8K26n16K00J14j45K79M4n03R1L3j17L50j29J07r4r6J83
3406A24j02n0j41J62K30n26L21o3J57j98j11N9K48R2m70J26j16L13P3j39j22L89
3428B56k60M5j14J68J22m4m98K75K98j12o3l94M18r7K05m72J31P9J03k21J46l21
3450c50L42N4P8l4l4k2r5L79k75Q3K24j56n7l00J16K99l26l22J39M54j52m4q4
$$ y = [98, -67, -32, -32, 48, -61, -6, 203, -12, 17, 97, 101, -9, -29, 235, -283, 66, 256, -164, 44, -175, -237, 179, -59, 74, -97, 68, -33, -217, 20, 7, 115, 275, 22, 50, 28, 90, 174, 62, 50, -277, -104, -302, 26, -106, 117, -75, 24, -18, -61, 71, 118, 190, -22, -167, -87, 131, 149, 37, 116, -37, -35, 61, 5, 127, -18, 89, -7, -42, -18, 67, 32, -35, 164, 85, -242, 105, -145, 133, -64, 78, 589, -292, -306, -75, -151, -183, 341, 202, 15, -245, -90, -124, -237, 104, 59, 26, -123, -224, -1, 97, 323, -193, 7, 121, -24, 255, 299, -204, -113, -80, -197, 153, 24, 131, 37, -59, 124, 22, -28, -169, -7, 223, -303, 18, -45, 112, -86, -197, -138, 110, 202, -268, -142, -258, 55, 128, -11, -133, 256, -4, 41, -73, 95, 217, 173, -325, -50, 248, 136, 73, -321, 97, 0, 205, -267, -136, -57, 46, -175, -29, -350, -8, 46, 124, 90, 56, 34, -61, 318, 43, 126, 350, 194, 137, -163, -47, 252, -74, -396, -257, 197, 45, 1, -83]
3473h3J19m2p2L2K4N7l8R0K56m46J02j09J44L45m23j92j25M71j11J17N7j79n7
3496f3k67L12j51P6K10m0j14J04l31K5J45K22j05j51J25l69L06K29r8J48k83j73
3518b43J25J39q8j73N29k22J87k81r6Q3Q2j4k00K13k25j1Q5K86q9k4q5J76l70
3541b16L10j82L4q9J33K79l97O4J23j0k7Kl69L12L9m4Q4k91L13p3P2j78M92k43
3565A38k01n8J13R6J06k4P2j88J73J77l88l31K43K44R7k52j30K27N1k65j77J79
3587i8q2mJ40l05M95j61N0K3l77K86K77l52J87p3j20o3p0O9K7R8k57K93j55J64
3611hl42L29J80j60J06l05N23n50J81j88J12K4J43l17J21J23l6J42k17J47j47
3632a39Q0J43n5K25k70k16J23m4r7K53J7R6j4r1L5J16J25m61L27k40J70l66K21
$$ y = [-83, 36, -6, -78, -46, -22, 35, -3, 87, 343, -103, -1, -110, 34, 379, -44, -236, -361, 110, -1, 116, 173, -6, -63, -330, -18, -169, -93, 117, 77, -37, 67, -264, -239, -94, 128, 23, -128, -3, -372, -66, 163, 65, 213, -70, -243, -118, 21, -67, -240, 289, 67, 254, -27, -123, -40, 42, 28, -172, 41, -184, -195, -110, 176, 87, 63, -22, 154, -216, 94, -88, -54, -143, -10, 269, -128, -64, 59, 49, 22, 24, -345, -33, 6, -38, 46, -245, 68, -5, 67, -111, 381, 138, -63, -121, -8, 88, 194, 170, 242, 54, 227, 404, 16, -315, -72, 172, 269, 17, -113, 114, 165, -100, -277, -98, -180, -184, -44, -349, 146, -15, 35, 58, -319, -33, 244, -108, 79, 6, -114, -177, -247, -178, -151, -53, -310, -17, -172, -8, -350, -21, 159, -1, 105, -200, 323, -227, -46, -234, -122, -98, 45, -272, -151, -28, -64, 78, -139, 8, -139, -59, 84, 29, 254, -16, -232, -109, -153, -250, 3, 20, 116, 102, 11, 46, 162, 287, -174, 153, -87, 83, -283, -62]
3655f2O3J46j10KJ68j29l7J31j55M1j99J8K82j34O3j7j15L7l35J67J22k24N51
3678B74m01J76l38K40J96k36L1J20N9r2K9J17r7j23k17L40J22k80J23k7q8J8q0
3701a34Qj53R0pK6K18j81L32k93L5J54R3j4o2k77j12N26k1p2rl01p8j98M06J19
3726I5po4J0J70j90j25L06j43L34l29J26k97J14L01n12K38K5Ko4k93K26N3P3q5
3750c6L26m11J08J23j60J83j35n8o8M0J57l69L71j19n8J49J14k78l0J74n6J57
3772A24j92kJ02J4M9p4j83Q1N3K87j40M1l41l2M04m38K82j41j3j20L06l20M68
3795B15m3l47K29m1Q1l69Q2K02k1N5j9J08p4K29n38J10J10r8M16m56J74J00R3
3818A98n44M30n7k20P06j92m80J99n4R0Q1Q8j03j87J38j86M4l24O17m09n0M3M64
$$ y = [-62, 1, 147, 37, 39, 207, 78, 41, 172, 17, 58, -141, -123, 159, 25, 88, 71, -44, -7, -342, -175, -53, -277, 274, -127, 49, -289, -49, 147, -89, -58, 62, 121, 29, 58, 175, 78, -45, -262, 78, 200, -80, 43, 16, -72, -54, -134, -126, -279, -189, -196, -170, 48, -133, 199, -94, -59, 95, 188, 174, 112, -165, -277, 249, 228, 156, 147, -154, -232, -430, -24, 95, 88, 24, 34, 204, 14, -111, 195, 52, 386, 57, 183, -114, 0, 301, -211, 27, 52, 54, -10, -303, -77, -24, 49, -36, 290, -121, -13, 110, -50, 133, -2, -60, -128, -88, 69, -300, 71, -48, -106, 43, 157, -121, -151, 23, -33, 124, -68, -70, 32, 46, 95, 21, -162, -81, -28, 259, 119, 160, -181, -213, 191, -247, 35, -106, -119, -239, 67, -253, 215, 172, -175, 54, 13, 94, -275, -193, 9, -12, 43, 24, 132, 58, 287, -251, -141, -31, -129, 287, -169, 5, 105, 198, -346, 84, 27, -193, 513, 321, -159, 40, -14, 76, 157, 245, 142, -45, 93, -93, -49, -373, 244, -165, -215, -172, 292]
3841B92l83J87k07J91q0j24K54k43K9L1J67p0J36k63K89l86o8J34J56k83J82J58
3863I9L2j73J85k30L24o05M48%j62J07l20K72l3J49K2l84J30l1J21k8O4J44k34
3886a03j9Q5m5L67j53L05o00J45J88r2o6J6m93M36j73n8L02R8k52%L61l99L69
3909B19l73L40m00L06r0l6Q7r7J32j74q%J17J77k3j79m0j58n2L64J05O9qm19j8
3934a59L01Q4m4j07j69J62j42j52K09K00j07k40P5Q2J91j17j49J89k35m6J4J87
3956B7o1J15p9N1j59k8j16L15Pl3J98k15J98l94l8L49k24m3K4K69o84O18J87p2
3980B12k76j05K75m4j18J47k36j59K11j3L7J7j62K27J10j55j83M66j69k91K88
4001G9j3l82L20p2R0n5J48k19J12J63m08N50n4j74j47P4j68LJ94j7q4O4J63m8
$$ y = [292, -91, 96, -111, 80, 0, -124, 130, -113, -84, -53, 114, 44, 180, -83, 206, -180, -248, -114, 42, -241, -59, 99, 131, -42, 143, -87, 237, -368, 80, 80, -82, 25, -295, -23, -56, 93, 115, -269, -139, -170, -49, -77, -13, 131, -103, -122, -37, -82, 285, 132, 437, -163, -18, 170, 78, 12, 28, -465, -29, -202, -260, 42, 140, -112, -112, 249, -150, 219, -154, 186, -214, 92, 2, -34, 53, -44, 88, -86, -94, -94, 23, 200, 177, -2, -42, -200, -252, 112, 217, 286, 278, -141, -159, 142, 226, 182, 75, -94, 68, -74, -226, -17, 183, 76, -164, -89, -7, 184, 67, -82, 107, -128, -174, -160, 27, -34, 81, 2, 53, -106, -134, -250, 65, 72, 39, 237, 22, 220, -174, -212, 137, -87, -130, -106, 163, -521, 97, 284, 212, -64, -169, 106, 62, -56, 91, -145, -304, -93, -106, -69, -52, -214, 13, 123, -32, -215, 251, 82, -209, 79, 66, -316, 4, -68, 22, -33, 115, -104, 8, 171, -237, 313, 259, 85, -62, 12, -156, -153, 41, 24, -60, 4, 167, 119]
4025A19k15J19L17k25o4O2nk85J48J28m7J86j92L0l2k50L78j69L78l51l6K98k65
4048B7k23J93Qj56M78k24J56k98L81r9j87q7R8R1j36q8K9J19j13J68qp4k1J1j09
4073f4N5pJ60n2n7L3k14J5J08O1j50L10j70m07L84R4q9k18K62K18l11K80k93o6
4097a18R2J05k25K03q8KL5j76k0K90l26K36K84m52q4J72J08j24j26K43q3q0N4
4120g8m5J77J74m55L01k7Oo2k95L74r7L3K69j41k08J29p2J17k13K18j63k08k3
4143b89J55K40N3r2j81K66N6j50Q8j59l18M89l58O3K44j75K7QK7j4K26l10k62
4166c66L28rj04p4P3J40j07J52k68K58L5Q6j80No7J75j39L7J53k43L09j66J63
4189A91J0K6l52J64n40J80K10l23M92j80L14l19J40K52m25L22j33ml4L8m6l3M2
$$ y = [119, -96, 23, 340, 115, 51, 113, 108, -177, -29, 99, 52, 238, 46, 76, 44, -206, 172, 3, 381, 30, -6, 292, 27, -196, -3, 5, -151, 327, 103, 259, -39, 342, 243, 56, -31, 67, 158, 22, -66, -37, 82, -31, 137, 129, 55, 34, 45, -64, -9, -16, 144, 92, 35, 68, -146, -131, -23, 38, -112, 198, 28, -379, 5, 99, 10, -208, 54, 272, -39, 241, -52, -118, -26, 79, -146, 57, -31, -29, 6, -170, -190, 100, -226, 10, 294, -158, -242, -70, 38, -86, -212, 31, -52, -132, -78, -123, 54, 228, -227, 74, 47, 53, -9, -304, 70, -27, 6, 275, 134, -74, 55, -17, 100, -113, 105, -58, -266, -289, -134, 106, 159, 67, -114, 152, 208, 58, 146, -13, -331, 158, -200, -137, 107, -68, -41, -33, -6, -20, 206, -104, -366, -38, -47, -151, -225, -152, -12, -119, 33, -235, 23, 58, 144, -36, -31, -98, 77, -62, -25, 128, -115, 194, 28, 191, 201, 227, -125, 39, -501, -321, -111, -434, 58, -122, 192, -127, 13, 265, -160, 162, 29, 25, -9, 29, -17, -50, -8]
4212hJ57p3r3P8J75m98K50O5M10k13n16L65k00K84m08R4R7r2L84m00L81q1k46
4235h8J01j91K27PJ79o2l35K31J13l02J20L37m02Ml2j1J65j48n6R9J87l22k30
4258d09K66M5J20j47r2K39m2q1L02j63J18j26qP8M2k2m17K66j29Q3J67J12K25
4281D27o08j30K69l0j60M78n23K21j49J66j79L14j44L57n12L16L6J15j24j5k32
4302a07j8j39K18K1J16N4j58J38k32Q4K0K69l88L5j2R9j17L06r8m90L89Q3k28
4325a55J92O4k2j90L00K9k64k04Q7K55J39k26J32j57n3J74n4q3j15L28q9j17P
4348b2k18O73m97q6J27J34K7l48K07J87j86j39J33M0J88P9m60J94K0J51k13j16
4370a25J73k42L41l41L76j98k78N38k43L3j19j06J48L52m14J83j31P5j14l2r4
$$ y = [-8, 149, 76, -17, 61, 236, -262, -12, 53, 463, 250, -266, 99, -101, 183, -225, -131, -34, -126, 258, -142, 239, 158, -88, 13, -178, 49, 56, 235, 173, -162, 69, 182, -120, 0, 337, -65, -61, -93, -104, 61, -87, -143, -44, 143, -179, -409, -143, -98, 22, -125, -217, 22, -20, -101, 201, 38, 156, 30, 22, 100, 142, 120, -297, -31, -160, -77, 90, 202, 427, -181, -311, -42, -72, -232, 246, -277, -56, -205, -39, -218, 96, -48, 309, -203, 113, 149, 264, 140, 125, -107, -125, -264, -46, -25, 91, 145, -13, 125, -107, -23, -3, 266, -122, -87, -99, 0, -117, 189, 91, -399, -10, 73, -155, 37, 101, 79, -111, 189, 218, -46, -250, -163, 92, 231, 5, 137, -20, -73, 101, 47, -36, -151, 177, 88, -29, -22, -240, 433, -64, -150, -23, 111, 138, -210, -3, 184, -2, -141, -8, 32, 220, 299, -161, 33, 53, 204, -9, -125, 48, -194, 147, -194, 182, -16, -294, 244, 1, 34, -85, -191, -43, 309, -105, 78, -53, 22, -92, -124, -218]
4391b18K9K09n4r2K4l23O56k15K8l9L6m65P32j73l69M90j52J16j69O9k24J55p4
4414b3N1k95M0M05l51J3L14r0j33Q1J41j98O2p7K38m02J11M2K19j53r5L5J07k8
4438A4l5o5K16M4L0k34k01K93J12p1j72N4O7k68L99j11n7J1J89l27j06O8K12k7
4462C5oM0j79K12K1ln1j36j05M55l32r7lK46p1P0k07J03k1n7oJ30n4k28L70p6
4488E0K08l59J01N0j54J75Qj80M75n39J50J99k31J79k07k66K90k08L68r8N5k75
4510b09J71j30J18j65M51j36m61P6M84n4j71J49j9l5n0r7L14m37J61j75o1L88
4532A12k99K51k24L31m26J30P6P0K5J07k58M40l53R5R5K10m35j66J79P2j9m04
4554c91L22O0j59J73J57k73L75l25K06o9J01r2L1J24l55j32j20J64J39j60L15
$$ y = [-218, -189, 20, -34, -126, -102, -425, 231, 16, 44, 5, 41, -424, 308, 135, -234, 256, 104, 220, 51, 120, -104, 51, -23, 28, -267, -227, 178, -173, -160, 154, 64, -69, 12, 153, -45, 17, -60, 178, -224, -113, -71, 148, -5, -100, -65, 42, 14, -21, -86, 130, 174, 204, -30, -231, 62, 174, 103, -69, -15, 52, -216, 183, 72, 15, 26, 215, -112, -218, -150, 62, 35, 29, 69, -110, 102, 123, 120, 69, -67, -172, 283, -49, -146, -149, 97, 26, 96, -111, -8, -29, -86, -92, 38, -16, -244, 126, 50, 258, -101, 0, 50, -104, 71, 79, -101, 374, -165, -15, 184, -47, 132, -75, -341, -51, -259, 109, 11, 66, -209, -38, -168, -50, -215, 236, 100, -361, -285, 199, 145, -26, 123, 104, 69, 19, -78, 236, -201, -40, -215, -276, 112, -187, 64, -160, 171, -255, -125, -49, 21, 46, 153, -105, 335, -18, 77, 172, 382, -53, -219, -40, 32, 13, -391, -69, -9, -168, 5, 162, -111, 264, -61, 145, 76, 177, 85, 116, 240, -115, -247, -367, -203, -64, -224, 91]
4575I1m04N65l68j08M40k49K38k25K35j62L5K26l61J27m5j80J96j56O9J85k02
4596e3k1N3k2L6L4q0Q6n8J12n4j10k6J91r8n9O8j11k01o8M73q3l1o3j27K38k61
4622b35L08j18J49j63J89k59K57l30K43j96q3L58j30J11j63M8K17j73k36L63j54
4643Ck23K03K51m37J2L71J92j99j17P2j71j31K32j52K08m01L89J56J27m99l1P2
4665g3J44K09j98k73K31j12J43K5p5Q5J2K42j90M6K0j94J17k03N1M0l58K69J18
4688G6RK06n7mk33N2P5l55J91k51L04K5j08J20k17KL14k05K86j13j32J78j79K61
4712B45J03l96l07N95k05n8k55M25jP4n93N99r4j42J29j30n1L0q3L75l11P3J20
4735A42k26L77k87J05r9l27J64J07K81l96Q2J72j70P4P5ol9n1R4j11J83j40K0
$$ y = [91, -313, 252, -116, -224, 216, -33, 205, -20, 215, 53, 88, 314, -47, 80, 35, -145, 51, -105, -36, 149, -53, -74, -21, -43, -7, 27, -53, 33, -25, 87, 33, -77, -103, 88, -10, -69, -1, -112, -313, -381, 92, 9, -22, -85, -212, 26, -235, 73, -45, 104, -59, 130, -129, 128, -202, 41, -155, -238, 120, -10, 101, -62, -14, 203, 30, -206, 157, 3, -220, -17, 234, -203, -191, 180, 372, 173, 56, 128, -43, -174, 58, -94, 114, -287, 102, 258, 385, -114, -145, -73, 71, 280, 82, -191, 40, -72, 71, 96, 21, 106, 118, 360, 170, 216, 236, 42, 159, -44, 7, 47, -311, -42, 76, 85, 291, 234, 230, -3, 49, 124, -231, -40, -291, 13, 38, -70, 50, -167, -165, 149, -56, 230, 117, -15, 163, -16, 245, 348, -48, -355, 240, 35, -23, -278, 147, 146, 220, -373, 226, 132, -10, 119, -11, -62, -32, -115, 260, -51, 22, 142, -84, 293, 6, 111, 12, -315, -151, -44, 237, -159, -77, 95, -75, -1, 74, 68, 29, -22, 72, -39, 144, 4, 24]
4758B4K13k35N9J57j23q4j99L33j88jk87M89R0k39k4j07q9K21k38K86j68K50j58
4781a8K11j99k12J65L58k63j48m6K00m0N0jOj49k40L09Nj15lJ26L0J74l27J84
4805E7O2j44k70P8J16J29j26L17k57J35l28O02o31K90J57k49L18k82Q2M2N8O6
4827B22l02N9K08l39J95k25J52J14M9j93K3L85k95j69J76K9r6k7L3J08p0J8l06
4850b51K00j2J07j83J99q7P9j24j3p7K29J81r7Oj46L06m05K42l02K87l3j47%M8
4874Gm9k28P3J96j5r2p3N24m02q4K60j33L14m99J33J08J77k02J20qJ05l63n5j4
4898b00K37O5q4L0rQ1j05q0J08m9j77K72Mk55M02Nj51m17L14N8J11Qj65P5l48
4923b70M75Mj16J74j95k22K42k15K73p0PL1j43P9K86l01R3J68o4l58K11j70p7
$$ y = [24, 237, 2, 61, 218, 95, 11, -188, 145, -43, -44, -331, 158, 248, 9, -15, -122, -211, 10, -228, 58, -110, 140, -18, 193, -6, -218, -53, 305, 42, -106, -152, 48, 8, 58, 57, 63, -86, -326, -17, -12, -127, -130, -4, 26, 200, -127, 57, 119, -25, -295, -217, -101, 28, -98, 219, -38, 97, -231, 371, -260, 30, 187, -62, 256, -26, 56, 98, 156, 222, -80, -21, 187, -152, 43, -182, -30, 84, 133, -60, -37, 348, 53, -116, 60, 89, -7, -34, -1, 107, 37, 55, -251, -51, -63, 44, -139, 60, -27, 52, -72, -85, -162, 67, 248, 151, 157, 11, 317, -88, 154, -148, 139, 106, -41, -41, 7, -42, -270, -197, -1, -16, -108, -181, 343, -59, -143, 117, -16, 298, -201, -68, 40, 217, 15, 135, 127, 232, -131, -186, -200, 37, 102, 18, 48, 39, 120, 15, -65, 43, -6, -183, 89, 93, -162, 240, 245, 94, -323, -9, 49, 160, 168, 3, 78, -270, 205, 209, 93, 267, 72, -150, 92, -123, 150, 80, 87, 118, -25, 54, 340, 39, 132, 300, 236, -122, 89, -81, -158]
4946a58N9K25m5k90K21l0k83N05k10J98J05l22M52o74M6N07k35o9M1n0K71ll42
4969h1J89j77J2j5p3N3P5j72J37k09K76o6O5J09k53p9K69j79K05K93k36j84J73
4992A32Q1q6j74n3J68j55J80j23J02j41J66l82M41j28j73K10j06k3q6J93R8m06
5014b65J60J78k46q5M21q4m7rj33K18Ql05J80K1J1n4k52K47Q5j07J92K62l51J48
5038A93m7k16L84k38k46J54J29RP4m1l37J65o6m0J39j72q8Q9k5K50k97K02J00
5061G5k03K35m5M1l5J14p2l04K56k84J19L09m69L55k54O5J33Q1j05j34K88l10
5083a44k14M41r7j31L66m22J34l0Q1j89M03j46j51Q6q0L13l9l03m2J69K10m38
5105b23P1L80k28J21K2p6O6j98KNN5Q1r5l0K5K32j48k62R5N4L23l26k29K92ln6
$$ y = [-158, -99, 126, 81, -209, 12, -18, -301, 204, -6, 192, 297, -25, 427, -247, -201, 306, 71, 2, 43, -7, 264, 261, -81, 108, -69, -57, -72, -145, -92, -17, -189, -52, -261, 15, -51, 14, 123, -130, -209, 60, -119, 86, 379, 143, -41, 132, 213, 127, -47, -100, 68, -87, 93, -30, 72, -69, 97, -285, 156, 28, -145, 65, -41, -64, -150, 43, 141, -265, -105, 73, -173, -258, 163, 79, 32, 23, -110, 108, 116, -189, -9, 12, 23, -31, -283, -36, 49, -58, 134, 396, 45, 193, 146, -70, 314, 76, -170, -16, 113, 122, 196, 155, -182, -17, -83, -123, 16, -156, -244, -155, -180, 70, -227, -25, 75, -128, 107, 62, 103, 68, 182, 110, -194, 62, -222, -103, 206, -263, 92, -162, -97, 36, 117, 12, -122, 166, -144, -358, 83, -14, -145, 221, -201, -67, -97, -16, -205, 198, 52, -99, -13, -93, 220, 181, -122, -164, 5, 215, -223, -152, 228, 0, 121, 143, 67, 133, -65, -63, -58, -3, 78, -17, -47, -22, 210, 62, -200, -105, -51, 272, -54, -283, 9, 6, -50]
5131e0j96L03m3k9j52Q8K03l99j5L68o0M6M31l51j45Pq0N17m97K06l52L99k26
5154b7j70J30L54j37l94L60pn2l93J9O54m22k92O06k56r7j27J95J09N9k11J03
5176Dq8K66k93j19K64K11m56J52k7M6j9qq0k58K90j55P62n10p4K56k73n7n6J91
5200c1J29nl2j76p4J42J45j43R0j36k3J43O2k48K03N3k46K26k31J30J94l43J44
5223b7%K69k21K83p5m78K14J19j28P4rP2J45p9L2J6r4j19N0k27K8K41l0m8k56
5248b48j08L25j28J82k01n9N05k07J03l93K74j73J3j63J73K56l27L34l53K4N1
5269a20R3J84k75M43j99J4k78O9J79J32j06l18P0LJ98P9K8j20k01P8LK12l01M33
5293C00l78l0K24j01q9J9k22L17J84k63l2K55j8k02R0k09J45J26N5n7QL1j12N5
$$ y = [-50, -246, 57, 14, -15, -167, -79, 124, -275, -290, 78, 18, 64, 495, 144, -1, 6, -74, 443, -54, 152, -200, 199, -27, -197, -67, 287, 150, -244, 116, 109, 57, -336, -317, 337, -85, -377, 229, -27, -124, -251, -56, 53, 112, -99, 4, -84, 182, -111, -230, 34, 245, -211, -59, -86, -40, -59, -67, -147, -405, -115, -270, 492, -18, -92, 164, -109, -166, -222, -31, 98, 93, 61, -115, -189, -47, 98, -45, 45, -91, -114, 29, 91, -157, 46, 99, -147, 79, -152, -22, 172, -171, -27, -27, 242, 21, 304, 229, -249, -35, 84, -44, 30, 21, 93, 238, 159, 191, 207, 113, -6, 44, -183, -155, 86, 56, 8, -248, -356, -31, -159, 23, -178, -237, 268, 61, 164, -229, 45, -128, -115, -278, -105, 151, -176, 158, -195, -171, -120, -27, 157, -118, 325, 126, 140, -138, -69, 110, 242, 136, -182, -112, -109, 89, 168, 196, 76, -125, -47, -44, 168, -133, 300, -78, -108, 116, 15, -74, -55, -277, 40, 224, -39, -71, 184, 166, -36, 54, -155, -10, 116, 171, 114, 122, 153, 41, 96]
5317I6k30L18j50k87K16J17k72K23j64J34J87l96L57l42J94J37P7j94m16K22J02
5338g1j84K02Q5k42L53q7j69J38r1J47J69j23j29m1N5J41l36K99k05K66K5j15
5360H7l77M61j78J19O1k04P2j4r4J55M0Q3l37r6K44O2j08L02k35k44K19j17J86
5383H7K3j04m9Q6J1K20j49l12k0J08j69J38O6K12j10M7K61k62j31o6o6K38lk08
5407a52k8J36K08j05J35j9k03k71M31J08l64K4K8j07N0k67L47j59L39j61J%J15
5430H6p6K98m35J17K33j60L4q4j93K41l8k70J10R1k2l1K42l6k01J07M4n52M06
5453h9J01L1j42P9l05M10l3j87J01J36j13k2J65j83L42l46K7k3q0J66l30P7L13
5476I5k91R5J31l49k2K42K47j70j95K58MK47k94q9m2P7n6J03mm1o9J57Lk36J33
$$ y = [96, -134, 184, 34, -253, -37, 80, -192, 31, -133, 1, 188, -208, 149, -193, 1, 138, 215, 21, -395, -173, -71, -255, -53, 32, -210, 143, 56, -113, 25, -66, 81, 250, 127, -2, -43, 12, 153, -183, 116, -89, 177, 202, 87, -290, 171, -7, 112, 173, -31, 41, 27, -67, 88, 128, 211, -126, -222, 22, 84, -24, 278, 43, -201, 18, -99, 87, 110, 6, -43, 43, 54, 274, 125, -187, -207, -99, -268, -130, -64, 148, 38, 85, 346, 84, -47, -113, -179, 59, 56, -152, -180, -44, 164, 59, 194, 175, -28, -299, 132, 240, -124, -100, -72, -179, -129, -396, -49, -208, 131, -30, -29, -29, 86, 10, 308, -127, -10, 223, 63, 97, 13, -180, 61, 23, -247, -137, -46, -68, -99, 143, 107, -94, 13, 57, -495, -89, 12, 43, -99, -20, -325, 85, 52, -135, -34, 102, -11, -33, 132, -51, 291, -55, -28, -51, -131, 35, -295, -218, 95, -196, -101, 30, -319, -341, -99, 148, -22, -217, 41, 45, 292, -2, -91, -133, -56, -112, -9, -13, -54, -123, 34, 37, -199, -66]
5501f6N6L37j35j98k8l2Q7J69l23P8L3l7L7M2j33K7R4K74Q5j84j94L4R0J49l18
5526e6K0J45l3K1L05k34r3j08p2J14n3n0K57k22j99M38j64R6k17r9K25k4L1NJ29
5551A62k35q7L83k04J24k46o6O3L0J6J09j4R6j54LM9J22l07K04k85J43J74J90
5574B70J93n51J04j5K1q8l06L13J24p1J75j54k20M06m03J4l9M52j36k77K41m29
5596c76K93m2L1J36J13j89j42j37M40j42l12L33j94K24k26k1K96j22rj64J94J36
5618A20j17J03k03J1k9m7J01l4L58P5l73K39m12K80j33%K6q8J27k73L09k29K51
5641F2j56L98n29K71K5R0p8j37L07j51l8K1J46l06M3L46l68K32j83k08J19M4J82
5664A32l25K40Nl46L35j32j7j49M07k14j53K33L6q2K04l87K89j44j39J79R8k51
$$ y = [-66, -10, 327, 192, -6, -34, -66, 21, 190, -133, -55, -22, -59, -22, 20, -113, -86, 8, 282, 367, 183, -11, 23, 113, 262, -56, -36, 109, 76, 97, 402, 168, 75, -33, -105, 9, -44, -94, 163, -59, -258, 180, 16, 112, -105, -204, 21, -3, 28, 33, 162, -73, -160, 223, 19, 143, -103, -169, -106, -76, -60, 49, 35, 131, -23, -20, 29, 151, -156, 48, -237, -94, 80, 270, 463, -88, 16, 1, 22, -66, -372, -59, 65, -6, 169, 15, -205, 201, -202, -188, -227, 225, 89, -188, 53, -376, -83, -125, -94, 42, 155, -34, -176, -313, 127, -15, -327, 6, -188, 36, -190, -211, 85, -37, -46, -210, -16, 120, 3, 106, -97, -86, -115, -162, -61, -95, 263, 338, -35, 204, -208, 72, -61, -61, -35, -123, 4, -269, 40, -189, 62, -94, 304, -225, 46, 71, 161, 83, -54, 253, 102, 64, 85, 231, -75, -32, 314, -54, 178, -5, -213, -94, -50, 132, -193, 47, 52, -294, 41, -91, -108, -257, 150, -64, -217, 16, 52, -30, 174, -213, 76, -68, -207, -28, 70, -181]
5686a81j5m6L09rj52J48n1J29k49P4K09k04P0j85j61L66r1L0Q8O7o9K5M8q2j36
5711f8N5j91J39j29N64m10J24L0J7j50l8R0k0o0K78k31j75J57L07l49j57j1K97
5734F9r4J69j39j44J59jj16L03j68J13n15O18k60J13K32j44j7j57J48k50q1J87
5756B5K8k44L47o7J30j99j32J28j75J89%O0PRr7k0L0K4j2q0j32P4J33J41J51k28
5782I0K1L52l11o60N80K4j19q0j42J06M27l7l58j7J38M7J66j74r9K7o0P2j20L59
5806B32k97k04K28O5Q7n6j31K67q6k38J43l1K58k33j32K51O7m28M73k17k28K11
5828Aj8K35k48P7j53r9O6J93k78M93k26Kk00J80r2K04k79L33r0NJ44k25j27J90
5852H8k31K78k75k7N0O0J55j83j3n3N1N60n16j32J16M99k51l57N01j09l28K41
$$ y = [-181, -196, -242, 67, 58, -94, 54, 3, 132, -117, -43, 166, -38, 32, -153, -314, 52, -39, -9, 79, 146, 77, 102, 150, 68, -68, -13, -204, -65, -194, 370, -40, 84, 114, 131, -19, -57, 33, 13, -47, 231, 0, -175, -18, 289, -60, -217, -228, 69, -25, 144, 5, -139, 20, 19, -97, 206, 38, 151, -364, 254, -6, 107, 339, 195, 178, 21, 169, -81, -162, 25, 53, -191, 156, 89, 219, 20, -112, 16, -159, 30, 30, 90, 97, 106, 9, -11, 19, 43, 31, -49, -181, -107, 26, 167, 318, 90, 111, 463, 152, -508, 72, 96, -23, -103, -245, -139, 288, 251, -107, -124, 14, 61, 227, 53, -46, -19, -79, -7, -127, 232, -65, -269, -41, 24, 111, 55, -76, 191, 105, -133, 10, -21, 237, 4, -128, 123, 190, -238, 235, 18, -210, 1, -17, 218, -30, 47, -106, -205, -139, 54, -224, 269, 43, 45, -155, 25, -67, 137, -142, 191, 101, 106, 250, 25, -102, 88, -143, 135, -140, -167, -117, -57, 98, -85, -98, -151, -100, 460, -56, -188, -72, 427, 176, -181, 320, 211, -117, 124]
5874A24j58K09q3l62K72j51J67o6Q2j90L69k79P5k7O5k6k54K04p8K55P0k26q8
5897i6l3j08Q1K10o8J71k22P0J14j99L65p7j19k54L4n9Q8J81p6J65l28m6K98q1
5921A1O4j43l9J20j41j8M30m87J49N9ll14P9J62k85K01J21L58l59j07j48K09R0
5944Ij57J86o4m7o6j53M39k59J73O4m8k92K88j56L50k38M4j42J73p9p2j54L10
5967A09r6j09mJ3M9Q5k65K28j99J71K39j84r6j92K46K46Ql09J28p5j3J52j33L15
5991C14l05P3J92j16m99K48J16l9k85Q5N82l03q4P0j31j70M46q9l20O2J39R5k93
6014b12J04R3J70j35R3k13K95o8mk77k61L64p8J47J46j57QJ35k59J84j12k6L40
6037B77l44J40p0l01M00K63l74OK58k32O3j76K60q5j07j94L59j15m9J80n28M38
$$ y = [124, -34, 175, 92, -270, 2, -149, 18, -48, 34, -156, 213, -66, 9, -18, 47, 21, -233, -29, -107, 148, 218, -8, -96, -129, -237, -156, 54, -14, 157, -65, 5, 119, -80, 285, 208, 89, -165, -131, -190, -102, 79, 3, 168, -160, -206, 92, 11, 75, -68, -107, 13, -128, -146, 284, -203, -54, 5, 2, -312, -233, -71, -356, -155, -34, 324, -35, -142, -290, -81, 9, -148, 38, -26, -73, -139, -292, 147, -112, 61, 125, 77, -215, 73, -83, 267, 29, 73, -69, 104, 25, -47, -201, 109, 13, -96, -100, -87, -38, 47, -218, 10, -189, -18, 221, 37, -59, -251, -5, 241, 249, -60, 68, -7, -20, 132, -1, 314, 9, 82, 274, 158, -341, -93, 23, -16, -301, -216, 366, 63, -21, 49, -82, -252, 194, 105, -215, -153, -14, 81, -212, -108, -15, 155, 20, 113, -100, 195, 127, 123, -154, -415, -51, -129, 18, 164, 7, 15, 150, -109, 75, -37, -63, 277, -67, 73, 3, -298, 102, 365, -9, -3, 255, 23, 86, -90, 170, 85, -22, -216, 143, 28, -21, 159, -369, 69]
$$ [...]
8191e2
##END NTUPLES=NMR FID
##END=
