##TITLE=1H_Ser Tac-NEG
 200.13MHz, CDCl3,
 8 sc
 
 4.4.2025
##JCAMPDX= 6.0         $$ Bruker NMR JCAMP-DX V2.0
##DATA TYPE= NMR FID
##DATA CLASS= NTUPLES
##ORIGIN= UXNMR, Bruker Analytische Messtechnik GmbH
##OWNER= pz
$$ XWIN-NMR		Version 3.5
$$ Fri Apr  4 16:29:43 2025 Russian Standard Time (UT+4h)  she@DPX200
##.OBSERVE FREQUENCY= 200.1313
##.OBSERVE NUCLEUS= ^1H
##.DELAY= (6, 6)
##.ACQUISITION MODE= SIMULTANEOUS
##.ACQUISITION SCHEME= undefined
##.AVERAGES= 8
##.DIGITISER RES= 18
##SPECTROMETER/DATA SYSTEM= spect
##.PULSE SEQUENCE= zg30
##.SOLVENT NAME= CDCl3
##.SHIFT REFERENCE= (INTERNAL, CDCl3, 0, 14.3821)
##AUDIT TRAIL= $$ (NUMBER, WHEN, WHO, WHERE, WHAT)
$$ ##TITLE= Audit trail, XWIN-NMR		Version 3.5
$$ ##JCAMPDX= 5.01
$$ ##ORIGIN= Bruker BioSpin GmbH
$$ ##OWNER= she
$$ F:/spectra/data/she/nmr/H-C/1/audita.txt
$$ ##AUDIT TRAIL=  $$ (NUMBER, WHEN, WHO, WHERE, WHAT)
(   1,<2025-04-04 16:28:34.96 +0400>,<she>,<DPX200>,
      <created by zg, POWCHK disabled, PULCHK disabled
       configuration hash MD5:
       00 E9 B6 7A A2 85 ED C7 34 08 36 98 17 FE 4E 26
       data hash MD5: 16K
       45 A6 A7 A4 C1 85 A0 EF 34 CC AA 43 25 D5 D3 91>)
$$ ##END=
$$ 
$$ hash MD5
$$ 31 12 06 04 C2 FE D7 09 D7 A0 B6 CC 74 4D 55 54
##$RELAX= 
##$RELAX= 
##$RELAX= 
##$RELAX= 
##$RELAX= 
##$RELAX= 
$$ Bruker specific parameters
$$ --------------------------
##$DU= <F:/spectra>
##$EXPNO= 1
##$NAME= <H-C>
##$PROCNO= 1
##$TYPE= <nmr>
##$USER= <she>
##$AMP= (0..31)
100 100 100 100 100 100 100 100 100 100 100 100 100 100 100 100 100 100 
100 100 100 100 100 100 100 100 100 100 100 100 100 100 
##$AQSEQ= 0
##$AQ_mod= 1
##$AUNM= <au_zg>
##$AUTOPOS= <>
##$BF1= 200.13
##$BF2= 200.13
##$BF3= 200.13
##$BF4= 200.13
##$BF5= 200.13
##$BF6= 200.13
##$BF7= 200.13
##$BF8= 200.13
##$BYTORDA= 1
##$CFDGTYP= 0
##$CFRGTYP= 5
##$CHEMSTR= <none>
##$CNST= (0..31)
1 1 145 1 1 1 1 1 1 1 1 1 1 1 1 1 1 1 1 1 1 1 1 1 1 1 1 1 1 1 1 1 
##$CPDPRG= <>
##$CPDPRG1= <>
##$CPDPRG2= <>
##$CPDPRG3= <>
##$CPDPRG4= <mlev>
##$CPDPRG5= <mlev>
##$CPDPRG6= <mlev>
##$CPDPRG7= <mlev>
##$CPDPRG8= <mlev>
##$CPDPRGB= <>
##$CPDPRGT= <>
##$D= (0..31)
0 0.7 0 0 0 0 0 0 0 0 0 0.03 0 0 0 0 0 0 0 0 0 0 0 0 0 0 0 0 0 0 0 0 
##$DATE= 1743769714
##$DBL= (0..7)
120 120 120 120 120 120 120 120 
##$DBP= (0..7)
150 150 150 150 150 150 150 150 
##$DBP07= 0
##$DBPNAM0= <>
##$DBPNAM1= <>
##$DBPNAM2= <>
##$DBPNAM3= <>
##$DBPNAM4= <>
##$DBPNAM5= <>
##$DBPNAM6= <>
##$DBPNAM7= <>
##$DBPOAL= (0..7)
0.5 0.5 0.5 0.5 0.5 0.5 0.5 0.5 
##$DBPOFFS= (0..7)
0 0 0 0 0 0 0 0 
##$DE= 6
##$DECBNUC= <off>
##$DECIM= 32
##$DECNUC= <off>
##$DECSTAT= 4
##$DIGMOD= 1
##$DIGTYP= 9
##$DL= (0..7)
0 120 120 120 120 120 120 120 
##$DP= (0..7)
150 150 150 150 150 150 150 150 
##$DP07= 0
##$DPNAME0= <>
##$DPNAME1= <>
##$DPNAME2= <>
##$DPNAME3= <>
##$DPNAME4= <>
##$DPNAME5= <>
##$DPNAME6= <>
##$DPNAME7= <>
##$DPOAL= (0..7)
0.5 0.5 0.5 0.5 0.5 0.5 0.5 0.5 
##$DPOFFS= (0..7)
0 0 0 0 0 0 0 0 
##$DQDMODE= 0
##$DR= 18
##$DS= 0
##$DSLIST= <SSSSSSSSSSSSSSS>
$$ [...]
##$SUBNAM0= <"">
##$SUBNAM1= <"">
##$SUBNAM2= <"">
##$SUBNAM3= <"">
##$SUBNAM4= <"">
##$SUBNAM5= <"">
##$SUBNAM6= <"">
##$SUBNAM7= <"">
##$SUBNAM8= <"">
##$SUBNAM9= <"">
##$SW= 18.0517328524113
##$SWIBOX= (0..15)
0 0 2 0 0 0 0 0 0 0 0 0 0 0 0 0 
##$SW_h= 3612.71676300578
##$TD= 16384
##$TD0= 1
##$TE= 0
##$TE2= 300
##$TE3= 300
##$TEG= 300
##$TL= (0..7)
0 120 120 120 120 120 120 120 
##$TP= (0..7)
150 150 150 150 150 150 150 150 
##$TP07= 0
##$TPNAME0= <>
##$TPNAME1= <>
##$TPNAME2= <>
##$TPNAME3= <>
##$TPNAME4= <>
##$TPNAME5= <>
##$TPNAME6= <>
##$TPNAME7= <>
##$TPOAL= (0..7)
0.5 0.5 0.5 0.5 0.5 0.5 0.5 0.5 
##$TPOFFS= (0..7)
0 0 0 0 0 0 0 0 
##$TUNHIN= 0
##$TUNHOUT= 0
##$TUNXOUT= 0
##$USERA1= <user>
##$USERA2= <user>
##$USERA3= <user>
##$USERA4= <user>
##$USERA5= <user>
##$V9= 5
##$VALIST= <valist>
##$VCLIST= <CCCCCCCCCCCCCCC>
##$VD= 0
##$VDLIST= <DDDDDDDDDDDDDDD>
##$VPLIST= <PPPPPPPPPPPPPPP>
##$VTLIST= <TTTTTTTTTTTTTTT>
##$WBST= 1024
##$WBSW= 4
##$XGAIN= (0..3)
0 0 0 0 
##$XL= 0
##$YL= 0
##$YMAX_a= 115929
##$YMIN_a= -167641
##$ZGOPTNS= <>
##$ZL1= 120
##$ZL2= 120
##$ZL3= 120
##$ZL4= 120
##$ABSF1= 10
##$ABSF2= 0
##$ABSG= 5
##$ABSL= 3
##$ALPHA= 0
##$AQORDER= 0
##$ASSFAC= 0
##$ASSFACI= 0
##$ASSFACX= 0
##$ASSWID= 0
##$AUNMP= <proc_1d>
##$AZFE= 0.1
##$AZFW= 0.1
##$BCFW= 1
##$BC_mod= 2
##$BYTORDP= 1
##$COROFFS= 0
##$CY= -3
##$DATMOD= 1
##$DC= 2
##$DFILT= <>
##$DTYPP= 0
##$F1P= 0
##$F2P= 0
##$FCOR= 0.5
##$FTSIZE= 0
##$FT_mod= 4
##$GAMMA= 1
##$GB= 0.15
##$INTBC= 1
##$INTSCL= 1
##$ISEN= 128
##$LB= 0.25
##$LEV0= 0
##$LPBIN= 0
##$MAXI= 10000
##$MC2= 0
##$MEAN= 0
##$ME_mod= 0
##$MI= 1.114404
##$NCOEF= 0
##$NC_proc= 0
##$NLEV= 6
##$NOISF1= 3.799351
##$NOISF2= 2.8
##$NSP= 1
##$NTH_PI= 0
##$NZP= 0
##$OFFSET= 14.38212
##$PC= 1
##$PHC0= -828.7388
##$PHC1= 10.19221
##$PH_mod= 1
##$PKNL= yes
##$PPARMOD= 0
##$PSCAL= 0
##$PSIGN= 0
##$REVERSE= no
##$SF= 200.129724274929
##$SI= 16384
##$SIGF1= 3
##$SIGF2= 2
##$SINO= 400
##$SIOLD= 16384
##$SREGLST= <1H.CDCl3>
##$SSB= 0
##$STSI= 0
##$STSR= 0
##$SW_p= 3205.1282051282
##$SYMM= 0
##$S_DEV= 0
##$TDeff= 0
##$TDoff= 0
##$TI= <>
##$TILT= no
##$TM1= 0
##$TM2= 0
##$TOPLEV= 0
##$USERP1= <user>
##$USERP2= <user>
##$USERP3= <user>
##$USERP4= <user>
##$USERP5= <user>
##$WDW= 1
##$XDIM= 8192
##$YMAX_p= 0
##$YMIN_p= 0
$$ End of Bruker specific parameters
$$ ---------------------------------
##NTUPLES= NMR FID
##VAR_NAME=  TIME,          FID/REAL,        FID/IMAG
##SYMBOL=    X,             R,               I
##VAR_TYPE=  INDEPENDENT,   DEPENDENT,       DEPENDENT
##VAR_FORM=  AFFN,          ASDF,            ASDF
##VAR_DIM=   8192,          8192,            8192
##UNITS=     SECONDS,       ARBITRARY UNITS, ARBITRARY UNITS
##FACTOR=    0.0002768,     1,               1
##FIRST=     0,             0,               0
##LAST=      2.2672688,     0,               0
##MIN=       0,             -167641,         0
##MAX=       2.2672688,     115929,          0
$$ Real data points
##PAGE= N=1
##DATA TABLE= (X++(R..R)), XYDATA
0@%%%%%%%%%%%%%%%%%%KqJ4j6J6j6J6j8K6l2L2l7M5m8N3o1O9p7Q7r9J11j22J34
41G1j48J64j85K05k25K48k73L01l33L66m01M43m90N40n99O67p44Q35r43J077j243
62f67J452j734K131k722L704n621J0667m9272j25579J05238J30691k4343m8449
75d504O5513N4920n8645q4876j4316L414l1538j1542O6380O5218k2233m4953L4683
88A7521M4658n0547o7063L3399N4663l5812m4574M8378N2318l9169m0448M7102
100B0426M2355n5160p1879J7102N8513K226l8837K280M8134K4256k7431l8567
112a6582j7080j70J6478L0953J1501j9060k986L1345M532m9464l4282K5367L2709
125A3261p220j7444M869P832l062J974N860r528j3234R525J6995l753n914J5804
$$ plain form
0 0 0 0 0 0 0 0 0 0 0 0 0 0 0 0 0 0 0 0 2 -6 8 -8 8 -8 8 -10 16 -16 16 -21 24 -24 29 -32 37 -40 47 -52 59 -63 71
41 71 -77 87 -98 107 -118 130 -143 158 -175 191 -210 233 -257 283 -316 351 -393 442 -501 576 -667
62 -667 785 -949 1182 -1540 2164 -3457 7210 -42062 -167641 -62403 68288 43945 -4504
75 -4504 61009 115929 57284 -27592 -41908 -38494 -70032 -81574 -15194 50024 27791 -17162 17521
88 17521 62179 11632 -55431 -22032 32631 -3181 -47755 623 52941 13772 -26676 20426
100 20426 62781 7621 -64258 -47156 11357 13583 -25254 -22974 25160 49416 21985 -16582
112 -16582 -33662 -33832 -17354 13599 25100 6040 3054 34399 38931 -10533 -44815 -19448 13261
125 13261 6041 -11403 -6534 1298 -1764 210 6070 -3458 -16692 -7167 9828 6075 161 15965
139A5965R028k0431j5656J3274J540l2109j2166M6024M2030k7313n0009J1761
151a8062M4763j2231n2192N34N0137J5570k2881O38J4555j8119k0922K1196J9084
164B2070l1026k8244L1105L5540k9645m7442K0756N8339L057l8230O320L8556
176D1156j6351n7551l656M4433j42m0502P992N0401K264m8398r560M2544J9502
189C2132k4725j2166J7827J44k6623n948K2015J70k3058R568L7998k904m6505
202b2075j0632M2319J8286l3336j9492K8327K3513j9447k5017Q006J7700n500
214B652j1374J0404J4438r209j5646O235J1532r323j4712N393J3031r74p258J266
228c545N646J229n19J975p10o690o371M393J3853O384r647q937N899M069j5961
$$ plain form
139 15965 24993 4562 -11094 2180 3720 -28389 -40555 5469 47499 20186 -29823 -18062
151 -18062 26701 14470 -37722 -37188 12949 28519 5638 6276 20831 2712 -18210 2986 22070
164 22070 -8956 -37200 -6095 29445 -200 -47642 -26886 31453 34510 -3720 2600 41156
176 41156 24805 -32746 -36402 8031 7889 -32613 -24621 25780 28044 -20354 -29914 12630 32132
189 32132 7407 -4759 13068 13212 -13411 -19359 2656 2826 -20232 -10664 27334 24430 -22075
202 -22075 -32707 9612 27898 -5438 -24930 3397 26910 7463 -17554 -9548 8152 2652
214 2652 -8722 1682 16120 6911 -8735 -2500 9032 -291 -15003 -9610 3421 2447 -4811 -3545
228 -3545 2101 3330 2811 4786 4076 -2614 -8985 -4592 9261 15645 5998 -2939 2960 7029 -8932
243h932j9738N639K6261J5070q966j0837N301O526j1298j4959O095J8508J908
256A0578j0342K148P269j0278j4583Q637J8201m499j6138L228J3662o304j6844
269a5265M032K0021K501j4026m73J3416n129k1764J889K7898R279k2025q526K0134
283A1962K848l0463j5628K4552K1866j0010j0379J2645O861j8859j5483J2695
295g393J5921o130p520J3420J1067j7098k1103R669K1129n305j6704P873J6934
308A4760r499k1209L938J9086o18j4186K668J4580k674j7766k410J8176Q599j1727
322A718o921J1099N307j4143j0779J0900J1670n775p392O946M032j1598j0001
335a4937Q306J1802k067p001M849R515m641j4062l7J4664N496j1090n389Q049
$$ plain form
243 -8932 -28670 -23031 3230 18300 9334 -1503 3798 10324 -974 -15933 -9838 8670 10578
256 10578 236 2384 9653 -625 -15208 -6571 11630 7131 -9007 -5779 7883 1579 -15265
269 -15265 -11233 8788 11289 -2737 -3210 10206 5077 -16687 -14798 13100 22379 354 -8172 11962
283 11962 14810 -15653 -31281 -6729 15137 5127 -5252 7393 14254 -4605 -20088 -7393
295 -7393 8528 2398 -5122 8298 19365 2267 -18836 -9167 11962 6657 -10047 -2174 14760
308 14760 5261 -15948 -12010 7076 6458 -7728 -5060 9520 6846 -10920 -13330 4846 13445 1718
322 1718 -5203 5896 11203 -2940 -13719 -2819 8851 3076 -4316 2630 6662 -4936 -14937
335 -14937 -6631 5171 3104 -3897 952 10467 5826 -8236 -8273 6391 11887 797 -4592 3457
349C457Q43j3656m657J3149R894n160m850N750K347j1257r961O561J1947p12q227
364d532L192J0110l235j1840K670J4427Q13j2625k813P196m768j4167K54J5731
378D13P475o909l052R725L090j2590q728R878J1009o858j0352M957O864q862r501
393a3441R812J4215k377r206L773O627q531j3380L324J3108K90r711N29R874n50
408D356j1381q16J3987N357j0625n571Q083K065j1831m459J3857J0173p715r199
422c719M086K893r971r026P862J3229M48o808K935N922o293j0707L286J2903J414
437H454r583N27Q420l591j2555p79J2618M099r078m368O072O81j0187l804J1366
452a708J1039l994n777O442N907q946j0239M858R421l122r945J13O347k597p762
$$ plain form
349 3457 4300 -9356 -14013 -864 9030 3870 -980 4770 7117 -4140 -14101 -7540 4407 3695 -4532
364 -4532 -1340 8770 5535 -6305 -3635 10792 11605 -1020 -3833 3363 -1405 -15572 -15318 413
378 413 7888 979 -2073 7652 10742 -1848 -10576 -698 10311 3453 -6899 -1942 4922 -3940 -13441
393 -13441 -3629 10586 8209 -997 2776 9403 872 -12508 -9184 3924 4214 -5497 -4968 4906 4356
408 4356 -7025 -7841 6146 11503 878 -4693 3390 5455 -6376 -10835 3022 13195 5480 -3719
422 -3719 367 3260 -6711 -15737 -7875 5354 5802 -1006 1929 7851 1558 -9149 -5863 7040 8454
437 8454 -1129 -602 7818 4227 -8328 -9107 3511 7610 -1468 -5836 236 917 -9270 -13074 -1708
452 -1708 9331 5337 -440 6002 11909 2963 -7276 -2418 7003 3881 -6064 -5951 396 -2201 -9963
467i963L549J2259L728p350j448N483l385j2752k541J0789N945n892j215R606
481F813M827p946o101O344N724p531j0666R17N402n629q569P406J5467J561q661
496f42K542R906k675j0748n70Q798O08r339m212M085N89p053j060J0514O553p223
512G3n858P482N172r417n924J1271J0147p237r341M149M511p592p951N838R974
527E297j286q122Q27P557j787r464P50J1905L841r064m933N737P43q511j162J0304
543B632M769n079j780M833j709r275l273P794N591m480m972L952O036l425p561
558e947L580J0186q07r204j375N492k873p745K742J0657K286n408j368L571p27
573C060o434l483M091N478r93m386J207L962k740l524N670O321m317p123K800
$$ plain form
467 -9963 -6414 5845 9573 2223 775 6258 2873 -9879 -12420 -1631 4314 -1578 -2793 6813
481 6813 11640 3694 -2407 3937 9661 2130 -8536 -7619 -2217 -7846 -16415 -9009 6458 8019 -642
496 -642 1900 11806 9131 -1617 -2187 6611 7219 -2120 -6332 -2247 -1658 -8711 -9771 743 7296 73
512 73 -5785 1697 6869 -2548 -8472 2799 12946 5709 -3632 517 5028 -2564 -10515 -4677 5297
527 5297 4011 -4111 -3284 4273 2486 -6978 -6228 5677 9518 454 -4479 1258 2001 -6510 -7672 2632
543 2632 7401 2322 542 5375 3666 -5609 -8882 -1088 4503 23 -4949 -997 5039 1614 -5947
558 -5947 -2367 7819 7012 -2192 -3567 1925 -948 -8693 -5951 4706 6992 1584 216 3787 3060
573 3060 -3374 -6857 -2766 2712 1719 -2667 -1460 2502 -238 -3762 1908 8229 3912 -3211 -411
588d11L647p210p419N743R677J69n408k39O093K125n522l176O095L610p545q054
604g825K910L154n787k218J0278Q136m774n452L223K677n217l509N209N921j376
619E350n089o03J116m470o193M219J0041j11q028L77Q483j459r826j30J1477M247
635I401p520m153L256R20m958j831N913M095l352m402J926K250m364l770N316
650a273O846k890o716J558M222k901l532N414P239j965o025M43L213l901o846
665g114J371P989K562o301l901M391M063m748l681N628O086k588n216J321J880
680A742l293j895M892M184l030n028P54L034k849m188L029P074J53p034j912M114
696b53K54l891J943P667K057o917m370L666J815n017k224O926O177m316p480j39
$$ plain form
588 -411 3236 -3974 -11393 -5650 4027 4196 -1212 -1451 4642 6767 1245 -1931 4164 7774 229 -7825
604 -7825 -4915 -1761 -7548 -9766 512 8648 3874 -1578 1645 4322 -895 -4404 805 6726 5350
619 5350 261 -342 774 -3696 -9889 -5670 4371 4260 -3768 -3391 5092 3633 -6193 -6323 5154 9401
635 9401 1881 -2272 984 1904 -3054 -4885 1028 5123 1771 -2631 -705 1545 -2819 -6589 -1273
650 -1273 5573 2683 -4033 -2475 1747 -1154 -4686 728 7967 6002 -23 420 3633 -268 -7114
665 -7114 -5743 2246 4808 -1493 -5394 -1003 3060 -1688 -5369 259 6345 3757 -1459 -138 1742
680 1742 -1551 -3446 1446 5630 2600 -2428 -1674 1360 -1489 -5677 -2648 4426 4579 -2455 -4367 -253
696 -253 1 -3890 -1947 5720 7777 860 -3510 156 1971 -3046 -5270 1656 7833 3517 -3963 -4102
712d102M063j197l045L345N335j022m864J63K382k360l338L671P169l32o640j164
728a936M290o15o191o42P236L513n660l577L329J102m424j560O245N138l834n527
744c113J658L271k112l806L473O918n92n989j675K376q35l174K338M999j189n684
760c136o88L659k96l619J734O669K250n447m088K928K923l394k617L845M402l663
776A462n024J412L660j763l252K920M356j806n928k48L764N78j916J974N250J106
792F545m725l258J198o13l121O97O518K056n251l862K085J442l113q16O023N445
808G250k796n684p80J744j472k136K819N521Q7m728j126K730n65l877Q38M867
824B692K12m818j615L068J001k570J2L841J961l302l161K173K138k499j686M473
$$ plain form
712 -4102 -39 -1236 -4281 -936 4399 3377 -1487 -1324 1058 -1302 -4640 -969 6200 5868 -772 -1936
728 -1936 2354 1739 -4452 -5094 2142 5655 -5 -3582 -253 849 -3575 -5135 1110 6248 2414 -3113
744 -3113 -1455 1816 -296 -4102 -629 6289 5697 -292 -1967 409 -426 -3600 -1262 3737 2548 -3136
760 -3136 -3824 -165 -461 -4080 -2346 4323 6573 1126 -2962 -34 2889 -505 -3122 723 5125 1462
776 1462 -3562 -2150 1510 -253 -3505 -585 3771 1965 -3963 -4211 -447 131 -1785 189 5439 6545
792 6545 1820 -1438 -240 -853 -3974 -3277 3241 5297 46 -3816 -1731 -289 -3402 -4218 1805 7250
808 7250 4454 -1230 -2010 -266 -1738 -3874 -1055 4466 4553 -175 -1301 1429 864 -3013 -2175 2692
824 2692 2904 -1914 -3529 -461 540 -2030 -2018 1823 3784 482 -2679 -506 1632 -867 -2553 1920
840A920M369k984n440M45K113k544l789L168N689K32l868l16K340p63l474Q14
856b088M843R69m001j573K571O34l711m84M982J885l791k564K775J812k916j847
872b504K552J580l549l192K381L897M24q67K337K916k542n938j181K656K21j883
888b692J790M189l06l868j523K153K93j876L11L179J435l212k438J385J469j007
904g18o53L269L315j921m255j73J413j618j756J828L422r27l498p91K185O96q75
921a057J524L315Q62m164l017J283J986j021q83L230J990l298m157Q79K109j210
937a629j243K957L570j531l663M84K785n11l105O62L638k17m211r15L291J442
953A804k804J81L947N29m718k501K626J717k653q79M126K313l627l194K085K956
$$ plain form
840 1920 6289 3305 -2135 -1690 423 -2121 -5910 -2742 2947 3179 -689 -1005 1335 572 -2902 -2088
856 -2088 2755 3724 -277 -1850 721 1355 -2356 -2840 2142 4027 236 -2328 447 2259 -657 -2504
872 -2504 48 1628 -1921 -5113 -2732 1165 1589 722 3059 5975 3433 -2505 -3686 -1030 -809 -2692
888 -2692 -902 3287 2981 -887 -2410 -257 36 -1840 -1529 1650 3085 -127 -2565 -1180 289 -718
904 -718 -1371 1898 5213 3292 -963 -1136 277 -1341 -3097 -1269 2153 1226 -2272 -3063 -878 -182 -1057
921 -1057 467 3782 4644 480 -2537 -1254 732 -289 -1172 2058 4048 750 -3407 -2528 -419 -1629
937 -1629 -2872 85 3655 2124 -1539 -1055 1730 1219 -1886 -1224 2414 2197 -2014 -2929 362 1804
953 1804 -1000 -819 3128 3657 -1061 -3562 -936 781 -1872 -2751 1375 3688 61 -3133 -1048 1908
969A908j821j460L040K395l048m422R35K758m61j503K522L436j737m800p81L151
985A12K28k450J102L306o54l836o12L160J001r93Q62K697o85m046k717J461J583
1002d81p37L1K914J524k405l381O26J671o25o65K501J978j540k670o06J467J61
1019b37J29Q56K009j09k138k286J2J040L1k92J517J046j917k313N86K086N2k61
1037a89J952J439j492k400q39J815O10n22m46J353L45l233k663J956K459r04n22
1054a281L110J619l298k485K054K024j276j278K169J289k191k498L29K276J21
1069F84j523R42K293j554m205J58L828K90k692J505M119j266m719q4L454K89k380
1086h61J167K534o84l534j788K120J141j175n78K619J683l129k277K122K183j877
$$ plain form
969 1908 87 -1373 1667 4062 1014 -3408 -2473 285 -176 -1679 843 4279 2542 -2258 -3039 112
985 112 340 -2110 -1008 2298 1644 -2192 -2804 356 1357 364 1226 3923 3238 -808 -3525 -2064 -481
1002 -481 -1218 -1187 1727 3251 846 -2535 -1909 -238 -863 -1528 973 2951 1411 -1259 -1865 -398 -237
1019 -237 -108 748 2757 2648 510 -1776 -1764 -724 -693 -985 532 1578 -339 -2652 -2066 20 72 -189
1037 -189 1763 3202 1710 -690 -1529 286 896 374 -72 1281 1626 -1607 -4270 -2314 145 -759 -1281
1054 -1281 1829 3448 150 -2335 -281 1743 467 -811 1358 2647 456 -2042 -1713 563 684
1069 684 -839 103 2396 842 -3363 -3205 623 913 -1779 -274 3845 2579 -2140 -2224 1230 1519 -861
1086 -861 306 2840 2156 -1378 -3166 -1046 95 -1080 -1658 961 2644 -485 -2762 -640 1543 -334
1102c34q00K853J349l289j545J884J143j749n67K274Q76k046k257J52J525O62
1118A31r88M93K253m06k426r53J714N66q45J022J630n87k020o68M85N82m11N13
1136H5R21k60r34j297o7R82Q02m70M29J179m15k149m22J653J127n72k9J234Q7
1155A884k141k052J54J809O76m03M82J553j123k896o93K294O46p24J297K386r99
1172B150l302q05K371L63j504Q51K078k00l139j488J886J091j418k00K447R38
1188B119k815k128K482K001j222j222K211J568k575k494J075J847p28j116J735
1203G38J379j761k477L68J661o77j195J723K542o54k300m8J795m22j573M43K161
1220A703l51k234l25J582K25j471q3J488K21j724j180J999Q89j46m72P14o3j237
$$ plain form
1102 -334 -1134 1719 3068 -221 -1766 118 1261 -488 -1055 1219 2095 49 -2208 -2056 -531 131
1118 131 -857 -364 1889 1483 -943 -1896 -182 384 -461 561 2191 1604 -416 -1084 -599 -17 -428 85
1136 85 1006 746 -188 -1485 -1552 -570 232 -238 191 1370 955 -1194 -1616 37 1164 592 563 1797 1884
1155 1884 -257 -2309 -2155 -346 330 -73 409 1962 839 -2057 -2750 -456 190 -534 763 3149 2150
1172 2150 -1152 -1957 414 777 -727 124 2202 2002 -1137 -2625 -739 352 -1066 -1266 1181 2119
1188 2119 -696 -2824 -342 1659 437 -785 1426 2994 419 -2075 -1000 847 119 -997 738
1203 738 2117 356 -2121 -1753 -92 -769 -1964 -241 2301 1647 -653 -701 1094 672 -901 -458 1703
1220 1703 1352 -882 -1207 375 600 -871 -954 534 755 -969 -2149 -150 739 593 121 835 772 -465
1238d65j128J108J088K67M9M32R4j712j411j27J540N61P5K40N44p38j692p59J168
1257h66J174l3K2Q57Q1j148j357O37J071L61o71K61M95q64j673j90J304R17q2
1276B96J21P75p01j535n51J297J007q2j59J166o1k165j476J178J739k21p03J128
1294A053M50j910k290R23J846p6l23J103Q85j010j994K86J690K80r24K17J199
1311A405m13j774o41J584M67j185m9J280l47j803n42J725R81n99k18J406J97j780
1329c06r97R27J441k50q11O84O01j461j981N98J704Q1n43N70J052j282j646J21
1347a498J263P06k05N65P01l95j489j121J180J092m68k79O86O8j657j227R29J153
1365DJ26k46P09O64j259j227L16J207L86j24J57O97p25j646k63J053O72n48P0
$$ plain form
1238 -465 -1593 -485 603 870 919 1351 1445 -267 -1678 -1805 -265 296 371 611 1155 417 -1275 -2034 -866
1257 -866 308 275 297 1154 1235 87 -1270 -633 438 799 128 389 884 20 -1653 -1843 -539 378 296
1276 296 417 1192 491 -1044 -1595 -298 709 627 468 1634 1573 -592 -2068 -890 849 628 -75 1053
1294 1053 1503 -407 -2697 -1774 72 -4 -327 776 1661 651 -1343 -1057 633 913 -11 206 1405
1311 1405 992 -782 -1423 161 628 -557 -606 674 327 -1476 -2018 -293 688 89 -129 1277 1474 -306
1329 -306 -1303 -376 1065 815 4 688 1289 -172 -2153 -1555 149 230 -313 257 1309 27 -1619 -1498
1347 -1498 -235 471 266 831 1532 1137 -352 -1473 -293 799 331 52 738 806 -851 -2078 -1149 4
1365 4 130 -116 593 1257 -2 -1229 -913 294 680 556 713 1410 685 -961 -1224 -171 501 -47 23
1384B3Q69m26j712q32J342R88o1p2R30R2j174r06N55J030q3p89N82Q90r39j723
1404a416K67J429p0r05L14J039m57j193j25J406M48m12%M68O9j329n58J146R36
1423A057m57m27N10J63j566j055Q91J185n9n70P72J91j264q28M37J443P01l80
1441G44k82P92o28j366n70J279O80o06P0K92Q4j759m53J334R15l96j85R04J68
1460A017j117j018Q06J188l49n42O14P09r92j367N2J172J37n30M18Q07o74j773
1478a442j17J359P71m10J33P93k00j757k75J193P24k08m35R05k34j343r28N49
1496i22J422q7o89N82N58j314q07O02J469K2p58M87O43j167r43J88J157K77l96
1515C24n3L56m25j400n30J174Q09k73p4R33Rj307r42J074P58n0K3O29L94j445
$$ plain form
1384 23 892 466 -1246 -2078 -736 252 191 119 1049 1141 -33 -939 -384 646 563 -226 356 1246 307 -1416
1404 -1416 -1149 280 210 -695 -381 658 201 -992 -1117 289 737 325 325 793 862 -467 -1025 121 1057
1423 1057 600 173 683 846 -720 -1775 -884 301 242 -328 444 635 -629 -1457 -1020 423 1124 744
1441 744 462 1254 626 -740 -1310 -31 649 43 113 405 489 -1270 -1723 -389 526 130 -55 849 1017
1460 1017 -100 -1118 -312 876 527 -15 599 1308 316 -1051 -999 173 310 -220 198 1005 331 -1442
1478 -1442 -1559 -200 571 161 294 1087 887 -870 -1145 48 772 564 129 1034 800 -543 -1471 -922
1496 -922 500 413 -276 306 864 -450 -1257 -655 814 836 78 565 1208 41 -902 -714 443 720 324
1515 324 271 627 202 -1198 -1728 -554 255 -18 -92 841 850 -457 -1399 -325 433 383 406 1035 1429 -16
1535a6j339K61J282L21k89j1M33n21j050q99J407Q89j68q2Q16j62j574m48J065
1554h5O88m17P2N93K40j469q65L00J035k29n2L54N26m96j174N2J179K74q49J04
1574b19J527j06j606l52J305J31p43l70Q93j60o30o34N42R19n14o57M87R67q70
1593i0j004R16J432n45q86M17O46q42j309J133J193m57p24p3J28n49o75J79J503
1612C93Q91r59o41M20K72j228k80J598J318j067p73O75l73j338J6J180P33k89
1630E48o64J43L8j115l06N80J314M58n54l54L22l35j211J25J551P54p36pL68r45
1650b6j193l04J012Q20p2L41l80N6q77r32O72J450L36m92K39L28o11j115J08J264
1670F24q8o05L2K41l30j024J23J037N65k07n98N84J13o95n56P03R71o25n76N55
$$ plain form
1535 -16 -1355 -1094 188 509 220 209 642 121 -929 -1828 -421 468 300 218 1034 872 -702 -1150 -85
1554 -85 603 186 258 851 1091 -378 -1243 -943 92 -137 -189 165 691 195 -979 -927 252 526 -323 -219
1574 -219 1308 1202 -404 -756 549 680 -63 -433 460 300 -330 -964 -422 497 -17 -674 -187 780 -90
1593 -90 -1094 -178 1254 709 -177 240 886 44 -1265 -132 1061 604 -120 -193 -65 -614 -1289 -1110 393
1612 393 1284 325 -316 104 376 -852 -1132 466 1784 717 -56 619 246 -1092 -1076 104 837 548
1630 548 -116 27 65 -1050 -1356 -776 538 996 442 88 410 75 -1136 -1011 540 1294 558 551 919 -26
1650 -26 -1219 -1523 -511 309 237 578 198 254 -623 -1555 -883 567 903 411 650 978 367 -748 -640 624
1670 624 536 -69 -37 204 -126 -1150 -1027 10 575 368 -230 354 467 -228 -784 -81 890 265 -311 244
1690B44M27q32q45Q04Q52k05p89J85M86n75q87K69J228J20m18l14P56J50j191
1709e35n17J682P79j020p88M78J65j046m83R93J101k45r21J11K52r04n99J318
1727a79J232Qq68J34J93p72r13M93J366K02o39o3L70l12j578J11J141N40k56k1
1747A89N40o0j093n89Q82O87p7k64M91k30o67j004O07Q92j21n24M17N27p71q99
1767a067L78R13J42l00k28O63m68p96J0J093N52n72n1L64K44j079n76L16R16q77
1787d23j48N91M34l65p97K80R79L2o51K62M06j22r20K51P64J13q44n56R01Q0o09
1808c42k96R36M40m92r07K47N43p35l96J036J157n58p25L80J70m72r76P50J020
1827G80k6p95m58O42l17r57J63J599K78r64k53N90J92j103M4J327L06n45o40L71
$$ plain form
1690 244 671 -161 -1006 -202 650 445 -344 -159 327 -248 -1135 -866 362 482 64 -250 506 656 -535
1709 -535 -1052 630 1409 389 -399 79 244 -802 -1285 -292 809 564 -357 -246 6 -898 -1497 -179
1727 -179 1053 1061 193 327 520 -252 -1165 -672 694 896 257 194 564 252 -1326 -1215 -74 466 210 189
1747 189 729 669 -424 -1013 -131 556 479 215 706 476 -191 -1195 -588 304 183 -341 76 603 -168 -1067
1767 -1067 -689 224 366 66 -162 501 33 -763 -753 340 892 320 269 633 877 -202 -778 -462 454 -423
1787 -423 -571 20 454 89 -708 -428 551 583 -68 194 600 478 -442 -191 573 686 -158 -714 187 267 -342
1808 -342 -638 298 738 246 -661 -414 129 -606 -1002 34 1191 633 -92 288 458 -14 -990 -240 780
1827 780 754 -41 -499 143 -174 -1131 -968 631 909 -55 -308 282 474 -629 -585 742 1048 503 -137 234
1847B34K78q48o85R67Q50l76p10J63K81o97p79P60J226N1o40j8L81k88r90L95
1867d45J151L08o13k79K21j71j014k33R27O51n11k82M41L03p12l59O22P96k62
1886E39q13R5O59l73o31J50R36K3o63k34L33R8r06N2J020L65p66m32L61K42n37
1907d82j07R88P35n16q50M79M40j017m61N81Q54q4r08n8Q11n40p16L94J045J83
1927G71q57ON44l59p46J92J034N17r81k99L24J58p53l30N45P96m79o40K68N71
1947B82n44p10R86O26k40p70M12O17n96o59L27P70K7o78J4K53j37o73o1Q22O96
1968G64o14m37L75J24o43j51P16P05m27o31L50K29l44p42O24R60j42q61k22M82
1988A15j7o17L7P85K76p24j54N76N5o37k80R94N49q74m43K92L84r05J7P12M66
$$ plain form
1847 234 512 -336 -1021 -54 796 420 -290 -127 154 -543 -1322 -562 664 715 75 57 438 150 -840 -445
1867 -445 706 1014 401 122 343 172 -842 -1075 -148 503 -8 -290 151 454 -258 -617 5 801 539
1886 539 -274 -179 480 107 -524 -374 562 585 -78 -312 21 119 -787 -735 285 650 -116 -548 -187 55 -482
1907 -482 -589 399 1134 618 -232 247 687 -330 -791 -210 644 560 -348 -406 405 -135 -851 -457 588 771
1927 771 -86 -80 464 105 -641 -449 585 1102 121 -178 146 304 -449 -779 -234 562 83 -557 -289 282
1947 282 -262 -972 14 640 400 -370 42 659 63 -596 -269 501 528 -150 -136 117 -20 -693 -754 68 764
1968 764 150 -287 88 212 -431 -582 134 839 412 -219 131 360 16 -726 -102 858 716 -145 -367 115
1988 115 98 -519 -482 303 579 -145 -299 277 332 -305 -585 409 958 84 -359 -67 317 -588 -571 141 607
2009F07l57p61J97O74n85n78N42J099j75q66R7L30j05o47K1J160J89q86q6N45
2029D15l29n74o1M49Q06o17n01M14L36p86q4N97P34m16n70K32M15j65r13O99O47
2050G28l19n23j72N69l92n75K8J092J9n53k27J56O18m09m42M97O42o85n81N75
2070D6M25m91n15O02N12k31n21j91L68k54m93M96P39O6n46n33Q64K48p24j98R05
2091E74N92j046m98L76J29q08l7Q38L31j96p39L59L67q4o72M96P78k89p86j6P08
2112C77l42o40K01J195k90p99J47L47m1q32J65Q05K10o27j64K24J64j84m31N79
2132F4R13n65q45N23L53n13l80L26P35l34q93K12N10k94m67L63P93K47j025kK86
2153GK92o27j54J049M02q44o03N01J29n73j74Q05N73o97m94P7L46j84l41L41P26
$$ plain form
2009 607 250 -511 -314 360 -225 -803 -261 838 663 -203 -106 224 119 -528 -507 653 842 -44 -130 415
2029 415 86 -488 -549 -100 706 89 -412 2 338 -448 -532 65 799 383 -187 45 460 295 -618 81 728
2050 728 409 -114 -286 283 -109 -684 -656 436 455 -98 -325 -169 449 40 -402 95 737 52 -529 46
2070 46 471 -20 -535 67 579 348 -173 -364 4 -250 -743 -247 492 558 12 -521 343 591 -133 -331 574
2091 574 1166 120 -378 -2 127 -681 -718 120 451 255 -484 -125 242 158 -514 -18 760 471 -315 -331 377
2112 377 35 -605 -404 791 501 -298 -151 196 155 -677 -512 293 503 -124 -288 -64 100 -84 -515 64
2132 64 977 412 -433 90 443 -70 -450 -124 611 277 -616 -404 106 -188 -655 -292 501 748 -277 -279 7
2153 7 299 -328 -482 567 969 125 -478 23 152 -421 -595 210 783 86 -408 -331 15 -169 -510 -169 557
2174E57k09m82n3K06N5m69j30J302K36j373nN29O1n17q7N39M62n80n61P5O79o24
2196c89j42M52Q84o17p00L70N88k05n50N25N02l32o65k33N03k63l82J6P57K12
2216C31l63k19K73L29o04N3O61K02o92m27M01K27l57n28O91N85m71m84J85L34
2236A27k85l82K60J000j74j017k1P69l23j88O1O47J93q06j65L09J88o62J58O09
2256B98K39o83l76K33K69l75J21O52M33n05n80K77K62r3p00M74P47l75p03k09
2276e94L68K83m35M2N70K98q17j79M47L04l45k33P94J65l86l85J2K84n05k30N02
2297d0M54m36l23j6N02N7o27m8R55q1n68k25L65R8l43Q3M27L20o66r6J05L67l85
2320a21j31L82M96n32p50K36N02j93k00J15Q89j00q76k3O09k0n14L01L88j53m86
$$ plain form
2174 557 348 -134 -187 19 74 -395 -525 777 1013 -360 -365 164 225 -292 -379 160 622 42 -519 -444 235 -389
2196 -389 -531 -79 805 188 -512 -142 446 241 -309 216 718 386 -279 -512 -9 -272 -654 -638 119 331
2216 331 -32 -251 22 351 -253 -200 461 663 -29 -456 -55 172 -185 -713 -22 563 92 -392 -207 127
2236 127 -158 -540 -280 720 546 -471 -492 277 -46 -234 -173 474 667 -139 -304 5 193 -469 -311 298
2256 298 537 -146 -522 -289 -20 -395 -274 378 811 306 -274 3 265 172 -528 -54 693 318 -385 -594
2276 -594 -226 57 -378 -336 234 532 -285 -464 -17 287 -58 -291 503 668 282 -103 -91 193 -312 -542 -40
2297 -40 414 -22 -345 -361 141 198 -429 -477 478 397 -171 -396 -31 67 -276 -193 234 554 -112 -208 -103 264 -121
2320 -121 -252 130 626 94 -656 -420 82 -111 -311 -196 693 593 -283 -306 303 283 -231 70 458 305 -181
2341a81k26M66R9m77N7N29J09o60k20L47M15n35j21O28N41o19n29O4O65j90m28
2362b66L66L37J20r20j21P15k88l25K06P88k49m39n42N64J17r2j40N88M42q61
2382@k15K19J37k04l73K98O19l87m91M3M75j72l56L32M68j22n36J23M12p8l72
2403a80L40K94j17n15j4M48J9j88m20N03J33l63m34K03L22n1l47M20O67n45l78
2424b03J41L69j37o80N13L62J26o71q5N28J8m91j28M91K91p19j25N36J48m58j
2445a75K16N05m48n16J93M02km90L98L05m41k54L9M44Nl20Q8M65j94n42M7M39
2467A64R3m81K06M70M1l37n67M18M4p8j85K64K99k11n77K07N21j19n52J87O14
2488D21l57m56J38N78r3l12p9M51K4m33j46L13M9k73n6M85jk99m18L77L84l94
$$ plain form
2341 -181 -407 59 158 -319 -262 267 376 -284 -504 -157 258 -277 -398 230 771 152 -377 -313 352 162 -266
2362 -266 100 437 557 -363 -484 231 -57 -382 -176 612 363 -76 -618 -54 63 -29 -169 419 861 0
2382 0 -215 4 141 -63 -436 -138 481 94 -397 -354 121 -51 -407 -75 393 271 -265 -142 270 192 -180
2403 -180 160 454 337 -178 -192 256 275 87 -333 170 303 -60 -494 -291 31 -20 -367 53 720 175 -203
2424 -203 -62 307 170 -510 3 365 491 -180 -265 263 281 -210 -338 153 444 -275 -400 136 284 -174 -175
2445 -175 41 546 98 -418 -225 177 175 -315 83 388 -53 -307 -268 176 181 -139 -51 414 220 -322 -275 164
2467 164 257 -224 -18 452 493 156 -411 7 51 -27 -212 52 351 140 -437 -230 291 172 -380 -193 421
2488 421 64 -392 -254 324 231 -81 -160 291 315 -118 -264 49 98 -175 -231 254 253 -46 -464 -87 297 -97
2510i7k27N83M47p14j28j46M93j18k46P9M32l86m26K21N55l18j77J16L36Pl80
2531i4j61M87J19l69r5M42j43m29r4J30L68j72l10M70K08m69k83J24O16k20l67
2552b42m0O00k06l48j89O78j86J45l29M00J71o64j09K76L22k61k04L03L1m83j
2573c36o7O39J31n34K27L71l17l31j02L85J58m52Q1M23o0m07j97L33K30k66j25
2594b16M71L1o60o0L91J30j31q1K15K20j84o09M33K94j9m30J74M03m38k65J56
2615a75K69j35j0j30N23j93m28p1K62N62m16q4L91K11p39k29L76K20m08j63L16
2636e1J06k08k56K47J07j11O7J28L35k29m25J43K91J53m51K26J60k41j33j66L76
2657F8O8j76k8L6K58k09p7P0K55k96l39M80N5j77k63P0K65J00j73LN7J17l88j13
$$ plain form
2510 -97 -324 259 706 -8 -136 -282 211 93 -153 -74 358 -28 -454 -233 322 4 -173 -57 279 286 -94
2531 -94 -255 232 351 -18 -113 329 186 -243 -337 -207 161 -11 -321 149 357 -112 -395 -271 345 125 -242
2552 -242 -282 318 112 -236 -425 253 67 212 -117 283 454 -210 -319 -43 279 18 -186 117 148 -335 -336
2573 -336 -403 236 367 -167 60 431 114 -217 -319 66 224 -228 -147 276 216 -191 -388 -55 175 -91 -216
2594 -216 255 286 -374 -434 -43 87 -44 -125 90 310 126 -483 -50 244 225 -205 -31 372 -66 -331 -175
2615 -175 94 -41 -51 -181 342 149 -279 -350 -88 474 58 -26 365 576 -163 -392 -16 204 -204 -367 -51
2636 -51 55 -153 -409 -162 -55 -166 -99 29 364 135 -290 -147 144 297 -154 72 232 -9 -142 -308 68
2657 68 136 -40 -68 -32 226 17 -60 10 265 -31 -370 110 165 -12 -275 -205 60 160 -13 -10 47 164 -224 -337
2681c37L57J25k16L0K35j04l00j79K58M43m57J55M3J71j93k45M9L66j15j44j3
2702g1Q6J64l96K08O6J67k24K46l18K17n18J67J75J06j30r8K86q9k25J9N4M13
2724C05j94k83K77J10k49l40L37J97j26l9k2J24q8l78O0P12l36J38QQ1k39l07
2746b52J6L65R1k26j87L93M5n01j19L09L28k58J7K39Mk80j92J74L17j40k47nK48
2769A39mk41j26N32j79j94o8N35l94j07RL05K3j68m89O45Q9l13j00K6K05l4k95
2792b04L0L98k57l01J80L84k87j8M6L53k79j64n6M45j93l20J72K71j44j46M9q9
2814a30K87k69j7QJ26j57J32j40N39n5m71J04J39j2k89J88Q5O7l10m4L24J16m40
2837b19j03M33K13j98Q7p1N2l13j35L46K4j10j19J61L31l91j36J72J33k42L4Q2
$$ plain form
2681 -337 20 145 -71 -41 194 90 -210 -389 -131 312 -145 10 53 224 31 -214 -165 201 86 -58 -71
2702 -71 15 179 -217 -9 57 224 0 246 -72 145 -373 -206 -31 75 -55 -153 133 44 -181 -162 -108 305
2724 305 111 -172 105 215 -34 -374 -37 160 34 -5 -27 97 9 -369 -309 403 67 205 213 294 55 -252
2746 -252 -236 129 220 -6 -193 200 245 -256 -375 -66 262 4 21 260 264 -16 -208 -34 283 143 -104 -109 139
2769 139 135 -106 -232 300 121 -73 -141 394 0 -107 -98 207 230 62 -427 218 307 -6 -106 -80 125 91 -204
2792 -204 -174 224 -33 -334 -154 230 -57 -75 -29 324 45 -119 -175 270 77 -243 -71 200 56 -90 -41 -130
2814 -130 157 -112 -129 -121 5 -152 -20 -160 379 324 -147 -43 96 84 -205 -17 68 135 -175 -219 105 221 -219
2837 -219 -322 111 324 126 213 142 194 -119 -254 92 116 6 -113 48 379 -12 -148 24 157 -85 -51 31
2859C1J79j41k02j08M70j97r0P5nM9k56J92J2J15P1k86J05j14j21J20J49L68l64
2882E2nRK84m46k06K11J38l2O0k22K88j45j05L2J62J66l64L6J88k3k94m2M26l4
2906A34k54R1O2L9j23k18M76J34l45Pj8N4j40j5n2K50Q2l38J42J07k48j54j3K19
2930a21J43R1M4q1j1k60K19L0o4O9O5p2O1l81j3K13K36q7k63K30K6M5l28J12K55
2955A58J17k98J04n4J29j51J68k07M41l90N1m9J97j67j45J79M3j34k01K35l1L4
2977B9k24K28K41j52n9%m1J0r6n2J60O4k82J33K0j35K26L6lj45J38k13J41K62
3001B86j60j89K17j6o2j35M2l2j78O3J07J37J10k11k91M78N9m55L79l3J16M6j84
3024I4L8nn8j48L53j37l6k72J63j03K3k84J94J73J37k06l6L46q7l95J83J78M3
$$ plain form
2859 31 210 69 -133 -241 229 32 -58 17 12 61 -195 -3 9 124 195 -91 14 -100 -221 -101 48 416 52
2882 52 47 56 340 -106 -312 -101 37 5 65 -157 131 -14 -119 -87 75 241 -123 -87 101 78 -216 -258 168 134
2906 134 -120 -29 33 72 -51 -269 207 341 -4 3 -15 39 -101 -116 -168 82 164 -174 -32 75 -173 -327 -340 -121
2930 -121 22 113 157 76 65 -195 24 54 -10 59 124 52 113 -268 -281 -68 168 81 -182 48 74 119 -209 -97 158
2955 158 275 -23 81 27 156 5 173 -34 407 17 68 19 216 49 -96 83 126 -8 -209 26 -5 29
2977 29 -195 33 274 122 63 63 22 32 -64 -116 44 108 -174 -41 -21 -156 70 106 103 -42 96 -117 24 286
3001 286 126 -63 154 138 76 -59 -17 -49 -227 -164 -57 80 190 -21 -312 166 225 -230 149 116 232 278 94
3024 94 132 127 69 -79 274 137 101 -171 -8 -111 -88 -372 -178 -5 132 -74 -110 236 149 -246 -63 115 158
3047A58Mj29J14qk43j79L03j21J08n7R0p1ok70K17J78j9k56J88J50k43n6J99j11
3071f0M3j17K91k7l7j12j19L11j24j51k84L81K2M3j29N1J26L6p3p4R8j06O1j9
3095C1J75j98k36L08l9r3k18L39K13lk97J45k16rK6J41M6J20l40J74K0J3j32k01
3119b31L53m4N0m8n8J10q9j14O7J41r9j52J76L46l81j8j11O0J22k9j43K93k86
3142h5L3j61M41j20q2r6j02K75q8j44K66l0r0O4J7L9p4j14j7M5K35K1pj15n9j61
3168a09R9J0J60j31j43K78j94L2J43l1j93M6m0K33n9j11j98K86MJ28l30j28J76
3191g2M7j59J84J98o2o4k18J05j61K49j60J69K06l5j30k0K41m01N5j23L78j13
3213A14j98J33N3n5l48L26J0m2j0J74k66L57k63k6J06q3N5k41K12j63o5J52n1
$$ plain form
3047 158 162 33 147 139 -104 -283 20 -101 7 -50 40 -31 -37 -307 -90 88 69 -187 1 151 -92 -148 51 -60
3071 -60 -17 -134 157 130 93 -19 -138 173 49 -102 -386 -5 17 60 -69 -18 108 144 71 -3 95 -11 50 31
3095 31 206 8 -228 80 41 -52 -270 69 282 279 -18 127 -89 -98 -72 69 115 235 -105 69 89 102 -30 -231
3119 -231 122 78 128 80 22 132 43 -71 -4 137 38 -114 62 408 27 9 -102 -42 80 51 -92 201 -85
3142 -85 -52 -213 228 108 26 -70 -172 103 15 -129 137 107 17 81 98 137 63 -51 -68 -23 212 233 226 111 52 -109
3168 -109 -10 0 160 29 -114 164 -30 2 145 114 -79 -33 -73 160 101 -10 -208 78 82 210 -120 -248 -72
3191 -72 -25 -184 0 198 136 72 -146 -41 -202 47 -113 56 262 227 97 77 318 -83 -28 -151 227 114
3213 114 -84 49 102 47 -301 25 35 -7 -17 157 -109 248 -15 -41 65 -18 37 -204 8 -155 -220 -68 -119
3236a19J21j08j09J42K38l58k9J11J39J5M4O9o8k37k5PK72n0m8Pn8J00l00J49
3260i5K05rl88J94J83k32J84j69J35J78l82L19j37L7j03oJ08J38l4k88K72j76
3282f6O8m9Q5J24n3Jpj5M5j69j67K44K21k01np9Q2K7m2L5p0l7M5m4ql2o4J61j15
3311h5J75m6L9q3l7j83o2N27l36Qj38L48j46l7j69J40J05J01J5Q7j87l53L46p
3335B2J21L4j45J60K21n23j03k11N12J93l45J41M3k22J2R5R5n3j11P6RK99l93
3358g3L6O1K34q3k29Q2k1M0k17J48R7K2j31J05n0j23J1J51J14j2j6j42KP3j17
3383c8N6J2J41j49j15K63jm07N0K4K52k9q7r5J88j57m1J72RJ76j82RP2r0m6J09
3409I6J81k26J09q9j43j22Rl5L46rJ41k92j19K74n6K1N4O0k17Q2k29M21k89k51
$$ plain form
3236 -119 2 -106 -215 -73 165 -193 -222 -111 28 43 87 156 88 -149 -174 -167 105 55 7 14 -44 56 -244 -95
3260 -95 110 101 -287 -93 90 -142 42 -127 8 186 -196 123 -14 23 -80 -86 22 160 126 -162 110 -66
3282 -66 2 -47 38 162 109 110 103 88 133 -36 -203 41 262 61 56 -23 59 86 44 79 9 -28 17 -27 -35 -67 -131 30 -85
3311 -85 90 44 83 0 -37 -220 -282 245 -91 -83 -221 127 -19 -56 -225 -85 20 121 136 223 36 -317 29 22
3335 22 143 177 32 192 413 -110 -213 -424 88 281 -64 77 120 -102 -90 5 100 47 -64 12 21 320 -73
3358 -73 -37 24 258 175 -54 28 7 47 -170 -22 75 97 -34 71 21 -102 -91 60 174 162 146 4 6 79 -38
3383 -38 18 30 171 22 -93 170 169 -238 -188 -164 88 59 -28 -123 65 -92 -133 39 48 224 42 51 123 33 -13 96
3409 96 277 51 160 71 -72 -194 -185 -220 126 117 258 -34 -153 121 65 86 140 200 -17 65 -164 257 -32 -283
3433b83J28K40l01J27J37K3j00k36J19J33Q7p3j3K40l45K62k76K68J5M3k51q6
3455a42n2M6j7K74j64J41j21J42k19j16J97j8mJ51M4k12L46k27p3k44K64K26n20
3478b98J2J32P9m8j72M85on1j72Q0j28J44k55J12K47l8k38R6J00r2P8j29N32m74
3502dk6M5J33m47J68J45k57M67p4j49Q7J96n02J14J43l8M3k42M26k78P2k71J05
3525a44J36j14K41r0r4k1j9k8J64r8K05m8%k9n6k2Q3J30k83K35k18O9j53k6J09
3550g1J60p8j41J61n4r7l3L0K16J00n0K7j09n7j81Q4J96j12RJ00j56j91K1K67
3574D1R9J28k91M5J46j44J44l15K33k8R0m07K00P4o8j53L15J00K6k76K1j73N7
3597a36J22m4J75N7j22j5K25j70j59K0J58p4j4j98K58j3l67K07J15J15j12j86
$$ plain form
3433 -283 -155 85 -216 -89 48 71 -29 -265 -146 -13 74 1 -12 228 -117 145 -131 137 152 195 -56 -142
3455 -142 -194 -148 -165 109 -55 86 -35 107 -112 -228 -31 -49 -53 98 142 -70 276 49 -24 -268 -4 222 -298
3478 -298 -286 -154 -75 -123 -295 190 184 133 -39 41 -87 57 -198 -86 161 123 -115 -19 81 -11 67 -62 470 -4
3502 -4 -30 15 148 -299 -131 14 -243 224 150 1 88 284 -218 -104 39 1 44 -198 228 -50 22 -249 -144
3525 -144 -8 -122 119 29 -65 -86 -105 -133 31 -67 138 90 90 61 5 -17 66 196 -87 148 -70 -1 -154 -180 -71
3550 -71 89 11 -130 31 -23 -120 -153 -123 93 193 143 170 61 4 -177 -93 103 -9 0 100 -56 -247 -226 41
3574 41 140 268 -23 22 168 24 168 -147 86 58 148 -259 -59 15 -53 -206 109 209 235 -41 -20 -193 -136
3597 -136 -14 -58 117 174 52 37 262 92 -67 -47 111 37 23 -175 83 70 -297 -90 25 140 28 -158
3619a58K05j91j1J31J08J87k30l1k62L17k0j30K11L3k26q3K6J46K2j29kK33k72
3642a26j01J89J12j50R0n0J86n8M4k83k8J81j5k0k12K44K9K5j15Pq8j57K38K11
3666A53op8p0L0J77k82J39j81J14m5k1k07K62k5j66J68k2J38k15J23m8J59j95
3689i8L51o0j44L9j69J75n0j6k7J27p7N9j16j62Q8r3O1L40R3k81o2J6K96m77J74
3714a3K18l10K50n7m5j0J53k56Q1J88k52J95R9l31J7j08J69J45J00k01r3J16p
3737D8k71K61J3J94j49j55J68j80n9J15J46R1l68O6r7M4Pq1L73L00j67l20K0P1
3761G0j57L35l59K48J68k82o2J0N5j33j18J97J41l12J53K8k8K9J17J05q0Ql65
3784b32L11k0J6k44K02J73k94J00j56J00mj95K95K2%N0q0l9K16l38K29j86K92
$$ plain form
3619 -158 47 -144 -155 -24 84 271 41 10 -252 65 45 -85 126 159 -67 -150 -124 22 44 -85 -87 146 -126
3642 -126 -227 -38 74 -76 14 -36 150 92 136 -147 -175 6 -9 -29 -241 3 32 57 -58 -51 -139 -296 -58 153
3666 153 147 69 -1 29 206 -76 63 -118 -4 -49 -70 -277 -15 -40 -206 -38 -60 78 -137 -14 -62 97 -98
3689 -98 253 193 49 88 -81 94 44 28 1 128 51 110 -6 -168 -80 -173 -112 228 321 40 -22 -6 290 -187 -13
3714 -13 205 -105 145 88 43 33 186 -70 11 199 -53 142 241 -90 -73 -181 -12 133 233 32 -61 55 48
3737 48 -223 38 51 245 96 -59 109 -71 -130 -15 131 222 -146 -80 -177 -133 -126 -207 166 466 299 -21 -1 70
3761 70 -87 248 -111 137 305 23 -39 -29 26 -107 -225 -28 113 -199 -46 -18 -46 -17 100 205 125 133 -232
3784 -232 79 59 75 -169 33 206 -88 12 -144 -44 -48 -243 52 74 74 124 44 5 221 -117 112 -74 218
3807B18M8l76J46j32j5RK0L04j05j17p0QJ59k98K48K93k22j15l7n4L16m20M78
3830B86k48m0J10k98L67k88K22K7k34R8L3q9J82p4j54l2K06k08J11mJ34l1no5
3854Fp7j2K31j40j66K52k15Q6j2J52P5j58j05J44J1J3Q3L3j81r2K62n7j40P3l26
3879b60K45J28J19l67j11M93m45L02p8k09R3p1J83L6n5k06R5L93J02k57qj46J02
3902G8k55N2L28k29j93q0K41N1j18J87O0O4j57J41r9j78M33n41L14n2O6j98j64
3925b49L36q7j59K79n9k16K94k34p2L04k48O5J08nJ00l54K49J13j89q7Q4K8O6
3948F7l09J25P7J48L5kj31K92n63J70K14o6j19L02k0j32j78K5k14M63m76J3K60
3971a9R7k97L6Q9j45K67j46J91J91j6l02Q8R5j14j82K05J59l80L69k83%J85k97
$$ plain form
3807 218 266 -110 36 -96 -111 -102 -82 222 117 0 -70 -62 97 -201 47 340 118 3 -34 -88 228 -192 286
3830 286 38 -2 108 -190 177 -111 111 138 -96 2 35 -54 128 54 -100 -132 74 -134 -23 -27 107 76 71 6
3854 6 -71 -83 148 8 -158 94 -121 -35 -47 105 180 22 -83 61 72 85 168 201 20 -72 190 133 -7 66 -260
3879 -260 -15 113 232 -135 -246 247 -198 104 26 -183 -90 -161 22 58 3 -203 -108 285 387 130 122 -24 78
3902 78 -177 -125 203 -26 -219 -299 -58 -7 -125 62 122 186 29 170 71 -107 326 -215 99 47 113 -85 -249
3925 -249 87 0 -159 120 61 -155 139 -95 -167 137 -111 -46 62 57 157 -197 52 165 -24 -111 -27 1 67
3948 67 -242 -117 -40 108 143 141 10 302 -261 -91 123 57 -62 240 220 88 -90 -65 -279 184 -292 -279 -19
3971 -19 78 -219 -183 -94 -239 28 -118 73 264 248 -54 34 129 15 -167 38 197 -183 186 -97 -97 88 -209
3994b09K90Qj6m37K22K37m4j26J18n0K57j70r2j13O3N3j65K50J6k94J00N6L09
4017B63m67J54J86q3n2k6J56j40p3J17J44j96K25k48O9o5K3O6P5l0N4n8l47PL4
4042b12J56q0m9L86k8q5j74P6N0k71L02J34m4k79j61J25O4O3J85m0r7q4J08j08
4066f3n6q5J72K44j39j52j05J93lq8J58K1L7m4k59K69k21q4K87j1j1L4k3j44O
4091f7m8j34K25K12K7k74k0P9r4N0O6K4q0k7n5J47Ql74K13r4N47k50k89J66R9
4116E7J61l96L40Q6j78k17J58K30j11J9j17n2J9Rp9j82L63k31L4K64k43j13K1
4139a58J73P0k16L29r8O8lk05J1K02k09j65J47j09K72j38l5M07j97k34lK96m5
4162A60p2l16J86m9O2j6J06q3j55j09L69l9j71L3jJ28k2k21R0L34k53j85J66K61
$$ plain form
3994 -209 81 89 73 -364 -142 95 51 -75 43 -7 250 80 -12 -125 -62 -9 -174 76 92 -202 -102 -46 263
4017 263 -204 -50 136 53 1 -25 131 -9 -82 35 179 -17 208 -40 29 -36 -13 53 128 98 152 94 -253 -246 -212
4042 -212 -56 -136 -185 201 173 88 -86 -10 40 -231 71 205 161 -118 -279 -154 -90 -27 158 118 21 -63 45 -63
4066 -63 -119 -204 -32 212 73 -79 -184 9 6 -82 76 97 134 90 -169 100 -121 -205 82 71 60 94 71 -73 -67
4091 -67 -115 -249 -24 188 215 -59 -79 0 -94 -44 22 46 -34 -61 -116 31 39 -335 -122 -216 331 81 -208 -42 57
4116 57 218 -178 162 248 70 -147 11 241 130 149 32 -20 -1 8 -71 -253 110 -121 -87 177 -66 -179 -158
4139 -158 15 85 -131 198 100 168 165 -40 -29 173 -36 -201 -54 -163 109 -29 -64 343 146 -88 -91 205 160
4162 160 88 -228 -42 -91 -29 -45 61 -22 -177 -286 83 44 -127 -94 -95 33 11 -210 -120 214 -39 -224 -58 203
4186B03L2l11j02o8L31j33Q7J15k10J28k47M4K65M1m18M33j72J24j15p5L48k99
4208Aj03L78Oj66k00n4J86J01l29m7L03k20K23k23J24J30j04j97M03j52j65l5
4230a40K66loj41m5J90j79j80N9R4j18Q2J05J48k02q9N4R0R1jJ47j26j43L17m05
4255a35K61kk34P0K6J29k55p5J15J53n5r3J12M8k95J5K49K0N2p9J2J37l57j14
4279b95M4O0K57j03J32l2J36l50l3J36J8J9J03R5k00J52m31K24M05l09j6J27j21
4302A8Q5k45J87M7j29p7K66o8k80J1J1L29j35p1l0K68j14j31j2m1m1K10L2K8p4
4327D4l8n9K18k20j4K7RK16l9k38R7J32N5k72J0L56j87k28J23p5j4NO9J23q0k01
4353a81j2R7J03r5k24M93J31l92J96j6M4Q6M4k83J62O6k94OJ18o1j18L08k8q0
$$ plain form
4186 203 235 -76 -178 -246 85 -48 39 154 -56 72 -175 -131 134 175 -243 190 18 142 27 -48 300 1
4208 1 -102 276 282 116 -84 -138 48 149 -180 -227 76 -144 79 -144 -20 110 6 -191 212 60 -105 -140
4230 -140 126 123 117 -24 -69 121 -58 -238 -179 -85 -203 -121 -16 132 -70 -159 -105 -15 76 75 222 96 -47 270 -135
4255 -135 126 124 -110 -40 -14 115 -140 -215 -100 53 -2 -95 17 65 -230 -215 34 54 106 27 39 176 -181 -295
4279 -295 -251 -191 66 -37 95 63 199 -151 -184 -48 -30 -11 92 187 -13 139 -292 -68 337 28 12 139 18
4302 18 103 -142 45 92 -37 -114 152 84 -196 -185 -174 155 20 -51 -81 187 73 -58 -70 -111 -152 58 90 118 44
4327 44 6 -53 165 -55 -69 -42 -33 183 144 -94 3 135 190 -82 -72 284 97 -131 -8 -83 -97 -92 -23 100 20 -181
4353 -181 -193 -96 7 -88 -312 181 312 -80 116 100 144 230 274 -9 153 219 -75 -69 49 -12 -130 178 150 70
4377G0k21K3L43n2l46J83J4N5r1j66J90o3J43j94J54N2l8r8L3n2RM7o2J24J11
4402A68k04j20K53J04j48j62K75Q4j97L0M4j58J22P4M2j40j58Ml9L83k22R2ok18
4426i7n0P5N9m7m0K47Qp3K37j61k47K7K74m15J50J39l22J43j4JJ08J5l14L04P4
4451H1P0l29R2K56j55K1Kj42p8k46M15J52j83j1N0J45k06nK5K66j94J71l44K53
4475A06j35j97J27J02j2j18K13K6Q4m17J04L10j03l07K12K11j49j67j48K69l8
4496b7j83K69j5J16j63j81K36L7L1k36R6J24rl3k71L34r2j8Q0j51J26k91M81l00
4520d0P2L5o1o4N2j88L63l30J27r8M5n6P5O9q7O1j49J57R7k18K48pj58J27k34
4545a62K21q8j73L00j78j8K7L1j4k12J90O1N3l55Q4O9L22p7j06J8L98l66j42J91
$$ plain form
4377 70 -151 -128 215 163 -183 0 14 69 -22 -188 2 -61 82 -112 42 94 56 -42 -9 -61 -52 -5 -67 57 168
4402 168 -36 -156 97 201 53 -109 166 250 53 83 127 -31 91 165 207 67 -91 -87 -126 257 35 127 121 -97
4426 -97 -147 -72 -13 -60 -100 147 155 82 319 158 -89 -62 212 -203 -53 86 -236 -93 -107 -106 2 17 -297 7 81
4451 81 151 -178 -86 170 15 36 38 -104 -182 -428 -13 139 -44 -55 -5 140 -66 -71 -46 220 26 197 -147 106
4475 106 -29 -226 -99 3 -9 -127 86 112 196 -221 -117 193 90 -217 -5 206 57 -110 -258 11 -27
4496 -27 -210 59 44 160 -3 -184 52 89 120 -116 -20 104 95 62 -209 125 33 15 95 -56 70 -221 260 -40
4520 -40 32 67 6 -58 -6 -194 169 -161 -34 -132 -87 -143 -68 1 -86 -25 -174 -17 80 -138 110 103 -55 72 -162
4545 -162 59 -29 -202 98 -80 -98 -71 -40 -54 -266 -76 -15 38 -317 -233 -164 158 81 -25 -7 391 25 -117 74
4569G4j20K14j58j71J06R9j88J40J45n7k71N9J94o8j18j09L41k2j34m7J84K9j01
4592B1R1l9R2n5k40qK28j57Q3q7J84k83j4J85R2o6j71J04J05M5r9r4N2Nn9N7o5
4619i3K49J60k18j2Kj33m4j4K86q0J3j4j23N9J7M7l6Pm8j27L12j83rr7O5O0j54
4646a08R5J50j40J62k28m9K30J06k66K34j89OQ5k96L05J17k82N3K7L0l07J25K60
4669A20m4l04K85J83l08mq0M12j71o6j97J36J42j98N8p9J97j64Jp1oK32J20k55
4693f1J83J08k97m3K71N8k82L8J85Q0k72k3O7m2Ljj17K06j98M5N3J77k36O0j92
4718b30K14j65J4L26m9Pj49k3K05k03m7J48K8J47m30j45N17J95l87k29K86l0k95
4741b95J74j11M86k05j38J81Nn3k5K6L12j73l97J27J8J27j52J34J22j64km9J22
$$ plain form
4569 74 -46 168 10 -161 -55 44 -144 -4 141 84 -187 -128 66 -2 -120 -229 112 90 -44 -91 93 122 21
4592 21 112 73 165 110 -130 -138 90 -67 16 -71 113 -170 -184 1 93 27 -144 -40 65 110 11 -83 -31 -26 -85 -28 -93
4619 -93 156 316 98 86 88 -45 -89 -103 183 103 116 102 -21 38 55 102 66 73 25 -102 210 27 18 -79 -14 46 -108
4646 -108 -13 137 -3 159 -69 -118 112 218 -48 186 -3 3 88 -208 97 214 -68 -15 12 42 -265 -140 120
4669 120 76 -228 57 240 -68 -72 -152 260 89 23 -174 -38 104 -94 -36 -115 82 -82 -81 -152 -158 74 194 -61
4693 -61 122 230 -67 -110 161 219 -63 -25 160 240 -32 -55 12 -30 -27 -28 -145 61 -137 -92 -39 138 -98 -38 -230
4718 -230 -16 -181 -167 159 110 117 -32 -55 150 -53 -100 48 76 223 -207 -352 165 360 -27 -256 30 0 -295
4741 -295 -121 -232 254 49 -89 92 97 44 19 45 357 184 -213 -86 -68 59 -93 41 163 -1 -3 -52 70
4764G0j56K2j4L41K5l1k67lQ1R1j03L4J19k91N0J31J27l36L67n10J72L3K1P0J81
4789B24J49k73k36L01k47J12R0j50M2lLk54L74k24M2J57j98j91K90oL5o3K02k18
4813d2K28j64r8J68j84J10q8R2m4r2J12J60j61K4j08j81K55J24J7j17J2J00p6
4836D7O6j53r1Q9m5J33P3l23K55j72K1k8N4J75O5n9%k28M82k73l0k9K04j59q5
4861a1k11L63j76j34M0M09j85j55j0l1j65J06PK57K74p5j65N9l7k07R6nL1Q0k48
4886i3J36k35L06j98K2K08k87rK25l4J03p8j94J48J50j34k21N37m15j22L09K7
4908A51j59K05k20j47N2j39K07j64N61l70J15LJ48j80j11J23k0j7o8K95k09M6
4930A02j19k48K73R1k31K02L3m2k7q6j92N62k23q2j6q9l8M5J95J9j64J94m6j01
$$ plain form
4764 70 -86 -64 -78 263 288 257 -10 -13 68 159 56 90 209 -82 -32 99 226 -110 257 -253 -81 -48 -27 43 224
4789 224 373 100 -136 165 -82 30 120 -30 12 9 12 -242 132 -92 -50 107 -91 -282 8 2 37 -26 176 -42
4813 -42 186 22 -76 92 -92 18 -70 22 -22 -114 -2 158 -3 21 -87 -268 -13 111 128 11 23 123 47
4836 47 113 -40 -131 -42 -87 46 119 -204 51 -121 -100 -128 -74 101 166 107 107 -121 361 88 58 29 233 74 -11
4861 -11 -222 141 -35 -169 -129 280 95 -60 -70 -101 -266 -160 -153 104 378 303 138 197 160 -47 49 44 75 155 -93
4886 -93 43 -192 114 -84 -62 146 -141 -150 75 41 144 66 -128 20 170 36 -185 352 -63 -185 124 151
4908 151 -8 197 -23 -170 -118 -257 -50 -214 347 -23 92 95 243 63 -48 75 55 38 -30 265 56 102
4930 102 -17 -265 8 99 -132 70 103 61 34 -52 -244 318 95 13 -3 -92 -130 -85 110 129 -35 159 113 12
4954A2O6R0j58J58j63k83J46J0J77k08Q6J13K48j27j82J77k00J70l90J80J21R7
4976A40j67j40L47r2m0k06K22n8p1J27K82k13j76J4K08q9J46j67j45J02k12Q6
4998a02J06R9p8p6J27L8k96L00j01j26K11j71J06K54j27j77K61j54N1j5j37o6
5020g3K05K39l09l5J0j75P9p0K44k59k0J89J1m1J12j05J51k53P0J18J72r1p4p3
5044B2L1k41N8K8K08l14K17N9P8r2J1r5M5J46l47J85p9J62j10K4j13J61m2j81
5068a79j73K90J73j68J36j5j01J86k7j67j04M26m61M20j97J24j24l1p7J61l55
5089b63N18m62L2o2J81J59n0J5P4r6o8J91n6Q4j63k3K3M2kJ44m12K81l0k03J47
5114AJ8j24%j31L15j15r9O5lO1K2J59o1J14o9j90J39ok56L42j96j7R1j52k0K31
$$ plain form
4954 12 78 168 10 168 5 -278 -132 -122 55 -153 -67 46 294 167 -15 162 -38 132 -258 -78 43 140
4976 140 -27 -167 180 88 48 -158 64 6 -65 62 344 131 -45 -31 177 88 234 67 -78 24 -188 -102
4998 -102 4 103 25 -51 76 114 -182 118 17 -109 102 -69 37 291 164 -13 248 94 145 130 -7 -73
5020 -73 132 371 62 27 37 -138 -59 -129 115 -144 -164 25 36 -5 107 2 153 -100 -30 88 260 169 95 22
5044 22 53 -188 -130 -102 106 -208 9 68 146 54 65 -30 15 161 -186 -1 -80 82 -28 -4 -117 44 2 -179
5068 -179 -352 -62 111 -57 79 64 -37 149 122 -45 -149 277 -184 236 39 163 39 8 -69 92 -263
5089 -263 255 -207 -175 -237 -56 103 53 68 142 46 -22 169 113 197 34 11 34 76 74 218 -194 87 57 -146 1
5114 1 19 -105 -105 -236 79 -36 -135 -70 -73 -12 10 169 108 222 153 -37 102 96 -160 182 -14 -31 60 -92 -112 119
5140A19j82j10K17j48J81m9NJ28q8L8j45J01j62J20M7j58J32P7%l81J77K67k12
5163b6k2k1M2j32J32K23j22ql8J21j47J26k33L45l04K7O4j05J06q7J30k56K90
5186A05p0j77L26j66l2n6R7J08j99J49k01J89j55k4K9P8K0k17J00n7K48j82J63
5209G6j95Q9k0J71N8q0O6k24J45n0J9j51J7J28q6jJ2J8j06R0j01J74J24j06j11
5234d4N1m6k10K8L20kj81P5K59j98j26Q4j11J81j52Rm0J47j7l17M84N3j51L3j6
5259A13K19j22j98j51J22l9J81j30J45j3k61n7O8K60k53j40J49l0J91Q4r0j53
5281a05J62j56J49o5p9J32j03J85Qp8o1l0j16L3J38R6o3J17j82o0K22l64K22J6
5305A8J03J60l60J04M9n7m84M13J4l7j96L01k19K45j68K21m7J67j45q0J03j45
$$ plain form
5140 119 -63 -173 44 -104 77 28 33 161 73 111 -34 67 -95 25 72 -86 46 123 123 -258 -81 186 -26
5163 -26 -48 -69 -27 -159 -27 196 74 66 28 149 2 128 -105 240 -64 -37 27 -78 28 -59 71 -185 105
5186 105 35 -142 184 18 -14 -70 27 135 -64 85 -116 73 -82 -106 -77 1 21 -196 -96 -153 95 -87 76
5209 76 -119 -30 -50 121 179 99 165 -59 86 36 55 -96 -79 49 -37 -38 -26 -8 -114 -24 -125 49 173 67 -44
5234 -44 7 -39 -249 -221 99 97 -84 -9 250 52 -74 10 -101 80 -72 -63 -103 44 27 -290 194 247 96 129 113
5259 113 332 210 12 -139 -17 -56 125 -5 140 127 -134 -191 -123 137 -116 -256 -107 -137 54 138 48 -105
5281 -105 57 -99 50 -15 -94 38 -65 120 128 50 -11 -41 -157 -124 14 110 47 164 -18 -78 144 -220 2 18
5305 18 121 281 -79 25 74 17 -467 -54 -40 -77 -273 28 -191 54 -114 107 60 227 82 2 105 -40
5327d0M9k8J42r7n7r6L13O0m3l58J93j38J94j86Q5n8J7p8K77j35J8j46R8J71j27
5352C0J5OP9o8j62q7J36nK58k82R9J40n6j55O8J2J33k17K03j94R0k0q2ln9R3J99
5379A71p5K1O5Nj18K3M5r1K51k63m8o1R5n7Q7J11j12L0N6j03o5L0J1q6J10P7n6
5406E3j16l3J31k04J11M7R7J50k02J45j3j20q0o3R2P0kj94O0R2j43K77k48K79
5430A86p8k9k06J9J83k71K39P7k2j54J17Q0k32J6o1K14m9j19j23J33L07l91pL15
5454A44mk12m8J67P3j55K17J19q7k96N4%j72R9J64j71Q1L5k39N5J85r2J47j36
5478g2J87l15J33J71p5n0j36L09j99K77l07o0Q0N3q6o9L89k56l0J22q7N1O5m8
5502D7M4J06k17K7K6LK10l19J1Q8j99J20j12J49j33%N3n5K89j06j25P4L47k37
$$ plain form
5327 -40 9 -19 123 26 -31 -127 186 246 203 -155 38 -100 94 -92 -7 -65 -48 -126 151 16 34 -112 -14 157 30
5352 30 45 51 130 62 -100 -187 -51 -56 202 -80 19 159 103 -52 16 28 161 -56 147 -47 43 23 -59 -62 -121 -28 171
5379 171 96 117 182 187 69 92 137 46 297 34 -14 -75 20 -37 50 161 49 79 135 32 -33 -3 8 -78 32 109 53
5406 53 -63 -96 35 -169 -58 -11 86 236 34 179 166 46 -34 -97 -5 65 63 -131 -71 21 -122 155 -93 186
5430 186 108 79 -127 -108 75 -196 43 120 98 -56 61 141 -91 -75 -136 78 29 -90 -213 -80 227 -164 -171 144
5454 144 140 -72 -120 47 120 -35 182 301 214 -82 -28 -28 -200 -101 63 -108 -27 8 -231 -176 9 -83 64 -72
5478 -72 115 -200 -67 104 29 -21 -157 152 -47 230 -77 -137 -57 -4 -90 -159 230 -26 -56 66 -21 30 95 47
5502 47 91 197 -20 7 33 36 246 -73 -62 26 -173 -53 -165 -16 -149 -149 -96 -151 138 32 -93 -19 328 91
5526I1o4O0m1p4J14L42k22k27r8K29J02j45j04j2J29J45l63J35P3k3J5k6l3p1
5550f8M8k5P8O8j23n3J01J41j94M4R0J46l22L4Q7r9N3k37L2L32n0j17J36j61K67
5575B08j57J0K40m04R4k43L93j14L6j06J84m9q0m9k04N08k82O7k27L28N1k65J86
5598A25l3l34R1P9K48m4l36Q5P7N8k55J23J64j19j18m0L74Mj48M2r6L17k33l5
5622dM2J3j9O4l80L86j96j48L29j45k4K54j15l3r5K05o6j05J41n1p5J16j07o8
5646h1J38M9p4k29J71J23K29k32j10q7P2Q9l6J05j33qMq4J40q7O0j8L01k69j15
5671h2k53L21k8p4K19j86N5m2J48R8p6j63K4KJ81l67J8l9M34o9o6j91K76L9kj02
5697G5L2p7k17L49N6j71k6M9j82K47j35k2J23K13m49n2K09j06n4k7J65j25J69
$$ plain form
5526 91 27 87 46 -28 86 428 206 -21 -119 110 212 67 -37 -49 80 225 -138 -3 70 47 62 36 3 -68
5550 -68 -20 -45 33 101 -22 -75 26 167 -27 17 107 253 -69 -35 52 -47 6 -231 -199 133 83 -34 102 -59 208
5575 208 51 61 301 -103 -9 -252 141 27 63 -43 141 92 12 -37 -241 267 -15 52 -175 153 204 -61 125
5598 125 92 -242 -151 -72 176 132 -204 -119 -42 16 -239 -116 48 -71 -189 -229 145 149 1 43 -53 264 31 -4
5622 -4 38 51 32 96 -284 102 -94 -242 87 -58 -82 172 57 24 -71 134 68 -37 104 53 -22 94 -13 -81
5646 -81 57 106 32 -197 -26 97 326 94 -16 -103 -31 58 22 127 -6 -14 -10 -94 46 -41 19 1 302 33 -82
5671 -82 -335 -14 -42 -116 103 -83 -28 -70 78 176 100 -63 -39 -37 144 -223 -205 -244 190 121 55 -136 140 179 177 75
5697 75 107 30 -187 162 218 47 21 70 -112 135 0 -22 101 314 -135 -187 22 -84 -138 -165 0 -125 44
5720D4j19m4J13J12k62J28J26N7k57R6N1J89l96K8K86k63O2O8o0L1j45K37J68
5743B50j28N1j33K1J34j27m2q7P2K27k87J09J65l67J34k6K34k33p0K3KK65k08
5766b1J0M7L5j68J58r1K02k47J18J69r8k35k0M1Q0M7pJ02Kk85K0P0K0J95m0k05
5792a01K68J0l51J28j5k6L9o0J15m1q3l8J77p4j45J83N3l21K52o2O1R6l1j51L42
5817B25j05k34p8J44K9O0J25j65L5j0j29N9Q4m8R5k35J31P3k34k0L16j28J38j37
5841iJ05N5m27J63K13j46J39l40K20l3r7m2K23K6Nq0J44J44k66jK26k25K3R6j77
5866f1n0L98k57M8j81K55j45o7J63o3p5k85L17n5K32k93J07n5J73l11J00K0L14
5889B29j80j35L29k93J45l21J88K35j81L3j74J53Q2k9j81L39m12K04J36k6j01
$$ plain form
5720 44 -75 -119 -6 106 -156 -28 98 155 -102 -6 45 234 -162 -134 152 -111 -49 19 -41 -10 -155 82 250
5743 250 122 173 40 61 195 68 26 -61 11 238 -49 60 225 -142 -8 -34 200 -33 -103 -80 -78 187 -21
5766 -21 -11 36 71 -97 61 -30 172 -75 43 212 114 -121 -141 -100 -20 27 20 122 124 -161 -141 -71 -51 144 104 -101
5792 -101 167 177 -174 -46 -61 -87 -48 -108 7 -34 -117 -155 22 -52 -197 -14 39 -282 -30 -92 -31 65 34 -117 225
5817 225 120 -114 -192 -48 -19 41 166 1 36 26 -103 -44 40 -8 87 -148 -17 56 -178 -198 118 -10 128 -9
5841 -9 96 151 -276 -113 100 -46 93 -247 -27 -60 -157 -199 24 50 55 -25 119 263 -3 -4 222 -3 20 116 -61
5866 -61 -111 287 30 78 -103 152 7 -60 103 40 -35 -320 -3 -58 174 -119 -12 -67 106 -205 -105 -85 229
5889 229 49 -86 243 -50 95 -226 -38 197 16 49 -125 28 110 81 -100 239 -173 31 167 141 40
5910D0J09p9P0m2r4p0K10k08N6N0rJ55m00P8L67k96N2l40L99J17J02j47M2j71
5934ikJ80j87j21K77k52K79j10l25J07L6L56l82K54P4k24K16m04J56q7K03J8j48
5957i5L07j34k0j61p7L38j29J68k41l9Jp9J6L9R5J57j90M3j43l1J36J15O5k95
5981a54J37M7j12j7J5K28O4k03l4j7N2r2J34J57k59l1L9M1P4m6M3j89J24j49p8
6006b26J44J65K1q8O5j36R9J24q7j41j6Qm5L10j09j22m6J76l27K43j35L33J11
6029C21k04j79Q1O6r6j74J31k5L27l49K40R4j10k32J03M9j40J37j20K69k14k06
6051b31J14J34J94k70o9LN0J59r0J30M8J2k02K78l61m7J97K33l28k7J3jJ32j5
6075E6j83J15P2J01k1Qk79J62j43Q9K10k09M3P9j01J8k18R4j5L6J83j34j13J03
$$ plain form
5910 40 149 70 140 98 4 -66 144 -64 -8 42 33 188 -212 -134 233 -63 -11 -351 48 165 267 120 162 -9
5934 -9 -11 169 -18 -139 138 -114 165 55 -270 -163 -127 229 -153 101 175 -49 167 -237 -81 -168 35 53 -95
5957 -95 212 78 58 -103 -180 158 29 197 -44 -83 -82 -161 -145 -106 -11 146 -44 -1 -144 -175 -39 76 141 -154
5981 -154 -17 30 -82 -99 -84 144 208 5 -29 -46 6 -86 48 205 -54 -85 -46 -5 69 23 66 -123 1 -148 -226
6006 -226 -82 83 104 16 81 -55 44 168 81 -60 -76 -68 -113 197 88 -34 -80 96 -231 12 -123 210 321
6029 321 117 -62 19 85 -11 -185 -54 -79 248 -101 139 233 123 -109 -6 43 -97 40 -80 189 -25 -231
6051 -231 -117 17 211 -59 -128 -125 -75 84 -6 124 172 184 -18 260 -101 -148 49 282 -46 -73 -60 -61 71 56
6075 56 -127 -12 60 161 140 148 -131 31 -112 -23 187 -22 21 100 -1 17 -201 -107 -122 -86 97 -37 -150 -47
6099d7N9l3Q3J02j80r9o3J20k5NJ41q7j29M5J46m8R9j49k00M46l14k7M8J29j15
6124i3L0M6L7L91m11k29J72L14m57J94j07J5n4j04L84M1j3q2k96K59j13n5J26
6147el7J0Om2J47L6j84QJ01l4J70j24j24R0p0J01j70j28J91k6J0K66k44P0j70
6172a52J05K33k59O1L7K0k60L47l7Q3k70J29o3K4K1l0kR9n3L0L5n4k50L63j58
6197aJ23K1q4j14K55k4k28Q9qk1q0l7K25J07k63o2m4J04nj83K86l8k2l9N6K42
6223B55k07j6j1qN7j0j91L45l57K07J26j01j10p2Q4L0q7j76%M47j18q9j9L19l65
6248f7j78J80M8j98J72kM8k51L52j09J95q2j40l1M7m8j51J77J88J4j58j14j04
6271b12K01m6p6q2L60j11J63j70J59k67n7l0K88Rj46N4r3K3RQ4Q8p2j2LJ44j35
$$ plain form
6099 -47 12 -21 62 164 -16 -115 -178 -58 -83 -78 63 -24 -153 -108 38 -10 89 -60 -260 186 -128 -155 -107 22 -93
6124 -93 -63 -17 20 411 0 -229 -57 257 -200 -6 -113 -98 -152 -256 128 169 156 74 -222 37 -76 -131 -5
6147 -5 -42 -32 -26 -68 79 115 -69 -61 40 6 176 52 -72 18 -52 49 -121 -249 -58 -84 -74 192 -52 18 -152
6172 -152 -47 186 -73 -12 25 45 -215 132 95 178 -92 37 -26 -2 19 -11 -13 86 33 63 98 44 -206 157 -1
6197 -1 122 143 59 -55 200 176 -52 37 29 8 -72 -109 116 223 -40 -102 -146 -42 -47 -230 56 18 -4 -43 13 255
6223 255 48 32 21 13 70 60 -131 214 -143 64 190 89 -21 -93 -9 21 -66 -242 -242 205 87 -2 -21 298 -67
6248 -67 -245 -65 -17 -215 -43 -45 3 -248 104 -5 190 108 -32 -63 -16 -64 -215 -38 150 164 6 -108 -212
6271 -212 -11 -57 -133 -215 145 34 197 27 186 -81 -138 -168 120 129 -17 37 -56 -33 -24 60 148 76 64 67 211 76
6297G6k43R9P0k8N4j86K64j54M9m3k3j4J95j56k3k49J81J9K49j40N4j43MJ08l19
6322b99M01j99M2kJ00j03J24p9J6j14L86k72J26l6r6nMm3J74J31j83L2l43K49
6346A1j68PM0OJ55j02K4M9J7J87k80Q3QK01j80k27O7j09J05J11J16j02p2l2r2
6371a77J50J4j11L20j20J6k86K32P9j77j26J31M4o4M4J16j46J73k02j8L61k95
6393d2J32j36l6L3n4K84O9j55k03L27n4l48J79j5qq3K13k13K79j68j75J58o0K60
6417A84k74o8Q2J33m7J09j54K8j79J84j69J40n2L2K5K08o7l3p7rJ58l46L8J06
6441d8J60l0j96M2o5Q3J47j2o8p8J96K3j49j39J98O4m9j29K25k49K16k1k53J80
6465D8J73k67j22J01j9L08k84M5m2K13k7m9j70J17q7l4j30L31P8j94M17n35J51
$$ plain form
6297 76 -167 -68 2 -26 28 -158 106 -48 1 -42 -65 -79 116 -40 -63 -312 -131 -112 137 -3 51 -92 -88 20 -299
6322 -299 102 -97 -55 -57 43 -60 64 -15 1 -113 273 1 127 91 -5 -10 -6 -49 125 256 73 105 -238 11
6346 11 -157 -150 -110 -104 51 -51 -27 22 39 226 -54 29 37 238 58 -169 -102 -211 -106 5 121 19 -53 -85 -177
6371 -177 -27 -13 -124 196 76 92 -194 38 117 -60 -186 -55 -11 -75 -31 85 -61 112 -90 -108 253 -42
6393 -42 90 -46 -82 -49 -103 181 250 95 -108 219 165 -183 -4 -19 -27 -110 103 -110 169 1 -174 -16 -76 184
6417 184 -90 -158 -76 57 10 119 -35 -7 -186 -2 -171 -31 -83 -51 -26 182 115 82 5 -4 154 -192 -154 -48
6441 -48 112 82 -114 -72 -137 -54 93 81 13 -65 131 154 5 -134 64 128 79 -50 175 -74 142 121 -132 48
6465 48 221 -46 -168 -67 -86 222 -62 -17 -59 154 127 78 -92 25 -62 -96 -226 105 183 -11 406 -129 22
6488B2O3L9o4l4n4J59k12L20k83J55m8j4J22k28J03P2p9j43N6L40j61r6p5r3K12
6513G9j26n7J27k02J36M8J80k10j38L6J04J53k43J61Jk87J92R1O4j02P0j75L87
6536B89l10JO3MJ88j57kk40J19j99L46k0M0k16J33J75k96O2%k8O8r6%J03Q2j20
6562a1q5L00k19j62R8J59k2k3k51K9L78j91q9J6J98j22N4M1l2p3Kj0l6P0K8j18
6588g1m4PL71l66P2P7K1l3o2J47q3j04J01rL5j02N9J24k1r0R4o8o6j56Q1R9k3
6615a0R3j18J94O7k71J58P6j07L8k53K21K9p9k4j4l3J49j73j0K9K8l3J71j35N
6640bn8J05j11q5J26j02J24l9J86k87J80j8Kk37K13n9j53J90J28j84j42J00L34
6663B11k81p5N5l2q2J95r0LL1P5J42j29J6j53R3M8k18K73j30L6l9O0o8J35j5k3
$$ plain form
6488 22 85 124 60 26 -28 131 -81 239 -44 111 63 49 171 -57 46 118 39 -104 -48 292 131 35 -40 -133 79
6513 79 -47 -104 23 -179 -43 5 185 -25 -163 -127 -23 130 -113 48 49 -238 -46 45 109 7 77 -98 289
6536 289 -21 -20 43 47 235 78 76 -164 -45 -244 102 82 122 -94 39 214 -82 -20 -20 -48 20 -76 -76 27 109 -11
6562 -11 -96 204 -15 -177 -79 80 58 35 -216 -187 191 0 -89 -73 125 3 57 98 66 -7 -5 -15 -51 19 47 -71
6588 -71 -115 -108 263 -103 -31 46 67 34 -28 119 36 -68 33 24 59 -43 16 140 119 29 123 55 -11 -167 -86 13 -10
6615 -10 83 -35 159 226 -45 113 189 82 120 -133 88 117 38 14 0 -33 116 -57 -67 -38 -10 -43 128 -7 -2
6640 -2 -60 45 -66 -151 -25 -127 -3 -42 144 -143 37 19 21 -216 -3 -62 -215 -25 103 -81 -223 -123 211
6663 211 -70 -145 -90 -122 -204 -9 -99 -96 -65 10 152 23 39 -114 -21 27 -191 82 -48 -12 -51 9 -59 76 61 38
6689C8J28j59j10R5j21M1J44p1K33k93q8J06J60p2O6J80k29j2K22j69l1j03q3
6712a28J49J06j27j17J5J84j03j5J6J07O8l85K68j11J3K45k4j92J96r3j65K20
6734A27o6K1n1O6q0J22j88J07j32o1L06k64L54k46J24k29l7M1J30k18L33q1k25
6757a47K26l3M9O7j95l5n9R3M3R1Q6J0k48K12k80L8K7m6K30j22o6J76k10P0J02
6782G9J12o9m5j04P6K1q2N8k07L19j87r8J46j07Q7r4j1M91m86J67J5q5O0q3J14
6807H7j38q4J09l1J39J49l42L4J24J44k9j56m2J77j01j1k8n1J53j65K47Q6k79
6830hl99M46J9m5Q2k32J37J79j82r5K42j07r2L5J90j20j56J25Q6j23j08J48K1
6853D3M9J27l09L13j37j06J80k07L8J48k51j07M76k89m5L0j43K41j66L5K1J90
$$ plain form
6689 38 166 7 -103 -8 -129 -88 56 -15 218 -75 -163 -57 103 31 97 277 48 36 258 89 58 -45 -128
6712 -128 21 127 0 -117 -102 82 -21 -36 -20 87 155 -230 38 -73 -60 185 161 -31 165 72 -93 127
6734 127 61 82 31 97 17 139 -49 58 -74 -135 171 -93 261 15 139 -90 -127 -86 44 -174 159 78 -147
6757 -147 79 46 95 162 -33 -68 -127 -34 9 100 186 196 -52 160 -120 -82 -55 -101 129 7 -59 117 -93 -23 79
6782 79 191 122 77 -27 49 70 -12 46 -161 158 -29 -127 19 -88 -1 -95 -106 385 -101 66 81 -4 56 -27 87
6807 87 -51 -135 -26 -57 82 231 -111 -77 47 191 162 6 -36 141 40 29 1 -50 103 -62 185 271 -8
6830 -8 -407 39 58 13 95 -137 0 179 -3 -98 144 37 -55 -20 170 50 -106 19 105 -18 -126 22 43
6853 43 92 219 -90 223 86 -20 160 -47 -9 139 -112 -219 257 -32 -77 -47 -190 51 -115 -80 -59 131
6875A31j9J1k2MM4k94L18j64r3J82j37pO0r1m0K15r5k51L38j77o6M6J9J50l2k09
6901a79J19n4J58k23j4K63j29%P0k3j68K12J1J7J21m5J75l13L8K52l37M7J08J12
6925B18k20J6n6J7J29k09J12J32j90L4J60n7j01q7K43j7j41k1O9K4l18L10n9M
6949hO9k2o1J4R2j91J41L9m0M5p2J05j03JL8k6R5k48M17n88M48k93J46j26K67
6974A39j15J16r5Rj30m5O4K68j66j28J79n8pJ0J7j4J57k11j08L19k58R9j2j47
6998a17L7J71j78J15p6j07J01n3J31n4m5J6K2MK3J9m8L6k00J52N7q9j26J32K65
7023A88k07J96m0K49k51O2j25q7R0m3m3k07M68j14k89K89k31J21r9P1j02L1j45
7046b18J44K33j58J10j14J07M4k42k4N7J7j17K54m3j9n1QR1R3m09K6L53J13j58
$$ plain form
6875 131 112 123 101 105 149 -145 173 9 -84 98 -39 -46 14 -77 -117 98 3 -248 90 -87 -153 -107 -88 62 30 -179
6901 -179 -60 -114 44 -179 -193 70 -59 -59 11 -12 -180 32 43 60 181 136 311 -2 36 288 -49 -2 106 218
6925 218 -2 14 -42 -25 104 -105 7 139 -51 -17 143 86 -15 -102 141 124 -17 -38 31 55 -263 47 -12 -8
6949 -8 61 39 -22 -8 84 -107 34 73 33 78 6 111 8 9 47 21 116 -132 285 -303 145 -148 -2 -128 139
6974 139 24 140 45 54 -76 -121 -57 211 45 -83 96 38 31 41 58 44 201 -10 -118 201 -57 42 30 -117
6998 -117 -80 91 -87 28 -48 -155 -54 -107 24 -30 -75 -59 -37 -33 -10 9 -39 -3 -203 -51 6 -83 -209 -77 188
7023 188 -19 177 137 386 135 197 72 -15 75 32 -11 -218 250 136 -153 136 -95 26 -73 -2 -104 -73 -218
7046 -218 -74 159 1 111 -3 104 148 -94 -118 -61 -44 -161 93 50 31 -20 -12 79 172 -237 -211 142 255 97
7070I7l37K15P5J36k49L98r6k70mJ88k71M3j00R6P7l04K53k8K42j51kj70J50J38
7094A26j27k79J35K3J3M2L36q0n9n3o9l9j0K39j97K24k11P3j91L83j47k73OK62
7118A27j11O3J46k34J4j38K39j16p4K14k15J38j39J55j11k49P7J57o2q6K86l68
7140b87M1L43o5n0p7r0M13j17k74J21K8M3j23J68R1j30R6j25j44J77l36M16r6
7163B3O3l34M56k13M2j92m5K89K5J4j87L7J62k69K06m1j13L1o6J42p0K06l30K88
7187A24k07L04j02k3O2k25n9M93j41j09j16k16K10k4L9l1p1J87q7j38K22kk14
7210a24J09L0J22j71K70k82J07N4j19k25J14K67k50K80j57Q6k12j0k7J88n2n1
7232e3K0Q0r9j8K22j14M8l88K65r4Q4k09J51J20l9k0J19J64j98o8q7M9J05j3m28
$$ plain form
7070 97 -240 -25 50 186 -63 335 239 -31 -35 153 -118 -75 -175 -79 -2 -306 -53 -81 161 10 8 -162 -12 126
7094 126 -1 -280 -145 -122 -109 -67 269 189 130 77 8 -31 -41 198 1 225 14 87 -104 279 132 -141 -135 127
7118 127 16 79 225 -9 5 -133 106 -10 -84 130 -85 53 -86 69 -42 -291 -214 -57 -119 -205 81 -287
7140 -287 -246 97 32 -18 -95 -185 228 111 -163 -42 -14 29 -94 74 165 35 131 6 -138 39 -297 119 23
7163 23 86 -248 208 -5 37 -155 -200 89 114 128 -59 -22 140 -129 77 36 -77 -46 -112 30 -40 166 -164 124
7187 124 -83 221 119 96 158 -67 -126 367 226 117 1 -215 -5 -29 10 -21 -92 95 8 -130 92 90 -124
7210 -124 -15 15 137 -34 236 -46 61 115 -4 -229 -115 152 -98 182 25 111 -101 -111 -138 50 -2 -53
7232 -53 -33 47 -52 -70 152 38 86 -302 -37 -131 -47 -256 -105 15 -24 -44 75 239 41 -27 -114 -65 40 27 -401
7257d01M89j78j6K44k28K82l4l22L63j32j39J42J9j20p2pK62j48J27j56LJ40j02
7280A6kN7O3M9j28K17j78j33O2K59j85j87K7m7K37n3m9j8J14j05l8N8j44K17K7
7305A36k02J07j42J69j29l5J15l7P7k19O1K14k9p6Nk03J15n5n1K26j52J28J44
7328A67j51J73p3l9k85J46J30q6J22l12L48j60q3J28R2k87L71j24j18j20J82K44
7350B65l53k27L01J50O7k56K70k64J90j34q0O7M9R6k79K27k15pK94j81K45j26
7372I9j62J43j04J31k11M4P6P0j46K04j69J14m33L60o3r1M5J23l0P6m3q6kM4j41
7397a52K03k51J98K0j20K00p1j85K07j98L09l2m0j65l9K37n6k10K18l45L98J89
7419C15n17K77j3j29J97j28J02J28m76L34j67M5L4J71l27L48o7k80K51j73K5J7
$$ plain form
7257 -401 88 -90 -106 138 -90 192 158 -164 199 67 -72 70 89 -31 -103 -110 152 4 131 -25 -22 118 16
7280 16 14 71 134 183 55 272 94 -39 23 282 97 -90 -63 -110 127 74 25 7 121 16 -22 36 -108 109 136
7305 136 -66 41 -101 68 -61 -96 19 -18 59 -160 -99 115 86 10 15 -188 -73 -128 -179 47 -105 23 167
7328 167 16 189 116 77 -208 -62 68 -18 104 -208 140 -20 -103 25 117 -170 201 77 -41 -161 21 265
7350 265 -88 -315 -14 136 203 -53 217 -47 143 9 -71 -4 45 141 -138 89 -126 -133 161 -20 225 99
7372 99 -63 80 -24 107 -104 -60 16 86 -60 144 -25 89 -344 16 -47 -138 -93 30 0 76 33 -53 -55 -11 -152
7397 -152 51 -200 -2 18 -102 98 27 -158 49 -149 160 128 88 -77 -116 121 65 -145 73 -272 126 315
7419 315 -202 75 62 -67 130 2 104 232 -244 90 -77 -32 2 173 -154 194 127 -153 98 -75 -50 -33
7441c3K3K2k2J21o1N9L3p5j06J2j51K61j98K72N2L5k10J1K1l6k08L6n0J19K64
7466A91j22j11K44j48k92K33k13M04m02J95j87L53k17P9J2j64j6R2K13j07J37
7487A74l33N8J76J15k03J8K69l50n2J57j24J35j20n0O9J35j43J45n5M0K7K5j06
7510GO8k58J29J7J51k18J40J25j36p3j15j7L97k27J99l19K65j89O7J38o5j04n2
7533g0O8M4Ro0k89L07L71j65l22K32j73J7MJ44r5j48J21J9NJ37J08l54m6R7J9
7558b0KRJ37k84K20J23j05q7p2J79j89J2j94L26j43j73J91m5pN5M7M8R0j92p0
7583a42K40o6j67J34%J37j71p7J81J05j68j34Q1J30l7j00P5R3j94J9M2M6N6j40
7607e7j65O4K52l7k8j1j38l2l3K47j66J20J15r1R5q2J57l19J46j56L8R6J1n9P6
$$ plain form
7441 -33 -10 12 -10 111 50 109 142 67 -39 -27 -178 83 -115 157 209 244 34 45 66 30 -178 -142 -192 -73 191
7466 191 69 -42 202 54 -238 -5 -218 186 -216 -21 -208 145 -72 7 19 -145 -161 -69 144 37 174
7487 174 -159 -101 75 190 -13 5 274 -76 -128 29 -95 40 -80 -130 -61 74 -69 76 21 61 88 113 7
7510 7 75 -183 -54 -37 114 -104 36 161 25 -48 -163 -180 217 -10 189 -130 135 -54 13 151 86 -18 -70
7533 -70 -2 42 51 -9 -298 9 380 215 -107 125 -48 -31 -27 117 22 -126 -5 14 19 156 264 -90 -136 -39 -20
7558 -20 -18 -9 128 -156 64 187 82 -5 -77 102 -87 -75 -269 57 -86 -259 -68 -113 -120 -65 -18 30 120 -72 -142
7583 -142 98 32 -135 -1 -1 136 -35 -112 69 174 6 -128 -47 83 46 -54 21 114 -80 -61 -19 27 83 -57
7607 -57 -222 -158 94 57 29 18 -120 -152 -185 62 -104 16 131 40 135 53 210 -109 37 -119 -81 15 26 -33 43
7632D3k09J66R7m3J26k4j18m9qL7k36J34O8J7l6m8J63r0L0m7Q7Jn1J84l02N2K17
7659A61j07r8N7K22j49m8L5p3O8j73j0J73j63K51j72K55k8j30m30L53q1J09n5
7682c3Pj14P9J30p4N3m41K93J24k08L57k98J35rj43K34q3L2k02Q6O0n4Q8j89J20
7707e0J1Q7n8K13j76j28J78N7r8k2J88k66J18k2J26j42j11m3L1K67o1j29R8K13
7731B81l85R4j63k6K54k14K32m8J25K3j83p0J53q4J89j61J40j08j51K0O9lK31
7754B15k30j6J71J2j25j64L85j75K00l72J22r3K30k44or6K91j7k67J18J79l4j15
7777c1N0j73K88l12J66K0o9J10j39N7R4j7N5k1j06p7N2K19k91P7L9m8J59k15K69
7802A56k37K2J02j75P7j15K76q7Q7L3l02Q0J34j41J60k12jO9J23J15l9q3j14K48
$$ plain form
7632 43 -166 0 97 54 180 156 38 -11 -19 18 -218 -84 -16 1 -35 -83 80 -10 20 -27 60 61 10 194 -108 -56 161
7659 161 54 -44 13 235 86 38 73 0 68 -105 -115 58 -105 146 -26 229 201 71 -359 -6 -87 22 -33
7682 -33 -26 -140 -61 69 -5 48 -393 -100 24 -184 173 -125 10 1 -142 92 9 41 -161 -75 -15 -69 19 -170 -50
7707 -50 -39 48 -10 203 27 -101 77 134 36 14 202 -64 54 32 158 16 -95 -138 -107 160 99 -30 68 281
7731 281 -104 -10 -173 -199 55 -159 73 25 150 173 -10 -80 73 -11 178 17 157 49 -102 -82 -13 -16 215
7754 215 -15 -31 140 152 27 -137 248 73 273 -99 23 -70 160 -84 -90 -186 105 88 -179 -61 118 84 -31
7777 -31 19 -154 134 -178 -12 8 -61 49 -90 -33 61 44 99 78 -28 -105 -53 166 -125 -48 -9 -57 102 -113 156
7802 156 -81 -59 43 -132 -55 -170 106 19 106 139 -163 -83 51 -90 70 -142 -143 -74 49 164 125 42 -72 176
7826A76k62m0j6J05R0j33P5J64j48M7j23j40Q4K9K56k17p8K31p4k33n5K44J47
7849A29r4p0n6J73K5j31K04m7l05p7K53J02Q8k84J03O1k7r4J11j25K61N3l98K76
7873A31R4N3k93k3l4K48m41L11j73J04K09n56M39j53K31o5j83Q3j50K33k63J41
7895e7j18L7R9P5j25j38J60J17P3j86N4r4K13j51j45K75O7j99Q1L3o3l5J28n0
7919E1j2j01K13j19k53J75j9K28k68j8K2J5K77N3l57K02n2J8j85M18j63j48K22
7942A99j36O7k09K18j10r5K35k08qj36J40K16k10J03r7j43L13k21K07k92K06L60
7964C99l78L6K09k26j84K17j7N2j12l4j62J52M0J94k02J27m1J33k80j6K69j46
7986C0p8k1J11J45m46L86p3k5n7K08n7k43K03Rj58R3o3o8K87p7k42K70k68J02
$$ plain form
7826 176 -86 -126 -142 -37 53 -80 -5 159 11 58 -65 -205 -121 -92 164 -53 -131 100 26 -207 -262 -18 129
7849 129 35 -35 -91 82 107 -24 180 133 -172 -249 4 106 194 -90 13 74 47 -47 64 -61 200 253 -145 131
7873 131 225 278 -15 -38 -72 176 -265 46 -127 -23 186 -370 69 -84 147 82 -101 -18 -168 65 -198 -57
7895 -57 -175 -138 -39 36 -89 -227 -67 50 123 -63 -9 -103 110 -41 -186 89 156 -43 38 71 8 -27 101 51
7919 51 39 -62 151 32 -221 -46 -65 163 -105 -123 -101 -86 191 244 -113 89 37 55 -130 288 125 -23 199
7942 199 63 130 -79 139 29 -66 169 -39 -47 -183 -43 173 -37 66 -31 -174 139 -82 125 -167 39 399
7964 399 21 57 266 40 -144 73 56 108 -4 -38 -200 -48 -8 186 -16 111 70 203 -77 -93 176 30
7986 30 -48 -69 42 187 -259 127 54 29 -28 180 123 -120 83 92 -66 27 -36 -104 183 106 -136 134 -134 -32
8010c2K08Pk42J47K17l72O0j60K67o5J62j21J1r3K6K08l12j52MJ98j5P0q2J21
8034F0R8l4k2J41k72k0P8J50k51M3J0J67j45j71P7J19j76R8K09k61K2q1N3P6Q5
8059E3j46J61r9q7J60J45p4j34NNj8P7k3k12K22j30O6P4j55R3k9PL5j45O6j00
8085a83K86k58K23j19l6R%J11j0l0q4K5l00L95j20J74j36L9l3K07k64Q2j05J23
8109dj13R3N4M0J25j59L2K0j2p6K17j53r5K9K35j75n7J56k56n6nJ53k9J78n7R9
8135A84k82P6J45r3n1K48j18R4m32K58J51j36l4O1m7k31K80k56J96N1m2J72m0
8158A54j16j88J92Kj30K60j60l12L57J70k47j39J74j67K83j84J06n1m4K82k47
8179eM4o8P4j56j8J31k4L3Q8k66J54J4
$$ plain form
8010 -32 176 183 -59 88 305 -67 -7 -167 100 35 197 76 87 -6 20 228 -84 -236 -232 -34 -49 21 -61 60
8034 60 158 124 102 243 -29 -49 29 179 -72 -29 -19 148 3 -168 -91 28 -148 -50 159 -102 -80 -161 -108 -32 53
8059 53 -93 68 -31 -118 42 187 113 -21 -16 -11 -29 48 25 -187 35 -95 -29 45 -110 -17 -46 -39 -4 -149 -83 -183
8085 -183 103 -155 68 -51 -87 -78 -78 33 23 -7 -91 -66 -366 29 -91 83 -53 -14 -47 160 -104 -22 -127 -4
8109 -4 -117 -24 30 70 195 36 68 88 76 0 217 64 -31 -2 233 58 1 157 -99 -155 -160 -7 -36 142 85 184
8135 184 -98 -22 123 30 -21 227 109 203 -229 29 180 44 10 71 24 -207 73 -183 13 64 22 194 154
8158 154 38 -150 42 44 -86 174 14 -298 59 229 -18 -157 17 -150 133 -51 55 4 -40 242 -5
8179 -5 39 -29 45 -111 -129 2 -22 11 99 -167 -13 1
8191A
$$ Imaginary data points
##PAGE= N=2
##DATA TABLE= (X++(I..I)), XYDATA
0@%%%%%%%%%%%%Qj6J6j6J6k4L2l8M6n5O3p2Q8j04J20j37J59j83K09k40K73l10
34a65L50l93M41m96N57o21O92p70Q53r46J048j156J277j411J554j710J885k078
52a089K289k525K788l084L418l802M248m768N388o140P078q285R900j2197J5738
67H957k1977L6212j31809m352J98657n3659m5143N1154O9111p2047p1295M334
79c1857L9580j8098n019M2123L6447n3307n7397K3304M8258m0434m9166M6215
91a9351O7402l3365m8450L9386M7318m6521m6137M2011M1628n1906n4753L9916
103b2822P0777n111m9186l956L8043L944m5177l7711M990K6060K6991K2797Q2
116B9721k6809j1414K0494o82m2036j6319M4910M1911j1015k4402K748O986j0347
$$ plain form
0 0 0 0 0 0 0 0 0 0 0 0 0 0 8 -8 8 -8 8 -16 16 -22 24 -31 32 -40 48 -56 64 -73 86 -97 112 -128 145 -165
34 -165 185 -208 233 -263 294 -327 365 -405 448 -498 550 -606 671 -740 814 -896 989 -1089
52 -1089 1200 -1325 1463 -1621 1797 -2005 2243 -2525 2863 -3277 3801 -4484 5416 -6781 8957
67 8957 -13020 23192 -108617 -112969 85688 32029 -13114 38040 107151 35104 -36191 -31857
79 -31857 7723 -10375 -15394 26729 63176 9869 -47528 -24224 24034 -16400 -65566 -19351
91 -19351 48051 14686 -33764 5622 52940 6419 -39718 2293 43921 -7985 -62738 -22822
103 -22822 47955 42844 -6342 -10298 27745 31689 -13488 -51199 -46209 -20149 6842 29639 29721
116 29721 2912 -8502 11992 11310 -30726 -47045 -2135 39776 28761 4359 7107 14093 3746
129C746j0183k421j0375j0324J2997K1744Q90n066J3568Q584j9832j5978J2341
142c09M884k3189m309M2253K8358l7172m7021J8563M6746j3051n0830M731N0657
155B0311O840l7784r027J9800m718j0492K6800K4366k4891k5607K5420K3048l9817
168e751m9145K2918N4476m156m2979P295M4077o320m3752Q811N1572r50m8278
181a2182l709L7248j0476n3429m710N0836K2303k6436j1247K3753O948k2719m645
194h465K1249O32k4625K805K8300q242m2338k074M7731J7498l6751j9092K9629
207F257J9386k6013k6394J3283K2860m206j2064R210J3485r865j5836P130J2787
220A0020q335j3332P985J4311l235j0672L58M735j387m672r35r20l615l26R346
$$ plain form
129 3746 -6437 -8858 -19233 -29557 -16560 5184 6074 1008 14576 23160 3328 -12650 -309
142 -309 4575 -18614 -22923 19330 47688 10516 -36505 -17942 28804 15753 -35077 -30346 20311
155 20311 27151 -10633 -19660 140 -4578 -15070 11730 36096 11205 -14402 11018 34066 -5751
168 -5751 -54896 -31978 22498 18342 -24637 -17342 26735 20415 -23337 -14526 37046 36096 -12182
181 -12182 -15891 21357 10881 -42548 -47258 3578 25881 -555 -11802 11951 18899 -3820 -8465
194 -8465 12784 13416 -11209 -8404 19896 11654 -30684 -32758 14973 32471 -4280 -23372 6257
207 6257 25643 -370 -26764 -13481 9379 5173 -6891 2319 15804 5939 -9897 -2767 10020
220 10020 1685 -11647 -3662 10649 7414 -3258 -2900 1835 448 -4224 -5159 -6079 -9694 -10020 -674
235f74J4194L584j0991q155N340L957j3184j2828J1373K3878M603j9749j5539
248a4191M847Q525o906q016J2027J9414n97j4930k276O747p433j0732J0512J7843
262A4834n873j6988L549J4348n481j5875N456J7924j923j8189l373J2676k504
275a419j5281O509K7710N433k4969r664J8680M568k5859q537K9014K0609j7196
288I598j8045Q220N462j6616j0938J8007J7864p126j0959R275P304j6504j6716
301b1174J4550K2541o261j8027O410J5966r333j8870O619K0295k175j7302J76
314f585J3019m212j6108J008J9096O961j3950q149J0879N775j2665p447J3823
327A445J2328p499r739N621M566j0143p316R945J0390n994j0668J922P613m789
$$ plain form
235 -674 13520 17104 6113 -2042 3298 7255 -5929 -18757 -7384 16494 21097 1348 -14191
248 -14191 -9344 -819 -7725 -15741 -3714 15700 15103 173 -2103 4644 -2789 -13521 -3009 14834
262 14834 8961 -8027 -4478 9870 4389 -11486 -6030 11894 9971 -8218 -11591 1085 -1419
275 -1419 -16700 -10191 17519 22952 -2017 -11681 6999 11567 -14292 -22829 6185 26794 9598
288 9598 -8447 -227 5235 -11381 -22319 -4312 13552 6426 -4533 4742 12046 -4458 -21174
301 -21174 -6624 15917 9656 -8371 -1961 14005 4672 -14198 -7579 12716 10541 -6761 -6585
314 -6585 6434 2222 -13886 -12878 6218 13179 -771 -8920 1959 7734 -4931 -12378 1445
327 1445 13773 6274 -3465 2156 6722 -3421 -10737 -792 9598 3604 -7064 -5142 2471 -2318
341b318j0421M660J7252M886j2153n808P835Q55j2048l225J3571Q189r119p453
355e297O008L902p960n422R501J0774n046j2515r41P029l605r371O067J6659K238
370A2021j1453r52Q996k581j2608P08J2769J076j3406o542Q119M422q014j916
384i361J4553J2114q138j2485K591N048r375r283R511J3501m207r993M216Q806
398G498n480r493O086J2862l236j3143j963Q500p26j0050J122J4396M103j2354
412a878o432Q701L158r804k130J4396Q374j0224r685N427N140p293o149R069J0356
427A1026n444j1434m43N226l621o699O738J4633n0j1003j637P404k662j0464K132
442f298J4322L820j0419m521O312J003r617l780R114O157q903q565N565P685m116
$$ plain form
341 -2318 -12739 -8079 9173 14059 1906 -3902 3933 4788 -7260 -10485 3086 11275 2156 -5297
355 -5297 711 4613 -3347 -8769 732 11506 6460 -6055 -6996 33 -3572 -12943 -6876 9783 12021
370 12021 568 -384 8612 6031 -6577 -5869 6900 7976 -5430 -11972 -3853 569 -7445 -9361
384 -9361 5192 17306 9168 -3317 -726 4322 -5053 -14336 -4825 8676 4469 -5524 -1308 7498
398 7498 2018 -7475 -1389 11473 8237 -4906 -6869 1631 905 -9145 -8023 6373 10476 -1878
412 -1878 -8310 391 3549 -6255 -8385 6011 14385 4161 -5524 -97 5043 -2250 -8399 670 11026
427 11026 5582 -5852 -6295 -1069 -4690 -11389 -4651 9982 9932 -1071 -2708 4696 2034 -8430 -6298
442 -6298 8024 11844 1425 -3096 3216 4219 -5398 -9178 -64 6093 -2810 -11375 -5810 1875 -2241
457b241m435J0447J2188l671j1712j631M397m956r150K889J1122J651p306n62
471b970P683J3r214l81J0158J808j1050o124O634L721o486j537J1984R677m336
486I580p419K594M934p234j1132K876Q971n090j2160J462J1814J365o156M976
500f19J2382J312r581m332M446J95o963j501P679L554r325o825O981N301q019
515e315m611J1378R166q481r359O223P519n214n705O816Q290n362j0706j096O669
530B12j134o948K695J2745K932j0596n425N993J752p830r11R480L428p336k854
545c797N691Q65o335J65Q883L605p562p170K529M532l880n761N305J0834l83r669
561b148o89O312j617p571K201Q595n90q166j396N228J418l367k27O136M223m077
$$ plain form
457 -2241 -6676 3771 15959 12288 576 -1055 3342 -1614 -10764 -7875 3247 4898 -2408 -2970
471 -2970 4713 4726 -4488 -4869 5289 7097 -3953 -10077 -3443 278 -6208 -7745 4239 13916 9580
486 9580 2161 4755 9689 2455 -8677 -5801 3170 -1920 -14080 -12618 -804 561 -5595 -619
500 -619 11763 13075 3494 -838 3608 3803 -3160 -4661 3018 6572 -2753 -9578 -2597 2704 -5315
515 -5315 -9926 1452 10618 2137 -7222 -999 6520 1306 -4399 2417 10707 5345 -5361 -6457 212
530 212 -922 -7870 -5175 7570 10502 -94 -5519 474 2226 -5604 -6515 2965 6393 -943 -3797
545 -3797 1894 2759 -3576 -3411 5472 9077 1515 -5655 -3126 1406 -2474 -8235 -2930 7904 7521 -2148
561 -2148 -2837 3475 1858 -5713 -3512 5083 4493 -3673 -5069 159 1577 -1790 -2017 4119 8342 4265
577D265p754j145K720k169k505N771P381l324n292M471M974o003p081M799O521
592E629m537r434n75O804K939k789J28P964M785o951p054L561L999n912l915P255
608A897M061q566p235M254M936k487r50P378N658l034o160m16K468k731l430M740
624C83Q091k809j0389j353P600j221q717J541J1728L349r037m140N118K534m070
639a392m07N484K089n008m736K398L247k463k126N428N005n040q143Q42M643k186
655b365l247M895O224k939n920J925M764j565m456K713P410j07q824m598M566
670a524L469m646l233N714N545l972n513J724L444k001j221M796K913m104m725
685c334J660L913j364k846L002N285k327q148j997N080J641l693J587O476k8p937
$$ plain form
577 4265 -3489 -4634 -1914 -4083 -6588 -817 6564 3240 -2052 2419 7393 1390 -5691 -892 5629
592 5629 1092 -8342 -8917 -2113 826 -1963 -1835 6129 10914 3963 -3091 470 4469 -1443 -5358 1897
608 1897 5958 -2608 -9843 -5589 -653 -3140 -4090 3288 8946 5912 -248 -664 1804 -927 -4357 383
624 383 8474 5665 -4724 -6077 1523 302 -8415 -6874 4854 8203 -834 -4974 144 2678 -1392
639 -1392 -1799 3685 5774 766 -3970 -1572 1675 -788 -2914 2514 7519 2479 -5664 -4822 -179 -2365
655 -2365 -5612 -717 5507 2568 -3352 -1427 3337 1772 -2684 29 7439 7332 -1492 -6090 -1524
670 -1524 1945 -2701 -5934 -220 5325 1353 -4160 -2436 1008 -993 -2214 2582 5495 1391 -3334
685 -3334 -1674 2239 875 -1971 1031 6316 3989 -4159 -6156 -1076 565 -3128 -1541 4935 4907 -3030
701c030l235N460L582l580j276O195M221o404p664J319N863k33k815K538L962
716D903k882n725l7L224j043k112L822N546k285p019k91N386P70m895Q61O889
732E112J748o891m586L772K304l707j251N992L140n417n687K277M521j630k892
747c195L309N370k178o947l82M408J174j721K043L972k161o542q02L664k9l495
763c512Q98N768K55o092k943M742L978k153k477L225L408m317m916K073M729j325
779A341k765K736L482l217n852k45M264O93k597R24L975l91m951j699L553K716
795A967j139J154M695n00p339m789K673K689j797k59N690L662m802n772J24L609
811a34l42j392K447L840j500n732p25L876R57k536J032M480l02n613j882L544
$$ plain form
701 -3030 -6265 -805 2777 -803 -2079 4116 8337 1933 -5731 -4412 1451 1218 -1597 941 4903
716 4903 2021 -3704 -3741 -517 -1560 -3672 150 5696 3411 -3608 -3899 1487 2257 -2638 -1777 5112
732 5112 6860 -31 -4617 -845 1459 -2248 -3499 2493 5633 216 -5471 -3194 1327 -303 -3195
747 -3195 114 5484 3306 -3641 -4023 385 1559 -162 1881 5853 3692 -2850 -3652 12 -17 -3512
763 -3512 -2614 3154 3409 -2683 -5626 -884 3094 941 -1536 1689 5097 780 -4136 -2063 2666 1341
779 1341 -1424 1312 4794 1577 -4275 -4520 -256 437 -2160 -1236 2739 2348 -2603 -4302 -749 1967
795 1967 828 1982 6677 6177 -1162 -5951 -3278 -589 -2386 -2645 3045 6707 1905 -3867 -3743 -134
811 -134 -476 -1868 579 4419 2919 -2813 -3538 338 1295 -1241 -209 4271 3969 -1644 -3526 18
827A8J516k551o02L341Q79m337k740K896K736j709j617M283L038l464n106J583
843a836L975j338k733K964M248k349n882j179K632k2j712J722N121N58l967j927
859a725K564O17l671p25M090J458l905j748M214K726k470j494K102N76m229l569
875e189K229L547j89k182J484K727k126l830J468M713J022k540j8K486k270n047
891c715o22L145J646p22Q94K828R6m127k816J234J699j042q29K781K467k141l110
908b334J326L322j10j778J239J695k347m625l63K869J264r89O58K256k98m147
924b362j881L049L098p23o76K014J593l904l517J713L300j155j819J787K162k815
940a36l621J104L712L84k738J177L234p70m538q01L611J198l088j49L391M47l964
$$ plain form
827 18 1534 -1017 -1619 1722 2601 -1736 -4476 -1580 1156 -553 -2170 2113 5151 1687 -3419 -1836
843 -1836 2139 801 -1932 1032 5280 2931 -2951 -4130 -1498 -1520 -3232 -1510 3611 4169 202 -1725
859 -1725 839 1456 -2215 -2940 1150 2608 -1297 -3045 1169 3895 1425 -69 2033 2609 -1620 -5189
875 -5189 -2960 587 398 -1784 -300 2427 301 -3529 -2061 2652 3674 1134 1116 3602 1332 -3715
891 -3715 -4337 -1192 454 -268 626 3454 3550 -577 -3393 -2159 -460 -1502 -2331 450 2917 776 -2334
908 -2334 -1008 2314 2204 426 1665 3360 1013 -3612 -3975 -1106 158 -831 -173 2083 1785 -2362
924 -2362 -4243 -1194 1904 1181 505 2519 4112 208 -3309 -1596 1704 549 -1270 517 2679 -136
940 -136 -3757 -2653 1059 1443 -1295 -118 3116 2346 -2192 -2993 618 1816 -1272 -1421 1970 2417 -1547
957a547j422L782K415k736j400K849N39m707l227L265L820j184j268K724K138
972D041l848l774J675L384o54k074J630K536j940m198R91M046Q97k617L45J713
988B153j701m186l36L556J427j192P30K126q58l468p73K750K012r67q17J360J09
1005A925l114k980J590L143J33n72J646J068k834k992L17J998M48P2Q35J101m95
1022A289j776j135J167K102m7p57K29L81k257k259J127K455r7j313J332M28j740
1039h71j806N70K743J812p07n47J137j49l046j855K257K377j625j838J809R64
1055A225l214k148L134K833j159j275J895R11k409k163J343K699k3j449LJ887
1071B090j471l380O78L634L91l685N14L222j620m457Q17M621R02k520P54K142
$$ plain form
957 -1547 -2969 813 3228 492 -908 1941 2480 -2227 -5454 -2189 1631 447 -821 1903 4041
972 4041 193 -3581 -1906 1478 824 -1250 380 2916 976 -3222 -2231 1815 2712 95 440 2153
988 2153 452 -3734 -4070 -514 913 -279 451 2577 1719 -1749 -2522 228 2240 1273 456 1816 1925
1005 1925 -1189 -4169 -2579 564 697 125 1771 2839 5 -2987 -2670 -672 -224 -152 683 1784 1289
1022 1289 -487 -1622 -455 1647 1600 843 1072 1453 -804 -3063 -1936 519 422 -891 441 869 -871
1039 -871 -2677 -2107 636 2448 1741 1194 2331 2182 -864 -2719 -462 1915 290 -1548 261 1225
1055 1225 -1989 -4137 -1003 1830 671 -604 1291 2202 -207 -2370 -1027 1672 1649 200 203 2090
1071 2090 619 -2761 -2083 1551 1942 -1743 -1229 1993 373 -4084 -3267 1354 2256 -264 490 2632
1087B632o36l453o05K482J396j478j031J582R30k864k464K359K583j723j402K542
1103H50J077l330j456K963J995j646p16K095M36k408j811J066J752L95j325J32
1119F9R63o07k720n08K447J296r23J87J317j022j922j13J582P19j18K74L49n10
1137G60j082r38L70J182Q31q12n49K28k33j762o4K260J282q46l55R76l22k128
1155a202p05J518J991L63j042m66K88r20k383l8K837Q77j024L16J134j391k912
1172b759J34K846J113j193L14J628n23k664n90K216J156j496p47J668j04k858
1188a859j324K530K415j504j655K049J076k265k179K136K648q34j056J033R85
1203B196k095k230R80K127n85j508J392J434j319k693K25K500j28j172Q92J833
$$ plain form
1087 2632 1996 -1457 -2062 420 1816 338 -693 889 1819 -1045 -3509 -1150 1433 -290 -1692 850
1103 850 1927 -1403 -2859 104 2099 453 -263 1832 2268 -140 -1951 -885 867 1262 -63 69
1119 69 1032 425 -2295 -2803 -356 940 17 204 1521 499 -1423 -1536 46 765 647 921 1270 760
1137 760 -322 -1260 -890 292 1123 311 -238 -10 -243 -2005 -2069 191 1473 627 272 1248 926 -1202
1155 -1202 -1907 -389 1602 1965 923 457 745 -175 -2558 -2596 241 1118 94 410 1544 153 -2759
1172 -2759 -2625 221 1334 141 455 2083 1560 -1104 -1694 522 1678 182 -565 1103 999 -1859
1188 -1859 -3183 -653 1762 258 -1397 652 1728 -537 -2716 -580 2068 1234 178 1211 2196
1203 2196 101 -2129 -1149 978 393 -1115 277 1711 392 -2301 -2076 424 296 -876 16 1849
1219A849n95k133j52J938K58j525l72J498J27j752p20J741J245j225p71N11j03
1236a81j312j57J576J136J54n44j0k84j176r92R30J972L92p77k62L5p08j493p
1255a708J577R78l52m55%l11p24p29R32J865N18r95j39J84j41j782L06J666N11
1274A201r34n32L06o16j168J19J881J061l39r40M28k96j593o10J878J927l86r47
1292D40N03M20k229j347J487K046m66j286O15L49j210j611P35K278L27j226J28
1309d7J115n16j633J81J961N53j209l53Q96m54j737m13J917P88j291l93P25J98
1327B88j713n88J800J831m81r61M11M51j233j430R61K135k02j389L53J65r68j420
1345a990N50J797N03r12%L03n06j164K21J457J187m04n66O94m43j571r27J565
$$ plain form
1219 1849 1254 -879 -1031 907 1165 -360 -732 766 893 -859 -1579 162 1407 182 -589 -78 -181
1236 -181 -1493 -1650 -74 1062 1216 672 662 378 -798 -1790 -860 1112 1504 727 465 500 -208 -1701 -1708
1255 -1708 -131 847 495 40 40 -271 -995 -1724 -792 1073 1591 596 457 641 500 -1282 -976 690 1201
1274 1201 267 -265 41 -575 -1743 -1624 257 1318 979 39 467 171 -1422 -2032 -154 1773 1387 440
1292 440 943 1363 -866 -2213 -726 1320 854 -432 183 532 -678 -2289 -1554 724 1051 -175 -47
1309 -47 1068 552 -1081 -900 1061 1614 405 52 948 494 -1243 -1656 261 1049 -242 -635 90 288
1327 288 -1425 -2013 -213 1618 1137 176 587 1038 -195 -1625 -664 1471 1269 -120 233 398 -570 -1990
1345 -1990 -1440 357 860 -52 -52 251 -255 -1419 -1198 259 1446 1042 476 1170 727 -844 -1771 -206
1363b06J400l87r64L32m0r22j111Q52J674K17n80j97O07o05j051L63J728O57j029
1382G38m26M82n23j605l76J700Q51p82m92P05k77r75n41J254J194k89m57J80P73
1401A134q02j243M60J442L3j186J39N96o90j233K95J492J53q19j58L29M0j007
1419a025j6J384R98k86j195J66K1p10o20J511J265m26j280l7J31r11n95P00J656
1438G31J23p80l17N39m94q66L45J525J034r90p64M24j22j653J0J144R73o03p52
1457d93M75L80j633l35J288J376l37p30L85J96q23q21O61J492qq39K52K04p69
1476g9j498K40J917L04p65l28M32k07j435L17J321J026p19l06K21q6j083m20J297
1495A49J138n82j000L8O76j075p47P46J448R6j184J23J70k77r05O47J590M26q16
$$ plain form
1363 -206 1194 807 -157 175 135 -787 -1898 -1046 628 845 265 68 675 70 -981 -618 1110 1767 738
1382 738 312 794 271 -1334 -1710 -10 841 59 -433 272 -5 -980 -1521 -267 927 638 181 361 1134
1401 1134 332 -911 -451 991 1024 -162 -23 573 -117 -1350 -1055 437 590 -229 -387 -58 -18 -1025
1419 -1025 -1041 343 1341 1055 -140 26 47 -663 -1283 228 1493 1067 -213 -250 -119 -1030 -1625 -925 731
1438 731 854 74 -243 296 -198 -1064 -719 806 1840 850 86 510 388 -1265 -1255 -111 862 259 -493
1457 -493 -18 362 -1271 -1606 -318 1058 721 -9 376 572 -251 -1072 -411 1081 1073 234 486 690 -79
1476 -79 -1577 -1337 580 884 119 -209 223 16 -1419 -1102 219 1245 526 220 441 355 -728 -1148 149
1495 149 1287 705 -295 -257 419 -656 -1403 -657 791 887 -297 -174 -4 -281 -1186 -539 1051 1477 661
1514F61m45L52k39j076j97R28J078n27q13K13Q1j223l84J380R37r7m90L55Q0j036
1534d62r84J068J455J32o36k42o2m32r33Q1J164J014o55o32J13j61j367M2J346
1553a51J427o16m73M16j56q58l97P87J062k41m60k16M42n07j191K54J257K68j100
1572d53R3R46j09j254j33J452M03j050J3P56J9q65l60O97M32m45p78K84N89p14
1592d77p64J216J002m09j512M73R66n50j122J476J431p50j114k42M18m03l31P15
1610B3J186J49j391j229Q04R9m18m2J604P40j402p74N98K28j189M68J624L26p50
1629F54r21j64K91n29m91J039J179J14j337m33K90l84m49J59J935M84j051l15
1647G1K76m82q56K37J465N44l88q00k69j37n20o36R48J159J16q97j56N08o88n19
$$ plain form
1514 661 216 568 329 -747 -944 -16 1062 535 -278 -65 16 -1207 -1591 -211 726 629 139 494 574 -462
1534 -462 -1446 -378 1077 1209 573 331 269 -163 -1096 -1015 149 1163 508 -124 -11 -172 -1539 -1497 -151
1553 -151 1276 660 187 603 447 -411 -808 -21 1041 800 340 124 566 59 -1132 -878 379 647 -453
1572 -453 -360 586 477 -777 -910 542 945 -105 -92 664 683 -182 -542 155 587 142 -636 -352 237 -477
1592 -477 -1241 -25 977 568 -944 -471 495 -55 -1177 299 1730 980 -134 -376 42 -361 -692 23
1610 23 1209 1358 -33 -1262 -458 -359 -777 -819 785 1525 123 -651 -53 175 -1014 -546 1078 1404 654
1629 654 -267 -431 -140 -669 -1160 -121 1058 1172 -165 -598 -308 -692 -1141 -982 953 1437 386 71
1647 71 347 -135 -991 -754 711 1255 867 67 -202 -339 -859 -1495 -547 612 728 -169 -325 183 -505 -1024
1667a024O58J653j04q24l08L04l06q46J00Q67M00m74o88kP72n33n96J012Q94n32
1687D23j209O86O65o93q64Q99J296o40o31J66L59l40q19K00R63K26j118n42Q32
1706a41P5r82K33J574N51j344n68O96M47p32k55J310O56q24j333J94K51n12l49
1725a053J201J089o63j449J77O96m90n09P82J528Q3j230m24P16o13q02J14J589
1743G42M93j030o53M44j00j096l4J122J049o89l87K89Q5n96p19Q94J020o3r04
1762a33K55L31o43n10M26J073o7p90j10K39k42o73J3J064L82o40m29Q49L6n38
1782a07m41Q65R61o16q11P2N16n59q75J55J259l12p05L27P78n46k51K62N78K07
1802G57j006l75P18L79m25j97O59N92r50r43K76O75m44k61P97P83p72j076P4P10
$$ plain form
1667 -1024 -366 1287 1183 359 51 355 49 -797 -697 170 570 96 -592 -594 178 -355 -951 61 955 423
1687 423 -786 -100 565 -128 -992 -93 1203 563 -68 98 457 117 -702 -502 461 687 -431 -973 -141
1706 -141 -66 -1048 -815 759 1310 -34 -602 94 541 -191 -446 864 1520 696 -637 -443 -192 -704 -1053
1725 -1053 148 1237 574 -875 -698 -2 -492 -1001 -219 1309 1392 162 -262 454 -159 -961 -847 742
1743 742 1235 205 -448 -4 -104 -1200 -1234 -112 937 248 -139 150 235 -361 -1080 -186 834 771 -133
1762 -133 122 453 -190 -700 -274 799 732 -58 -168 71 -171 -844 -831 233 615 -25 -454 395 431 -107
1782 -107 -548 317 1278 662 -149 -77 439 -120 -995 -840 419 107 -598 -271 507 -39 -290 -28 550 757
1802 757 -249 -624 94 473 48 -149 510 1102 152 -791 -515 160 -284 -545 252 1035 263 -813 -739 -29
1822b9L2n22P55J162l43j223k33M42q9m75K10R73K19j181m67O61R2q46Q0J188
1842D06M75r43l92L97N55r47j36J090O66q18o04J3M11k97q01R14R68k92j187j8
1862e40N19k15o04M44J184k8o96k98K71J23m92r4R87M76q84p32K38L23k92n68
1882h78P75Q17n73o99L73K61no99N01Q43j71n31j00K69K16q09O6J329k95p67o21
1903f98M32J12l18k13J079M72o43q15L87N64m97l23O81Q68k46j188k74O34m3o84
1923g13N31J043K5j198l83O55k5o97L32J137P9q17o11N28P10p30j08P09N56q42
1943A81p81M69M78m75o41N95P45j78j006K85O78m39o35P13J029p8j055m2L75j93
1963B5m51N4R66J50p91o05L81O90q80q8P27Q33r79m99J32N69k28n47O79Q35o55
$$ plain form
1822 -29 3 -519 236 1398 1055 -168 -401 41 -48 -523 -313 660 879 -302 -769 -108 -16 -862 -782 406
1842 406 881 -62 -454 -57 498 -449 -585 505 1171 353 -251 -238 173 -124 -925 -11 957 665 -522 -540
1862 -540 -21 -236 -840 -396 788 760 64 -234 37 160 -332 -426 561 1037 153 -579 -341 -18 -310 -878
1882 -878 -103 714 141 -558 -185 76 71 -628 -127 716 545 14 -86 183 399 -410 -344 985 690 -77 -698
1903 -698 -266 -154 -472 -685 394 866 223 -592 -205 359 -138 -461 220 1088 842 -346 -620 14 -29 -713
1923 -713 -182 861 886 -312 -695 -40 -65 -762 -430 707 786 -31 -642 -114 596 -134 -242 467 1023 181
1943 181 -600 -131 347 -128 -769 -174 571 393 -613 -328 350 -89 -724 -11 1018 940 -115 -157 218 25
1963 25 -426 -372 594 744 -47 -652 -271 419 -461 -549 178 1011 32 -467 -335 234 6 -541 138 973 318
1984C18o93j97Q13j13o07J74R64j43r25m60Q94K3n88j03R21N13j075j06M10K61
2004B81j95l35M98O73q00q26M74O52o46n61P95M82l06o65k31R34l19n43L65J101
2024H28r1p35m41O39K7o28K74P34K47p61o12K92K77m50j5N54L63l71q35L64N71
2045B31j57m73N71P14k68r10k5N82q1o40M47P46k59q05j98K0N73l30m59P58M18
2066D55l23p35N71N73n90m05P39L93m51m66QM90k44k79J61N93j56j127n9N38O39
2087C25q66K09R67J68j024m30P72K48n27j56R44J38o03j049M77N67j40n17L95
2106a02O96m34p69L62O86k85o51K16R21o5j050J28O85J2q61M35O33K4n99n19K22
2127c15N36n06o9O19K89n63o91O43N37n40m77O57N83m36n53J22N13l32m41M57
$$ plain form
1984 318 -375 -572 241 128 -479 -305 659 516 -409 -869 25 48 -540 -643 278 791 -284 -390 20 281
2004 281 86 -249 249 922 122 -704 -230 422 -224 -785 10 492 186 -479 -710 224 -95 -638 -273 828
2024 828 737 2 -439 200 227 -401 -127 607 854 93 -519 -227 50 -400 -415 139 502 131 -704 -340 231
2045 231 74 -399 172 886 618 -292 -317 265 184 -456 -9 737 478 -327 -525 -505 68 -262 -721 37 455
2066 455 132 -603 -32 541 -49 -454 285 678 227 -239 -231 259 15 -264 -103 490 334 -793 -852 -314 325
2087 325 -541 -332 635 803 -221 -651 121 369 -158 -314 630 768 165 -884 -407 160 20 -497 -102
2106 -102 594 160 -609 -247 439 154 -497 -281 640 575 -475 -347 338 350 -511 -76 557 581 -18 -537 -315
2127 -315 221 -285 -354 265 554 -9 -700 -57 480 -60 -537 120 703 267 -286 -164 349 17 -424 33
2147C3O86l05q83N9L26K2p6k37O70N25r66m90P44K93m66k70Q51J37r81k74M36
2168a66L65Ol54M9O13l50o32O8J56J23j56J96O58j54p27l16O63O2o3K7N58K20
2190H46r39l04L55J2O5k33J47N58o71q20L44N95J88n65O69P35k49r78J43O07j11
2211C94o66O1N44j57m42n56N44J93k46l2P60J41o91n07N31O15n72k32N47N41p11
2232E9m28L8P17r2p15L72N61m84o73J09N94J14o67J77P70k5n86l46N71M22m12
2253G6j24M40R0p30k62L39L81k42l73L17N84n63n52K79O25k50mm4O84m09o45J06
2275b77M26K18n72R2M41J12o85m24N87M7p8j68N20K34n95m20N18K87k8l01Q1M37
2297D52k74p80J47P09j16l95Q2O99k61p97J56N88P1m51l2M22J17m37l31M21K64
$$ plain form
2147 33 719 414 -469 -410 -84 -62 -138 -375 295 820 -146 -636 108 401 -65 -335 516 653 -328 -602 -166
2168 -166 199 205 -149 -100 513 163 -469 -401 -245 -122 -278 -82 576 422 -305 -621 42 104 41 68 626 846
2190 846 -93 -397 -42 -30 35 -198 -51 507 -164 -984 -640 -45 143 -422 247 982 733 -245 -102 505 394
2211 394 -272 -211 333 176 -266 -822 -278 -85 -331 -363 397 538 -153 -660 -129 486 -86 -318 229 770 59
2232 59 -369 -331 386 294 -421 -49 512 28 -645 -536 58 172 -495 -318 452 427 -159 -505 66 488 76
2253 76 -48 392 482 -248 -510 -171 210 -32 -405 -88 496 -67 -619 -340 285 35 31 -13 671 262 -383 -277
2275 -277 149 367 -205 -113 328 440 -245 -669 -82 -35 -113 -281 239 473 -122 -542 -24 263 235 -66 15 452
2297 452 178 -602 -455 254 138 -257 -175 524 263 -534 -378 210 281 -170 -202 220 337 -100 -431 -10 254
2318B54k04k79M12K99l35n97J59N21j31m86J57P08o77n02K22N78K37p52N92L34
2338E10l34n17j23O81J38l69k17N62R8p86q6M11L23l32K3M4N25p12l82K77O86
2359D20j61m84O6M36k00m14J88K77K42l70n1L57k9o05l79O42K24m19J29K94J68
2380C31m50o08O11N59k73k49L93J91l61n85K65N20k82l34L78K36j92p26K8Q86
2400C38j61m12R2O30j94n04k8K53L47j83r6K22J92p20j30P1N12k37l55L31L96
2421C64l41m55L60K58N2k29j26O94o1p15j01M59J11n01J11M65n2n19k61M68J18
2442I9j27k47L76J54m37k83L64N29m38O4P4J86k32k86pM78J16o12J66K75k09o66
2464f63K30M29J63j68j02L52J00m26j54N30J18k04k43P3O43o94m90L01M30p3n36
$$ plain form
2318 254 50 -229 183 482 147 -450 -291 230 99 -387 -230 478 -199 -701 -479 99 336 -416 176 510
2338 510 176 -341 -464 217 355 -14 -231 331 429 -357 -443 -32 291 -41 -18 26 551 -161 -543 -266 420
2359 420 259 -225 -159 277 77 -337 -149 128 370 0 -51 306 277 -328 -707 -65 159 -260 -131 163 331
2380 331 -119 -727 -116 443 170 -79 314 505 144 -441 -176 344 62 -272 106 342 150 -576 -548 338
2400 338 177 -235 -143 487 293 -211 -239 14 361 178 82 304 496 -224 -354 -283 229 -8 -363 -32 364
2421 364 23 -432 -72 186 238 9 -117 577 516 -199 -300 159 270 -231 -120 345 293 -226 -487 -19 99
2442 99 -28 -275 101 255 -182 -465 -101 428 -10 54 128 314 82 -204 -211 267 383 -229 -63 212 3 -663
2464 -663 -433 -4 159 -9 -111 241 341 -85 -239 291 409 205 -38 35 678 -16 -506 -205 225 152 -384
2485c84O37K30m92o18M12O03j35k91J0N38l20k09k88L99J19o6l16M98l39k46k44
2506e02K28M79k19j90L15k1j02k98K67N53k76k58L9K36j28l75R3M51j26l46M6
2527a34K75r7l23J14M83r8l37j34M82j22m03k57O83M78m35l75J87J45l00j64K61
2548g1M64j4n66J81K54m28k19N8N81j33k90r6M63p5k90l97Q08N0k37R2r8J1j99
2571a51k4J51K01n1j77o8K64j49n12M03L86Q0l84p0L41m7l96K90K3L68o66L43
2593A55q3j31k23j2K99J92j72l17L18J65j84l95L07K97J24n27L19J40k23l65J09
2614b07P68j56m67r0K50j35k95q2L19J96n3m79N29k9k34J49K97J72n44j84L01
2635B6K98o71J92J14L02l13j99l3K69O7j75OK08K29m98J85L02o1j77j68K04n1
$$ plain form
2485 -384 253 483 -9 -627 -215 388 253 -38 -28 510 190 -19 -307 92 211 145 -171 327 -12 -258 -502
2506 -502 -274 205 -14 -204 111 90 -12 -310 -43 510 234 -24 15 251 123 -252 -159 292 166 -180 -134
2527 -134 141 44 -279 -165 318 220 -117 -251 231 109 -294 -551 132 610 175 -200 -13 132 -168 -332 -71
2548 -71 393 379 -187 -6 248 -180 -399 -341 240 107 -183 -279 184 109 -181 -578 230 280 43 135 37 48 -151
2571 -151 -175 -24 177 126 -51 -119 145 -4 -516 -113 273 353 -31 -101 240 193 -203 87 110 478 -188 155
2593 155 72 -59 -282 -294 5 197 25 -292 26 191 7 -388 -81 216 340 -187 132 272 49 -316 -207
2614 -207 561 405 -62 -152 98 -37 -332 -414 -95 101 48 -431 98 69 -165 -16 281 453 -91 -275 26
2635 26 324 -347 -155 -41 261 -52 -251 -284 -15 52 -123 -117 91 320 -178 7 309 248 71 -97 107 56
2657E6r3k10L05L9k57m5K17L24j53l64LJ43j69n8j10M67J42m20K32m1K7m16K17
2680a64L76m7m05L10K8Jl46J38M6K37pk39J52R4j93l56O64K8j37j51J28J92o07
2703b58RJ79M34k96l9k21r3M46n56Q6N92k8k21P5m2jl41j30M17K07j76k67J10
2726a14L38m48j52M22L06k36m04J50J33rk94M3L31J15l17J29j31J83k31j9L16
2747A11J96k35o1J4K72n84J37J29J02L5l40M65j34P0n32J13M33j21Nl6L70m03
2769Fj45K3K11m5k13J70j20K47l63K0K24J5j29j62M96j71p9j39J27J91k7l00K06
2792D3K74k88k18L71N4j63k24Q4J42r1k41J17K20Q4k71p8L80k42j5j93N02k2j10
2815A15m71L13j7j83J5K06K27j64m80M32J19m5n42K95M82k13j06J68j71J81m20
$$ plain form
2657 56 -37 -247 58 97 -160 -205 12 336 183 -181 -178 -35 -204 -262 -372 95 237 -183 49 8 35 -381 -164
2680 -164 212 165 -240 70 98 99 -247 -109 -63 174 167 -72 80 174 -19 -375 289 317 180 29 157 349 -258
2703 -258 -249 -70 364 68 29 -192 -285 161 -395 -309 283 255 34 109 67 66 -275 -405 12 219 43 -224 -114
2726 -114 224 -224 -376 46 352 116 -288 -138 -5 -14 -308 -265 66 181 -136 -7 -138 45 -186 -205 111
2747 111 307 72 11 25 297 -287 -150 -21 81 116 -224 241 107 177 -355 -242 191 70 75 39 409 6
2769 6 -139 -116 95 50 -163 7 -113 134 -229 -209 15 30 -99 -261 235 64 -15 -154 -27 164 137 -163 43
2792 43 317 29 -189 182 236 73 -151 -67 75 -16 -257 -140 80 164 -107 -185 195 -47 -62 -255 247 225 115
2815 115 -356 -43 -60 -243 -228 -22 205 41 -439 -7 112 67 -475 -180 302 89 -17 151 -20 161 -259
2836b59l3M36N2k85rK4J41n39M3N08L66m98n7J58j12K1k44J91NJ75j91M7L01k30
2860A1j96N0J63J36l36L7J98Q2k92O5K64J66m54p0K99Q2m56K61P9R3k38o7K47
2883A24j61j62k0K03K04l02o8l5L81M3k19K9K78r3k39j33J98R1k05N3K62O3k19
2906G3k30jJ98j68j64L75N8k31k4J04Jk16K84NL71j63ro7j62pj03O0J92j87J37
2931A26k49N01l52N6k09L04nj59l2L7K44n36L45q2K55k44j43K22J0j2j91n7L63
2954A92j1m01J52J78j21o5j11L59L0k33R4Q0l4k14J34j11L64j08k69K11j84rp0
2977a47K37K5j46K6Q7Q1k31m6K88o9J65n59L02J12lk47j98L28K24l62L01k73K09
3000A04m0k30r9N12l27q6J15K18j59l12L66kK06l10K7J30j30r8J25L3k0m8k4L2
$$ plain form
2836 -259 -292 144 196 -89 -98 -74 67 -472 -429 79 445 -53 -110 48 -64 -43 -287 -96 -91 84 -107 -60 241 11
2860 11 -185 -135 28 164 -172 -135 63 145 -147 -82 182 348 -106 -176 123 205 -251 10 89 182 -56 -123 124
2883 124 -37 -199 -219 -16 188 -114 -182 -217 164 207 -12 17 295 202 -37 -170 28 119 -86 -33 229 292 73
2906 73 -157 -158 40 -128 -292 83 141 -90 -114 -10 -9 -225 59 64 435 272 263 196 34 27 -76 -16 176 -11 126
2931 126 -123 378 26 82 -127 177 172 13 -19 18 262 -274 71 -11 244 0 -143 79 89 77 -114 -171 192
2954 192 181 -220 -68 110 -11 -76 -187 172 202 -31 63 143 109 -105 29 -82 282 174 -95 116 -68 -77 -147
2977 -147 90 115 -31 -5 82 163 -68 -114 174 105 270 -289 13 125 122 -125 -323 5 229 -133 168 -105 104
3000 104 64 -166 -265 247 -80 -166 -51 167 8 -304 62 60 266 -44 -17 113 -17 -115 10 43 23 -25 -49 -17
3024a7m6OO0lJ77o7l67L12O9k37j37K39J67J05N4k92n2nN4r3L22j74K3q0j5Q5
3050H8j97K6K79J1l57k1K78n7j5q4K8P4Oj14n4J63j43Q8LJ97k90Q3n8N4L1k83
3076b64N12j43l4j50JR2m0l17K12K73J02l26J4J94j66j48M7L67j87K38n30J70
3098h3K07j60N3j48L91k73pK1j00J67r7K2O5L2j31j36J05J30k41K02K0L6N2jj59
3123c3K36k71k0RK68k23l9j13O5k14J61L6R8J42k36Q8RPj03J76k68M97l21OJ27
3148H4j97N0n2K19m0J80l77K63r9j18j72L72L7o6l9k0o6q2J40J27j85r6L9K74
3172A76j06K2k33K14p5J33j53j19K42J79m42K0J33j02J91n8P0q2o8j05K25K96
3194C58k39j87J42j82RP9q3J24K96j72k99J35O6p4p8J67J50k02j16P4J73j70j44
$$ plain form
3024 -17 -63 -57 3 0 177 110 -257 55 124 -113 -250 -11 156 261 315 23 -29 -34 20 -73 249 75 98 18 3 88
3050 88 -109 -83 196 207 -150 -171 107 50 35 -49 -21 53 59 -55 -109 54 -89 -1 2 199 -91 -8 -66 -12 19 -264
3076 -264 248 105 71 -79 -78 14 -26 -343 -131 142 244 -82 -68 126 -40 -188 -141 226 39 277 -253 -83
3098 -83 124 -36 17 -131 260 -13 -20 1 -99 68 -29 -7 58 90 -41 -177 -72 58 -183 19 39 75 127 126 -33
3123 -33 203 -68 -88 -79 189 -34 -73 -186 -121 -335 -174 -138 -40 102 -134 -46 -37 -30 -133 43 -225 272 -49 -43 84
3148 84 -113 -63 -115 104 64 244 -133 130 31 -87 -259 113 150 84 45 25 -41 -123 17 144 -41 -137 -98 176
3172 176 70 92 -141 73 -2 131 -22 -141 101 280 -162 -142 -9 -111 80 22 92 10 -58 -163 62 358
3194 358 119 -68 74 -108 -99 -20 -103 21 317 145 -154 -19 47 -27 -105 62 212 10 -106 -32 141 -29 -173
3217a73J90J35k63j8JJ43j97J35N3j46J55l7K3q4L4q6j22M71m6nj43o0R5k25P5
3242i5Q7Ql0p4J5J10q8q5J39J94Jk60L7m1L0Ro9J55Q7j67MK60k66m2J49P3j01
3269D0l62K87N9K14k05j67J93J42j60j17J41J24l03k85M81N5p7j87J03J04j39
3290e9n2K66O4k65O6Qn0J40j71m6K71j58km7j18n0j24K99j18L07K0l27J7OL35
3315B12l73L01J24j46k14J8R8q1j16J02J33p3K14m22J75Rl4j33J86J64K2k35J8
3338e1K65m1l38M2K33j01k6q1M29l00J9k13L01Pk66j22J83q3J4P7J43j2n4LQJ87
3364B23j10j35l6N6m5N3j11R2O6j33j44L00m8R5k23L52m36K9K0J75K10jk32j0
3388GR6q8J63j48J79l44j29L12J5j54O7J4L62m2j89k31K43n2k63K21L0r8j0K95
$$ plain form
3217 -173 17 152 -111 -129 -128 15 -182 -47 6 -140 15 -22 1 -83 -49 -135 -257 214 168 163 20 -40 55 -170 -95
3242 -95 -8 0 -30 -104 -89 21 -67 -152 -13 181 182 -78 -41 -82 -52 -43 -112 43 130 -37 -33 227 -39 -81 68 141 40
3269 40 -322 -35 24 238 33 -134 59 201 41 -76 65 189 -114 -399 82 137 60 -127 -24 80 -59
3290 -59 -111 155 219 -46 20 28 -22 118 -53 -99 172 14 12 -35 -153 -203 -327 -28 -146 161 181 -146 -129 -123 212
3315 212 -161 140 264 118 -96 -78 20 -61 -177 -75 58 -15 199 -223 -48 -39 -73 -206 -20 144 166 -69 -51
3338 -51 214 173 -165 -123 110 9 -17 -98 331 31 50 -163 138 145 -121 -243 -60 -143 -129 -52 91 79 25 28 36 223
3364 223 113 -22 -58 -2 -47 6 -105 -13 53 -80 -224 76 28 123 -100 252 -184 -155 -135 40 250 249 17 7
3388 7 103 15 178 30 209 -135 -264 48 63 -91 -24 -10 352 310 121 -110 133 81 -182 39 69 -29 -39 256
$$ [...]
8191A07
##END NTUPLES=NMR FID
##END=
