##TITLE=1H_Ser TRiS-N
 200.13Hz,CDCl3.
 8 sc
 4.6.2026
##JCAMPDX= 6.0         $$ Bruker NMR JCAMP-DX V2.0
##DATA TYPE= NMR FID
##DATA CLASS= NTUPLES
##ORIGIN= UXNMR, Bruker Analytische Messtechnik GmbH
##OWNER= pz
$$ XWIN-NMR		Version 3.5
$$ Thu Jun  4 15:52:49 2026 Russian Standard Time (UT+4h)  she@DPX200
##.OBSERVE FREQUENCY= 200.131
##.OBSERVE NUCLEUS= ^1H
##.DELAY= (6, 6)
##.ACQUISITION MODE= SIMULTANEOUS
##.ACQUISITION SCHEME= undefined
##.AVERAGES= 8
##.DIGITISER RES= 18
##SPECTROMETER/DATA SYSTEM= spect
##.PULSE SEQUENCE= zg30
##.SOLVENT NAME= CDCl3
##.SHIFT REFERENCE= (INTERNAL, CDCl3, 0, 14.3821)
##AUDIT TRAIL= $$ (NUMBER, WHEN, WHO, WHERE, WHAT)
$$ ##TITLE= Audit trail, XWIN-NMR		Version 3.5
$$ ##JCAMPDX= 5.01
$$ ##ORIGIN= Bruker BioSpin GmbH
$$ ##OWNER= she
$$ F:/spectra/data/she/nmr/H-C/1/audita.txt
$$ ##AUDIT TRAIL=  $$ (NUMBER, WHEN, WHO, WHERE, WHAT)
(   1,<2026-06-04 15:51:26.15 +0400>,<she>,<DPX200>,
      <created by zg, POWCHK disabled, PULCHK disabled
       configuration hash MD5:
       00 E9 B6 7A A2 85 ED C7 34 08 36 98 17 FE 4E 26
       data hash MD5: 16K
       78 A9 9D 45 4A E9 D9 9C F6 F3 92 3A 1B 0D 87 FA>)
$$ ##END=
$$ 
$$ hash MD5
$$ 75 43 30 37 B0 69 B6 61 3B A5 DB 57 56 09 4E 1D
##$RELAX= 
##$RELAX= 
##$RELAX= 
##$RELAX= 
##$RELAX= 
##$RELAX= 
$$ Bruker specific parameters
$$ --------------------------
##$DU= <F:/spectra>
##$EXPNO= 1
##$NAME= <H-C>
##$PROCNO= 1
##$TYPE= <nmr>
##$USER= <she>
##$AMP= (0..31)
100 100 100 100 100 100 100 100 100 100 100 100 100 100 100 100 100 100 
100 100 100 100 100 100 100 100 100 100 100 100 100 100 
##$AQSEQ= 0
##$AQ_mod= 1
##$AUNM= <au_zg>
##$AUTOPOS= <>
##$BF1= 200.13
##$BF2= 200.13
##$BF3= 200.13
##$BF4= 200.13
##$BF5= 200.13
##$BF6= 200.13
##$BF7= 200.13
##$BF8= 200.13
##$BYTORDA= 1
##$CFDGTYP= 0
##$CFRGTYP= 5
##$CHEMSTR= <none>
##$CNST= (0..31)
1 1 145 1 1 1 1 1 1 1 1 1 1 1 1 1 1 1 1 1 1 1 1 1 1 1 1 1 1 1 1 1 
##$CPDPRG= <>
##$CPDPRG1= <>
##$CPDPRG2= <>
##$CPDPRG3= <>
##$CPDPRG4= <mlev>
##$CPDPRG5= <mlev>
##$CPDPRG6= <mlev>
##$CPDPRG7= <mlev>
##$CPDPRG8= <mlev>
##$CPDPRGB= <>
##$CPDPRGT= <>
##$D= (0..31)
0 0.7 0 0 0 0 0 0 0 0 0 0.03 0 0 0 0 0 0 0 0 0 0 0 0 0 0 0 0 0 0 0 0 
##$DATE= 1780573885
##$DBL= (0..7)
120 120 120 120 120 120 120 120 
##$DBP= (0..7)
150 150 150 150 150 150 150 150 
##$DBP07= 0
##$DBPNAM0= <>
##$DBPNAM1= <>
##$DBPNAM2= <>
##$DBPNAM3= <>
##$DBPNAM4= <>
##$DBPNAM5= <>
##$DBPNAM6= <>
##$DBPNAM7= <>
##$DBPOAL= (0..7)
0.5 0.5 0.5 0.5 0.5 0.5 0.5 0.5 
##$DBPOFFS= (0..7)
0 0 0 0 0 0 0 0 
##$DE= 6
##$DECBNUC= <off>
##$DECIM= 32
##$DECNUC= <off>
##$DECSTAT= 4
##$DIGMOD= 1
##$DIGTYP= 9
##$DL= (0..7)
0 120 120 120 120 120 120 120 
##$DP= (0..7)
150 150 150 150 150 150 150 150 
##$DP07= 0
##$DPNAME0= <>
##$DPNAME1= <>
##$DPNAME2= <>
##$DPNAME3= <>
##$DPNAME4= <>
##$DPNAME5= <>
##$DPNAME6= <>
##$DPNAME7= <>
##$DPOAL= (0..7)
0.5 0.5 0.5 0.5 0.5 0.5 0.5 0.5 
##$DPOFFS= (0..7)
0 0 0 0 0 0 0 0 
##$DQDMODE= 0
##$DR= 18
##$DS= 0
##$DSLIST= <SSSSSSSSSSSSSSS>
$$ [...]
##$SUBNAM0= <"">
##$SUBNAM1= <"">
##$SUBNAM2= <"">
##$SUBNAM3= <"">
##$SUBNAM4= <"">
##$SUBNAM5= <"">
##$SUBNAM6= <"">
##$SUBNAM7= <"">
##$SUBNAM8= <"">
##$SUBNAM9= <"">
##$SW= 18.0517599122864
##$SWIBOX= (0..15)
0 0 2 0 0 0 0 0 0 0 0 0 0 0 0 0 
##$SW_h= 3612.71676300578
##$TD= 16384
##$TD0= 1
##$TE= 0
##$TE2= 300
##$TE3= 300
##$TEG= 300
##$TL= (0..7)
0 120 120 120 120 120 120 120 
##$TP= (0..7)
150 150 150 150 150 150 150 150 
##$TP07= 0
##$TPNAME0= <>
##$TPNAME1= <>
##$TPNAME2= <>
##$TPNAME3= <>
##$TPNAME4= <>
##$TPNAME5= <>
##$TPNAME6= <>
##$TPNAME7= <>
##$TPOAL= (0..7)
0.5 0.5 0.5 0.5 0.5 0.5 0.5 0.5 
##$TPOFFS= (0..7)
0 0 0 0 0 0 0 0 
##$TUNHIN= 0
##$TUNHOUT= 0
##$TUNXOUT= 0
##$USERA1= <user>
##$USERA2= <user>
##$USERA3= <user>
##$USERA4= <user>
##$USERA5= <user>
##$V9= 5
##$VALIST= <valist>
##$VCLIST= <CCCCCCCCCCCCCCC>
##$VD= 0
##$VDLIST= <DDDDDDDDDDDDDDD>
##$VPLIST= <PPPPPPPPPPPPPPP>
##$VTLIST= <TTTTTTTTTTTTTTT>
##$WBST= 1024
##$WBSW= 4
##$XGAIN= (0..3)
0 0 0 0 
##$XL= 0
##$YL= 0
##$YMAX_a= 259267
##$YMIN_a= -82156
##$ZGOPTNS= <>
##$ZL1= 120
##$ZL2= 120
##$ZL3= 120
##$ZL4= 120
##$ABSF1= 10
##$ABSF2= 0
##$ABSG= 5
##$ABSL= 3
##$ALPHA= 0
##$AQORDER= 0
##$ASSFAC= 0
##$ASSFACI= 0
##$ASSFACX= 0
##$ASSWID= 0
##$AUNMP= <proc_1d>
##$AZFE= 0.1
##$AZFW= 0.1
##$BCFW= 1
##$BC_mod= 2
##$BYTORDP= 1
##$COROFFS= 0
##$CY= -3
##$DATMOD= 1
##$DC= 2
##$DFILT= <>
##$DTYPP= 0
##$F1P= 0
##$F2P= 0
##$FCOR= 0.5
##$FTSIZE= 0
##$FT_mod= 4
##$GAMMA= 1
##$GB= 0.15
##$INTBC= 1
##$INTSCL= 1
##$ISEN= 128
##$LB= 0.25
##$LEV0= 0
##$LPBIN= 0
##$MAXI= 10000
##$MC2= 0
##$MEAN= 0
##$ME_mod= 0
##$MI= 1.114404
##$NCOEF= 0
##$NC_proc= 0
##$NLEV= 6
##$NOISF1= 3.799351
##$NOISF2= 2.8
##$NSP= 1
##$NTH_PI= 0
##$NZP= 0
##$OFFSET= 14.38212
##$PC= 1
##$PHC0= -4219.532
##$PHC1= 12.59229
##$PH_mod= 1
##$PKNL= yes
##$PPARMOD= 0
##$PSCAL= 0
##$PSIGN= 0
##$REVERSE= no
##$SF= 200.129724274929
##$SI= 16384
##$SIGF1= 3
##$SIGF2= 2
##$SINO= 400
##$SIOLD= 16384
##$SREGLST= <1H.CDCl3>
##$SSB= 0
##$STSI= 0
##$STSR= 0
##$SW_p= 3205.1282051282
##$SYMM= 0
##$S_DEV= 0
##$TDeff= 0
##$TDoff= 0
##$TI= <>
##$TILT= no
##$TM1= 0
##$TM2= 0
##$TOPLEV= 0
##$USERP1= <user>
##$USERP2= <user>
##$USERP3= <user>
##$USERP4= <user>
##$USERP5= <user>
##$WDW= 1
##$XDIM= 8192
##$YMAX_p= 0
##$YMIN_p= 0
$$ End of Bruker specific parameters
$$ ---------------------------------
##NTUPLES= NMR FID
##VAR_NAME=  TIME,          FID/REAL,        FID/IMAG
##SYMBOL=    X,             R,               I
##VAR_TYPE=  INDEPENDENT,   DEPENDENT,       DEPENDENT
##VAR_FORM=  AFFN,          ASDF,            ASDF
##VAR_DIM=   8192,          8192,            8192
##UNITS=     SECONDS,       ARBITRARY UNITS, ARBITRARY UNITS
##FACTOR=    0.0002768,     1,               1
##FIRST=     0,             0,               0
##LAST=      2.2672688,     0,               0
##MIN=       0,             -82156,          0
##MAX=       2.2672688,     259267,          0
$$ Real data points
##PAGE= N=1
##DATA TABLE= (X++(R..R)), XYDATA
$$ [...]
$$ plain form
2062 1223 1498 2076 2011 1331 1281 1337 957 934 1382 1223 499 230 269 35 -12 81 -245 -644 -1173 -1041 -1223 -1341
2084 -1341 -697 -605 -504 -1095 -1708 -1767 -1728 -1385 -352 177 325 362 -117 -615 -542 -162 546 1017 1062 1637 1117
2105 1117 589 767 1088 1351 1740 2202 1743 1566 1443 1553 1190 1156 1712 1286 646 564 870 667 -232 329
2125 329 585 -40 -781 -397 -515 -1230 -1428 -1054 -868 -1631 -1901 -1751 -1576 -1586 -1136 -394 -756 -1385 -1753 -1492
2145 -1492 -1453 -786 -63 290 473 299 -94 -303 -121 221 596 796 1174 1052 695 647 776 652 659 1332 1613
2166 1613 1087 695 740 460 98 447 948 514 -178 -571 -114 -563 -857 -440 -365 -1036 -1156 -919 -745 -1259
2186 -1259 -1085 -839 -1156 -1575 -1200 -1107 -1205 -613 -252 -150 -255 -138 -252 -610 -765 -28 721 904 1378 972
2206 972 573 227 417 977 1345 1624 1743 1219 569 468 563 730 977 1063 932 387 158 41 -278 -472 -439
$$ packed form
2062A223K75N78o5o80n0N6l80k3M48j59p24k69L9k34m7R3l26l99n29J32j82j18
2084a341O44R2J01n91o13n9L9L43J033N29J48L7m79m98P3L80P08M71M5N75n20
2105A117n28J78L21K63L89M62m59j77j23J10l63l4N56m26o40q2L06k03q99N61
2125C29K56o25p41L84j18p15j98L74J86p63k70J50J75j0M50P42l62o29l68K61
2145a492L9O67P23L53J83j74l93k09J82L42L75K00L78j22l57m8J29j24PO73K81
2166A613n26l92M5k80l62L49N01m34o92l93M57m49k94M17P5o71j20K37J74n14
2186a259J74K46l17m19L75R3r8N92L61J02j05J17j14l58j55P37P49J83M74m06
2206I72l99l46J90N60L68K79J19n24o50j01R5J67K47Q6j31n45k29j17l19j94L3
$$ plain form
2227 -439 215 -113 -402 -638 -1104 -1736 -1562 -1164 -1282 -1213 -922 -971 -1514 -1338 -599 -458 -1036 -946 -1031 -1121 -965 30
2249 30 567 384 46 -67 -49 -328 285 1044 1434 1133 1068 1060 548 472 390 813 1219 1577 1291 963 752 287
2271 287 174 270 647 744 195 -385 -426 -997 -1437 -856 114 -41 -788 -957 -1067 -1268 -1490 -767 -620 -1104 -1245
2292 -1245 -400 -285 -648 -381 87 -172 -691 -397 143 296 330 402 952 754 723 596 778 179 417 1554
2312 1554 1684 1930 1565 1098 237 491 774 766 1070 944 583 -133 -134 -90 -291 -277 -115 -263 -520 -681 -704 -1170
2334 -1170 -1752 -788 -464 -652 -794 -873 -966 -1462 -1307 -710 -550 -759 -596 -325 -478 -617 214 97 65 154 190
2355 190 34 349 932 1305 1015 781 651 542 235 -133 772 858 990 989 883 624 -222 -19 -64 -396 167
2376 167 206 -137 -276 -1024 -1424 -921 -643 -614 -336 -834 -883 -1158 -975 -903 -212 -414 -422 -525 -344 -402 -421 212 343
$$ packed form
2227d39O54l28k89k36m66o32J74L98j18O9K91m9n43J76P39J41n78R0q5r0J56R95
2249C0N37j83l38j13J8k79O13P59L90l01o5qn12p6q2M23M06L58k86l28k11m65
2271B87j13R6L77R7n49n80m1n71m40N81R70j55p47j69j10k01k22P23J47m84j41
2292a245Q45J15l63K67M68k59n19K94N40J53L4P2N50j98l1j27J82n99K38J137
2312A554J30K46l65m67q61K54K83qL04j26l61p16jM4k01J4J62j48k57j61k3m66
2334a170n82R64L24j88j42p9r3m96J55N97J60k09J63K71j53j39Q31j17l2Q9L6
2355A90j56L15N83L73k90k34j30j09l07l68R05Q6J32jj06k59q46K03m5l32N63
2376A67L9l43j39p48m00N03K78K9K78m98m9k75J83P2O91k02qj03J81n8j9O33J31
$$ plain form
2399 343 49 -72 414 856 264 548 996 813 254 687 1074 729 327 781 1359 1118 699 989 370 -336
2419 -336 -23 260 532 301 362 205 -929 -1161 -1170 -727 -663 -634 -557 -849 -1081 -1200 -1486 -970 -395 -529 -650 -860
2441 -860 -836 -1094 -892 -404 161 314 73 288 335 -113 -6 302 868 679 800 1430 926 710 1161 1423 1020
2462 1020 813 924 351 542 621 893 1014 529 375 354 -521 -538 -347 73 -136 -171 -132 -528 -1002 -1348 -898
2483 -898 -1032 -633 -322 -130 -1199 -831 -663 -975 -485 -155 244 85 -541 -102 -138 -41 157 728 960 820
2503 820 736 500 435 739 908 716 688 1377 1230 766 829 1263 736 589 837 495 48 -12 533 407 200 131
2525 131 -258 -292 -938 -773 -546 -566 -473 -171 -446 -722 -1489 -1304 -1092 -743 -949 -414 -188 -494 -571 -407 -322 -164
2547 -164 63 402 185 154 122 -213 310 707 699 756 976 902 317 316 678 434 726 848 972 336 474 249 534
$$ packed form
2399C43k94j21M86M42n92K84M48j83n59M33L87l45m02M54N78k41m19K90o19p06
2419c36L13K83K72k31O1j57j134k32rM43O4K9P7k92k32j19k86N16N75j34j21k10
2441h60K4k58K02M88N65J53k41K15M7m48J07L08N66j89J21O30n04k16M51K62m03
2462A020k07J11n73J91P9K72J21m85j54k1q75j7J91M20k09l5L9l96m74l46M50
2483h98j34L99L11J92j069L68J68l12M90L30L99j59o26M39l6R7J98N71K32j40
2503H20q4k36o5L04J69j92k8O89j47m64O3M34n27j47K48l42m47o0N45j26k07o9
2525A31l89l4o46J65K27k0R3L02k75k76p67J85K12L49k06N35K26l06p7J64Q5J58
2547a64K27L39k17l1l2l35N23L97qN7K20p4n85jL62k44K92J22J24o36J38k25K85
$$ plain form
2570 534 52 155 356 155 -377 -643 -60 86 9 -48 -271 -776 -1035 -861 -219 -367 -297 -148 -350 -200 -769
2591 -769 -662 -524 -255 -142 22 18 77 -148 -184 120 294 653 137 364 442 -114 211 109 549 1060 852 577
2613 577 761 119 214 564 333 277 641 261 -245 -266 154 366 -227 -348 -372 -557 -422 -327 -78 -565 -468 -163
2635 -163 -621 -989 -1028 -786 -669 -463 -149 191 -144 -627 -549 -556 -267 -184 361 102 -50 -273 -59 210 381 415
2657 415 408 466 199 291 404 129 244 357 913 564 464 -7 -100 -85 -384 -179 85 244 -170 -155 -143 83 -372
2680 -372 -435 -551 -222 -556 -745 -425 -188 -295 -127 72 -596 -532 -732 -441 -371 -175 110 78 -78 -411 226
2701 226 45 93 694 604 667 470 516 11 77 382 729 494 539 422 243 -175 -178 302 392 397 388 42 -171 -158 -388
2726 -388 -189 -472 -93 -473 -356 -450 -341 -79 -659 -475 -153 -502 -272 -620 27 -119 -233 28 87 -272 -306
$$ packed form
2570E34m82J03K01k01n32k66N83J46p7n7k23n05k59J74O42j48P0J49k02J50n69
2591g69J07J38K69J13J64mN9k25l6L04J74L59n16K27P8n56L25j02M40N11k08k75
2613E77J84o42R5L50k31n6L64l80n06k1M20K12n93j21k4j85J35R5K49m87R7L05
2635a63m58l68l9K42J17K06L14L40l35m83P8pK89Q3N45k59j52k23K14K69J71L4
2657D15pN8k67R2J13k75J15J13N56l49j00m71r3J5k99K05K64J59m14J5J2K26m55
2680c72o3j16L29l34j89L20K37j07J68J99o68O4k00K91P0J96K85l2j56l33O37
2701B26j81M8O01r0O3j97M6n05O6L05L47k35M5j17j79m18lM80R0Nrl46k13J3k30
2726c88J99k83L79l80J17r4J09K62n80J84L22l49K30l48O47j46j14K61N9l59l4
$$ plain form
2747 -306 -156 -227 -147 183 852 538 46 621 8 -54 387 544 750 420 162 131 -97 322 423 486 457 226
2769 226 101 -111 -119 -203 -259 1 -158 13 -152 -371 -682 -754 -303 103 -425 -195 -405 -508 -303 -365 -121 -173
2791 -173 75 -784 -439 -75 -21 12 532 379 9 39 0 272 -23 460 866 453 380 415 460 365 396 462 688
2814 688 868 388 144 30 -171 125 265 119 -164 44 -229 -374 -422 -452 -121 -139 -200 -41 -136 -613 -529 -370
2836 -370 -230 -332 -219 -346 -437 -341 -99 -360 20 -134 -295 -242 -155 154 351 295 566 204 266 223 43 237
2858 237 143 670 505 443 340 16 122 117 170 403 327 273 45 -43 -248 -266 238 -63 -190 -307 -167 -442 -581
2881 -581 -707 -357 -299 -372 -561 -407 -387 -538 -504 -353 79 -19 -311 -294 -76 228 112 243 151 250 126 3 208
2904 208 113 336 240 635 493 384 349 484 69 438 612 593 529 385 360 -113 114 186 467 420 -119 -124 8
$$ packed form
2747c06J50p1Q0L30O69l14m92N75o13o2M41J57K06l30k58l1k28M19J01O3k9k31
2769B26j25k12qq4n6K60j59J71j65k19l11p2M51M06n28K30k10j03K05o2K44n2
2791a73K48q59L45L64N4L3N20j53l70L0l9K72k95M83M06m13p3L5M5r5L1O6K26
2814F88J80m80k44j14k01K96J40j46k83K08k73j45m8l0L31j8o1J59r5m77Q4J59
2836c70J40j02J13j27r1R6K42k61L80j54j61N3Q7L09J97n6K71l62O2m3j80J94
2858B37r4N27j65o2j03l24J06nN3K33p6n4k28q8k05j8N04l01j27j17J40k75j39
2881e81j26L50N8p3j89J54K0j51L4J51M32r8k92J7K18L04j16J31r2R9j24j23K05
2904B08r5K23r6L95j42j09l5J35m15L69J74j9o4j44k5m73K27P2K81m7n39nJ32
$$ plain form
2927 8 -266 -626 -232 -262 -172 -297 -174 -275 -734 -437 -132 -469 -139 -346 -268 -501 -184 -89 -285 -165 -231 -8
2949 -8 -46 63 255 227 262 341 189 -54 124 415 288 284 469 454 640 85 159 189 1 338 447 155 246 29
2973 29 -285 -147 -254 -108 -283 -17 -183 -112 -489 -414 50 -80 -105 -171 -287 -416 -541 -404 -234 -167 -191 173
2995 173 35 -277 139 -180 83 86 153 142 316 325 405 185 202 297 350 71 437 223 237 180 519 466 333 356 -14
3020 -14 -375 -394 -60 75 317 21 -96 -263 -171 -224 -367 -284 -165 -219 -278 -67 -261 -167 -493 -382 -290 -383 -134
3043 -134 -364 -428 -351 68 -88 89 82 -39 106 182 107 222 -166 174 298 -76 -54 385 442 336 350 22 138
3066 138 184 257 311 405 757 190 293 -283 -264 -298 -525 -285 -28 -28 -424 -180 -327 -467 -375 -282 -111 -224 -265 -40
3090 -40 -341 -479 -419 -248 -100 -50 219 -137 129 -424 56 194 140 323 -101 327 58 211 107 279 208 326
$$ packed form
2927Hk74l60L94l0R0j25J23j01m59K97L05l37L30k07P8k33L17R5j96J20o6K23
2949hl8J09J92k8L5P9j52k43J78K91j27mJ85j5J86n55P4L0j88L37J09k92R1k17
2973B9l14J38j07J46j75K66j66P1l77P5M64j30k5o6j16j29j25J37J70O7k4L64
2995A73j38l12M16l19K63LO7j1J74RQ0k20J7R5N3k79L66k14J4n7L39n3j33K3l70
3020a4l61j9L34J35K42k96j17j67R2n3j43Q3J19n4n9K11j94R4l26J11R2r3K49
3043a34k30o4P7M19j56J77pj21J45P6p5J15l88L40J24l74K2M39N7j06J4l28J16
3066A38M6P3N4R4L52n67J03n76J9l4k27K40K57%l96K44j47j40R2R3J71j13m1K25
3090d0l01j38O0J71J48N0K69l56K66n53M80J38n4J83m24M28k69J53j04J72p1J18
$$ plain form
3112 326 253 16 184 456 260 134 432 -103 37 53 -6 -67 -22 203 126 -104 -278 -207 -404 -481 -207 25 -307
3135 -307 -228 -291 -299 -474 -527 -119 -4 -636 -301 -233 -271 -346 -181 142 129 122 -310 109 -168 -113 156 250 230 275 275 -63
3161 -63 -95 278 374 -104 218 363 71 55 -197 394 262 -269 199 92 -344 -246 -479 119 -371 15 -3 124
3183 124 -325 -405 -397 -471 -232 28 -398 -140 -330 -358 -506 -198 117 -18 52 60 78 -39 -309 244 174 203 364 232
3207 232 68 143 469 321 404 217 323 272 277 371 364 108 86 197 334 118 73 -112 268 42 62 80 -212 -471
3231 -471 -595 -221 -401 -222 195 0 -654 -448 -520 -394 31 29 -198 20 -402 -281 55 -259 281 46 379
3252 379 277 255 -182 -169 83 213 336 245 483 165 145 109 42 257 -101 202 181 23 247 -105 144 -19
3274 -19 13 2 192 -657 -138 194 19 54 -271 -75 -408 -236 -165 -220 -222 -166 -128 -261 -303 -151 80 -33 -72 -25
$$ packed form
3112C26p3k37J68K72j96j26K98n35J40J6n9o1M5K25p7k30j74P1j97p7K74K32l32
3135c07P9o3qj75n3M08J15o32L35O8l8p5J65L23j3pm32M19k77N5K69R4k0M5%l38
3161f3l2L73R6m78L22J45k92j6k52N91j32n31M68j07m36R8k33N98m90L86j8J27
3183A24m49q0Qp4K39K60m26K58j90k8j48L08L15j35P0QJ8j17k70N53p0K9J61j32
3207B32j64P5L26j48Q3j87J06n1NR4pk56k2J11J37k16m5j85L80k26K0J8k92k59
3231d71j24L74j80J79M17j95o54K06p2J26M25kk27K18m22J21L36l14N40k35L33
3252C79j02k2m37J3K52J30J23r1K38l18k0l6o7K15l58L03k1j58K24l52K49j63
3274a9L2j1J90q49N19L32j75L5l25J96l33J72P1n5kN6L8j33m2J52K31j13l9M7
$$ plain form
3298 -25 -188 141 -52 -83 -162 91 139 105 348 389 302 217 -1 103 535 16 473 452 119 -161 43 286 21
3321 21 263 195 409 -38 11 186 -161 -205 -76 -77 84 -448 194 -141 -244 -161 -353 -90 -165 -384 -146 -274 -174
3344 -174 -90 -129 -443 -443 -484 30 -18 -142 134 23 -51 70 -150 130 175 361 248 83 318 11 200 344 226
3367 226 346 310 234 90 -156 -83 216 205 -84 135 92 14 -137 -56 123 -123 -336 -55 -279 -408 -83 89
3389 89 -78 -247 -191 -67 -391 -178 -276 -79 -49 127 110 -169 -130 -146 138 -28 17 301 540 144 91 307 229
3412 229 16 328 670 401 406 240 56 84 134 272 193 278 237 66 -50 -260 179 -88 158 -230 -215 -317 -230
3435 -230 84 -275 -178 -271 5 -278 -62 -262 235 -23 113 -75 133 -118 -309 -264 -185 29 194 498 185
3456 185 86 82 437 357 321 137 448 270 334 155 -42 147 306 96 131 147 -138 52 -236 -62 -98 -3 159
$$ packed form
3298b5j63L29j93l1p9K53M8l4K43M1q7q5k18J04M32n19M57k1l33k80K04K43k65
3321B1K42o8K14m47M9J75l47m4J29jJ61n32O42l35j03Q3j92K63p5k19K38j28J00
3344a74Q4l9l14%m1N14m8j24K76j11p4J21k20K80M5J86j13j65K35l07J89J44j18
3367B26J20l6p6j44k46P3K99j1k89K19m3p8j51Q1J79k46k13K81k24j29L25J72
3389H9j67j69N6J24l24K13r8J97L0J76j7k79L9j6K84j66M5K84K39l96n3K16p8
3412B29k13L12L42k69Nj66j84K8N0J38p9Q5m1j71j16k10M39k67K46l88J5j02Q7
3435b30L14l59R7r3K76k83K16k00M97k58J36j88K08k51j91M5P9K14J65L04l13
3456A85r9mL55q0l6j84L11j78O4j79j97J89J59k10L5J6k85J90k88J74l6R5J62
$$ plain form
3479 159 244 106 -67 -74 -190 -270 -73 129 57 -88 -34 -186 -95 -79 135 83 99 -200 -117 -35 -15 138 48 349 -42
3504 -42 272 272 278 285 426 174 216 -112 98 -26 181 275 311 225 107 -108 -127 -283 -202 -71 -262 86 -109 -97 -205
3529 -205 -158 -173 -126 3 47 -197 -325 -410 -220 1 -432 -121 63 -152 -82 -162 -28 -48 -34 -77 173 -97 34
3552 34 287 163 79 341 373 58 182 380 -19 0 311 524 215 -131 83 124 -179 37 327 395 151 -143
3574 -143 -128 -289 -189 -6 -84 -70 34 -196 -550 -466 -366 -91 -239 -296 -9 -263 -146 -275 -34 -229 -129 151
3596 151 204 -161 84 83 -68 -88 0 34 82 159 307 146 219 275 503 485 26 123 -23 40 331 488 443 220 -63
3621 -63 -26 178 -40 104 39 -90 -14 401 -309 -384 -200 -156 -7 4 -69 -264 -421 -305 -200 -188 -301 -35 -414
3644 -414 47 -181 -32 34 -59 160 -105 -27 -47 257 -42 102 375 316 35 292 374 212 162 120 410 267 -169
$$ packed form
3479A59Q5j38j73pj16q0J97K02p2j45N4j52R1J6K14n2J6k99Q3Q2K0J53r0L01l91
3504d2L14%OPJ41k52M2l28K10j24K07R4L6q6j18k15j9j56Q1J31j91L48j95J2j08
3529b05M7j5M7J29M4k44j28q5J90K21m33L11J84k15P0q0J34k0J4m3K50k70J31
3552C4K53j24q4K62L2l15J24J98l99J9L11K13l09l46K14M1l03K16K90O8k44k94
3574a43J5j61J00J83p8J4J04k30l54Q4J00K75j48n7K87k54J17j29K41j95J00K80
3596A51N3l65K45jj51k0Q8L4M8P7J48j61P3N6K28j8m59R7j46O3K91J57m5k23k83
3621f3L7K04k18J44o5j29P6M15p10p5J84M4J49J1p3j95j57J16J05J2j13K66l79
3644d14M61k28J49O6r3K19k65P8k0L04k99J44K73n9k81K57Q2j62n0m2K90j43m36
$$ plain form
3667 -169 24 58 -243 139 31 61 85 -59 -244 26 -242 37 -29 -170 -172 -46 -248 -563 -383 -246 -211 -310 -277
3690 -277 -157 -194 -372 -446 -191 -211 -112 -95 -176 33 -53 47 -350 383 183 221 144 251 89 118 521 366 348 137
3714 137 109 295 184 -61 276 339 142 137 -130 53 -313 -194 10 97 54 64 -2 -277 -157 31 -285 1 -109
3737 -109 149 -126 -115 -232 -255 -11 -237 -29 44 -366 -256 -129 119 131 153 -62 63 6 189 265 -57 22 86
3760 86 304 275 3 190 51 249 477 201 59 90 131 51 -317 -142 -95 246 -198 -101 -284 -421 -225 -102
3782 -102 -241 -176 255 -95 -479 -315 -111 60 -144 78 283 -186 -569 -224 86 -109 0 -28 -16 27 227
3803 227 114 -19 190 145 440 183 386 -9 187 436 9 287 423 187 -115 -123 79 253 259 -426 -173 -22
3825 -22 -108 -112 155 39 -155 -32 -199 -395 -334 -206 170 -26 -240 -260 59 -222 -516 -292 -33 131 34 146
$$ packed form
3667a69J93L4l01L82j08L0K4j44j85K70k68K79o6j41kJ26k02l15J80J37L5r9L3
3690b77J20l7j78p4K55k0R9J7q1K09q6J00l97P33k00L8p7J07j62K9M03j55j8k11
3714A37k8J86j11k45L37O3j97nk67J83l66J19K04Q7m3J0o6k75J20J88l16K86j10
3737a09K58k75J1j17k3K44k26K08P3m10J10J27K48J2K2k15J25n7J83P6l22P9O4
3760H6K18k9k72J87j39J98K28k76j42L1M1q0l68J75M7L41m44R7j83j37J96J23
3782a02j39O5M31l50l84J64K04J71k04K22K05m69l83L45L10j95J09k8J2M3K00
3803B27j13j33K09m5K95k57K03l95J96K49m27K78J36k36l02qK02J74Oo85K53J51
3825b2q6mK67j16j94J23j67j96O1J28L76j96k14k0L19k81k94K24K59J64r7J12
$$ plain form
3847 146 102 -2 -148 144 -177 199 312 278 290 -241 -26 339 85 55 258 149 134 135 60 -24 418 149 79
3870 79 136 -12 -13 -293 -36 140 84 -159 63 14 -223 -135 -56 146 -108 -449 -338 -361 -194 -53 -65 -191 60
3893 60 46 -29 -297 -163 127 12 -19 12 353 150 -123 28 572 121 295 230 430 162 38 77 110 79 59
3916 59 183 96 -18 -207 -117 241 -17 192 -108 -183 -128 -550 -364 -182 -102 -257 -189 -69 -487 -570 -143 -121 -171
3939 -171 -448 120 -310 -128 -409 114 241 -193 263 -42 -42 -114 87 218 157 116 235 212 98 -115 -100 41
3961 41 93 132 333 157 314 180 8 15 -48 -51 131 -43 -134 109 -328 -53 17 -58 -217 -125 -278 -265 -218 96 -136
3986 -136 -79 -165 -85 -355 -118 -26 -71 -139 -28 -98 -121 -138 79 73 183 35 22 256 -89 37 226 10 334 313
4010 313 517 358 224 37 172 122 252 302 156 -90 2 -185 135 -26 -164 -34 -251 -98 71 -343 69
$$ packed form
3847A46m4j04j46K92l21L76J13l4J2n31K15L65k54l0K03j09j5Jp5q4M42k69p0
3870G9N7j48jk80K57J76n6k43K22m9k37Q8P9K02k54l41J11k3J67J41j2j26K51
3893F0j4p5k68J34K90j15l1L1L41k03k73J51N44m51J74o5K00k68j24L9L3l1k0
3916E9J24q7j14j89R0L58k58K09l00p5N5m22J86J82Q0j55O8J20m18q3M27K2n0
3939a71k77N68m30J82k81N23J27m34M56l05%p2K01J31o1m1J19k3j14k13J5J41
3961D1N2L9K01j76J57j34j72Po3lJ82j74r1K43m37K75P0p5j59R2j53J3M7L14k32
3986a36N7q6Q0k70K37R2m5o8J11p0k3j7K17oJ10j48j3K34l45J26J89k16L24k1
4010C13K04j59j34j87J35n0J30N0j46k46R2j87L20j61j38J30k17J53J69m14M12
$$ plain form
4031 69 -409 -237 -135 -157 -229 -404 -202 -136 -161 251 -220 -36 49 -161 128 -35 -51 28 87 145 13 225 497
4054 497 41 97 185 342 222 -245 -56 356 588 312 246 292 -99 175 86 -102 -1 370 103 21 -74 -7 38
4077 38 -245 -205 -12 21 28 -234 -201 -71 -331 -96 66 -307 -502 -138 -33 36 -125 100 -31 113 101 64 1
4100 1 7 106 261 260 0 183 146 88 190 -63 205 254 198 177 -63 -131 -56 165 204 297 126 -161 -34 -142 -56 -52
4126 -52 -164 122 -448 -282 -192 -217 -200 -89 117 -27 -178 -98 -270 0 -158 -208 -93 40 -231 -17 -153 -26
4148 -26 218 113 -38 440 207 137 130 245 558 233 117 489 91 236 185 -68 213 61 32 102 -81 121
4170 121 -139 -88 -34 138 -27 -217 -178 -298 -255 -126 52 -67 314 -244 -360 -38 -523 -450 -340 -99 -207 122
4192 122 76 -26 -259 -64 178 254 -36 -180 201 -173 14 235 -34 52 101 -71 280 26 261 24 140
$$ packed form
4031F9m78J72J02k2p2j75K02O6k5M12m71J84Q5k10K89j63j6P9N9N8j32K12K72
4054D97m56N6Q8J57j20m67J89M12K32k76o6M6l91K74q9j88J01L71k67q2r5O7M5
4077C8k83M0J93L3Pk62L3J30k60K35J62l73j95L64J05O9j61K25j31J44j2l7o3
4100AOR9J55jk60J83l7n8J02k53K68M9n6k1k40o8P5K21L9R3j71k87J27j08Q6M
4126e2j12K86n70J66R0k5J7J11K06j44j51Q0j72K70j58n0J15J33k71K14j36J27
4148b6K44j05j51M78k33p0pJ15L13l25j16L72l98J45n1k53K81j52k9P0j83K02
4170A21k60N1N4J72j65j90L9j20M3J29J78j19L81n58j16L22m85P3J10K41j08L29
4192A22m6j02k33J95K42P6k90j44L81l74J87K21k69Q6M9j72L51k54K35k37J16
$$ plain form
4213 140 500 235 -81 62 89 -165 29 214 122 106 -361 -85 -218 -217 -340 -216 -38 -370 -107 -265 -351 -305
4235 -305 -211 14 -201 -186 -408 -273 -308 -73 37 264 101 286 229 -7 151 179 262 206 277 70 -218 102 132
4258 132 357 272 -120 53 -78 48 163 237 214 1 140 132 -407 -207 -344 -204 124 131 35 -206 -320 -243 -33
4281 -33 -81 -132 14 -332 -507 -152 -101 -320 98 87 36 -44 -174 -365 -42 65 262 110 -145 308 195 -43
4303 -43 282 156 253 137 282 23 -147 16 -14 236 207 186 78 90 42 -183 154 78 -166 96 -106 -36 -186
4326 -186 -329 -98 -200 -198 -127 -13 -447 -67 -271 41 86 41 214 -390 24 -224 -143 -283 -276 141 162 166 116 -235
4350 -235 -107 68 173 6 -187 261 275 -10 -222 2 187 105 -79 82 -71 -19 -121 -194 39 -128 6
4371 6 -67 47 -88 -8 -222 -44 159 -344 -274 -150 80 -459 -201 -215 59 -123 -107 -121 -168 -42 46 245 32
$$ packed form
4213A40L60k65l16J43K7k54J94J85r2j6m67K76j33Jj23J24J78l32K63j58q6M6
4235c05R4K25k15J5k22J35l5K35J10K27j63J85n7k36J58K8Q3n6P1k07k88L20L0
4258A32K25q5l92J73j31J26J15P4k3k13J39qn39K00j37J40L28Pr6k41j14P7K10
4281c3m8n1J46l46j75L55N1k19M18j1n1q0j30j91L23J07J97j52k55M53j13k38
4303d3L25j26R7j16J45k59j70J63l0K50k9k1j08J2m8k25L37p6k44K62k02P0j50
4326a86j43K31j02KP1J14m34L80k04L12M5m5J73o04M14k48Q1j40PM17K1Mn0l51
4350b35J28J75J05j67j93M48J4k85k12K24J85q2j84J61j53N2j02p3K33j67J34
4371Fp3J14j35Q0k14J78K03n03P0J24K30n39K58j4K74j82J6j4m7J26Q8J99k13
$$ plain form
4394 32 -44 132 -112 -17 253 249 365 -58 111 28 137 129 -129 220 239 98 384 195 77 434 95 33 411
4417 411 -108 13 -31 -90 -51 -106 -195 -223 197 -11 -330 -94 -188 -151 -239 -61 -65 -453 -154 -85 -79 40 11 24 -53 323
4443 323 11 98 -58 23 387 117 84 8 -97 50 116 137 293 262 43 125 4 -60 308 -34 -81 -4 78 -98
4467 -98 -23 2 138 -327 -304 138 -201 -421 -242 147 -93 114 66 -91 144 115 -52 -37 121 5 -190 -94 -158
4490 -158 -168 -12 93 -11 217 125 189 -67 130 7 30 304 317 90 187 208 -148 79 101 54 233 -161 -28
4513 -28 118 36 140 453 311 49 273 -126 33 -113 -111 -104 194 -35 -173 -139 185 115 -324 -338 -72 -170 111
4536 111 -310 86 57 85 -150 9 -98 -36 244 199 -92 102 56 35 55 -71 165 -4 194 136 495 143 209
4559 209 -55 57 -46 -88 223 85 -267 61 -377 3 -15 -131 -63 1 -105 -132 -114 -296 -130 -190 -103 22 -68
$$ packed form
4394C2p6J76k44R5K70mJ16m23J69q3J09qk58L49J9j41K86j89j18L57l39o2L78
4417D11n19J21m4n9L9n5q9k8M20k08l19K36r4L7q8J78ml88K99O9OJ19k9J3p7L76
4443C23l12Q7j56Q1L64k70l3p6j05J47O6K1J56l1k19Q2j21o4L68l42m7P7Q2j76
4467i8P5K5J36m65K3M42l39k20J79L89k40K07m8j57K35k9j67J5J58j16j95R6o4
4490a58j0J56J05j04K28r2O4k56J97j23K3K74J3k27R7K1l56K27K2m7J79l94J33
4513b8J46q2J04L13j42k62K24l99J59j46KPK98k29j38L4L24p0m39j4K66r8K81
4536A11m21L96k9K8k35J59j07O2K80m5k91J94m6k1K0j26K36j69J98n8L59l52O6
4559B09k64J12j03m2L11j38l52L28m38L80j8j16O8O4j06k7J8j82J66o0Q7J25r0
$$ plain form
4582 -68 22 -82 164 -159 -122 -48 155 213 -168 221 -88 -165 -65 286 187 -99 -185 16 -2 -144 106 446 378
4605 378 223 146 35 -200 7 182 119 7 153 54 -428 -86 131 177 11 -113 -186 -172 14 -269 -148 -35
4627 -35 184 2 90 90 -264 -144 -293 174 94 -114 294 -304 -234 -130 357 -47 199 499 -126 293 128 42
4649 42 -85 -9 86 261 310 166 309 261 282 230 102 154 172 -145 -60 -91 226 -120 74 47 92 -267 -179 4 -193
4674 -193 -114 -238 -88 -311 -35 -167 231 -73 208 -178 -359 84 -2 -109 30 50 147 -98 -81 -221 98 156
4696 156 249 -158 -30 28 223 59 -52 -49 67 172 302 192 -92 247 -169 54 -54 230 57 -217 72
4717 72 51 -221 74 -159 88 -109 -77 119 -239 -277 -71 -114 37 -8 47 -68 -155 -259 -86 -138 -129 146 69 -150
4741 -150 -137 40 -32 120 363 95 363 -76 55 -166 219 184 294 88 188 166 50 234 143 142 107 -141 -145
$$ packed form
4582f8R0j04K46l23L7P4K03N8l81L89l09p7J00L51r9k86q6K01j8j42K50L40o8
4605C78j55p7j11k35K07J75o3j12J46r9m82L42K17M6j66j24p3J4J86k83J21J13
4627c5K19j82Q8%l54J20j49M67q0k08M08n98P0J04M87m04K46L00o25M19j65q6
4649D2j27P6R5J75M9j44J43m8K1n2j28N2J8l17Q5l1L17l46J94k7M5l59Q8J83j97
4674a93P9j24J50k23K76j32L98l04K81l86j81M43q6j07J39K0R7k45J7j40L19N8
4696A56R3m07J28N8J95j64j11LJ16J05J30j10k84L39m16K23j08K84j73k74K89
4717G2k1k72K95k33K47j97L2J96l58l8K06m3J51m5N5j15q7j04J73n2RK75p7k19
4741a50J3J77p2J52K43k68K68m39J31k21L85l5J10k06J00k2j16J84r1jl5k48m
$$ plain form
4764 -145 -212 -109 102 -222 249 -247 -127 -143 -236 44 -10 -256 -343 -92 -172 -194 73 -306 -220 -286 98 11 -88 -249
4788 -249 -98 272 22 17 84 -117 232 128 -20 148 148 0 215 174 315 -41 34 -177 27 112 -133 46 42
4811 42 58 -167 71 142 111 -70 283 -80 -136 -115 44 24 -220 -209 -227 4 -87 -66 -220 286 58 48 -69 -187
4835 -187 101 32 148 134 6 172 -112 73 -156 -351 64 70 140 221 -109 95 7 185 199 99 34 -133 106
4858 106 12 -61 43 162 -245 -76 -310 -123 -220 -381 -250 10 -230 -105 -34 -261 171 -119 -205 19 27 8 -115
4881 -115 -336 135 318 -166 -43 246 -63 -213 -83 219 161 62 106 79 -1 -39 178 224 157 357 -40 63 186
4904 186 -141 -34 95 -268 190 98 29 215 242 -173 -257 -73 -115 -35 106 49 -119 -169 110 100 -106 184 -42
4927 -42 -166 -48 2 86 -247 -115 83 -270 -151 -246 189 -92 -159 83 53 101 -239 -141 232 -110 126 258 -217
$$ packed form
4764a45o7J03K11l24M71m96J20j6r3K80n4k46q7K51q0k2K67l79Q6o6L84q7r9j61
4788b49J51L70k50nO7k01L49j04j48J68%j48K15m1J41l56P5k11K04Q5k45J79m
4811D2J6k25K38P1l1j81L53l63n6K1J59k0k44J1j8K31r1K1j54N06k28j0j17j18
4835a87K88o9J16j4j28J66k84J85k29j95M15OP0Q1l30K04q8J78J4j00o5j67K39
4858A06r4p3J04J19m07J69k34J87r7j61J31K60k40J25P1k27M32k90q6K24Qj9j23
4881a15k21M71J83m84J23K89l09j50J30L02n8r9M4k7q0l8K17M6o7K00l97J03J23
4904A86l27J07J29l63M58r2o9J86K7m15q4J84m2Q0J41n7j68n0K79j0k06K90k26
4927d2j24J18N0Q4l33J32J98l53J19r5M35k81o7K42l0M8l40R8L73l42K36J32m75
$$ plain form
4950 -217 400 94 -19 -28 -219 210 275 -71 130 287 4 58 -40 -126 60 -174 -47 -22 220 -32 -111 231 27
4973 27 -122 -229 -41 -145 -100 -30 -52 55 75 76 -40 60 -253 -53 26 203 98 97 -80 -10 431 94 161 107
4997 107 -102 71 -81 146 -99 22 339 144 35 -203 -274 115 -7 151 326 -72 235 73 -184 -158 -170
5018 -170 108 -94 -62 46 -72 -162 -96 -40 -192 214 -149 -21 -74 -117 -40 -121 65 23 -108 -151 90 23 31 -43 -63
5043 -63 99 473 -113 150 -28 -27 -17 -27 237 69 -105 233 -117 -146 152 329 16 -54 -145 4 151 -19 175
5066 175 -118 49 23 -126 27 87 -146 195 -54 -136 -29 -227 -29 -5 -27 138 214 -90 -12 -137 -73 214 171
5089 171 61 132 -22 27 -242 -1 84 -103 83 1 -83 237 -25 -67 69 26 117 159 -113 265 -46 -165 72
5112 72 103 180 -212 40 -252 -227 158 95 -69 56 59 171 -198 -79 55 -308 3 68 255 76 163 -243 -116
$$ packed form
4950b17O17l06j13rj91M29O5l46K01J57k83N4r8q6J86k34J27K5K42k52p9L42k04
4973B7j49j07J88j04M5P0k2J07K0Jj16J00l13K00P9J77j05jj77P0M41l37O7n4
4997A07k09J73j52K27k45J21L17j95j09k38p1L89j22J58J75l98L07j62k57K6j2
5018a70K78k02L2J08j18r0O6N6j52M06l63J28n3m3P7q1J86m2j31m3K41o7Qp4k0
5043f3J62L74n86K63j78JJ0j0K64j68j74L38l50k9K98J77l13p0r1J49J47j70J94
5066A75k93J67k6j49J53O0k33L41k49q2J07j98J98K4k2J65P6l04P8j25O4K87m3
5089A71j10P1j54M9k69K41Q5j87J86q2q4L20k62m2J36m3R1M2k72L78l11j19K37
5112G2L1P7l92K52k92K5L85o3j64J25LJ12l69J19J34l63L11O5J87j79Q7m06J27
$$ plain form
5135 -116 212 294 242 -12 39 50 -34 -12 -59 -58 155 0 148 6 -66 17 375 173 245 -39 -44 -253 10 95 51
5160 51 137 96 43 -150 47 9 6 49 -163 216 33 -9 2 44 176 14 -160 -14 127 93 -23 150 167 145 108
5185 108 -5 102 145 -187 159 45 388 111 132 -63 268 -45 101 14 -6 156 -150 269 153 -268 -257 197
5207 197 169 185 209 -32 -167 -66 125 -136 -83 -146 -209 101 -8 -70 -52 10 -146 -167 116 -233 -245 -142 138 40
5231 40 -162 -46 -293 -166 211 -104 263 52 -33 -112 141 149 -17 82 101 72 151 -88 -137 -50 43 230 264 55
5255 55 131 -35 -50 104 -5 -37 -304 -179 3 65 -306 -226 21 102 -414 -121 -43 55 -107 41 -274 -140 282
5278 282 71 -129 -28 93 66 375 370 -68 110 -3 -108 -102 37 315 -76 123 271 30 -41 59 119 125 90
5301 90 246 45 -128 105 -83 -152 14 27 -76 47 212 -47 -277 65 -94 130 -210 -11 217 -25 -210
$$ packed form
5135a16L28Q2n2k54N1J1q4K2m7JK13j55J48j42p2Q3L58k02P2k84nk09K63Q5m4
5160E1Q6m1n3j93J97l8lM3k12L79j83m2J1M2J32j62j74J46J41l4j16J73J7k2l7
5185A08j13J07M3l32L46j14L43k77K1j95L31l13J46q7k0J62l06M19j16m21J1M54
5207A97k8J6K4k41j35J01J91k61N3o3o3L10j09o2J8O2j56k1K83l49j2J03K80r8
5231D0k02J16k47J27L77l15L67k11q5p9K53Qj66R9J9k9P9k39m9Q7R3J87L4k09
5255E5P6j66j5J54j09l2k67J25J82O2l71Q0K47Q1n16K93P8R8j62J48l15J34M22
5278B82k11k00J01J21k7L09nm38J78j13j05OJ39K78l91J99J48k41p1J00O0Ol5
5301I0J56k01j73K33j88o9J66J3j03J23J65k59k30L42j59K24l40J99K28k42j85
$$ plain form
5322 -210 -157 -267 -156 145 -29 -14 -187 -50 136 -190 84 -115 55 -229 189 152 125 225 69 197 126 272
5344 272 58 145 170 110 146 -15 45 -99 34 -101 1 -162 -317 -126 78 28 -10 34 -59 -9 -76 -58 -60 -28 -115
5369 -115 -201 -3 -10 61 211 -276 -172 -200 71 317 253 -30 274 -2 -133 38 180 133 24 74 115 102 58 223
5393 223 -152 -219 59 31 87 -351 -37 33 -122 -16 304 49 -151 -17 -194 -208 -41 61 -409 386 89 -18
5415 -18 -175 109 -275 -15 175 -88 47 -34 -109 -235 -94 110 -74 -58 -54 302 -12 18 -5 -205 394 -66 -49
5438 -49 158 12 -31 31 -106 -65 -168 36 -245 254 203 89 69 -8 -59 -167 85 -220 -42 -72 84 -53 -340
5461 -340 -80 15 161 -27 -63 98 -33 -193 -37 -341 73 -124 178 -111 154 -67 -263 -25 21 88 381
5482 381 58 63 334 10 116 -30 -98 285 -36 133 14 -73 62 -122 265 -151 136 -110 103 -140 39
$$ packed form
5322b10N3j10J11L01j74J5j73J37J86l26K74j99J70k84M18l7k7J00j56J28p1J46
5344B72k14Q7K5o0L6j61O0j44J33j35J02j63j55J91K04n0l8M4r3N0o7J8kL2q7
5369a15q6J98pP1J50m87J04k8K71K46o4k83L04k76j31J71J42m7j09N0M1j3m4J65
5393B23l75o7K78k8N6m38L14P0j55J06L20k55k00J34j77j4J67J02m70P95k97j07
5415a8j57K84l84K60J90k63J35q1p5j26J41K04j84J6ML56l14L0k3k00N99m60J7
5438d9K07j46m3O2j37M1j03K04k81M99n1j14k0p7n1j08K52l05J78l0J56j37k87
5461c40K60R5J46j88l6J61j31j60J56l04M14j97L02k89K65k21j96K38M6O7K93
5482C81l23NK71l24J06j46o8L83l21J69j19q7J35j84L87m16K87k46K13k43J79
$$ plain form
5503 39 25 273 -115 113 -169 -52 73 -142 -36 -18 -70 96 -143 21 -4 9 123 302 -4 -19 -238 99
5525 99 -154 -219 79 377 141 31 -49 -162 -216 -10 42 -36 98 17 -76 -7 12 91 -199 202 40 137 -37 75
5549 75 -86 25 -107 -70 134 -167 109 -47 226 198 154 -250 161 9 116 -63 -7 -35 165 -172 37 -90
5571 -90 -145 117 -119 96 61 197 48 17 383 -125 109 403 -143 361 322 -354 748 52 375 -784 -402
5592 -402 699 -655 -121 642 -61 518 -377 -506 482 -712 282 -169 -300 -172 570 121 -245 547 -680
5611 -680 277 9 -194 8 -297 -132 -186 136 -203 -196 -124 -40 -103 40 -49 -75 -86 76 303 -102 194 -2 102
5634 102 -262 45 60 -104 -15 37 10 31 -137 180 370 70 -23 131 124 96 -47 193 157 127 38 -74 -39 -67 -193
5659 -193 -232 4 -68 -237 -174 -77 5 -315 -96 156 175 203 -218 -205 -134 104 -43 -229 99 162 -85 34 96 -153
$$ packed form
5503C9j4K48l88K28k82J17J25k15J06J8n2J66k39J64k5J3J14J79l06j5k19L37
5525I9k53o5K98K98k36j10q0j13n4K06N2p8J34q1r3O9J9P9k90M01j62R7j74J12
5549G5j61J11j32L7K04l01K76j56K73k8m4m04M11j52J07j79N6k8K00l37K09j27
5571i0n5K62k36K15l5J36j49l1L66n08K34K94n46N04l9o76J102o96L23j159L82
5592d02J101j354N34P63p03N79q95j29R88j194R94m51j31J28P42m49l66P92j227
5611f80R57k68k03K02l05J65n4L22l39PP2Q4o3J43q9k6j1J62K27m05K96j96J04
5634A02l64L07J5j64Q9N2k7K1j68L17J90l00r3J54pk8j43K40l6l0q9j12L5k8j26
5659a93l9K36p2j69O3R7Q2l20K19K52J9K8m21J3P1K38j47j86L28O3k47J19O2k49
$$ plain form
5683 -153 -268 10 46 -5 -27 155 311 -18 255 292 259 13 167 -78 -68 152 -32 99 75 -150 -67 178 -11
5706 -11 -239 -277 41 -37 -3 -54 -225 133 -32 -23 -46 -50 11 -52 -68 29 332 96 148 -65 -48 4 -112 90 483 70
5732 70 106 325 38 99 34 147 201 -10 75 244 -175 5 298 1 8 158 151 -107 -206 188 -177 -103 31 40 -23
5757 -23 -177 185 51 111 -48 -59 77 -189 -173 -129 141 -177 -221 124 210 33 -12 42 123 180 51 123 72 90 -36
5782 -36 -20 126 -2 139 -205 142 233 -112 100 -92 264 45 -134 156 41 349 39 -139 -4 -192 210
5803 210 -68 40 -93 -159 -113 -79 -14 202 239 13 -31 74 161 -144 92 279 -153 -96 -59 -154 -79 335 -51 73
5827 73 182 135 -22 -34 186 135 232 113 121 239 154 12 134 107 197 -100 71 -188 -101 -142 158 28 40 -71
5851 -71 198 -155 94 -26 -354 -89 -111 108 -85 -233 -247 42 152 86 87 52 -128 -70 45 153 94 173 0
$$ packed form
5683a53j15K78L6n1k2J82J56l29K73L7l3k46J54k45J0K20j84J31k4k25Q3K45j89
5706a1k28l8L18p8L4n1j71L58j65Rk3mO1o3j6R7L03k36N2k13J7N2j16K02L93m13
5732G0L6K19k87O1o5J13N4k11Q5J69m19J80K93k97PJ50pk58r9L94l65P4J34Ro3
5757b3j54L62j34O0j59j1J36k66J6M4K70l18m4L45Q6j77m5N4Q1N7j29P2n1J8j26
5782c6J6J46j28J41l44L47R1l45K12j92L56k19j79K90j15L08l10j78J35j88M02
5803B10k78J08j33o6M6L4O5K16L7k26m4J05Q7l05K36J87m32N7L7r5P5M14l86J24
5827G3J09m7j57j2K20n1R7j19QJ18q5j42J22k7R0k97J71k59Q7m1L00j30J2j11
5851g1K69l53K49j20l28K65k2K19j93j48j4K89J10o6Jl5j80N8J15J08n9P9j73
$$ plain form
5874 0 -43 -45 84 -3 -45 -49 12 190 -248 274 2 0 -79 108 83 -103 -121 -355 -204 -144 -94 -157 62 341 -31 -204
5900 -204 -122 -149 -77 150 50 -304 -26 98 29 -138 -50 82 -17 -6 -234 60 29 77 125 -28 201 119 8 132
5924 132 -38 309 12 167 -253 80 146 -196 -6 -137 -34 245 -50 -92 34 -80 3 301 -184 38 140
5945 140 107 103 139 -68 10 87 -35 -277 73 -319 -325 206 20 -11 7 17 -97 -385 201 145 -118 -18 18 162
5969 162 -79 272 70 -128 107 165 121 -9 -97 118 122 -23 50 165 250 -78 167 -134 -199 16 -126 -13 13
5992 13 -31 -224 -190 -1 82 -162 -45 160 9 -14 -6 6 -212 86 223 -187 -97 20 -34 -198 -121 64 110 -298
6016 -298 -78 -78 371 95 -2 30 296 9 154 109 -20 -196 -98 254 42 157 -50 -169 -278 -182 -27 94
6038 94 117 49 -137 63 4 -44 -76 -39 96 -63 97 41 170 -242 -198 -107 -220 173 21 19 -154 -303 102 31
$$ packed form
5874@m3kJ29q7m2mO1J78m38N22k72kp9J87k5j86j8k34J51O0N0o3K19K79l72j73
5900b04Q2k7P2K27j00l54K78J24o9j67Q8J32r9J1k28K94l1M8M8j53K29q2j11J24
5924A32j70L47k97J55m20L33O6l42J90j31J03K79k95m2J26j14Q3K98m85K22J02
5945A40l3mL6k07P8P7j22k42L50l92oN31j86l1J8J0j14k88N86n6k63J00L6J44
5969A62k41L51k02j98K35N8m4j30q8K15Mj45P3J15Q5l28K45l01o5K15j42J13K6
5992A3m4j93L4J89Q3k44J17K05j51k3QJ2k18K98J37m10R0J17n4j64P7J85M6m08
6016b98K20%M49k76r7L2K66k87J45m5j29j76R8L52k12J15k07j19j09R6J55J21
6038I4K3o8j86K00n9m8l2L7J35j59J60n6J29m12M4R1j13L93j52kj73j49M05p1
$$ plain form
6062 31 -33 -31 -159 61 -24 -170 -100 179 291 -165 62 -3 135 203 65 -56 12 304 3 25 -133 21 62 -144
6086 -144 45 -246 -2 -141 -15 -42 127 -100 -115 10 -118 29 -135 -140 -29 -21 174 161 1 -204 -57 -195
6108 -195 -75 10 -509 -81 -233 -168 -269 -8 115 -210 -79 83 -21 191 56 259 160 -14 61 206 136 214
6130 214 340 -96 -212 -24 19 -73 -118 83 110 169 44 -22 -17 36 123 78 324 160 169 -144 -181 -42 -154 -112 13
6155 13 15 91 -93 137 -218 -245 152 124 -56 -63 145 -12 -148 140 158 259 -136 376 165 87 164 339 76 48
6179 48 130 41 -205 -51 125 -19 58 -186 95 -22 -272 -26 -82 193 10 15 -18 -37 -170 32 -23 36 195 -90
6203 -90 -175 70 -84 229 -7 6 107 -28 -42 -21 -5 -162 -8 140 -87 -87 42 129 -194 21 -56 -80 113 -15
6227 -15 249 174 48 54 159 98 -238 141 124 110 49 2 295 -23 311 167 24 -23 162 86 -156 -137 -96 -240
$$ packed form
6062C1o4Kj28K20q5j46P0K79J12m56K27o5J38O8j38j21O8K92l01K2j58J54M1k06
6086a44J89k91K44j39J26k7J69k27j5J25j28J47j64nJ11QJ95j3j60k05J47j38
6108a95J20Q5n19M28j52O5j01K61J23l25J31J62j04K12j35K03r9j74P5J45p0P8
6130B14J26m36j16J88M3r2m5K01K7N9j25o6NN3Q7m5K46j64Rl13l7J39j12M2J25
6155A3KP6j84K30l55k7L97k8j80pK08j57j36K88J8J01l95N12k11p8P7J75k63k8
6179D8Q2q9k46J54J76j44P7k44K81j17k50K46n6K75j83Nl3j9j33K02n5N9J59k85
6203i0q5K45j54L13k36J3J01j35j4K1J6j57J54J48k27%J29Q7l23K15p7k4J93j28
6227a5K64p5j26OJ05o1l36L79j7j4o1m7K93l18L34j44j43m7J85p6k42J9M1j44
$$ plain form
6251 -240 35 196 -245 147 40 -50 100 140 -2 1 -122 -52 150 217 -218 -98 -167 -215 -119 -141 -118 26 131 166
6275 166 -32 -47 23 146 111 12 243 100 -38 -36 7 115 158 37 97 86 248 -19 158 -157 134 -167 108
6298 108 -68 -219 163 41 64 68 219 123 48 10 -243 -252 65 -269 31 -80 -93 198 -7 153 280 120 -211
6321 -211 -50 255 58 356 75 158 229 29 319 75 -185 -34 -156 98 225 3 -118 -187 254 -126 -341
6342 -341 123 -92 -63 51 -227 94 -44 87 -68 64 -23 -289 -212 -210 -258 44 -175 155 150 -291 -122 -29 -180
6365 -180 56 371 48 128 300 22 14 58 201 75 215 -47 45 -149 179 40 -147 -108 255 51 -247 52
6387 52 384 -80 223 74 -312 266 -77 -223 129 -77 109 71 -190 -32 38 -84 -14 -51 -136 -125 193 9
6409 9 36 -98 -150 104 13 -24 -106 15 -95 -34 59 167 -42 86 227 23 205 -147 238 222 141 38 53 219
$$ packed form
6251b40K75J61m41L92j07r0J50M0j42Lj23P0K02O7m35J20o9m8R6k2K3J44J05L5
6275A66j98j5P0J23l5r9K31j43j38KM3J08M3j21O0j1J62k67J77l15K91l01K75
6298A08j76j51L82j22K3MJ51r6p5l8k53rL17l34L00j11j3K91k05J60J27j60l31
6321b11J61L05j97K98k81Q3P1k00K90k44k60J51j22K54J27k22j21o9M41l80k15
6342c41M64k15K9J14k78L21j38J31j55J32q7k66P7Km8L02k19L30nm41J69R3j51
6365a80K36L15l23Q0J72k78qM4J43j26J40k62R2j94L28j39j87L9L63k04k98K99
6387E2L32m64L03j49l86N78l43j46L52k06J86l8k61J58P0j22P0l7q5J1L18j84
6409IK7j34n2K54r1l7q2J21j10O1R3J08k09J28J41k04J82l52L85j6q1j03J5J66
$$ plain form
6433 219 39 -162 -71 7 -20 111 -37 30 -221 -74 -181 3 9 -23 -128 -106 40 -73 -160 214 -49 -232 -81
6456 -81 -161 109 -118 -8 29 214 -338 -207 4 -254 -65 94 26 -190 -186 25 -57 -17 243 233 -139 113 -197
6479 -197 -135 20 112 60 34 180 -183 -70 -250 -228 -177 70 27 -239 57 75 -155 0 137 156 -235 -55 -111
6502 -111 -41 -156 99 -57 -85 251 -68 -247 -116 -165 23 -61 154 367 191 35 19 50 -145 -49 13 155 1
6525 1 -126 -2 65 191 -249 -189 71 2 -8 153 -69 90 -40 -1 -12 -241 -258 -285 46 144 113 161 -119 17
6549 17 -122 26 -141 -194 -64 171 -121 -5 -54 -84 255 285 76 124 -105 155 -135 16 -139 54 -19 43 -96
6572 -96 -124 -90 -5 -149 -119 194 201 -180 -159 65 -268 57 4 29 166 -82 -117 31 -113 80 34 34 -167 -95 -13
6597 -13 -335 -12 40 -86 -132 309 168 -173 -122 18 -181 -146 -94 -427 70 -23 -91 292 20 202 -120 -46 137
$$ packed form
6433B19j80k01R1P8k7J31j48O7k51J47j07J84Ol2j05K2J46j13q7L74k63j83J51
6456h1q0K70k27J10L7J85n52J31K11k58J89J59o8k16MK11q2M0K60j0l72K52l10
6479a97O2J55R2n2k6J46l63J13j80K2N1K47m3k66K96J8k30J55J37J9l91J80n6
6502a11P0j15K55j56k8L36l19j79J31m9J88q4K15K13j76j56j6L1j95R6O2J42j54
6525Aj27J24O7J26m40O0K60o9j0J61k22J59j30L9j1k29j7k7L31R8l1M8k80J36
6549A7j39J48j67n3J30K35k92J16m9l0L39L0k09M8k29K60k90J51j55J93p3O2j39
6572i6k8L4Q5j44L0L13Pl81K1K24l33L25n3K5J37k48l5J48j44J93m6%k01P2Q2
6597a3l22L23N2j26m6M41j41l41N1J40j99L5N2l33M97r3o8L83k72J82l22P4J83
$$ plain form
6620 137 119 1 106 -33 231 44 14 136 81 150 204 247 55 115 -127 -116 -206 -19 124 39 -202 -157 46 -170
6644 -170 71 -287 94 169 -222 -201 -114 305 -5 157 94 -58 51 -238 -168 -22 -52 -18 90 -156 43 115 39
6667 39 -12 146 -112 -110 26 -36 -188 -391 182 158 -214 88 7 -61 -97 2 -7 -13 154 -125 15 -89 53 -55 -135
6692 -135 39 -56 67 224 -139 -44 50 -250 140 132 -205 -98 -136 -102 -177 -41 12 -91 -22 -27 124 -142 -184 -192 -87
6717 -87 211 40 128 -97 126 53 58 -115 128 -34 -110 -74 142 3 34 191 -5 27 219 37 -149 -46 -92
6740 -92 25 35 93 -35 -118 -190 92 -11 -40 -117 87 51 28 -215 1 -87 153 133 134 -182 80 30 72 -59 -114
6765 -114 10 417 160 84 -26 -8 -156 193 97 286 -180 226 198 55 -10 -111 -269 -84 209 -108 121 8
6787 8 15 -30 -109 -124 -34 41 -97 -207 21 -249 153 51 -146 76 -2 -167 149 75 -43 -318 -73 28 -58 -104
$$ packed form
6620A37j8j18J05j39K64j87l0J22n5O9N4M3j92O0k42J1r0J87J43q5k41M5K03k16
6644a70K41l58L81P5l91K1Q7M19l10J62o3j52J09k89P0J46l0L4J08k46J99P2p6
6667C9n1J58k58KJ36o2j52k03N73k4l72L02q1o8l6R9roJ67k79J40j04J42j08q0
6692a35J74r5J23J57l63R5R4l00L90ql37J07l8L4p5J36N3j03O9nJ51k66m2qJ05
6717h7K98j71Q8k25K23p3Nj73K43j62p6L6K16j39L1J57j96L2J92j82j86J03m6
6740i2J17J0N8j28q3p2K82j03k9p7K04l6k3k43K16q8K40k0Jl16K62n0M2j31n5
6765a14J24M07k57p6j10J8j48L49r6J89m66M06k8j43o5j01j58J85K93l17K29j13
6787HPm5p9j5R0P5j38j10K28k70M02j02j97K22p8j65L16p4j18k75K45J01q6m6
$$ plain form
6811 -104 -99 166 13 81 -94 -178 78 -14 53 -41 -165 96 -342 -22 -231 -111 206 36 -28 92 104 78 -38
6834 -38 -167 127 -61 -218 -17 -95 75 -7 190 164 -59 249 -47 81 124 -131 43 105 -203 42 -35 224
6856 224 -12 -94 30 216 266 346 -262 -262 41 12 38 -106 31 90 -129 -50 -54 -174 157 -100 208 120 -164 -165 139
6881 139 53 -170 277 142 -119 86 -62 141 5 43 -21 -72 -65 -37 -53 35 -259 -81 -240 -161 -75 101 34 16
6905 16 128 -142 -7 122 246 -142 232 43 -30 91 114 26 89 170 269 -105 371 158 -8 -18 298 113 109
6928 109 94 176 91 -117 211 -37 -72 154 103 118 13 -102 41 147 -94 -317 -221 130 33 -104 72 26 -275
6951 -275 3 41 -60 2 49 101 73 119 97 -88 159 -81 126 53 11 45 84 93 89 -43 -125 8 69 21 -67 -44 49
6978 49 40 -183 -43 -16 -140 6 -258 -170 3 -176 -73 -15 -169 -100 -236 -102 28 -335 118 -122 73 -83
$$ packed form
6811a04NK65j53O8j75q4K56r2O7r4j24K61m38L20k09J20L17j70o4J20J2k6j16
6834c8j29K94j88j57K01p8J70q2J97k6k23L08k96J28M3k55J74O2l08K45p7K59
6856B24k36q2J24J86N0Q0o08%L03k9K6j44J37N9k19P9mj20L31k57L08q8k84jL04
6881A39q6k23M47j35k61K05j48K03j36L8o4n1PK8j6Q8k94J78j59P9Q6J76o7j8
6905A6J12k70J35J29J24l88L74j89p3J21K3q8O3Q1R9l74M76k13j66j0L16j85m
6928A09j5Q2q5k08L28k48l5K26n1J5j05j15J43J06k41k23R6L51r7j37J76m6l01
6951b75K78L8j01O2M7N2k8M6k2j85K47k40K07p3m2L4L9Rmj32q2J33O1m8q8K3R3
6978D9rk23J40K7j24J46k64Q8J73j79J03N8j54O9j36J34J30l63M53k40J95j56
$$ plain form
7000 -83 -66 194 149 -56 -175 232 -91 21 0 230 -10 131 84 129 -59 -127 -15 132 115 38 189 453 -136
7023 -136 12 -106 169 8 -151 -28 -9 47 46 92 -27 33 128 116 -148 56 -54 121 -274 -20 25 -81 -142
7046 -142 -345 113 -28 -201 137 72 -185 -125 -86 -56 66 141 259 60 -56 53 -24 91 -282 78 -124 -93
7068 -93 119 -83 7 -244 131 -160 -81 -218 -65 330 66 -97 116 -190 -91 -203 42 -106 57 5 -430 59
7090 59 -347 -341 -8 -48 5 -286 -312 -97 -385 44 4 -13 -58 73 155 -7 274 -119 241 4 -353 128 -129
7113 -129 -60 -220 -56 -8 -11 -149 103 68 -22 144 11 416 83 164 287 -89 -3 -2 337 172 71 14 110 -189
7137 -189 -157 -1 -11 59 155 213 -237 -64 -333 85 -191 -255 32 64 85 82 -135 15 53 -224 28 -114 156 -21
7161 -21 -175 -153 -203 107 212 36 40 -132 141 117 -80 -154 35 -71 298 -134 -116 22 439 -180 47 189 177
$$ packed form
7000h3J7K60m5k05j19M07l23J12k1K30k40J41m7M5j88o8J12J47j7p7J51K64n89
7023a36J48j18K75j61j59J23J9N6jM6j19O0R5j2k64K04j10J75l95K54M5j06o1
7046a42k03M58j41j73L38o5k57O0L9L0J22P5J18j99j16J09p7J15l73L60k02L1
7068i3K12k02R0k51L75k91P9j37J53L95k64j63K13l06R9j12K45j48J63n2m35M89
7090E9m06OL33m0N3k91k6K15k88M29m0j7m5J31Q2j62K81l93L60k37l57M81k57
7113a29O9j60J64M8lj38K52l5r0J66j33M05l33Q1J23l76Q6JL39j65j01n7R6k99
7137a89L2J56j0P0R6N8m50J73k69M18k76o4K87L2K1lk17J50L8k77K52j42K70j77
7161b1j54K2n0L10J05j76Mj72K73k4j97p4J89j06L69m32J8J38M17o19K27J42j2
$$ plain form
7184 177 83 206 -23 174 -113 -80 -88 -49 390 -38 -116 -119 -6 100 202 34 32 -225 20 214 -82 160 4
7207 4 -12 78 -122 47 192 15 -4 -159 81 -39 137 -148 -170 -133 42 -130 192 -34 -125 -209 20 12 34 127
7231 127 145 -164 -50 -139 113 -119 76 83 96 283 -4 145 39 89 -222 137 -224 73 -5 -193 -12 -9 71
7254 71 47 17 468 -65 -182 46 -106 -17 -251 -217 88 67 110 102 -49 33 -57 52 57 164 -153 -101 168 2 -91
7279 -91 -204 -55 -92 -116 -78 159 -1 78 -46 26 -91 304 -19 99 175 -47 279 -55 -99 -112 37 -209 62
7302 62 107 -39 -395 288 -4 -27 -71 28 -154 -83 137 -33 -20 195 -137 -168 29 -18 -21 127 -207 -89 59 -176
7326 -176 -38 -103 -31 -119 -61 -276 301 -251 -303 -64 37 -31 224 -147 -44 63 -229 -323 40 -24 183 -131 199
7349 199 57 14 -285 -31 -184 -1 83 -35 -27 -59 430 -21 236 -211 -70 -95 216 -49 125 -79 -17 -273
$$ packed form
7184A77r4J23k29J97k87L3qL9M39m28p8lJ13J06J02j68kk57K45J94k96K42j56
7207Dj6R0k00J69J45j77j9j55K40j20J76k85k2L7J75j72L22k26r1q4K29qK2R3
7231A27J8l09J14q9K52k32J95PJ3J87k87J49j06N0l11L59l61K97p8j88J81LQ0
7254G1k4l0M51n33j17K28j52Q9k34L4L05k1M3qj51Q2r0J09NJ07l17N2K69j66r3
7279i1j13J49l7k4L8K37j60P9j24P2j17L95l23J18P6k22L26l34m4j3J49k46K71
7302F2M5j46l56O83k92k3m4R9j82P1K20j70J3K15l32l1J97m7lJ48l34J18J48k35
7326a76J38o5P2q8N8k15N77n52n2K39J01o8K55l71J03J07k92r4L63o4K07l14L30
7349A99j42m3k99K54j53J83Q4j18Ql2M89m51K57m47J41k5L11k65J74k04O2k56
$$ plain form
7371 -273 84 -16 124 54 -267 126 90 225 -166 156 217 18 26 33 87 -28 209 167 104 90 155 -230 -107 -218
7395 -218 -269 86 -238 -31 4 -41 185 -185 165 -18 35 -354 69 151 11 92 105 295 -125 -72 105 -45 71
7418 71 -356 -99 -166 156 -67 -50 -76 -97 98 48 212 -189 11 -14 60 -134 306 153 -95 -57 -36 -30 54 29 95
7443 95 102 -124 -51 -119 211 -26 -94 -187 -25 92 263 78 -129 261 -70 97 -105 -78 138 40 -68 -70 -162 135
7467 135 172 54 275 232 142 -265 182 -86 40 106 224 -152 -105 66 23 27 -64 100 -71 -166 174 -42 57 46
7491 46 -21 -86 -68 82 -211 383 -80 -44 -38 -161 121 49 -67 162 86 100 -104 -70 39 -322 243 151 27 56
7515 56 56 28 -36 80 -174 6 96 20 389 39 -111 3 65 -54 71 203 65 -104 -28 106 84 -28 27 -35
7539 -35 -245 -156 1 28 32 401 -61 -51 -7 87 -52 -12 -113 185 -55 -130 -211 214 41 203 56 34 -41 296
$$ packed form
7371b73L57j00J40p0l21L93l6J35l91L22O1j99QPN4j15K37m2o3j4O5l85J23j11
7395b18n1L55l24K07L5m5K26l70L50j83N3l89M23Q2j40Q1J3J90m20N3J77j50J16
7418G1m27K57o7L22k23J7k6k1J95n0J64m01K00k5P4j94M40j53k48L8K1OQ4k5O6
7443I5Pk26P3o8L30k37o8r3J62J17J71j85k07L90l31J67k02K7K16r8j08kr2K97
7467A35L7j18K21m3r0m07M47k68J26O6J18l76M7J71m3Mr1J64j71r5L40k16R9j1
7491D6o7o5J8J50k93N94m63L6Oj23K82p2j16K29p6J4k04L4J09l61N65r2j24K9
7515E6%k8o4J16k54J80R0p6L69l50j50J14O2j19J25J32j38j69P6J34k2j12N5o2
7539c5k10Q9J57K7ML69m62J0M4R4j39M0j01K98k40p5q1M25j73J62j47k2p5L37
$$ plain form
7563 296 -140 -428 7 522 -65 -28 385 -420 73 -241 -123 -102 -35 -134 -105 -8 -15 -155 -113 -159 -15 85 -110
7586 -110 40 156 36 127 -130 63 -48 -97 -73 61 -72 -90 -31 -49 24 -234 -156 -261 -4 -15 -176 72 42
7609 42 -45 76 153 -51 -56 -29 -37 -80 89 7 -40 -27 -346 -7 -176 -99 -21 -3 109 28 -161 131 43 -55 102 43
7635 43 164 39 16 58 167 2 166 -140 129 158 35 23 -118 173 80 -68 29 22 -2 -106 -161 166 -66 -3
7659 -3 -34 -167 188 -5 16 106 -30 -63 300 80 91 -88 -36 -157 -118 -37 -52 -108 37 43 52 -39 -142 -70 306 -27
7685 -27 -4 124 56 40 67 -62 19 -24 -29 101 19 17 112 31 117 -130 46 -102 -30 32 104 112 -150 -241 107 28 33 193
7713 193 59 69 -7 85 -205 -273 43 -166 64 78 -208 -43 -181 157 169 -187 262 92 95 -159 -19 164 -58
7736 -58 -91 -64 -105 -19 100 -170 -212 -206 296 138 -63 53 1 144 9 164 -256 162 21 -6 -11 159 201 -28
$$ packed form
7563B96m36k88M35N15n87L7M13q05M93l14J18K1O7r9K9R7pj40M2m6J44J00j95
7586a10J50J16j20R1k57J93j11m9K4J34j33j8N9j8P3k58P8j05K57j1j61K48l0
7609D2q7J21P7k04nK7qm3J69q2m7J3l19L39j69P7P8J8J12q1j89K92q8r8J57n9
7635D3J21j25k3M2J09j65J64l06K69K9j23j2j41K91r3j48R7pk4j04n5L27k32O3
7659cl1j33L55j93K1R0j36l3L63k20J1j79N2j21L9Q1j5n6J45ORr1j03P2L76l33
7685b7K3J28o8j6K7j29Q1m3nJ30q2kR5q1Q6k47J76j48P2O2P2Qk62r1L48p9NJ60
7713A93j34J0p6R2k90o8L16k09K30J4k86J65j38L38J2l56M49j70Lk54J40J83k22
7736e8l3K7m1Q6J19k70m2ON02j58k01J16n2J43j35J55m20M18j41k7nJ70M2k29
$$ plain form
7760 -28 200 230 -68 -227 32 -222 -5 -30 138 -322 53 -83 7 217 -211 205 -50 138 253 -4 44 125
7782 125 -248 -291 -93 -22 -300 3 -147 108 -2 -215 124 -91 104 -53 191 -27 91 -118 -47 -106 222
7803 222 -87 -140 -124 -199 101 280 22 0 -186 -124 -195 62 1 -151 232 -10 -32 -142 122 176 -350 -85 95
7826 95 -262 -7 33 66 -164 82 256 202 131 -100 217 68 0 -37 73 54 -67 -108 -158 -159 66 49 267 139
7850 139 173 166 -69 -26 172 -15 34 31 92 -305 -80 -340 78 2 -40 -106 215 151 -132 161 -144 23 -24 148
7874 148 259 148 -81 135 -133 78 111 2 121 -146 -13 62 276 -185 -143 324 49 -239 290 97 -78
7895 -78 -113 -3 165 52 -329 186 284 2 114 -119 101 171 -160 -187 -128 -285 -66 -176 9 41 23 -93 -15
7918 -15 11 36 -126 -93 90 -64 199 -160 37 -50 71 -26 45 -133 -52 -228 -266 -33 58 287 53 -10 -145 109
$$ packed form
7760b8K28L0k98j59K59k54K17k5J68m60L75j36R0K10m28M16k55J88J15k57M8Q1
7782A25l73m3J98P1k78L03j50K55j10k13L39k15J95j57K44k18J18k09P1n9L28
7803B22l09n3J6p5L00J79k58k2j86O2p1K57o1j52L83k42k2j10K64N4n26K65J80
7826I5l57K55M0L3k30K46J74n4p1k31L17j49o8l7J10j9j21m1n0jK25j7K18j28
7850A39L4pk35M3J98j87M9lO1l97K25k60M18p6m2o6L21o4k83K93l05J67m7J72
7874A48J11j11k29K16k68K11L3j09J19k67J33P5K14m61M2M67k75k88N29j93j75
7895g8l5J10J68j13l81N15R8k82J12k33K20P0l31k7N9j57K19j10J85L2j8j16P8
7918a5K6K5j62L3J83j54K63l59J97q7J21r7P1j78Q1j76l8K33R1K29k34o3j35K54
$$ plain form
7942 109 -27 10 -92 -57 218 41 30 172 -12 -101 159 -65 -96 -292 -110 -64 -54 37 104 79 -38 -19 13 -58
7966 -58 9 45 160 -77 63 128 -102 90 -186 -95 -144 -102 -429 215 31 -259 -65 -67 -104 59 -156 225 121
7989 121 -156 138 240 50 231 91 79 -172 -184 39 -58 138 -37 -289 -191 210 27 -45 -145 38 389 57
8011 57 0 -12 179 -332 -88 32 130 -46 -57 149 181 5 -257 -72 63 -10 -201 -69 6 -109 -18 75 92 105
8035 105 -202 258 -221 -38 85 -56 4 -311 70 -96 51 5 132 51 105 -192 8 -38 -121 163 135 -165
8057 -165 -160 -197 215 -35 -33 -133 231 -125 229 -121 -185 251 51 71 116 -269 30 145 -310 -137 -186 -128 -18
8080 -18 18 -69 -35 74 -61 46 72 89 231 -68 97 145 -123 -163 -145 65 -1 -12 -71 -55 -87 41 281 -229 47
8105 47 49 -96 -54 38 -116 145 36 -28 -77 -214 128 -58 -95 -266 5 186 -83 -42 11 -196 -230 -142 -112 156
$$ packed form
7942A09j36L7j02L5K75j77j1J42j84q9K60k24l1j96J82M6J0R1O7k5j17J9L2p1
7966e8O7L6J15k37J40O5k30J92k76R1m9M2l27O44j84k90J94kl7J63k15L81j04
7989A21k77K94J02j90J81j40j2k51j2K23r7J96j75k52R8M01j83p2j00J83L51l32
8011E7n7j2J91n11K44J20R8j76j1K06L2j76k62J85J35p3j91J32P5j15R1R3J7J3
8035A05l07M60m79J83J23j41O0l15L81j66J47m6J27q1N4k97K00m6q3K84k8l00
8057a65Nl7M12k50Kj00L64l56L54l50o4M36k00K0M5l85K99J15m55J73m9N8J10
8080a8L6q7L4J09j35J07K6J7J42k99J65M8k68m0J8K10o6j1n9J6l2J28K40n10K76
8105D7Kj45M2R2j54K61j09o4m9j37L42j86l7j71K71J81k69M1N3k07l4Q8L0K68
$$ plain form
8129 156 -226 66 -100 -213 -261 -227 77 -26 93 -142 175 6 40 132 -83 31 -35 20 -54 -73 36 102 236
8152 236 -96 34 -55 264 86 27 -220 -57 239 194 -86 266 139 -24 154 -36 92 -53 105 -2 262
8173 262 83 -255 -47 34 -202 -86 86 157 34 -255 -102 40 174 -58 69 -153 -47 -247
$$ packed form
8129A56l82K92j66j13m8L4L04j03J19k35L17j69L4R2k15J14o6N5p4j9J09O6J34
8152B36l32J30q9L19j78n9k47J63K96m5k80L52j27j63J78j90J28j45J58j07K64
8173B62j79l38K08Q1k36J16J72P1j23k89J53J42J34k32J27k22J06k00
8191b47
$$ Imaginary data points
##PAGE= N=2
##DATA TABLE= (X++(I..I)), XYDATA
$$ plain form
0 0 0 0 0 0 0 0 0 0 0 0 0 0 -8 8 -8 8 -8 16 -16 17 -24 25 -32 40 -48 56 -64 72 -81 96 -108 122 -138 161
34 161 -177 201 -225 255 -283 317 -352 392 -432 481 -530 586 -649 715 -787 868 -955 1053
52 1053 -1162 1282 -1416 1568 -1744 1940 -2174 2445 -2777 3181 -3693 4367 -5291 6652 -8860
67 -8860 13055 -23994 121660 259267 160538 142464 114809 120992 114603 131847 116675 99485
79 99485 84382 87683 64804 42492 33592 40880 26637 10786 1237 -5783 -29849 -45704 -46202 -41946
93 -41946 -50418 -59489 -65675 -66937 -68585 -67068 -67818 -68531 -68476 -63730 -58324 -53453 -50413 -41231 -20859 -340
109 -340 -1653 -20336 -23427 1215 28038 41160 44632 41662 29753 25362 40383 59599 67671 73773
123 73773 81699 76133 57379 47262 44638 31908 17966 24558 37692 33043 14833 1709 -8266
$$ packed form
0@%%%%%%%%%%%%qJ6j6J6j6K4l2L3m1M9n7P2q8J04j20J36j53J77k04K30k60K99
34A61l38L78m26M80n38O00o69P44q24R13j011J116j235J364j502J655j823K008
52A053k215K444k698K984l312L684m114M619n222N958o874Q060r658J1943j5512
67h860K1915l7049J45654J37607r8729j8074k7655O183o389J7244j5172j7190
79I9485j5103L301k2879k2312q900P288j4243j5851r549p020k4066j5855m98M256
93d1946q472r071o186j262j648J517p50p13N5M746N406M871L040R182K0372K0519
109c40j313j8683l091K4642K6823J3122L472k970j1909m391J5021J9216Q072O102
123G3773P926n566j8754j0117k624j2730j3942O592J3134m649j8210j3124r975
$$ plain form
136 -8266 -18612 -17158 -7262 -8896 -19971 -22913 -20137 -27985 -39079 -37074 -28034 -28408 -35124 -40055 -44287
151 -44287 -44795 -34474 -19663 -13412 -13728 -10962 -4385 1418 6742 11804 15616 18307 20264 22830 28831
166 28831 36622 37913 35245 41668 55913 58725 46524 35817 31112 25326 23082 31511 34844 22341
180 22341 10120 11772 9601 -3988 -7708 2516 2244 -12943 -21026 -19328 -25965 -36966 -33330 -26391
194 -26391 -32146 -38188 -31709 -25334 -30805 -33722 -26346 -23040 -30262 -32513 -26174 -21599 -21432 -16177 -3261
209 -3261 8511 13335 10979 7478 6532 9834 15555 22637 27290 23318 14887 13262 18075 19579 21166
224 21166 29505 34285 22249 6267 1603 -822 -8764 -9277 3893 9738 2245 -5584 -9107 -20895
238 -20895 -33820 -29853 -18012 -17095 -20620 -16082 -14368 -24645 -31449 -25193 -18794 -19228 -18224 -13674 -14492
$$ packed form
136h266j0346J454R896j634j1075k942K776p848j1094K005R040l74o716m931m232
151d4287n08J0321J4811O251l16K766O577N803N324N062L812K691J957K566O001
166B8831P791J291k668O423J4245K812j2201j0707m705n786k244Q429L333j2503
180B2341j2221J652k171j3589l720J0224k72j5187q083J698o637j1001L636O939
194b6391n755o042O479O375n471k917P376L306p222k251O339M575J67N255J2916
209c261J1772M824k356l501r46L302N721P082M653l972q431j625M813J504J587
224B1166Q339M780j2036j5982m664k425p942n13J3170N845p493p829l523j1788
238b0895j2925L967J1841R17l525M538J714j0277o804O256O399m34J004M550q18
$$ plain form
253 -14492 -16323 -10172 -2602 -348 916 7356 12073 12127 14091 18527 20482 19721 19494 18261 17613 20526
269 20526 24069 24644 23907 23037 18670 11727 8415 7944 7351 8915 11664 7042 -4620 -12117 -13703 -16811
285 -16811 -17524 -8664 974 -3851 -15056 -22064 -30308 -41580 -41588 -28568 -20765 -20752 -15565 -9212 -16237 -26649
301 -26649 -21645 -10343 -10273 -11563 -4222 697 -3180 -2397 8556 15185 15013 19626 27654 26829 20420 20182
317 20182 23592 22728 19511 20150 22335 20730 17030 14911 16329 17330 13925 7657 4119 3412 407 -1888
333 -1888 1338 2282 -5927 -14066 -14527 -16619 -24166 -23340 -11105 -7894 -18389 -25454 -24558 -28915 -35004 -27566
349 -27566 -13961 -10897 -12968 -6859 -1967 -8988 -13584 -5256 2066 2200 5228 13565 14081 7272 7382
364 7382 14715 19650 20351 21525 20668 16343 14487 17264 19129 18262 17070 15377 11519 6511 2071 -995
$$ packed form
253a4492j831O151P570K254J264O440M717N4J964M436J955p61k27j233o48K913
269B0526L543N75p37q70m367o943l312m71n93J564K749m622j1662p497j586l108
285a6811p13Q860R638m825j1205p008q244j1272qJ3020P803J3N187O353p025j0412
301b6649N004J1302P0j290P341M919l877P83J0953O629j72M613Q028q25o409k38
317B0182L410q64l217O39K185j605l700k119J418J001l405o268l538p07l005k295
333a888L226R44q209q139m61k092p547Q26J2235L211j0495p065Q96m357o089P438
349b7566J3605L064k071O109M892p021m596Q328P322J34L028Q337N16o809J10
364G382P333M935P01J174q57m325j856K777J865q67j192j693l858n008m440l066
$$ plain form
380 -995 -710 -86 -3466 -9599 -11199 -8997 -8835 -8402 -5480 -4729 -11149 -17420 -19574 -24492 -29528 -25427 -15831
397 -15831 -11305 -10453 -7201 -7281 -15405 -17828 -7074 2834 5736 8259 11570 8242 4773 10568 18125
412 18125 18092 17358 23722 25485 17764 13084 16677 17597 14095 15522 19637 17936 12576 12075 12454 8288
428 8288 4847 5915 5719 -260 -5680 -8088 -9735 -11536 -12908 -13794 -15335 -18366 -21384 -20548 -13461 -7346
444 -7346 -9110 -15938 -20233 -23739 -26162 -20655 -8156 -2108 -3117 434 5842 1937 -5504 -1603 8005
459 8005 10395 12494 21101 25970 18212 12112 16841 20184 17966 19576 24961 20610 9459 6394 10288
474 10288 10473 9390 13182 15370 8504 701 -1763 -1401 -3256 -5808 -7734 -9865 -11091 -10307 -9126 -9380
490 -9380 -11327 -15222 -17180 -15024 -12980 -14826 -15193 -10396 -7002 -7697 -7253 -4325 -5037 -7942 -1538 11005
$$ packed form
380i95K85O24l380o133j600K202J62M33K922P51o420o271k154m918n036M101R596
397a5831M526Q52L252q0q124k423J0754R908K902K523L311l328l469N795P557
412A8125l3p34O364J763p721m680L593R20l502J427M115j701n360n01L79m166
428H288l441J068j96n979n420k408j647j801j372q86j541l031l018Q36P087O115
444g346j764o828m295l506k423N507J2499O048j009L551N408l905p441L901R608
459H005K390K099Q607M869p758o100M729L343k218J610N385m351j1151l065L894
474A0288J85j083L792K188o866p803k464L62j855k552j926k131j226P84J181k54
490i380j947l895j958K156K044j846l67M797L394o95M44K928p12k905O404J2543
$$ plain form
506 11005 16835 16493 16153 13894 5514 1934 9676 18366 20201 22883 26644 22193 13050 11148 14583
521 14583 12537 8588 9103 8701 3034 -9 858 -1326 -5540 -4550 -733 -2444 -9111 -14183 -19113 -24420
537 -24420 -24334 -18270 -14582 -16566 -18684 -18839 -18789 -17009 -13304 -11887 -14782 -16456 -14591 -10512 -4874 -17
553 -17 1695 1628 2178 2205 1267 4149 11659 16515 16006 17959 20697 17117 11267 11641 14627 13582 13711 19404
571 19404 19595 8893 1148 1345 860 -1672 2299 9150 4430 -7088 -10892 -7852 -8683 -10573 -8194
586 -8194 -7441 -13092 -16548 -13637 -12233 -16136 -16664 -12196 -9090 -8935 -8585 -6965 -6663 -6733 -6348 -4246 -1318
603 -1318 695 1441 2906 6361 9355 9173 9401 9705 4858 -1139 558 7338 9423 9604 12582 11144
619 11144 1287 -6019 -3257 87 -3140 -5988 -5306 -8699 -15920 -17043 -14380 -16153 -18934 -14378 -9228
$$ packed form
506A1005N830l42l40k259q380l580P742Q690J835K682L761m451r143j902L435
521A4583k046l949N15m02n667l043Q67k184m214R90L817j711o667n072m930n307
537b4420Q6O064L688j984k118j55N0J780L705J417k895j674J865M079N638M857
553a7J712o7N50K7r38K882P510M856n09J953K738l580n850L74K986j045J29N693
571A9404J91j0702p745J97m85k532L971O851m720j1518l804L040q31j890K379
586h194P53n651l456K911J404l903n28M468L106J55L50J620L02p0L85K102K928
603a318K013P46J465L455K994j82K28L04m847n997J697O780K085J81K978j438
619A1144r857p306K762L344l227k848O82l393p221j123K663j773k781M556N150
$$ plain form
634 -9228 -12252 -17346 -19063 -20432 -22390 -18997 -11744 -8768 -9203 -8916 -8390 -10187 -9147 -4052 -1 588
650 588 1927 4271 4645 5467 9240 11664 12114 12858 14284 14204 14984 18294 18676 15777 11978 9979 7551
667 7551 6459 7802 9521 8473 9132 10021 5632 -2729 -7829 -9528 -10946 -10535 -5555 -4579 -11280 -16498
683 -16498 -16148 -16382 -18351 -13629 -7667 -9536 -15323 -15195 -13032 -14278 -13087 -4139 2975 2199 670 2930
699 2930 1863 -1147 1295 7257 9973 9648 12796 16775 15810 13276 13901 15021 15138 13924 11873 10224
715 10224 9324 9006 8775 8966 7181 1838 -3834 -4449 -2411 -3001 -4074 -3069 -5001 -13151 -19188 -17911
731 -17911 -16438 -18184 -15310 -9405 -11207 -18389 -20480 -18216 -18532 -18230 -11403 -5946 -7711 -9472 -5531
746 -5531 -2915 -4176 -813 6879 11708 11476 11508 11849 9390 8713 13390 18701 20837 21931 22533 21084 18417
$$ packed form
634i228l024n094j717j369j958L393P253K976m35K87N26j797J040N095M051N89
650E88J339K344L74Q22L773K424M50P44J426q0P80L310L82k899l799j999k428
667G551j092J343J719j048O59Q89m389q361n100j699j418M11M980R76o701n218
683a6498L50k34j969M722N962j869n787J28K163j246J191Q948P114p76j529K260
699B930j067l010K442N962K716l25L148L979r65k534O25J120J17j214k051j649
715A0224r00l18k31J91j785n343n672o15K038n90j073J005j932q150o037J277
731a7911J473j746K874N905j802p182k091K264l16L02O827N457j765j761L941
746e531K616j261L363P692M829k32L2L41k459o77M677N311K136J094O02j449k667
$$ plain form
763 18417 18046 17315 15496 13751 12825 10163 8655 8921 8893 6819 5069 2568 -2218 -7350 -8032 -7055 -7540
780 -7540 -8513 -8126 -10281 -15171 -16522 -14738 -15318 -15520 -12023 -8691 -11177 -14622 -14733 -15997 -16649 -11524 -2850
797 -2850 -219 -1719 -1201 -1060 -3602 -2713 4215 9434 8597 8579 10873 9244 5563 6952 11602 11796 10725
814 10725 11830 11675 7795 4763 5453 5231 2062 1244 2043 1952 -39 -1752 -2997 -4277 -5728 -7539 -10231
831 -10231 -12946 -13835 -13686 -11816 -7533 -6520 -10552 -14104 -14159 -13831 -13163 -8417 -2329 -2759 -6615 -5657 -2498
848 -2498 -2643 -1893 5079 10536 8887 6931 9257 8923 5141 6844 13635 16784 15554 17045 18559 14027
864 14027 7691 7827 9996 9900 9053 9078 6964 1525 -573 83 759 -241 -2004 -4394 -6669 -7538 -7071
881 -7071 -7358 -8214 -9607 -12454 -13449 -11315 -9086 -9208 -8755 -6225 -5930 -9167 -9548 -7706 -7681 -6888 -1799 3078
$$ packed form
763A8417l71p31j819j745r26k662j508K66k8k074j750k501m786n132o82R77m85
780g540r73L87k155m890j351J784n80k02L497L332k486l445j11j264o52N125Q674
797b850K631j500N18J41k542Q89O928N219q37j8K294j629l681J389M650J94j071
814A0725J105j55l880l032O90k22l169q18P99r1j991j713j245j280j451j811k692
831a0231k715q89J49J870M283J013m032l552n5L28O68M746O088m30l856R58L159
848b498j45P50O972N457j649j956K326l34l782J703O791L149j230J491J514m532
864A4027o336J36K169r6q47K5k114n439k098O56O76j000j763k390k275q69M67
881g071k87q56j393k847r95K134K229j22M53K530K95l237l81J842K5P93N089M877
$$ plain form
899 3078 3676 2875 4323 4300 1329 3319 9289 12616 11720 10428 8761 4868 3266 8303 12715 12749 11336
916 11336 10031 6451 1096 413 1350 -215 -2846 -1404 -159 -2708 -5708 -6393 -8204 -10597 -9606 -7686
932 -7686 -8214 -10554 -11070 -10124 -9355 -8497 -6763 -5771 -6509 -7111 -6292 -4538 -996 1216 714 -891 -794 -58
950 -58 1595 6440 11658 12349 9632 9594 9972 8012 7860 12569 14877 12117 10706 13038 10952 4700 2466
967 2466 5356 5549 4143 5812 5624 -1133 -7865 -7307 -4917 -5543 -5512 -3099 -4346 -9592 -12244 -10934 -10132
984 -10132 -11082 -10654 -10145 -10280 -10282 -8511 -6775 -5710 -5201 -5568 -5575 -3993 -2098 -1541 822 3812 4306 3438 5366
1003 5366 7663 5875 4531 7149 11026 10965 9112 8560 6162 2125 2538 7569 9515 6615 4705 2977
1019 2977 -2377 -6726 -5291 -2529 -3421 -4858 -4029 -5504 -9570 -11083 -9936 -10077 -10744 -8804 -7298 -9089
$$ packed form
899C078N98q01J448k3k971J990N970L327q96j292j667l893j602N037M412L4j413
916A1336j305l580n355o83R37j565k631J442J245k549l000o85j811k393R91J920
932g686n28k340n16R46P69Q58J734R92p38o02Q19J754L542K212n02j605R7P36
950e8J653M845N218O91k717l8L78j960j52M709K308k760j411K332k086o252k234
967B466K890J93j406J669j88o757o732N58K390o26L1K413j247n246k652J310Q02
984a0132r50M28N09j35kJ771J736J065N09l67pJ582J895N57K363K990M94q68J928
1003E366K297j788j344K618L877o1j853n52k398m037M13N031J946k900j910j728
1019B977n354m349J435K762q92j437Q29j475m066j513J147j41o67J940J506j791
$$ plain form
1035 -9089 -11419 -11049 -10968 -11746 -9623 -6411 -4632 -4411 -3999 -3341 -3568 -1347 1220 2113 1663 1729 3299 5722
1053 5722 8291 10809 10809 8995 7885 7235 6413 7151 9039 9013 6797 5590 5230 2216 290 1742 2908
1070 2908 1344 529 832 -2321 -8130 -9368 -6626 -5880 -6352 -3859 -1813 -5919 -10822 -10028 -8679 -8911
1086 -8911 -7537 -3237 -3145 -6628 -6831 -4278 -3090 -3553 -996 2007 1894 1367 2836 4476 4283 4341 5304
1103 5304 6873 7442 7438 7275 7305 8287 7231 6421 5757 4424 1407 87 2432 4103 2763 1030 1059 -1466
1121 -1466 -6288 -7382 -4317 -3561 -4995 -4870 -4129 -7993 -12283 -10251 -6800 -7270 -6833 -4402 -3965 -8080
1137 -8080 -9610 -7040 -6071 -5933 -3466 871 1782 532 516 1587 1571 3188 5968 7697 7366 7284 7981 8323
1155 8323 8463 9211 9702 9279 8906 8021 6314 5900 6249 5605 3864 2830 1823 168 -538 1424 1616 156
$$ packed form
1035i089k330L70Q1p78K123L212J779K21M12O58k27K221K567Q93m50O6J570K423
1053E722K569K518%j814j110o50q22P38J888k6k216j207l60l014j926J452J166
1070B908j564q15L03l153n809j238K742P46m72K493K046m106m903P94J349k32
1086h911J374M300R2l483k03K553J188m63K557L003j13n27J469J640j93N8R63
1103E304J569N69mj63L0R82j056q10o64j333l017j320K345J671j340j733K9k525
1121a466m822j094L065P56j434J25P41l864m290K032L451m70M37K431M37m115
1137h080j530K570R69J38K467M337R11j250j6J071j6J617K780J729l31q2O97L42
1155H323J40P48M91m23l73q85j707m14L49o44j741j034j007j655p06J962J92j460
$$ plain form
1173 156 -1339 -2694 -5546 -7786 -6619 -4743 -5010 -5038 -3401 -4413 -8333 -9957 -8562 -7595 -6635 -3696
1189 -3696 -1624 -3677 -6263 -4681 -2768 -3275 -1258 3771 5384 3425 2953 3956 3101 2450 5014 8214
1205 8214 7215 5542 5860 6257 5044 4642 5697 5124 3231 1712 1579 1668 1261 383 -122 -717 -1092 -3041
1223 -3041 -4329 -3832 -3384 -4413 -4388 -3650 -5889 -8881 -8700 -6113 -5390 -5753 -3214 -2004 -4744 -8145 -6888
1240 -6888 -4120 -3406 -1568 2671 3489 142 -812 1316 2191 1430 3953 7008 6660 4243 4529 5296 3864
1257 3864 2347 3944 5574 4972 4232 3394 2514 272 454 1202 1281 430 -464 -1229 -1280 -834 -1217 -1570 -2159
1276 -2159 -3337 -5113 -5790 -4011 -2685 -3092 -3007 -2684 -4126 -5660 -4387 -2102 -1649 -1412 190 545 -1113
1293 -1113 -1392 955 1891 2056 4558 7240 7063 4755 3771 2956 1250 2116 5337 6935 4684 2848 2252
$$ packed form
1173A56j495j355k852k240J167J876k67k8J637j012l920j624J395R67R60K939
1189c696K072k053k586J582J913n07K017N029J613j959m72J003q55o51K564L200
1205H214r99j673L18L97j213m02J055n73j893j519j33Q9m07q78n05n95l75j949
1223c041j288M97M48j029K5P38k239k992J81K587P23l63K539J210k740l401J257
1240f888K768P14J838M239Q18l347r54K128Q75p61K523L055l48k417K86P67j432
1257C864j517J597J630o02p40q38q80k242J82P48P9q51q94p65n1M46l83l53n89
1276b159j178j776o77J779J326m07Q5L23j442j534J273K285M53K37J602L55j658
1293a113k79K347R36J65K502K682j77k308r84q15j706Q66L221J598k251j836n96
$$ plain form
1310 2252 894 -334 717 2497 1176 -485 -647 -1367 -3008 -3803 -2789 -2597 -4069 -3682 -3202 -3516 -4187
1327 -4187 -4227 -4539 -5221 -5316 -5571 -5413 -5218 -4343 -3601 -2377 -661 -498 -1779 -2584 -1389 -443 692 4033
1345 4033 5897 3865 1366 2037 3579 3831 5161 8315 8400 5144 4161 4696 3959 2017 3323 5280 4672
1362 4672 2112 1894 1900 -1131 -2530 -1139 674 -470 -1035 -1045 -2081 -4557 -5052 -3752 -2627 -3493 -3933
1379 -3933 -4175 -4938 -4810 -4192 -2872 -2083 -2782 -4135 -2891 -1204 381 715 1477 1856 798 -125 1858
1396 1858 3885 3933 3880 5934 6678 4515 3343 3705 2992 1786 3228 5823 5671 3149 2059 1676 -402
1413 -402 -1225 1001 2525 1208 -1066 -2110 -3600 -5235 -4635 -2953 -3219 -4278 -4205 -4189 -5094 -5497 -4888 -4879
1431 -4879 -5427 -4852 -3761 -3533 -3302 -2817 -2560 -1634 -517 575 915 634 792 1799 2847 4014 4438 3645
$$ packed form
1310B252j358j228J051J780j321j661j62p20j641p95J014J92j472L87M80l14o71
1327d187m0l12o82r5k55J58J95Q75P42J224J716J63j281q05J195R46J135L341
1345D033J864k032k499O71J542K52J330L154Q5l256r83N35p37j942J306J957o08
1362D672k560k18Ol031j399J391J813j144n65j0j036k476m95J300J125q66m40
1379c933k42p63J28O18J320P89o99j353J244J687J585L34P62L79j058r23J983
1396A858K027M8n3K054P44k163j172L62p13j206J442K595j52k522j090l83k078
1413d02q23K226J524j317k274j044j490j635O00J682k66j059P3J6r05m03O09R
1431d879n48N75J091K28K31M85K57R26J117J092L40k81J58J007J048J167M24p93
$$ plain form
1449 3645 2693 3278 3846 4243 6351 7465 6193 3511 2624 2345 2228 2617 4467 4464 2517 508 570 -621
1467 -621 -2578 -1598 213 -989 -2193 -1465 -1722 -4403 -6138 -4996 -3886 -4047 -3389 -2555 -3890 -5693 -4980
1484 -4980 -2927 -1906 -2369 -1362 -983 -1072 -853 447 1559 2084 1870 1561 1967 2553 3247 4020 4805 4945
1502 4945 3970 3307 3503 3462 2863 2706 4224 3950 2500 1444 2068 1036 -650 -19 1968 2097 -321 -1633
1520 -1633 -2448 -4933 -5721 -3057 -1195 -2252 -3375 -3056 -3336 -5253 -5434 -2907 -2212 -2625 -2144 -1475 -1675
1537 -1675 -2284 -1196 -317 107 919 2441 2733 2527 2648 2997 3084 3378 3848 3606 3345 3729 3865 3819 4756 5129
1557 5129 4172 2541 1502 1398 1601 2441 3472 2901 698 -214 -126 -1281 -1634 164 757 -567 -1804
1574 -1804 -1949 -2836 -4310 -3559 -2083 -1901 -2041 -1353 -1261 -3288 -3579 -2325 -621 -354 444 1580 1374 -85
$$ packed form
1449C645r52N85N68L97K108J114j272k682q87k79j17L89J850lj947k009O2j191
1467f21j957R80J811j202j204P28k57k681j735J142J110j61O58Q34j335j803P13
1484d980K053J021m63J007L79q9K19J300J112N25k14l09M06N86O94P73P85J40
1502D945r75o63J96m1n99j57J518k74j450j056O24j032j686O31J987J29k418j312
1520a633q15k485p88K664J862j057j123L19k80j917j81K527O95m13M81O69k00
1537a675o09J088Q79M24Q12J522K92k06J21L49Q7K94M70k42k61L84J36m6R37L73
1557E129r57j631j039j04K03Q40J031n71k203r12Q8j155l53J798N93j324j237
1574a804j45q87j474P51J476J82j40O88R2k027k91J254J704K67P98J136k06j459
$$ plain form
1592 -85 89 1424 2049 2278 3242 3847 3165 2257 3462 4140 3387 2935 3362 2937 2760 2339 2781 2667 2435 1780
1612 1780 639 646 262 -250 -64 759 608 -344 -1710 -2239 -3314 -4352 -3532 -1736 -1872 -2444 -2144 -2010 -3858
1631 -3858 -4907 -3239 -1519 -1701 -1518 -340 -1136 -2756 -2323 -21 1140 867 1744 3094 2145 1130 1873
1648 1873 2748 2612 2621 3638 3749 2796 2513 2935 3041 3267 2898 2757 2200 1682 1187 1173 716 780 346 -566 -345
1669 -345 -1280 -1733 -1557 -348 -542 -1496 -2633 -3136 -4096 -4408 -2639 -1299 -1468 -1972 -1705 -2267 -3601 -2593
1687 -2593 -1192 33 16 641 1168 241 -488 52 896 1127 1761 3133 2656 1613 1124 1567 1434 1190 2129
1706 2129 2410 1521 790 381 616 297 600 933 85 -1158 -1219 -917 -1239 -1327 -1140 -1948 -2998 -3345 -3522 -3008
1726 -3008 -2372 -2066 -2252 -2474 -2900 -2724 -2998 -2509 -1255 -812 -516 -109 46 -1062 -1846 -45 1187 1986
$$ packed form
1592h5J74J335O25K29R64O05o82r08J205O78p53m52M27m25j77m21M42j14k32o55
1612A780j141Pl84n12J86Q23j51r52j366n29j075j038Q20J796j36n72L00J34j848
1631c858j049J668J720j82J83J178p96j620M33K302J161k73Q77J350r49j015P43
1648A873Q75j36RJ017J11r53k83M22J06K26l69j41n57n18m95j4m57O4m34r12K21
1669c45r35m53J76J209j94r54j137n03r60l12J769J340j69n04K67n62j334J008
1687b593J401J225j7O25N27r27p29N40Q44K31O34J372m77j043m89M43j33k44R39
1706B129K81q89p31m09K35l19L03L33q48j243o1L02l22q8J87q08j050l47j77N14
1726c008O36L06j86k22m26J76k74M89J254M43K96M07J55j108p84J801J232P99
$$ plain form
1744 1986 2562 3815 3151 1179 969 2171 2348 2387 3260 3998 2436 1341 1732 2399 1984 1558 2087 1970
1762 1970 740 246 319 205 -1002 -1272 -1145 -1077 -1536 -1670 -1676 -2060 -2114 -1987 -2067 -2676 -3025 -3616 -2557 -1762 -1203
1783 -1203 -1103 -1044 -1302 -1782 -1927 -471 1167 1252 1426 1594 1352 1 350 2024 2577 2349 2779 3585 2883
1802 2883 1425 1834 2451 1772 2043 2926 3021 1600 642 255 217 -519 257 651 -246 -1121 -2088 -1889 -2178 -2254
1822 -2254 -1796 -2390 -3205 -3209 -2867 -2827 -2683 -2326 -2444 -3294 -3050 -2397 -2293 -1404 -732 -353 -766 -796 -806 -470 -206
1843 -206 899 1585 2239 3137 3069 2091 1108 1342 2161 2318 3312 3813 2950 1471 892 1507 1578 1515 2291 2188
1863 2188 966 -539 -122 319 -909 -1272 -363 -602 -2027 -1849 -1603 -2100 -3122 -2556 -2166 -2155 -2601 -2660 -2324
1882 -2324 -2832 -2459 -1816 -1140 -996 -1476 -1291 -499 -118 720 1219 1098 476 63 -47 912 1984 2481 2781
$$ packed form
1744A986N76J253o64j972k10J202J77L9Q73P38j562j095L91O67m15m26N29j17
1762A970j230m94P3j14j207k70J27O8m59j34ol84n4J27q0o09l49n91J059P95N59
1783a203J00N9k58m80j45J456J638Q5J74J68k42j351L49J674N53k28M30Q06p02
1802B883j458M09O17o79K71Q83R5j421r58l87l8p36P76L94q97q75r67J99k89p6
1822b254M58n94q15mL42M0J44L57j18q50K44O53J04Q89O72L79m13l0j0L36K64
1843b06J105O86O54Q98o8r78r83K34Q19J57R94N01q63j479n79O15P1o3P76j03
1863B188j222j505M17M41j228l63R09k39j425J78K46m97j022N66L90J1m46n9L36
1882b324n08L73O43O76J44m80J85P92L81Q38M99j21o22m13j10R59J072M97L00
$$ plain form
1901 2781 2942 1919 861 692 1397 1670 1152 1876 2406 1595 209 96 -130 -829 -726 51 220 -761 -1837
1920 -1837 -1945 -1997 -2725 -1832 -1178 -1662 -2806 -2511 -2420 -2357 -2310 -1531 -1162 -1508 -1566 -1215 -600 -582 116 83 -138 52
1942 52 299 511 1254 1395 1910 1801 1885 1927 1450 1094 1466 1912 2250 2454 2480 1999 243 102 508 844 1274
1963 1274 1758 1362 -86 -935 -1070 -1134 -1248 -950 -403 -1140 -1669 -1657 -1490 -1801 -1885 -1178 -878 -1454 -1291 -531
1983 -531 -1107 -1412 -610 -92 37 -126 375 976 548 863 1310 1442 880 670 1153 753 1145 1910 2272 2014
2003 2014 1626 982 689 480 663 1084 1309 1052 589 58 -908 -915 -1011 -989 -324 163 -833 -1708 -1626 -1929 -2483
2024 -2483 -2037 -895 -611 -1617 -1580 -1357 -1171 -1852 -728 455 228 -266 -315 93 -475 -137 599 1310 928
2043 928 913 1356 1441 1363 1534 1865 1581 1204 941 1079 1212 1134 1767 1729 1283 414 -27 -449 -76 -208 55 55
$$ packed form
1901B781J61j023j058j69P05K73n18P24N30q11j386j13k26o99J03P77J69r81j076
1920a837j08n2p28Q93O54m84j144K95R1O3M7P79L69l46n8L51O15J8O98l3k21J90
1942E2K47K12P43J41N15j09Q4M2m77l56L72M46L38K04K6m81j756j41M06L36M30
1963A274M84l96j448q49j35o4j14K98N47p37n29J2J67l11q4P07L00n76J63P60
1983e31n76l05Q02N18J29j63N01O01m28L15M47J32n62k10M83m00L92P65L62k58
2003B014l88o44k93k09J83M21K25k57m63n31r66pr6K2O65M87r96q75Q2l03n54
2024b483M46J142K84j006L7K23J86o81J124J183k27m94m9M08n68L38P36P11l82
2043I28j5M43Q5p8J71L31k84l77k63J38J33p8O33l8m46q69m41m22L73j32K63%
$$ plain form
2065 55 340 -167 -1277 -1772 -1335 -1599 -1309 -654 -427 -974 -1678 -1825 -1480 -1754 -1233 -443 -331 -927 -760 -756 -805
2086 -805 -505 227 717 692 760 964 771 660 986 1680 1250 1127 1414 1296 1082 568 1377 1042 657 489 605
2107 605 172 207 752 953 381 -74 -417 -1092 -1827 -1480 -965 -861 -879 -861 -1344 -2049 -2182 -2270 -1966 -1445 -1085
2128 -1085 -1127 -1386 -1779 -1371 -1714 -1250 -611 -269 -170 -139 11 -142 -360 203 1108 1002 880 1321 1257 652 790
2149 790 1463 1543 1063 1186 1351 1097 189 717 1040 697 -202 284 15 -268 24 305 794 -156 -531 -715
2169 -715 -1323 -1759 -1297 -1089 -488 -645 -985 -1262 -1475 -1566 -1300 -1307 -378 34 -78 -541 -308 -700 -798 -41 891
2190 891 985 784 769 783 585 526 1273 1604 1390 1154 1450 1323 560 747 1114 717 428 878 809 171 236 246
2212 246 -3 -138 -457 -400 -656 -1128 -821 -187 -689 -807 -768 -1324 -1810 -1806 -1249 -690 -600 -687 -569 -1114 -1539 -1215
$$ packed form
2065E5K85n07j110m95M37k64K90O55K27n47p04j47L45k74N21P90J12n96J67Mm9
2086h05L00P32M90k5O8K04j93j11L26O94m30j23K87j18k14n14Q09l35l85j68J16
2107F05m33L5N45K01n72m55l43o75p35L47N15J04j8J8m83p05j33q8L04N21L60
2128a085m2k59l93M08l43M64O39L42R9L1J50j53k18N63R05j06j22M41o4o05J38
2149G90O73Q0m80J23J65k54r08N28L23l43q99M86k69k83K92K81M89r50l75j84
2169g15o08m36M62K08O01j57l40k77k13r1K66pR29M12j12m63K33l92r8P57R32
2190H91R4k01j5J4j98n9P47L31k14k36K96j27p63J87L67l97k89M50o9o38O5J0
2212B46k49j35l19N7k56m72L07O34n02j18L9n56m86MN57N59R0q7J18n45m25L24
$$ plain form
2234 -1215 -625 -254 270 389 397 184 35 -104 474 758 1026 1032 1040 973 770 610 688 1318 1329 1291 1453 887 407
2257 407 210 590 678 822 416 514 438 -430 -115 153 -175 -924 -865 -652 -1342 -1207 -892 -220 -928 -817 -703
2278 -703 -1153 -1442 -1089 -840 -283 70 95 358 -440 -468 -231 102 374 1318 1310 995 825 602 306 931 1620
2299 1620 1668 1244 1050 851 429 453 1082 1304 1098 652 847 810 344 -153 30 -144 -754 -451 -31 -789 -877
2320 -877 -915 -977 -1002 -1129 -878 -1136 -1801 -1255 -1071 -539 -416 -229 -871 -1213 -1180 -559 110 294 741 905 396
2341 396 -180 94 348 622 1151 1030 1144 606 936 854 852 1102 1151 1173 812 864 525 -192 139 252 336 443
2363 443 419 35 -457 -830 -448 -317 -342 -698 -533 -952 -1233 -836 -692 -682 -983 -790 -646 -653 -496 95 160 140
2385 140 88 495 85 -39 -198 373 754 737 1317 1377 1021 286 356 641 637 1063 1354 1180 724 318 121 170
$$ packed form
2234a215N90L71N24J19Qk13j49j39N78K84K68OQo7k03j60P8O30J1l8J62n66m80
2257D07j97L80Q8J44m06R8p6q68L15K68l28p49N9K13o90J35L15O72p08J11J14
2278g03m50k89L53K49N57L53K5K63p98k8K37L33K72R44ql15j70k23k96O25O89
2299A620M8m24j94j99m22K4O29K22k06m46J95l7m66m97J83j74o10L03M20p58q8
2320h77l8o2k5j27K51k58o65N46J84N32J23J87o42l42L3O21O69J84M47J64n09
2341C96n76K74K54K74N29j21J14n38L30q2kK50M9K2l61N2l39p17L31J13Q4J07
2363D43k4l84m92l73L82J31k5l56J65m19k81L97J44J0l01J93J44pJ57N91O5k0
2385A40n2M07m10j24j59N71L81j7N80O0l56p35P0K85mM26K91j74m56m06j97M9
$$ plain form
2407 170 711 623 539 267 -136 -258 -466 -399 -199 -191 -721 -179 -835 -1217 -1163 -989 -952 -851 -477 -525 -732 -748 -558
2430 -558 -188 -378 -352 -12 -71 -238 -115 800 737 799 1010 1304 531 189 301 1194 1321 1381 1318 1022 781 440
2452 440 832 702 748 990 594 480 209 -77 108 -370 -81 -82 -108 -302 -389 -973 -1031 -800 -717 -429 -489 -251 -987
2475 -987 -1212 -1217 -644 -401 -428 -134 -192 -384 82 -20 203 148 420 288 20 382 651 985 792 1018 1367 709
2497 709 590 428 563 402 811 1363 1214 716 220 300 -202 -114 86 380 487 -158 -230 -793 -650 -819 -504
2518 -504 -382 -1017 -841 -1237 -1403 -1002 -986 -897 -521 -413 -586 -694 -778 -357 -685 -327 84 233 -94 -64 534
2539 534 669 345 267 772 672 181 297 541 712 579 1039 982 374 88 92 433 457 408 786 572 -198 -282
2561 -282 -328 -532 -502 -348 39 -368 -549 -630 -669 -908 -446 -465 -501 -720 -407 -507 -921 -675 -716 -200 -67 50
$$ packed form
2407A70N41q8q4k72m03j22k08O7K00Qn30N42o56l82N4J74L7J01L74m8k07j6J90
2430e58L70j90K6L40n9j67J23R15o3O2K11K94p73l42J12Q93J27O0o3k96k41l41
2452D40L92j30M6K42l96j14k71k86J85m78K89jk6j94q7n84n8K31Q3K88o0K38p36
2475i87k25nN73K43k7K94n8j92M66j02K23n5K72j32k68L62K69L34j93K26L49o58
2497G09j19j62J35j61M09N52j49m98m96Q0n02Q8K00K94J07o45p2n63J43j69L15
2518e04J22o35J76l96j66M01J6Q9L76J08j73j08q4M21l28L58M11J49l27L0N98
2539E34J35l24p8N05j00m91J16K44J71j33M60n7o08k86ML41K4m9L78k14p70q4
2561b82m6k04L0J54L87m07j81q1l9k39M62j9l6k19L13j00m14K46m1N16J33J17
$$ plain form
2583 50 -121 -425 -352 23 292 243 124 170 642 403 526 363 194 791 791 382 235 359 566 839 651 569
2605 569 447 110 22 267 -143 -138 112 370 -117 -326 -290 -319 -960 -538 -303 -485 -633 -443 -797 -950 -726 -363
2627 -363 -39 -415 -346 -330 -317 -524 -385 292 227 43 49 185 -106 13 354 326 402 397 231 428 416 497 83 542
2651 542 811 231 242 74 336 113 145 579 567 -89 -154 -358 -334 -364 171 409 51 -240 -522 -540 -639 -651 -122
2674 -122 149 -280 -470 -338 -229 -230 -274 -6 116 175 23 4 210 -75 -138 244 232 682 434 226 346 96
2696 96 -5 152 1078 636 816 65 208 273 569 96 173 119 -79 -223 -144 166 -85 63 -87 -404 -263 -557
2718 -557 -474 -348 -347 -422 -310 -361 -334 -652 -439 -518 17 -132 133 195 -239 -124 -334 -16 -7 374 312 164 307 11
2742 11 299 520 392 591 648 563 306 13 238 96 319 273 132 207 230 422 -77 48 81 -12 -81 -155 -315
$$ packed form
2583E0j71l04P3L75K69m9j19M6M72k39J23j63j69N97%m09j47J24K07K73j88q2
2605E69j22l37q8K45m10NK50K58m87k09L6k9o41M22K35j82j48J90l54j53K24L63
2627c63L24l76O9J6J3k07J39O77o5j84OJ36k91J19L41k8P6nj66J97j2Q1m14M59
2651E42K69n80J1j68K62k23L2M34j2o56o5k04K4l0N35K38l58k91k82j8r9j2N29
2674a22K71m29j90J32J09jm4K68J22N9j52j9K06k85o3L82j2M50k48k08J20k50
2696I6j01J57R26m42J80p51J43O5K96m73P7n4j98j44P9L10k51J48j50l17J41k94
2718e57Q3J26Jp5J12n1K7l18K13p9N35j49K65O2m34J15k10L18RL81o2j48J43k96
2742A1K88K21j28J99N7q5k57k93K25j42K23m6j41P5K3J92m99J25L3r3o9p4j60
$$ plain form
2765 -315 -340 -304 -133 167 -195 -541 -567 -707 -690 -384 53 178 -485 -75 -459 -659 -260 -226 393 202 -99 66
2787 66 246 -362 156 368 334 571 533 363 333 453 429 255 350 646 679 399 242 49 -58 204 354 293 184
2810 184 -98 -223 -308 -328 -242 -88 -499 -604 -394 -505 -625 3 -179 215 -432 -611 -302 -307 -495 -364 -18 34
2832 34 -326 -170 -157 -100 -272 -166 253 297 54 568 156 -21 239 439 141 669 322 118 143 256 310 322
2854 322 422 523 244 220 -44 -105 -97 -30 102 -158 -463 -46 -42 -512 -288 -536 -377 -299 -346 -356 -477 -325 -24
2877 -24 -194 64 -236 -382 -205 -224 55 345 397 -6 39 -80 113 0 334 558 292 465 683 321 160
2898 160 219 481 675 498 633 682 357 -107 153 80 144 19 107 195 -374 -305 -111 -318 -285 -417 -516 -516 -569 -476
2922 -476 -148 -531 -401 -655 -532 -423 -392 -477 -70 -79 -114 -57 -333 199 -349 -254 47 413 430 169 187 272 51
$$ packed form
2765c15k5L6J71L00l62l46k6j40J7L06M37J25o63M10l84k00L99L4O19j91l01J65
2787F6J80o08N18K12l4K37l8j70l0J20k4j74R5K96L3k80j57j93j07K62J50o1j09
2810A84k82j25q5k0Q6J54m11j05K10j11j20O28j82L94o47j79L09nj88J31L46N2
2832C4l60J56J3N7j72J06M19M4k43N14m12j77K60K00k98N28l47k04K5J13N4J2
2854C22J00J01k79k4k64o1QO7J32k60l05M17Mm70K24k48J59P8m7j0j21J52L01
2877b4j70K58l00j46J77j9K79K90N2m03M5j19J93j13L34K24k66J73K18l62j61
2898A60N9K62J94j77J35M9l25m64K60p3O4j25Q8Q8n69O9J94k07L3j32r9%n3R3
2922d76L28l83J30k54J23J09L1q5M07rl5N7k76N32n48R5L01L66J7k61J8Q5k21
$$ plain form
2945 51 89 547 153 323 620 402 315 -101 288 120 -115 420 266 3 -274 -110 91 -1 -175 -148 -240 -87
2967 -87 -363 -403 -445 -326 -405 -681 -34 -319 -558 -478 -152 -119 -303 -350 -204 -74 -165 162 71 70 178 81 42 142
2991 142 106 356 207 430 137 229 554 -76 82 -76 498 79 176 130 262 122 -32 -61 -75 -123 26 -147
3013 -147 -252 -497 -184 -314 88 -206 -186 -286 -297 -477 -500 -527 -507 -374 -175 -307 -216 -110 -245 -106 -197 -206 -139
3036 -139 -272 -210 -74 38 248 323 57 27 151 -85 84 196 609 486 645 400 175 166 341 -34 395 202
3058 202 121 113 73 -346 -90 33 -195 103 -10 208 -342 -559 -258 -446 -213 -212 -272 -41 -638 -68 -295 -192
3080 -192 -138 11 -218 -15 50 -130 114 82 6 89 220 -148 141 140 444 281 476 324 319 180 189 300 289 137
3104 137 457 372 177 -1 -196 -312 148 -29 21 275 322 15 -47 -67 -98 -116 -109 -385 -186 -469 -257 -70 107
$$ packed form
2945E1L8M58l94J70K97k18q7m16L89j68k35N35j54k63k77J64K01r2j74K7r2J53
2967h7k76m0m2J19p9k76O47k85k39Q0L26L3j84m7J46J30r1L27r1jJ08r7l9J00
2991A42l6K50j49K23k93R2L25o30J58j58N74m19R7m6J32j40j54k9j4m8J49j73
3013a47j05k45L13j30M02k94K0j00j1j80k3k7K0J33J99j32R1J06j35J39r1rO7
3036a39j33O2J36J12K10P5k66l0J24k36J69J12M13j23J59k45k25rJ75l75M29j93
3058B02q1qm0m19K56J23k28K98j13K18n50k17L01j88K33Jo0K31n97N70k27J03
3080a92N4J49k29K03O5j80K44l2p6Q3J31l68K89jL04j63J95j52nj39RJ11j1j52
3104A37L20q5j95j78j95j16M60j77N0K54M7l07o2k0l1j8Pk76J99k83K12J87J77
$$ plain form
3127 107 -361 -247 89 -269 -341 -159 6 -159 -108 100 204 41 -123 258 318 51 621 115 -130 161 167 159
3149 159 232 405 548 202 100 -23 151 -24 415 385 240 108 147 -284 -266 -235 -275 54 66 -312 -239 -341 -162
3172 -162 -87 -206 -195 38 -14 -300 -346 -220 -126 -56 -181 29 -306 -375 -45 -33 96 104 211 439 228 93 300
3195 300 354 498 163 378 534 152 208 477 242 246 530 407 285 -28 159 -428 156 89 -82 280 35 -126
3217 -126 -469 -45 -200 50 -250 -345 -168 -289 -134 -220 -445 -305 -250 -120 170 -501 -390 46 -281 -243 -21
3238 -21 328 -217 -14 70 -91 -47 114 513 223 280 266 287 142 317 411 136 176 75 -188 92 92 117 362 152
3262 152 -56 -88 -236 -162 -81 47 8 -194 -260 -154 -184 -411 -209 -214 -3 -176 -172 -292 -105 -29 -364 -97 177 59
3286 59 -78 -98 -296 -224 -173 427 356 218 163 2 86 117 -99 294 223 313 -139 360 556 169 461 309 132
$$ packed form
3127A07m68J14L36l58p2J82J65j65N1K08J04j63j64L81O0k67N70n06k45K91Oq
3149A59P3J73J43l46j02j23J74j75M39l0j45j32L9m31J8L1m0L29J2l78P3j02J79
3172a62P5j19J1K33n2k86m6J26R4P0j25K10l35o9L30J2J29QJ07K28k11j35K07
3195C00N4J44l35K15J56l82N6K69k35MK84j23j22l13J87n87N84o7j71L62k45j61
3217a26l43M24j55K50l00r5J77j21J55q6k25J40N5J30K90o71J11M36l27L8K22
3238b1L49n45K03Q4j61M4J61L99k90N7j4K1j45J75R4k75M0j01k63K80%K5K45k10
3262A52k08l2j48P4Q1J28l9k02o6J06l0k27K02nK11j73Mj20J87P6l35K67K74j18
3286E9j37k0j98P2N1O00p1j38n5j61Q4L1k16L93p1R0m52M99J96l87K92j52j77
$$ plain form
3309 132 140 -143 -22 -98 -140 83 -17 -229 -145 -148 -338 -343 -417 41 198 -366 -274 -363 -361 -325 -354 -212 6 -14 -405 -39
3335 -39 -245 -120 -129 76 168 91 -146 -169 222 41 242 299 69 230 203 -85 167 373 68 451 388 171 -250
3358 -250 111 107 57 83 -150 -174 -175 -70 -176 -121 64 58 -107 -105 -225 -199 -455 -41 -149 -106 50 -438 -161 -379 -270
3383 -270 42 -39 -108 102 270 -136 -108 -118 24 -17 375 334 186 63 -98 60 54 24 107 -89 89 128 337 129
3407 129 15 362 298 148 -155 13 192 -309 132 239 -158 -200 -272 -365 -261 -121 -37 338 -431 -252 -194 -366
3429 -366 -246 -178 -242 23 25 -137 -73 -251 -89 -305 221 -11 301 103 -119 -49 33 5 283 201 296 -39 18 -15
3453 -15 153 132 -45 103 -26 123 128 -340 -279 108 -254 -108 -219 -310 -167 -348 -335 -282 -339 -247 -42 -202 -357
3476 -357 -253 -442 154 -64 -307 131 144 -346 -345 240 -18 87 154 325 -46 123 194 124 7 365 451 298
$$ packed form
3309A32Qk83J21p6m2K23j00k12Q4lj90np4M58J57n64R2q9KL6k9J42K18k0l91L66
3335c9k06J25rK05R2p7k37k3L91j81K01N7k30J61k7k88K52K06l05L83o3k17m21
3358b50L61mn0K6k33k4jJ05j06N5J85oj65Kj20K6k56M14j08M3J56m88K77k18J09
3383b70L12q1o9K10J68m06K8j0J42m1L92m1j48j23j61J58ol0Q3j96J78L9K09k08
3407A29j14L47o4j50l03J68J79n01M41J07l97m2p2r3J04J40Q4L75p69J79N8j72
3429c66J20O8o4K65Kj62O4j78J62k16N26k32L12j98k22P0Q2k8K78q2R5l35N7l3
3453a5J68k1j77J48j29J49Nm68O1L87l62J46j11r1J43j81J3N3n7R2K05j60j55
3476c57J04j89N96k18k43M38J3m90JN85k58J05O7J71l71J69P1p0j17L58Q6j53
$$ plain form
3498 298 117 419 227 -4 282 181 101 -173 -245 -76 59 -9 195 344 264 57 -137 -366 -150 -170 -91 8
3520 8 -352 21 -69 19 -62 -59 149 -135 -389 -442 -487 -151 125 232 163 115 -83 -34 -41 -372 116 144 380 40 272
3545 272 -5 -97 -16 453 262 472 417 412 255 -246 332 282 188 69 231 60 118 -286 -273 -158 -108 -17 -22 -569
3569 -569 -441 -328 33 -26 -285 -207 -184 4 8 -91 -262 -186 -228 -104 -24 80 -130 -160 269 156 -36 177 217 211
3593 211 -313 418 404 344 -15 262 179 -182 155 200 249 181 87 24 62 29 117 -89 113 64 187 114 -100 -299
3617 -299 -237 -311 -613 -281 -11 -592 63 -559 -512 -61 28 36 -60 -543 -225 -295 -41 -31 208 167 -314 9 -1 48
3641 48 92 558 -69 50 191 -29 -31 -163 200 322 90 289 200 -179 34 50 170 -117 204 118 189 -55 -222
3664 -222 -67 -225 -26 36 -110 -487 -348 -254 -328 -14 7 67 -225 -245 -135 117 -336 -410 114 -354 -44 150
$$ packed form
3498B98j81L02j92k31K86j01q0k74p2J69J35o8K04J49q0k07j94k29K16k0P9R9
3520Hl60L73r0Q8q1LK08k84k54n3m5L36K76J07o9m8j98M9pl31M88K8K36l40K32
3545B72k77r2Q1M69j91K10n5nj57n01N78n0r4j19J62j71N8m04J3J15N0R1nn47
3569e69J28J13L61n9k59P8K3J88Mr9j71P6m2J24Q0J04k10l0M29j13j92K13M0o
3593B11n24P31j4o0l59K77q3l61L37M5M9o8r4o3L8l3Q8k06K02m9J23p3k14j99
3617b99O2p4l02L32K70n81O55o22M7M51Q9Qr6m83L18p0K54J0K39m1m81L23j0M9
3641D8M4M66o27J19J41k20kj32L63J22k32J99q9l79K13J6J20k87L21q6P1k44j67
3664b22J55j58J99O2j46l77J39R4p4L14K1O0k92k0J10K52m53p4N24m68L10J94
$$ plain form
3686 150 -28 -162 -65 452 76 -71 216 -5 117 130 413 253 131 -58 241 220 -76 62 354 90 124
3707 124 160 -56 -197 -37 -57 51 135 -32 44 -320 -198 -317 -333 -371 -422 -341 151 -291 29 -407 -235 -214 -111
3730 -111 -218 -136 2 -192 15 -26 21 -176 -168 -45 -23 -1 -220 167 320 230 329 195 -264 -246 301 311 283 443
3754 443 179 160 -24 -310 -62 -77 249 -46 3 -165 -218 -510 -284 -231 201 130 -29 -61 -285 -489 -238 -382
3776 -382 -176 -83 65 -269 -75 -16 -305 -201 -192 -3 79 -35 68 132 184 311 305 303 265 -83 36 204 401 315
3800 315 255 264 -66 153 29 60 278 267 134 134 34 -564 -222 20 -9 78 214 -43 -318 -358 -290 -281 -454 80
3824 80 -164 -23 -375 -169 -347 -326 -346 -106 85 -14 180 -94 41 27 -42 206 224 142 186 362 -150 127 88
3847 88 255 161 302 72 111 311 181 129 272 243 142 -221 3 -37 169 -95 -156 -251 -375 -95 -108 24 -251
$$ packed form
3686A50j78j34R7N17l76j47K87k21J22J3K83j60j22j89K99k1k96J38K92k64L4
3707A24L6k16j41J60k0J08Q4j67P6l64J22j19j6l8n1Q1M92m42L20m36J72K1J03
3730a11j07Q2J38j94K07m1M7j97QJ23K2K2k19L87J53r0R9j34m59J8N47J0k8J60
3754D43k64j9j84k86K48j5L26k95M9j68n3k92K26N3M32p1j59l2k24k04K51j44
3776c82K06R3J48l34J94N9k89J04RJ89Q2j14J03O4N2J27okl8l48J19J68J97q6
3800C15o0Rl30K19j24L1K18j1j33%j00n98L42K42k9Q7J36k57k75m0O8Rj73N34
3824H0k44J41l52K06j78K1k0K40J91r9J94k74J35j4o9K48J8q2M4J76n12K77l9
3847H8J67r4J41k30L9K00j30n2J43k9j01l63K24m0K06k64o1r5j24K80j3J32k75
$$ plain form
3870 -251 -134 -209 -38 -332 -461 -177 -261 -151 -171 288 -98 -306 -291 -164 -298 210 -31 36 -3 93 167 137 117
3893 117 206 365 323 -112 450 66 -25 10 -30 335 307 0 322 64 -63 -4 -3 -185 -98 -214 54 -160 -161 -86
3917 -86 -203 -32 -436 -294 -42 -391 -194 -248 11 -148 -207 -368 -229 -247 -193 68 252 155 38 234 -330 185
3939 185 181 220 339 83 346 304 130 1 338 193 193 416 248 -254 -31 26 34 115 124 -42 -272 -259 4 83 46
3964 46 -237 -98 -429 -255 -226 -51 -209 -234 -162 -188 -451 -527 82 -40 -312 -36 -99 21 -191 -159 -114 -215 -40
3987 -40 118 173 249 207 134 90 52 359 481 433 234 90 106 -111 67 121 -75 189 130 13 3 31 -37 13 -85
4012 -85 -252 -22 -154 -315 -145 -412 -220 133 -185 -59 -388 -358 -118 -240 70 -97 -55 -269 -272 -224 134 153
4034 153 207 215 238 -34 -111 -125 -185 249 84 -22 -47 111 -39 -75 261 158 154 9 313 -78 -305 -38 188 26
$$ packed form
3870b51J17p5J71k94j29K84q4J10k0M59l86k08J5J27j34N08k41O7l9R6P4l0k0
3893A17Q9J59m2m35N62l84r1L5m0L65k8l07L22k58j27N9Jj82Q7j16K68k14jP5
3917h6j17J71m04J42K52l49J97n4K59j59n9j61J39j8N4K61J84r7j17J96n64N15
3939A85mL9J19k56K63m2j74j29L37j45%K23j68n02K23N7QQ1Rj66k30J3K63P9l7
3964D6k83J39l31J74K9J75j58k5P2k6k63p6O09j22k72K76o3J20k12L2M5j01J75
3987d0J58N5P6m2p3m4l8L07J22m8j99j44J6k17J78N4j96K64n9j17j0K8o8N0r8
4012h5j67K30j32j61J70k67J92L53l18J26l29L0K40j22L10j67M2k14lM8L58J9
4034A53N4QK3k72p7j4o0M34j65j06k5J58j50l6L36j03mj45L04l91k27K67K26j62
$$ plain form
4058 26 360 -52 295 134 -377 45 -227 -223 14 -161 -145 -141 -147 238 -83 -7 4 -110 -152 -230 -129 -147 -171 -218 -34
4083 -34 -260 -199 24 60 106 -19 126 -278 -111 145 103 63 -89 253 280 287 13 177 -177 54 294 -202 89
4106 89 99 187 -57 -304 -14 -19 -108 -20 15 -47 -95 -248 -45 -150 -123 -197 -98 -182 17 -190 -441 -321 -101 -157 -277
4131 -277 -81 -40 -20 149 12 173 136 -287 12 -11 -183 -109 412 439 171 -9 -66 113 -32 166 356 107
4153 107 287 12 60 25 -31 -199 -118 -239 92 348 -17 -176 -148 50 -188 9 -132 -121 -61 -297 -246 -95 151
4176 151 -85 -133 -131 -140 -60 29 202 95 208 133 -126 228 -36 46 -6 287 146 325 156 289 72 438 373 6
4200 6 67 125 111 -297 -198 28 206 86 3 42 -219 -147 -284 44 -159 -1 -192 -294 -167 -348 206 -479 -141
4223 -141 -160 -122 27 -497 -187 103 104 -120 -13 87 -61 -248 -93 -66 306 429 157 -37 142 24 -238 191
$$ packed form
4058B6L34m12L47j61n11M22k72MK37j75J6MoL85l21P6J1j14m2p8J01j8k4m7J84
4083c4k26O1K23L6M6j25J45m04J67K56m2m0j52L42K7Pk74J64l54K31K40m96K91
4106H9J0Q8k44k47K90nq9Q8L5o2m8j53K03j05K7p4R9q4J99k07k51J20K20n6j20
4131b77J96M1K0J69j37J61l7m23K99k3j72P4N21K7k68j80n7J79j45J98J90k49
4153A07J80k75M8l5n6j68Q1j21L31K56l65j59K8J98k38J97j41J1O0k36N1J51K46
4176A51k36m8KrQ0Q9J73j07J13p5k59L54k64Q2n2K93j41J79j69J33k17L66o5l67
4200FO1N8j4m08R9K26J78j20q3L9k61P2j37L28k03J58j91j02J27j81N54o85L38
4223a41j9L8J49n24L10K90Jk24J07J00j48j87J55K7L72J23k72j94J79j18k62M29
$$ plain form
4245 191 344 12 118 410 -1 -88 39 282 238 18 -164 -124 -217 -29 -186 -59 -271 -339 -247 -105 -139 -183 -400
4268 -400 -203 178 -267 201 -117 -189 -31 -135 163 72 -10 68 184 76 -63 380 169 300 77 316 133
4289 133 209 272 350 259 224 50 275 312 311 100 469 273 61 246 25 -117 98 95 47 52 -330 90 -85 -293
4313 -293 -148 -124 -270 74 -279 -8 -73 -221 -376 -386 162 -359 -87 -185 -13 -66 -237 190 261 161 166 -14 87
4336 87 249 71 182 -118 -21 144 95 3 45 -40 186 -173 26 -81 -26 15 114 -72 105 -63 210 -350 -326
4359 -326 -112 -241 -113 82 25 -47 -74 209 -256 -202 -17 -210 -156 107 -102 -130 -143 -257 -244 -219 -43 136 -4
4382 -4 -108 -91 120 18 286 218 140 322 350 -70 20 24 0 -6 -25 90 -8 93 -92 18 332 200 337 211 -365
4407 -365 97 -47 81 -108 71 56 -196 -318 -317 113 21 17 75 -228 -439 -466 -198 103 -196 45 -96 51 -44
$$ packed form
4245A91J53l32J06K92m11q7J27K43m4k20j82M0r3J88j57J27k12o8R2J42l4m4k17
4268d00J97L81m45M68l18p2J58j04K98r1q2P8J16j08j39M43k11J31k23K39j83
4289A33P6O3P8r1l5j74K25L7jk11L69j96k12J85k21j42K15lm8Nl82M20j75k08
4313b93J45K4j46L44l53K71o5j48j55j0N48n21K72r8J72n3j71M27P1j00Nj80J01
4336H7J62j78J11l00R7J65m9r2M2q5K26l59J99j07N5M1R9j86J77j68K73n60K4
4359c26K14j29J28J95n7p2k7K83m65N4J85j93N4K63k09k8j3j14J3K5J76J79j40
4382dj04J7K11j02K68o8p8J82K8m20R0Mk4oj9J15r8J01j85J10L14j32J37j26n76
4407c65M62j44J28j89J79j5k52j22JM30r2mN8l03k11k7K68L01k99K41j41J47r5
$$ plain form
4430 -44 -277 -92 -15 20 147 10 -36 -207 155 226 -99 447 361 130 -120 -2 -41 -107 -22 137 -35 28 -78
4453 -78 106 -18 1 151 254 48 9 -418 -100 13 -115 -273 -174 -289 -217 -363 -129 -22 -109 -224 -117 8
4475 8 -82 30 -165 63 282 -41 157 317 57 -16 -52 124 18 176 183 8 6 -212 354 129 26 87 281
4498 281 177 159 -191 21 -2 -88 135 -121 -243 -68 -102 12 200 -160 -6 -113 -91 -336 -278 3 -84 141
4520 141 -53 -149 -57 -110 158 -170 -175 -157 10 -80 35 31 267 19 254 -49 244 95 -120 -125 -263 -18 139 310
4544 310 143 181 -72 8 -151 -25 30 278 -52 188 -37 -121 -370 -316 -26 -20 80 -106 -382 -165 -191 100 26
4567 26 -182 -45 -78 -90 17 -135 262 101 177 71 90 70 0 344 267 -35 395 300 33 78 74 131 199 -55 40
4592 40 166 30 246 297 70 194 45 32 -5 109 -246 -172 129 -163 19 99 -134 -199 -97 -155 -249 -55 -123
$$ packed form
4430d4k33J85P7L5J27j37m6j71L62P1l25N46q6k31k50J18l9o6Q5J59j72O3j06
4453g8J84j24J9J50J03k06l9m27L18J13j28j58R9j15P2j46K34J07q7j15J07J25
4475Hr0J12j95K28K19l23J98J60k60p3l6J76j06J58Pj75kk18N66k25j03O1J94
4498B81j04j8l50K12k3q6K23k56j22J75l4J14J88l60J54j07K2k45N8K81q7K25
4520A41j94r6R2n3K68l28nJ8J67r0J15mK36k48K35l03K93j49k15nj38K45J57J71
4544C10j67L8k53Q0j59J26N5K48l30K40k25q4k49N4K90OJ00j86k76K17k6K91p4
4567B6k08J37l3j2J07j52L97j61P6j06J9k0p0L44p7l02M30r5k67M5mN7O8k54R5
4592D0J26j36K16N1k27J24j49j3l7J14l55P4L01k92J82Q0k33o5J02n8r4J94o8
$$ plain form
4615 -123 -71 -150 -9 -380 -384 -98 -31 179 9 -168 35 -92 -208 74 129 79 134 -105 11 -3 -62 73 -8 163
4639 163 -18 158 -77 -265 129 418 299 246 328 -220 -132 131 121 158 29 35 20 -108 -95 -185 -26 78 -293
4662 -293 74 -42 -245 -253 -112 -323 47 56 -58 -10 -105 51 56 -163 -38 -50 465 138 152 -107 166 34 146
4685 146 100 73 -54 -94 -71 244 6 -20 57 91 -54 -105 -75 52 -157 422 -171 -240 -253 24 -186 19 116 -56
4709 -56 -44 -139 -160 -257 -87 -178 117 27 -282 -181 -64 -191 -93 -228 -39 -159 178 -69 -11 15 112 100 175 -122
4733 -122 216 295 -7 331 22 323 474 136 287 9 -96 -156 117 162 -19 8 -60 -98 232 -89 98 59
4755 59 102 -234 -128 -270 -279 -15 165 -156 -159 -211 198 -194 -390 -142 -39 144 22 -62 51 -287 -50 -285 -4
4778 -4 -1 -76 163 355 -17 -30 120 221 -25 -14 181 198 303 -128 100 -24 -7 -2 55 73 157 140 61 1 -317 24
$$ packed form
4615a23N2p9J41l71mK86O7K10j70j77K03j27j16K82N5n0N5k39J16j4n9J35q1J71
4639A63j81J76k35j88L94K89j19n3Q2n48Q8K63j0L7j29Oj5j28J3r0J59J04l71
4662b93L67j16k03qJ41k11L70Rj14M8r5J56Nk19J25j2N15l27J4k59K73j32J12
4685A46m6k7j27m0K3L15k38k6P7L4j45n1L0J27k09N79n93o9j3K77k10K05R7j72
4709e6J2r5k1r7J70r1K95r0l09J01J17j27R8j35J89j20L37k47N8K6R7j2P5k97
4733a22L38P9l02L38l09L01J51l38J51k78j05o0K73M5j81K7o8l8L30l21J87l9
4755E9M3l36J06j42rK64J80l21ln2M09l92j96K48J03J83j22q4J13l38K37k35K81
4778dLp5K39J92l72j3J50J01k46J1J95J7J05m31K28j24J7NN7J8Q4j7p9o0l18L41
$$ plain form
4804 24 -220 -96 20 8 -165 -97 -233 34 -118 259 50 -34 -60 18 -161 25 -119 -110 40 6 -142 254 78
4827 78 -162 292 -5 182 182 16 319 88 82 -278 8 162 202 -15 341 -23 -119 -222 33 141 163 234 223
4850 223 90 192 85 -265 -237 -134 -103 243 -154 -204 104 -289 -77 -127 131 -121 -151 -75 -71 -274 187 78 -48
4873 -48 -17 135 -135 207 -52 109 187 92 122 67 -369 -195 39 -129 330 -49 205 55 -44 65 -307 -57
4895 -57 58 151 115 -282 -60 -14 -60 -24 -83 87 121 -184 71 -171 -180 198 114 -210 -23 -78 182 -80 7 -54 -131
4920 -131 -190 -64 -6 -47 -235 -47 75 336 166 195 255 -347 -197 -139 295 138 301 102 -211 -21 -115 -58 254
4943 254 159 54 -178 -62 -474 7 -48 -57 -189 -78 -93 -48 23 -277 153 -41 73 -126 318 -111 -101 -180 -63
4966 -63 -201 -76 -160 -237 -80 -241 -284 108 159 5 153 -138 -38 97 32 439 -50 -41 2 61 1 166 -19 117
$$ packed form
4804B4k44J24J16j2j73O8j36K67j52L77k09q4k6P8j79J86j44RJ50l4j48L96j76
4827G8k40M54k97J87%j66L03k31ol60K86J54M0k17L56l64r6j03K55J08K2P1j1
4850B23j33J02j07l50K8J03L1L46l97n0L08l93K12n0K58k52l0P6Mk03M61j09j26
4873d8L1J52k70L42k59J61P8r5L0n5m36J74K34j68M59l79K54j50r9J09l72K50
4895e7J15R3l6l97K22M6m6L6n9J70L4l05K55k42rL78q4l24J87n5K60k62Q7o1p7
4920a31n9J26N8m1j88J88J22K61j70K9O0o02J50N8M34j57J63j99l13J90r4N7L12
4943B54r5j05k32J16m12M81n5rj32J11j5M5P1l00M30j94J14j99M44m29J0p9J17
4966f3j38J25q4p7J57j61m3L92N1j54J48k91J00J35o5M07m89RM3N9o0J65j85J36
$$ plain form
4990 117 143 -92 21 -17 44 -26 231 -9 -103 24 -27 -46 98 -73 -27 45 -481 67 7 -277 -314 -204 -139 -295
5014 -295 93 -120 -70 -3 -296 -133 105 -60 -169 287 113 124 -28 108 18 -58 274 291 -269 193 37 10
5036 10 159 353 217 43 234 -1 124 -69 400 254 -111 13 -157 -6 66 -126 23 234 -73 -143 -154
5057 -154 33 -182 -17 -65 126 -19 -18 -36 -28 -64 -82 -136 131 257 142 -189 76 185 147 66 -79 -285 -209 5
5081 5 156 226 -195 -7 -2 8 50 128 -164 132 186 24 187 268 -88 -129 -27 84 146 -95 65 -23 -187 -164 -169
5106 -169 16 -41 1 54 -97 -109 -85 -52 -165 -289 -106 105 93 32 168 333 112 39 227 -208 -52 -166 116
5129 116 -210 -178 24 152 21 -193 236 139 224 -140 46 -72 202 -84 -239 137 191 -101 -260 -151 -64 -138
5151 -138 -131 9 10 -104 60 -140 -173 -2 -281 52 137 80 117 -118 -247 -264 -57 97 76 167 68 -218 -246 -32
$$ packed form
4990A17K6k35J13l8O1p0K57k40r4J27n1j9J44j71M6P2n26N48o0k84l7J10O5j56
5014b95L88k13N0O7k93J63K38j65j09M56j74J1j52J36r0p6L32J7n60M62j56k7
5036A0J49J94j36j74J91k35J25j93M69j46l65J24j70J51P2j92J49K11l07p0j1
5057a54J87k15J65m8J91j45Jj8Ql6j8n4K67J26j15l31K65J09l8q1j45k06P6K14
5081EJ51P0m21J88NJ0M2P8k92K96N4j62J63Q1l56m1J02J11O2k41J60q8j64K3n
5106a69J85n7M2N3j51j2K4L3j13j24J83K11j2o1J36J65k21p3J88m35J56j14K82
5129A16l26L2K02J28j31k14M29r7Q5l64J86j18K74k86j55L76N4k92j59J09Q7p4
5151a38PJ40Jj14J64k00l3J71k79L33Q5n7L7k35j29j7K07J54k1R1r9k86k8K14
$$ plain form
5175 -32 -49 -66 127 -21 -28 28 -132 -58 -62 289 -65 -16 106 -70 21 113 126 132 -64 -148 147 -162 186 -193 -25
5200 -25 -65 27 142 120 -148 -449 -109 135 -69 108 37 -2 -29 -168 -142 118 59 159 59 81 94 12 192 -142
5224 -142 159 62 -46 45 260 128 83 -43 111 140 55 -106 -90 -126 303 100 2 70 172 171 -10 61 156 -91
5248 -91 32 -13 -260 83 -72 -89 -178 -77 -43 20 -91 -365 -145 -57 -73 60 86 -47 223 -67 -191 81 -19
5271 -19 82 196 -216 154 121 -260 -64 128 70 157 111 118 275 110 -75 -41 8 287 -106 108 24 -19 59 -233
5295 -233 -64 -30 210 64 6 18 -194 -278 -56 58 -200 -153 92 0 -24 -1 350 -103 -134 -100 93 34 -292 324
5319 324 36 -86 -51 -164 173 159 291 169 199 72 -111 188 75 -85 -20 271 -86 21 115 -337 135 -37
5341 -37 -29 -24 69 43 39 -207 -41 3 -14 -28 49 -93 19 43 124 -1 98 247 -86 198 160 -99 -56 -276 14 -41
$$ packed form
5175c2j7j7J93j48pN6j60P4mL51l54M9J22j76R1R2J3Oj96q4K95l09L48l79J68
5200b5m0R2J15k2k68l01L40K44k04J77p1l9k7j39K6K60n9J00j00K2J3q2J80l34
5224a42L01r7j08R1K15j32m5j26J54K9q5j61J6l6M29k03r8O8J02jj81P1R5k47
5248i1J23m5k47L43j55j7q9J01L4O3j11k74K20Q8j6J33K6j33K70k90j24K72j00
5271a9J01J14m12L70l3l81J96J92n8Q7m6PJ57j65j85L4M9K79l93K14q4m3P8k92
5295b33J69L4K40j46n8J2k12q4K22J14k58M7K45r2k4K3L51m53l1L4J93n9l26O16
5319C24k88j22L5j13L37j4J32j22L0j27j83K99j13j60O5K91l57J07R4m52M72j72
5341c7QNR3k6mk46J66M4j7j4P7j42J12K4Q1j25R9J49l33K84l8k59M3k20K90n5
$$ plain form
5367 -41 67 -42 -110 -74 -83 278 145 113 -171 230 159 45 104 -49 156 108 4 -49 -106 -74 170 292 259 -61
5391 -61 -1 56 139 0 -156 312 157 78 28 -344 -62 -58 147 -283 47 -212 -22 6 28 -356 -9 -22 -23 -103 -59
5416 -59 -105 -37 119 5 102 8 -68 -14 -23 35 45 -21 -8 317 -111 456 -63 134 452 124 188 98 20 -34 -217 -82
5442 -82 -84 -13 96 -78 -245 -200 228 15 -129 -70 -133 -168 -321 100 144 -177 -230 -182 -99 -117 1 149 83 107 49
5467 49 -171 -97 -32 154 81 -17 417 -86 211 92 -65 -55 122 -61 11 220 24 22 -144 23 -271 -53 -147
5490 -147 -93 30 154 -68 106 100 -154 -4 29 -76 74 23 171 117 -131 151 178 22 -135 217 113 82 -8
5513 -8 8 222 27 -108 36 90 -1 -106 272 -16 84 13 70 -140 -71 -56 -1 226 223 137 173 47 -66 26 -98
5538 -98 289 303 -84 195 -71 15 -17 -51 -105 85 -315 -165 150 -35 -124 13 -95 -84 305 -174 -72 -217 -48
$$ packed form
5367d1J08j09o8L6rL61j33l2k84M01p1j14N9j53K05m8j04n3n7L2K44J22l3l20
5391f1O0N7Q3j39j56M68j55p9n0l72K82MK05m30L30k59J90K8K2l84L47j3jq0M4
5416e9m6O8J56j14R7r4p6N4rN8J0o6J3L25m28N67n19J97L18l28O4r0p8n4j83J35
5442h2kP1J09j74j67M5M28k13j44N9o3l5j53M21M4l21n3M8Q3j8J18J48o6K4n8
5467D9k20P4O5J86p3r8M34n03K97j19j57J0J77j83P2K09j96kj66J67k94K18r4
5490a47N4J23J24k22J74ok54J50L3j05J50n1J48n4k48K82K7j56j57L52j04l1r0
5513hJ6K14j95j35J44N4r1j05L78k88J00p1N7k10O9J5N5K27lq6L6j26j13R2j24
5538i8L87J4l87K79k66Q6l2l4n4J90m00J50L15j85q9J37j08J1L89m79J02j45J69
$$ plain form
5561 -48 86 -199 -322 32 -5 126 26 154 47 249 -202 26 -89 -29 181 1 -71 -12 64 -273 41 219
5583 219 254 45 437 -37 -149 513 -468 -14 -344 -131 1118 603 293 -271 223 -118 97 -102 274 -253
5603 -253 -748 435 142 -637 735 -113 -571 154 -6 77 206 -216 299 489 -173 -120 125 -2 -136 -55
5623 -55 235 118 77 48 -74 -92 169 -79 184 260 -46 42 -222 40 -88 -155 -353 142 111 -34 -36 -59 -241 -128
5647 -128 156 -38 102 -46 -377 -21 -13 79 -47 251 -263 -11 52 -64 72 290 350 154 74 -8 -43 -83 127
5670 127 158 269 -77 133 15 -222 -63 333 222 240 -11 124 20 -41 67 -89 63 -223 -193 13 -388
5691 -388 -87 33 -201 228 297 -56 -31 -375 -138 -129 -94 -109 -216 108 -87 -107 148 -24 -136 58 -2 59 -208
5714 -208 -107 -190 96 168 177 194 3 249 105 -13 84 232 -167 221 200 -117 150 31 -196 128 -275 -23
$$ packed form
5561d8J34k85j23L54l7J31j00J28j07K02m51K28j15O0K10j80p2N9P6l37L14J78
5583B19L5k09L92m74j12O62r81M54l30K13J249n15l10n64M94l41K15j99L76n27
5603b53m95J183k93p79J372q48m58P25j60Q3J29m22N15J90o62N3K45j27j34Q1
5623e5K90j17m1k9j22j8K61k48K63P6l06Q8k64K62j28o7j98M95l1j45kk3j82J13
5647a28K84j94J40j48l31L56QR2j26K98n14K52O3j16J36K18O0j96q0q2l5m0K10
5670A27L1J11l46K10j18k37J59L96j11J8k51J35j04o1J08j56J52k86L0K06m01
5691c88L01J20k34M29O9l53K5l44K37RL5j5j07L24j95k0K55j72j12J94o0O1k67
5714b08J01q3K86P2RJ7j91K46j44j18R7J48l99L88k1l17K67j19k27L24m03K52
$$ [...]
8191G2
##END NTUPLES=NMR FID
##END=
