##TITLE=1H_Ser S-5
 CDCl3,8 sc, 
 3.02.2021
##JCAMPDX= 6.0         $$ Bruker NMR JCAMP-DX V2.0
##DATA TYPE= NMR FID
##DATA CLASS= NTUPLES
##ORIGIN= UXNMR, Bruker Analytische Messtechnik GmbH
##OWNER= root
$$ XWIN-NMR		Version 3.5
$$ Wed Feb  3 11:03:17 2021 Russian Standard Time (UT+4h)  she@DPX200
##.OBSERVE FREQUENCY= 200.1315066352
##.OBSERVE NUCLEUS= ^1H
##.DELAY= (6, 6)
##.ACQUISITION MODE= SIMULTANEOUS
##.ACQUISITION SCHEME= undefined
##.AVERAGES= 8
##.DIGITISER RES= 18
##SPECTROMETER/DATA SYSTEM= spect
##.PULSE SEQUENCE= zg30
##.SOLVENT NAME= CDCl3
##.SHIFT REFERENCE= (INTERNAL, CDCl3, 0, 15.7039)
##AUDIT TRAIL= $$ (NUMBER, WHEN, WHO, WHERE, WHAT)
$$ ##TITLE= Audit trail, XWIN-NMR		Version 3.5
$$ ##JCAMPDX= 5.01
$$ ##ORIGIN= Bruker BioSpin GmbH
$$ ##OWNER= she
$$ F:/spectra/data/she/nmr/H-F/1/audita.txt
$$ ##AUDIT TRAIL=  $$ (NUMBER, WHEN, WHO, WHERE, WHAT)
(   1,<2021-02-03 11:01:45.81 +0400>,<she>,<DPX200>,
      <created by zg, POWCHK disabled, PULCHK disabled
       configuration hash MD5:
       00 E9 B6 7A A2 85 ED C7 34 08 36 98 17 FE 4E 26
       data hash MD5: 16K
       3E 7F 29 D2 10 73 98 58 F0 33 3D 66 C9 E9 A3 E0>)
$$ ##END=
$$ 
$$ hash MD5
$$ DC D0 F9 A2 2C 2B 13 BF 42 46 7F 8F DC 6B 93 9B
##$RELAX= 
##$RELAX= 
##$RELAX= 
##$RELAX= 
##$RELAX= 
##$RELAX= 
$$ Bruker specific parameters
$$ --------------------------
##$DU= <F:/spectra>
##$EXPNO= 1
##$NAME= <H-F>
##$PROCNO= 1
##$TYPE= <nmr>
##$USER= <she>
##$AMP= (0..31)
100 100 100 100 100 100 100 100 100 100 100 100 100 100 100 100 100 100 
100 100 100 100 100 100 100 100 100 100 100 100 100 100 
##$AQSEQ= 0
##$AQ_mod= 1
##$AUNM= <au_zg>
##$AUTOPOS= <>
##$BF1= 200.13
##$BF2= 200.13
##$BF3= 200.13
##$BF4= 200.13
##$BF5= 200.13
##$BF6= 200.13
##$BF7= 200.13
##$BF8= 200.13
##$BYTORDA= 1
##$CFDGTYP= 0
##$CFRGTYP= 5
##$CHEMSTR= <none>
##$CNST= (0..31)
1 1 145 1 1 1 1 1 1 1 1 1 1 1 1 1 1 1 1 1 1 1 1 1 1 1 1 1 1 1 1 1 
##$CPDPRG= <>
##$CPDPRG1= <>
##$CPDPRG2= <>
##$CPDPRG3= <>
##$CPDPRG4= <mlev>
##$CPDPRG5= <mlev>
##$CPDPRG6= <mlev>
##$CPDPRG7= <mlev>
##$CPDPRG8= <mlev>
##$CPDPRGB= <>
##$CPDPRGT= <>
##$D= (0..31)
0 1.2 0 0 0 0 0 0 0 0.06 0 0.03 0 0 0 0 0.0002 0 0 0 0 0 0 0 0 0 0 0 0 
0 0 0 
##$DATE= 1612335705
##$DBL= (0..7)
120 120 120 120 120 120 120 120 
##$DBP= (0..7)
150 150 150 150 150 150 150 150 
##$DBP07= 0
##$DBPNAM0= <>
##$DBPNAM1= <>
##$DBPNAM2= <>
##$DBPNAM3= <>
##$DBPNAM4= <>
##$DBPNAM5= <>
##$DBPNAM6= <>
##$DBPNAM7= <>
##$DBPOAL= (0..7)
0.5 0.5 0.5 0.5 0.5 0.5 0.5 0.5 
##$DBPOFFS= (0..7)
0 0 0 0 0 0 0 0 
##$DE= 6
##$DECBNUC= <off>
##$DECIM= 32
##$DECNUC= <off>
##$DECSTAT= 4
##$DIGMOD= 1
##$DIGTYP= 9
##$DL= (0..7)
0 120 120 120 120 120 120 120 
##$DP= (0..7)
150 150 150 150 150 150 150 150 
##$DP07= 0
##$DPNAME0= <>
##$DPNAME1= <>
##$DPNAME2= <>
##$DPNAME3= <>
##$DPNAME4= <>
##$DPNAME5= <>
##$DPNAME6= <>
##$DPNAME7= <>
##$DPOAL= (0..7)
0.5 0.5 0.5 0.5 0.5 0.5 0.5 0.5 
##$DPOFFS= (0..7)
0 0 0 0 0 0 0 0 
##$DQDMODE= 0
##$DR= 18
##$DS= 0
##$DSLIST= <SSSSSSSSSSSSSSS>
$$ [...]
##$SUBNAM2= <"">
##$SUBNAM3= <"">
##$SUBNAM4= <"">
##$SUBNAM5= <"">
##$SUBNAM6= <"">
##$SUBNAM7= <"">
##$SUBNAM8= <"">
##$SUBNAM9= <"">
##$SW= 16.9725356469052
##$SWIBOX= (0..15)
0 0 2 0 0 0 0 0 0 0 0 0 0 0 0 0 
##$SW_h= 3396.73913043478
##$TD= 16384
##$TD0= 1
##$TE= 0
##$TE2= 300
##$TE3= 300
##$TEG= 300
##$TL= (0..7)
0 120 120 120 120 120 120 120 
##$TP= (0..7)
150 150 150 150 150 150 150 150 
##$TP07= 0
##$TPNAME0= <>
##$TPNAME1= <>
##$TPNAME2= <>
##$TPNAME3= <>
##$TPNAME4= <>
##$TPNAME5= <>
##$TPNAME6= <>
##$TPNAME7= <>
##$TPOAL= (0..7)
0.5 0.5 0.5 0.5 0.5 0.5 0.5 0.5 
##$TPOFFS= (0..7)
0 0 0 0 0 0 0 0 
##$TUNHIN= 0
##$TUNHOUT= 0
##$TUNXOUT= 0
##$USERA1= <user>
##$USERA2= <user>
##$USERA3= <user>
##$USERA4= <user>
##$USERA5= <user>
##$V9= 5
##$VALIST= <valist>
##$VCLIST= <CCCCCCCCCCCCCCC>
##$VD= 0
##$VDLIST= <DDDDDDDDDDDDDDD>
##$VPLIST= <PPPPPPPPPPPPPPP>
##$VTLIST= <TTTTTTTTTTTTTTT>
##$WBST= 1024
##$WBSW= 4
##$XGAIN= (0..3)
0 0 0 0 
##$XL= 0
##$YL= 0
##$YMAX_a= 57172
##$YMIN_a= -42735
##$ZGOPTNS= <>
##$ZL1= 120
##$ZL2= 120
##$ZL3= 120
##$ZL4= 120
##$ABSF1= 10
##$ABSF2= 0
##$ABSG= 5
##$ABSL= 3
##$ALPHA= 0
##$AQORDER= 0
##$ASSFAC= 0
##$ASSFACI= 0
##$ASSFACX= 0
##$ASSWID= 0
##$AUNMP= <proc_1d>
##$AZFE= 0.1
##$AZFW= 0.1
##$BCFW= 1
##$BC_mod= 2
##$BYTORDP= 1
##$COROFFS= 0
##$CY= 11.3945322036743
##$DATMOD= 1
##$DC= 2
##$DFILT= <>
##$DTYPP= 0
##$F1P= 15.9154993809931
##$F2P= -4.1035820241983
##$FCOR= 0.5
##$FTSIZE= 0
##$FT_mod= 4
##$GAMMA= 1
##$GB= 0.15
##$INTBC= 1
##$INTSCL= 1
##$ISEN= 128
##$LB= 0.24
##$LEV0= 0
##$LPBIN= 0
##$MAXI= 10000
##$MC2= 0
##$MEAN= 0
##$ME_mod= 0
##$MI= 1.114404
##$NCOEF= 0
##$NC_proc= 0
##$NLEV= 6
##$NOISF1= 3.799351
##$NOISF2= 2.8
##$NSP= 1
##$NTH_PI= 0
##$NZP= 0
##$OFFSET= 15.70392
##$PC= 1
##$PHC0= -10762.38
##$PHC1= 14.60095
##$PH_mod= 1
##$PKNL= yes
##$PPARMOD= 0
##$PSCAL= 0
##$PSIGN= 0
##$REVERSE= no
##$SF= 200.130013532006
##$SI= 16384
##$SIGF1= 3
##$SIGF2= 2
##$SINO= 400
##$SIOLD= 16384
##$SREGLST= <1H.CDCl3>
##$SSB= 0
##$STSI= 0
##$STSR= 0
##$SW_p= 3612.71676300578
##$SYMM= 0
##$S_DEV= 0
##$TDeff= 0
##$TDoff= 0
##$TI= <>
##$TILT= no
##$TM1= 0
##$TM2= 0
##$TOPLEV= 0
##$USERP1= <user>
##$USERP2= <user>
##$USERP3= <user>
##$USERP4= <user>
##$USERP5= <user>
##$WDW= 1
##$XDIM= 8192
##$YMAX_p= 0
##$YMIN_p= 0
$$ End of Bruker specific parameters
$$ ---------------------------------
##NTUPLES= NMR FID
##VAR_NAME=  TIME,          FID/REAL,        FID/IMAG
##SYMBOL=    X,             R,               I
##VAR_TYPE=  INDEPENDENT,   DEPENDENT,       DEPENDENT
##VAR_FORM=  AFFN,          ASDF,            ASDF
##VAR_DIM=   8192,          8192,            8192
##UNITS=     SECONDS,       ARBITRARY UNITS, ARBITRARY UNITS
##FACTOR=    0.0002944,     1,               1
##FIRST=     0,             0,               0
##LAST=      2.4114304,     0,               0
##MIN=       0,             -42735,          0
##MAX=       2.4114304,     57172,           0
$$ Real data points
##PAGE= N=1
##DATA TABLE= (X++(R..R)), XYDATA
0 0 0 0 0 0 0 0 0 0 0 0 0 0 0 0 -8 8 -8 8 -8 15 -16 17 -24 25 -32 38 -42 48 -55 63 -73 86 -94 109 -121 136
36 136 -152 173 -191 213 -237 261 -290 320 -352 390 -430 473 -520 573 -631 693 -765 843 -932
55 -932 1029 -1141 1272 -1424 1600 -1815 2077 -2406 2835 -3418 4253 -5565 7910 -13378 49989
70 49989 27153 -37567 57172 -30576 6516 22395 -20598 11397 300 -23545 21562 -42735
82 -42735 15823 -9891 -15537 17416 -36814 -437 -1329 -15234 9575 -4189 -17659 26208 -33198
95 -33198 20023 4793 -15767 38567 -15059 2881 16850 -7751 17751 12231 -9168 28686
107 28686 -23682 27927 -4508 -11600 32621 -25652 12017 -331 -19536 13077 -6565 -14363
119 -14363 13812 -37040 13340 -10238 -19335 10796 -22544 -3138 -7334 -10145 -8374 1 -7702
132 -7702 3575 -20604 10185 -8757 -2071 15301 -16617 9278 1027 -3878 8915 2392 -2027
145 -2027 20115 -19216 15791 -3838 -3731 19168 -10415 8136 -4037 -851 1831 -1477 -1906 5945
159 5945 -14020 12621 -16334 -1443 6600 -13820 7695 -10003 -4260 -3220 49 -4814 4029
172 4029 -10291 6812 -8725 -1350 3486 -6809 6471 -5157 1487 -3601 2393 -845 5435 -10173
186 -10173 12244 -9249 1820 6393 -11769 9302 -6240 -268 -3593 -384 -2577 4491 -9484
199 -9484 6379 -11668 1592 -71 -6383 6186 -9501 5509 -7505 1189 -2164 1140 -2656
212 -2656 5850 -8670 2589 1280 -2952 6153 -4039 4909 -4865 5527 -3579 4994 -1303 6292
226 6292 -4306 3496 393 -1751 7980 -4596 6979 -4434 2887 -1227 2145 -1887 6326 -5476
240 -5476 4479 -1233 -2960 6710 -5201 7044 -6633 5046 -3683 1683 175 2011 -4575 4536
254 4536 -3005 -925 3994 -5383 6944 -7853 4898 -4535 1676 -634 2114 -2959 1539 -2457
268 -2457 -1035 1891 -4707 4689 -6387 5594 -5501 2160 -1300 1051 -3271 3310 -2851 -601
282 -601 3397 -4723 5592 -6209 6556 -4806 2257 69 1564 -228 3571 -1825 683 2261
296 2261 -3349 6354 -6154 7885 -5170 3327 -139 -118 198 2487 -1327 275 1562 -2671 5756
311 5756 -5491 6900 -5687 3811 -1020 366 815 2161 -840 1066 1733 -2233 5611 -5192 7150
326 7150 -5107 4088 -797 -49 816 1258 -1351 403 86 -3012 3391 -6396 5997 -7583 2639
341 2639 -3347 -2373 -528 -1900 -2470 -960 -1595 -3484 1977 -6400 5417 -7326 4044 -2808 -318
356 -318 1002 -263 429 1061 1279 -646 4393 -3242 7310 -4546 6365 -1091 1681 2345 468 926
372 926 1150 728 -1006 3392 -4635 5416 -6869 4269 -3567 -568 127 -2576 -619 -1243 -807 -1860
388 -1860 1564 -4468 5135 -6428 5233 -3442 1404 1587 -458 2071 988 1987 417 3765 -1895
403 -1895 6482 -3987 6551 -2263 2319 1523 -858 1147 -435 -22 -1192 1333 -4917 3340 -7405
418 -7405 3474 -5941 -1203 -1731 -4368 -842 -3429 -2190 -2892 -553 -4475 2843 -6497 4406 -4676
433 -4676 1750 422 -1191 2729 50 2357 406 3534 -273 6088 -2840 6963 -1787 3963 1759
448 1759 334 2543 545 1788 -360 1956 -3000 4274 -5427 4343 -5127 596 -920 -2779 196
463 196 -2955 -517 -1781 -242 -3567 2148 -4887 4715 -4504 2462 -526 -63 2834 -1019 2579 516
479 516 3406 -809 4350 -2564 5866 -1962 3544 -109 259 1926 -604 916 -1637 1598 -3128 2302
495 2302 -5600 2461 -4732 610 -2272 -3333 -828 -3051 -689 -2969 -952 -3322 1624 -4883 2928
510 2928 -4779 2720 -893 -109 1390 -1405 3703 -291 3358 -651 3680 -782 5425 -1827 4565
525 4565 577 2126 2260 -619 2341 -90 3120 -2158 3229 -3673 3810 -2969 1323 -1852 -704
540 -704 274 -2451 -89 -2627 831 -2457 1308 -4544 2489 -4226 3088 -2520 -27 1059 -1597 2462
556 2462 -2076 2291 -899 3260 -1464 2805 -2225 3822 -658 1497 716 -1051 2495 -1668 2158
571 2158 -2915 2598 -3099 2332 -4262 1478 -1436 -423 -40 -1780 -21 -2557 567 -3022 1320
586 1320 -3398 2522 -3846 1393 -2728 1293 831 -1681 2155 -2417 3208 -491 2415 -1159 3154
601 3154 -806 3879 -949 2332 1574 805 2657 -1606 3246 -1206 3864 -1916 2416 -1861 2204 -971
617 -971 439 -399 -1155 1221 -2268 853 -2757 2164 -2693 1828 -3982 1535 -2196 630 -420 -1971
633 -1971 1644 -2428 2272 -2671 1951 -1186 2259 -1966 1883 -2126 2077 257 -497 1694 -2470
648 -2470 2895 -2556 2203 -2454 2219 -1939 1089 -1923 108 -279 -703 575 -2795 1196 -2874 1958
664 1958 -2782 1960 -2373 2068 -2167 395 -120 -666 2504 -2189 2136 -2256 2406 -872 2346 -1346
680 -1346 2381 -1094 1997 -29 30 2383 -1227 3098 -2983 2630 -1366 2627 -1239 1411 -1141 991
696 991 -124 17 1304 -1340 2219 -2643 2094 -2654 2473 -1648 1670 -1996 266 -544 -369 1165
712 1165 -2079 2137 -2977 1759 -2418 1306 -1781 1546 -2240 -38 -1598 -576 935 -2256 1963
727 1963 -3374 1870 -2961 1524 -1567 1064 -1052 555 -910 -258 1189 -994 2628 -2414 2640
742 2640 -1654 2671 -1226 2156 -609 1359 35 59 1389 -786 2657 -1833 2432 -2286 1932 -1394
758 -1394 1459 -1107 929 -978 -441 383 -1662 2406 -2818 2094 -2880 1651 -1710 1472 -635 1111
774 1111 -220 285 610 -933 2561 -1724 2987 -2347 2256 -1263 1744 -230 927 -248 -190 719
790 719 -1303 2031 -2162 2054 -2829 1099 -2570 362 -1689 -18 -1341 -1165 -869 -2181 1248 -3165
806 -3165 1988 -3158 1288 -2087 772 -1004 859 -238 146 468 -771 2383 -1325 3649 -1788 3113
822 3113 -822 2431 491 1467 1019 733 1173 -371 2248 -1333 3023 -1843 2400 -2029 1201 -1048
838 -1048 530 -581 -618 -196 -2020 815 -2904 1747 -2985 1404 -2478 531 -993 496 -470 -28
854 -28 443 -580 1883 -1606 3046 -1985 2908 -1430 1702 -556 961 819 211 1029 -798 1688 -1716
871 -1716 1968 -2436 1977 -2536 726 -2043 -462 -1106 -945 -451 -2457 385 -2906 1105 -2949 1286
887 1286 -2663 583 -1246 15 -461 -136 689 -769 1728 -1330 2873 -1281 2994 -1116 2482 344
903 344 1497 1113 893 1855 178 2070 -932 2736 -1609 2726 -1688 1525 -1203 64 -261 -764 321
920 321 -1614 885 -2801 1079 -2704 1053 -2441 630 -1826 -349 -475 -569 242 -1024 1361 -1905
936 -1905 2398 -2014 2432 -1550 2167 -489 711 647 331 1486 -380 1692 -1342 2112 -1747 1964
952 1964 -1810 1450 -1596 -36 -609 -1100 64 -1600 618 -2551 898 -2586 1036 -2296 637 -1666
968 -1666 -182 -742 -769 291 -802 1547 -1457 2178 -1424 2535 -972 1995 -316 1588 1039 799
984 799 1848 -10 2319 -637 2397 -888 2218 -1632 2397 -867 685 -113 -848 860 -1750 890
1000 890 -2026 875 -2280 228 -2368 572 -1898 -160 -906 -1345 410 -1315 718 -1894 1286 -2292
1016 -2292 1552 -1474 972 -438 736 16 -521 846 -147 1020 -470 2054 -1698 2159 -1160 1612
1032 1612 -1216 838 -541 -894 322 -1577 1739 -1669 1064 -2110 953 -1304 947 -2242 956
1047 956 -643 -300 579 -801 1210 -1734 2385 -1762 1335 -592 1621 -189 1427 -315 198 1455
1063 1455 -177 1341 -1112 2201 -1275 2115 -1309 1160 -407 1064 -189 -481 862 -1346 736
1078 736 -1742 1287 -1652 1208 -1776 667 -1520 588 -429 -431 140 -1464 1361 -1725 1515 -1922
1094 -1922 1583 -1247 1014 -1093 248 -215 -104 457 -844 889 -1224 1695 -1882 1527 -1279 1310
1110 1310 -1103 428 -686 -283 982 -1115 1156 -1606 1630 -1515 1258 -1125 1418 -870 673
1125 673 -393 348 863 -518 1574 -1478 1890 -1391 1717 -1336 1318 -542 808 39 -31 519 -59
1142 -59 987 -1504 1777 -1953 1856 -1674 1202 -1062 465 51 48 455 -1290 1294 -1228 1629 -1193
1159 -1193 1153 -1252 1039 -852 435 -114 -41 261 -986 1146 -1769 1807 -1870 1087 -1704 546
1175 546 -945 144 -1112 -582 8 -661 438 -1741 678 -2179 988 -1548 1595 -2497 673 -28
1191 -28 -89 397 -523 1750 -1405 1764 -663 2083 -733 1766 -610 1143 -10 354 675 -568 1392
1208 1392 -652 2167 -1138 1511 -819 1451 -796 457 -261 99 58 -638 614 -1419 1116 -2085
1224 -2085 1199 -1710 875 -1089 114 -630 -506 197 -707 1020 -1149 1168 -1262 1579 -1257 1218
1240 1218 -633 1021 -151 141 632 -213 1121 -1069 1560 -1191 1416 -989 999 -1025 167 -559
1256 -559 -198 -429 -951 208 -1747 853 -2103 741 -1979 494 -1296 322 -338 -214 82 -745 828
1273 828 -1019 1355 -1166 1595 -946 1651 -288 1547 356 828 1270 84 1535 -186 1979 -837
1289 -837 1941 -789 1267 -393 979 -148 -56 -31 -493 406 -1280 619 -2014 970 -2183 694 -1489
1306 -1489 -182 -608 -692 -15 -1135 586 -1303 1061 -1250 1355 -1314 1275 -726 905 -187 475
1322 475 536 -306 974 -484 1593 -935 1743 -659 1176 -649 525 -216 206 61 -805 353 -1335
1339 -1335 723 -1808 733 -1838 430 -1468 6 -850 -517 -45 -978 561 -972 1224 -1048 1432
1355 1432 -854 1566 -172 1327 340 711 1020 183 1724 -237 1913 -480 1758 -427 1532 -664
1371 -664 970 -99 415 210 -674 429 -1349 797 -1373 856 -1715 223 -1433 -146 -914 -674
1387 -674 -235 -1030 91 -1382 780 -1533 859 -1337 813 -672 966 -242 166 867 -266 1096
1403 1096 -889 1751 -674 1343 -699 1218 -600 826 -338 188 24 -669 670 -1218 804 -1397
1419 -1397 1150 -1313 394 -1246 -58 -569 -365 -58 -666 488 -1093 757 -1224 1049 -987 1324
1435 1324 -519 796 -175 610 820 76 1282 -583 1813 -559 1588 -559 1385 -357 902 -74
1451 -74 104 385 -311 602 -1048 974 -1324 827 -1463 338 -1153 343 -826 -377 -68 -780 294
1468 294 -909 445 -1238 834 -1140 588 -1115 698 -486 -81 295 -514 1022 -667 1482 -1031
1484 -1031 1184 -501 1032 -584 679 17 593 144 -498 638 -940 943 -1219 883 -977 944
1500 944 -541 551 -457 -145 188 -470 626 -704 947 -974 1209 -791 1150 -516 870 -220
1516 -220 6 388 -223 1078 -608 1090 -645 1088 -624 771 -436 844 -232 250 -44 -389 521
1533 521 -905 948 -1270 931 -1174 484 -777 198 -469 -70 123 -692 440 -799 814 -1290
1549 -1290 850 -1002 748 -922 248 -687 -40 -73 -690 827 -1020 770 -1100 822 -1101 565
1565 565 -591 698 -726 70 -55 -409 510 -762 1066 -766 1222 -795 976 -610 807 -175
1581 -175 157 247 -141 683 -194 825 -540 1290 -551 1219 -560 780 -71 204 271 -358 466 -701
1599 -701 694 -919 811 -1011 875 -889 126 -655 -2 -131 -691 272 -889 945 -1115 896
1615 896 -1170 744 -793 289 -421 -37 -219 -428 471 -549 755 -717 1047 -1203 882 -677
1631 -677 464 -410 -9 174 -552 357 -921 511 -1209 876 -1114 551 -1050 209 -546 231 97
1648 97 -625 339 -618 755 -942 1213 -742 1282 -399 832 -50 760 389 78 1070 -286 1070
1665 1070 -370 1597 -735 1336 -445 684 -29 309 198 -398 453 -1036 706 -856 808 -1074
1681 -1074 272 -916 94 -862 -120 -598 -770 165 -1017 603 -1006 475 -1077 629 -901 396
1697 396 -236 252 179 -80 515 -201 764 -474 1093 -645 1215 -568 630 -156 273 91 -112 514
1715 514 -583 591 -835 593 -1279 721 -1023 88 -586 -171 -386 -640 -80 -883 728 -882 720
1732 720 -645 988 -491 693 -75 563 169 357 894 -95 1303 -251 1333 -463 1398 -360 986
1749 986 3 483 269 92 563 -682 829 -1152 466 -981 406 -1042 -45 -1151 -253 -628 -437
1766 -437 221 -1012 196 -1151 219 -897 560 -786 419 -440 280 -127 242 704 -458 991 -304
1783 -304 1068 -353 1291 -342 961 -259 215 -112 122 682 -520 849 -743 355 -740 797
1799 797 -993 126 -523 -135 -424 -378 -72 -752 768 -1162 409 -871 977 -729 478 -205 167
1816 167 249 2 504 -156 1072 -277 1327 -530 1183 -538 1079 -79 373 224 135 369 -460 618
1834 618 -1053 527 -1023 470 -1066 318 -798 -392 -299 -713 -51 -780 293 -1022 385 -1026 477
1851 477 -1183 184 -559 89 -198 -145 322 -173 931 -580 1065 -634 1033 -580 722 -244 491
1868 491 270 -108 405 -455 780 -713 694 -636 670 -865 774 -453 -14 -56 -239 369 -491 795
1886 795 -787 776 -804 576 -744 577 -413 294 204 140 476 -353 1077 -835 975 -537 1003
1903 1003 -496 643 -205 453 94 -178 353 -173 708 -1137 933 -826 598 -678 441 -706 182
1920 182 29 -443 116 -948 361 -1284 619 -867 517 -992 453 -648 232 -38 -366 189 -600
1937 -600 682 -987 808 -918 769 -635 451 -456 151 293 -220 426 -360 669 -544 1110 -840
1954 -840 675 -877 642 -238 206 128 -45 520 -444 485 -414 1131 -348 974 -419 645 -253 262
1972 262 7 -48 187 -393 436 -763 764 -884 587 -795 533 -580 -115 -100 -332 217 -618 359
1990 359 -761 679 -1049 575 -625 454 -845 342 -142 -377 295 -681 465 -683 589 -752
2006 -752 605 -586 501 -584 169 -112 -117 371 -429 578 -711 1018 -886 540 -617 493 -244
2023 -244 133 72 -299 367 -535 236 -552 719 -650 633 -516 832 -269 569 84 -89 539 -326
2041 -326 751 -382 898 -406 1068 -542 701 -367 296 -98 175 621 -441 386 -662 710
2057 710 -766 452 -646 122 -571 -188 -446 -260 92 -602 213 -868 516 -965 463 -923 507
2074 507 -517 365 -180 -21 369 -602 472 -721 912 -824 852 -392 674 20 432 -123 -88 412
2092 412 -352 664 -664 708 -990 572 -677 403 -560 207 -233 -466 151 -743 551 -745 527
2109 527 -924 636 -554 567 -214 258 208 -39 258 -122 578 -365 1113 -749 880 -331 779
2126 779 -145 427 96 282 407 -300 474 -825 765 -941 563 -575 201 -619 -84 -720 -538 -162
2144 -162 -969 213 -907 416 -987 604 -842 429 -580 283 -234 -220 307 -282 787 -371 904
2161 904 -660 697 -233 931 -331 349 151 43 383 -343 724 -799 732 -366 618 -604 336
2178 336 -630 35 -340 -259 55 -486 502 -640 621 -804 584 -527 711 -451 346 21 136 166
2196 166 -238 588 -218 1000 -443 841 -277 896 -12 435 332 119 303 -288 611 -478 689 -652
2214 -652 582 -555 529 -465 -180 -334 -316 -393 -918 303 -935 222 -1049 719 -647 304 -534 -91
2232 -91 -419 -142 373 -270 595 -338 649 -649 669 -279 715 -329 557 -75 85 533 -109 981 -639
2251 -639 868 -327 771 -640 570 -307 -24 253 -124 -25 -716 433 -984 585 -565 917 -490
2268 -490 668 -315 150 -194 95 -296 147 611 -1245 590 -1087 351 -428 1175 -232 576 -703
2285 -703 326 126 253 456 272 1510 -644 1038 441 983 -246 849 -81 -376 -204 -712 620 -172
2303 -172 343 -1443 37 -695 -26 -456 232 -297 -789 276 -424 703 -21 241 -302 957 -724 1069
2321 1069 286 190 -48 178 86 -56 469 -1054 495 -831 617 -886 1086 -58 -338 -166 -164 379 -693
2340 -693 397 -985 466 -431 942 -679 622 -241 71 -302 -359 -14 283 543 -921 680 -623
2357 -623 712 -606 868 -512 123 -135 301 204 -638 370 -479 674 -858 472 -549 187 -218
2374 -218 372 -147 -343 251 -453 535 -680 597 -765 671 -742 264 -471 -87 136 -196 -97 -461
2392 -461 593 -333 431 -670 686 -533 521 -242 406 -129 -65 157 -377 642 -265 665 -567 536
2410 536 -461 540 -68 460 -8 213 283 -142 493 -458 585 -679 688 -342 531 -184 517 -108 60
2429 60 97 -236 423 -492 361 -541 482 -635 240 -492 141 -265 -145 92 -458 382 -556 75 -786 301
2449 301 -563 292 -627 45 -147 -237 186 -73 240 -404 568 -443 617 -548 450 -307 266 133 44 404
2469 404 -174 769 -210 449 -581 460 -531 290 -428 149 -46 -63 120 -335 366 -772 464 -523 466
2488 466 -442 268 -322 292 -228 335 201 -99 621 -213 610 -38 741 -268 591 -74 150 143 35 360
2508 360 -300 415 -302 192 -553 555 -632 547 -499 272 -426 -72 6 -358 203 -1022 133 -1279
2526 -1279 343 -775 386 -497 -236 -72 95 -72 -766 -229 -495 225 -293 641 249 586 279 403 96
2545 96 309 310 14 425 -324 573 -422 795 -423 447 -164 215 -281 86 -227 -246 176 -584 456 -511
2565 -511 363 -533 319 -640 112 -61 -30 267 -6 185 -173 445 -229 604 -395 770 -353 337 101 138
2585 138 536 -103 409 -40 663 -625 609 -712 392 -528 277 -457 -213 -153 -430 -69 -295 114 -692
2604 -692 169 -634 235 -547 97 -369 -134 -87 -317 299 -381 457 -338 563 -418 551 -128 556 -91 295
2624 295 361 18 317 -270 881 -567 792 -200 652 -22 426 -57 -249 122 -185 347 -536 407 -371
2643 -371 199 -213 139 -668 345 -311 -161 59 -139 589 -523 532 -424 609 -562 601 -236 233
2661 233 -126 134 415 -102 339 -191 384 -229 640 -451 287 -532 54 -312 -137 -28 -422 224 -574 149
2681 149 -717 326 -763 -77 -508 109 -436 -180 -215 -186 119 -353 213 -412 439 -578 390 -371 397 -115
2701 -115 267 209 321 199 -236 583 -367 879 -402 580 -266 261 -129 5 115 -169 288 -241 305 -491
2721 -491 501 -528 380 -713 74 -285 -192 135 -138 192 -275 435 -432 414 -303 438 -274 256 -18 204
2741 204 52 -34 248 -239 417 -364 341 -290 501 -484 262 -111 99 -63 -226 313 -414 235 -618 425
2761 425 -471 277 -494 221 -205 -85 39 -313 74 -293 302 -437 451 -416 471 -312 178 -146 43 50 -94
2782 -94 390 -350 553 -350 537 -175 452 -334 377 -84 -27 235 -27 234 -292 552 -306 507 -500 314
2802 314 -419 83 -129 389 211 7 332 -375 493 -486 409 -537 425 -214 -42 -355 37 -214 -24 359
2822 359 -516 195 -523 532 -504 69 -479 411 -457 104 199 -176 313 -209 241 -562 656 -326 209
2841 209 -421 609 -411 281 231 -268 438 -228 406 -396 542 -171 554 -581 -79 -93 -69 189 -166 166
2861 166 -373 314 -399 428 -302 235 -197 237 -148 39 99 -25 210 -317 539 -397 581 -170 386 -96
2881 -96 540 -19 -167 52 -212 444 -131 236 -363 475 -476 142 -577 83 -255 -27 74 -375 -8 -246
2901 -246 313 -579 311 -597 440 -259 334 -161 37 -58 -477 459 -387 345 -222 439 -383 261 -296 180
2921 180 -58 571 147 126 258 -200 598 -461 695 -270 827 -264 402 -157 -61 -25 156 79 -608 438
2941 438 -80 806 -844 -518 -528 198 -1317 -272 -153 -721 133 -106 587 -447 246 -522 433 -233 -207
2960 -207 -724 356 396 -256 840 -338 731 -741 -215 -807 135 -515 -120 -182 -261 326 -149 12 -830
2979 -830 636 -811 295 -1005 196 -1122 44 -12 -169 8 -458 589 -864 448 -690 -384 -871
2996 -871 377 -265 -88 -856 594 -32 506 251 936 607 -449 426 -621 991 -36 503 -145 246
3014 246 942 -216 -828 19 609 -659 1012 -652 -348 -255 -332 -813 81 -153 -518 106 136 391 -654
3033 -654 603 -600 -592 275 308 -280 206 -485 -252 1230 -734 694 -328 956 -641 723 -681 -219
3051 -219 271 350 -410 -380 260 -203 291 -811 742 79 135 -404 -75 -508 25 -23 499 499 -433 499 -316
3072 -316 -20 -1104 448 -804 507 -82 259 167 503 107 -173 523 -509 409 -402 825 -326 304
3090 304 177 34 60 169 86 -267 149 -556 119 -363 355 -665 597 -435 8 353 -205 216 -159 268
3110 268 -490 540 -609 460 -362 163 34 -17 -86 79 -386 -710 895 -724 407 -358 -176 -170 168
3129 168 -90 136 213 -551 474 -533 248 -333 275 -367 104 -656 92 -61 10 -15 -214 36 -285 268
3149 268 -557 519 -426 372 -323 349 -54 102 -173 -115 273 -268 396 -441 447 -370 440 -136 237 -168
3169 -168 160 43 54 202 -280 344 -327 457 -645 346 -593 281 -180 98 10 26 -199 -302 417 -490 283
3190 283 -438 437 -180 129 -245 -28 81 -76 194 -93 188 -209 234 -359 144 -429 297 -6 401 -117
3210 -117 -236 302 -330 194 -514 362 -377 212 -325 153 -128 275 -102 1 95 -168 272 -327 226 -158
3230 -158 454 -450 177 -150 288 149 -145 164 20 148 -378 165 -177 327 -248 191 -127 220 78 -181
3250 -181 57 -3 81 -151 355 -224 324 -504 121 -78 81 -1 -169 259 -187 384 -340 600 -184 312 -427
3271 -427 346 -119 -128 -142 -127 260 -137 480 -545 300 -380 135 -301 214 -55 51 -189 67 45 -3 437 -285
3293 -285 300 -465 376 -90 195 -262 67 2 20 179 -91 585 -221 479 -343 388 -19 291 -299 161 23
3314 23 334 87 -164 386 -115 403 -587 211 -513 107 -352 91 23 -76 35 -280 471 -318 454 -260 372
3335 372 -155 314 -128 280 100 -8 355 -222 335 -353 287 -171 167 89 248 -132 53 121 -40 -106 -27
3356 -27 175 -328 318 -441 190 -549 -16 -165 -22 -57 -248 154 -440 110 -310 358 -311 272 -241 140 -160
3377 -160 306 -156 -65 186 -243 406 -74 296 -177 629 -262 345 -145 218 25 135 131 -340 320 -329 372
3398 372 -198 308 -302 193 -404 227 -188 -130 74 -231 215 -346 355 -285 211 -225 -3 -447 132 23
3418 23 135 110 -74 39 -36 265 -508 232 -356 213 -232 240 5 -128 188 -287 176 -376 340 -352 251
3439 251 -566 66 -423 28 -222 -134 79 -168 174 -417 73 -314 92 -200 87 -258 217 120 50 196 -116
3460 -116 462 -16 512 -129 497 -16 454 144 100 297 168 309 -357 408 17 233 -257 195 -170 204
3480 204 -461 -44 -311 -173 11 -268 143 -310 402 -534 95 -587 226 -193 377 -70 -19 286 -31 292
3500 292 -141 402 -143 490 -72 435 86 -54 -161 77 267 -265 203 -60 87 -324 154 -332 -25 -53
3520 -53 60 -364 35 131 -33 -17 -220 -65 -423 189 -56 220 -22 10 60 -35 136 -32 396 -34 304 -443
3542 -443 273 -111 346 -37 240 103 -60 406 -205 196 -296 482 -165 312 -243 373 1 100 -48 -102 -65
3563 -65 -52 127 -67 264 -297 122 -188 345 -201 87 -131 28 152 -207 224 -293 70 -405 544 -146 233
3584 233 -120 81 -73 -222 50 -137 224 -269 116 -308 284 -164 -22 -82 -53 16 -168 11 -256 290 -245
3605 -245 165 -186 86 -76 242 -110 128 16 48 281 -71 261 -151 372 -325 256 101 114 -194 66 -80
3626 -80 -61 154 7 104 -313 194 11 199 -275 331 -347 201 130 -219 -89 -4 73 -188 271 -326 353 -493
3648 -493 317 -262 84 -276 -29 -109 -70 50 -546 139 -245 268 -154 393 -343 34 -125 -11 104 12 77
3669 77 -364 144 -489 341 -305 265 -133 205 115 -41 135 -245 -55 -130 327 -75 116 -378 133 -286 284
3690 284 -30 7 226 -183 126 -369 -47 -332 213 -146 25 -122 60 -85 -98 140 -232 70 -60 69 -195
3711 -195 250 -322 240 -223 17 37 -139 51 -105 134 -353 423 -289 321 -114 295 -160 271 -89 46
3731 46 117 -316 158 -299 93 -223 321 -275 104 -423 -86 23 -6 -9 262 69 -377 173 -13 214 -267 315
3753 315 17 90 73 101 189 69 348 -24 205 -187 406 -470 113 0 331 126 254 178 -144 303 -219 333
3775 333 -196 373 -315 198 -280 259 -45 -13 -29 -60 165 -156 49 -607 204 -236 155 -333 229 -144 38
3796 38 101 -347 121 -128 182 -307 197 -243 164 -34 137 204 -69 110 -35 262 -90 200 -157 305 -305
3817 -305 106 -415 107 -31 -36 -11 -458 105 -143 204 -256 380 -285 211 -94 289 15 -297 11 -43 405
3838 405 -125 260 -278 209 21 -75 -2 164 -76 -57 240 -58 154 52 176 -203 168 -330 69 85 -83
3859 -83 202 92 123 -189 168 -285 33 -355 373 -188 175 -171 214 -40 -171 149 -101 153 -208 312 64
3880 64 45 7 230 -21 -78 -23 132 164 -14 175 -259 193 51 260 -61 282 -286 91 -523 -13 -52 -428
3902 -428 88 -411 250 -351 202 -469 174 -186 102 1 -27 -260 -134 146 -210 256 -144 234 67 313
3922 313 -301 383 145 171 21 51 148 41 224 -14 263 -241 257 -155 433 -119 -46 -290 -72 2 -337 -39
3944 -39 -388 273 -136 398 -225 -99 -201 -252 -74 -112 2 -235 110 -233 136 -326 -77 -3 156 -224 105
3965 105 -248 79 523 296 670 -581 -3 -154 95 -499 266 64 -252 300 -199 48 -146 93 -843 -72
3985 -72 -53 159 -236 -343 -279 -111 198 -312 342 -120 -75 -141 54 -409 491 -3 131 98 280 1 -18 163
4007 163 -119 63 412 79 -85 8 -208 201 -641 224 -222 104 271 -92 392 -142 173 -69 -110 -222 -294
4028 -294 -344 175 -72 -222 491 13 186 -420 -57 -326 391 -558 96 -107 -67 151 10 53 -216 100 -27
4049 -27 396 -195 146 -57 72 -52 84 138 -295 145 -348 77 -232 407 -114 79 -150 154 42 150 -185
4070 -185 35 304 -425 320 -218 228 -39 -21 -107 308 -145 -117 5 165 404 -194 254 -125 400 -148 296
4091 296 -112 129 61 177 -311 -25 -89 -369 114 -103 97 -42 60 -241 50 -18 125 -19 181 311 -372
4112 -372 272 -154 228 -64 291 -210 221 -201 -148 -18 -193 -41 -234 205 -354 241 -227 332 -249 214
4132 214 32 99 61 -181 112 -63 387 -236 411 7 177 -140 235 -227 128 34 -70 311 -89 95 -175
4153 -175 363 -613 74 -304 147 -125 -170 55 -386 -53 -436 -209 -391 198 -130 144 -435 128 -310 81
4173 81 231 -361 336 -283 68 -15 357 -221 709 50 381 -179 170 -9 85 -47 -62 563 -296 108 21 152
4195 152 35 280 351 -200 -42 87 -64 -217 429 -222 272 -419 -292 -581 335 -207 -241 354 -155 -402 285
4216 285 337 -14 410 -257 447 -275 601 -232 -135 284 -39 449 -120 -166 -402 525 70 125 205 290 6 -174
4238 -174 211 -212 359 -115 313 -75 421 -236 74 -324 64 105 220 130 303 316 -27 -84 -352 327 -317
4259 -317 -172 -112 577 -24 579 -313 -325 261 443 105 -198 382 206 149 41 467 -144 42 141 -223 115
4280 115 -212 201 -195 202 -508 369 75 109 182 -212 164 76 97 -161 324 228 153 73 224 191 211 46 60
4303 60 20 232 401 -84 709 -353 531 -545 -84 201 -54 -172 -50 68 157 256 167 -191 -66 370 -261
4324 -261 127 99 417 52 -80 -333 -253 87 -28 272 -188 305 -23 220 -393 178 -15 223 130 -172 -8
4345 -8 55 -370 -284 432 -103 249 133 35 -227 20 175 9 49 -174 509 144 -204 -243 -3 -6 768 -120 -417
4368 -417 -55 -238 136 -119 -6 -77 501 -407 370 -359 170 179 7 -4 170 27 21 237 148 477 -105 301
4390 301 -158 -132 -10 732 522 -127 -187 -129 189 184 -49 -379 -420 -42 242 -95 161 -301 -240 -273 -3 453 -304
4413 -304 565 -748 541 -390 115 -179 385 -182 -64 346 352 290 321 -109 -403 23 -200 -165 -265 647 -150
4434 -150 -119 -261 34 -328 -509 145 -146 36 -166 331 -149 -30 84 -183 73 -174 -203 -363 70 -266 93
4455 93 -21 134 -36 -35 -228 -48 34 226 413 -303 71 -65 262 -189 110 52 -51 -11 114 84 79 303 -228
4478 -228 377 -112 351 -85 -104 -135 371 64 -8 -189 -309 -40 -57 258 -292 159 -279 -16 80 49 -108 110
4500 110 8 -205 -45 -466 206 -274 216 121 237 -83 -37 14 -11 -73 -60 144 -140 172 -314 162 -296 207
4522 207 121 83 -47 40 -29 -113 72 -219 9 -303 84 -355 115 -21 160 7 153 149 -151 159 -20 224
4544 224 -158 90 -273 84 -382 267 78 57 199 -155 -29 -3 217 -218 -6 -36 346 -68 46 50 -211 7
4566 7 -45 2 -270 13 -191 -42 55 426 -163 57 108 19 302 -155 14 -103 190 -104 241 -215 308 -222
4588 -222 -16 -116 -135 213 36 424 -255 -32 -151 197 -112 201 -255 196 111 -60 10 34 151 -292 -1
4609 -1 -24 134 -186 86 18 192 205 -233 214 143 116 -212 233 -161 219 -236 66 -404 -32 92 -194 174
4631 174 -424 -113 -57 -228 -80 -35 45 245 -151 179 190 -35 142 -63 262 -97 182 -99 173 -184 -109 -203
4653 -203 132 183 -18 87 -172 -117 46 246 -192 195 33 255 -125 224 21 -218 -51 -99 245 -239 130
4674 130 -440 -179 -347 183 -225 264 249 85 70 95 -116 -211 234 -53 121 -121 14 64 -25 -321 -60 -71
4696 -71 -213 -84 -309 55 -160 165 -436 105 -132 -23 -37 -32 -27 -117 149 -222 -10 -20 255 7 256 -274 132
4719 132 -269 22 304 -209 55 -290 226 50 46 -251 156 -93 -91 37 63 66 -151 130 -196 103 -144 156
4741 156 -34 136 -258 73 -92 -48 -114 -59 -27 -251 -34 -69 179 -272 142 36 -234 -13 -144 117 104 77
4763 77 -349 318 -116 231 -331 17 103 -192 193 54 76 -171 577 -432 -19 -54 179 -161 158 47 -213
4784 -213 269 76 -54 -222 168 -140 67 -207 102 -98 113 94 -22 19 17 261 34 242 14 235 -167
4805 -167 18 -55 169 -19 167 96 -255 164 -94 -81 -235 65 -138 40 15 143 -238 134 -240 147 21
4826 21 -71 110 -189 58 -137 119 88 102 -97 313 -80 64 183 116 -4 -257 119 28 174 -62 372 -116
4848 -116 -47 -30 0 42 27 -11 -120 216 51 204 -216 -90 53 -118 -50 113 -10 -1 -2 -74 -139 14 16 -79 59
4873 59 -62 167 -153 107 156 -87 135 -69 397 -34 199 -64 22 96 0 -24 17 -94 -30 96 -180 217 -217
4896 -217 108 -54 136 -5 -200 -96 164 69 58 -7 -17 -23 -40 245 -343 177 80 74 -121 -85 167 -109 0 1
4920 1 287 -22 184 -116 -31 -85 186 -84 -260 -107 -121 127 -374 187 -308 60 -158 231 18 -113 -137 -199
4942 -199 219 -227 -22 1 123 -128 20 -278 21 -63 -114 60 -128 -218 36 262 -80 9 -55 331 -216 -75
4964 -75 -213 9 68 28 255 -28 -248 -207 -43 -78 81 -10 -163 -79 -118 -52 -126 95 -116 177 -303 -59 -84 173
4988 173 -10 58 -43 103 167 -164 168 100 247 -263 133 -152 110 3 159 -135 75 -232 -74 63 -38
5009 -38 -76 -218 251 -370 237 -34 -93 -78 8 80 187 -130 77 181 100 131 -127 188 -261 81 44 60 -47
5032 -47 -100 -239 -169 -109 -152 197 -180 -85 -33 12 -102 32 -105 12 56 -95 155 -452 65 -34 -15 -5 269 -76
5056 -76 141 48 38 211 85 8 -16 -61 -27 181 -107 239 -224 125 173 116 92 -196 227 -9 -43 -277 88 -69
5080 -69 19 -182 -66 -38 -59 67 -47 1 -49 -9 -162 110 -196 -60 65 -12 54 -119 72 -121 144 -39 566
5103 566 -224 163 88 425 -210 92 181 186 -405 -86 147 59 -48 -99 174 -94 113 -193 192 32 173 -11
5125 -11 21 218 -176 -68 -37 -29 -144 152 59 193 -216 -50 120 12 -45 75 28 -86 226 -105 -6 -143 225
5148 225 177 103 72 -57 276 -145 260 -129 -34 -57 133 -314 47 -271 -151 101 22 -154 -91 10 -207 163
5170 163 -313 227 -191 -84 27 -41 -24 -224 -168 -43 105 -73 17 -93 235 170 89 -46 -35 5 -61 92 -122
5193 -122 129 56 -64 5 107 -166 -81 -219 4 -119 -250 61 -223 15 -230 51 -63 179 -23 26 116 -154
5215 -154 144 87 120 -170 271 -231 112 167 127 -70 -107 14 -85 -16 -33 215 -39 91 -120 191 -86 323 -323
5238 -323 -133 55 -222 274 -82 140 -80 81 174 88 -321 255 -50 155 225 14 -59 -131 -60 -47 60 -64
5260 -64 110 35 38 90 72 -91 -112 135 97 164 -448 -116 -19 79 -268 -75 -126 106 -175 17 2 -79 -227 -411 32
5285 32 -129 180 -12 205 -40 -65 -77 -108 -2 -105 69 -29 90 -161 137 -197 154 5 -144 78 -64 42
5307 42 131 101 169 -14 -1 -117 40 254 -19 181 140 69 -291 110 175 -16 189 -99 121 -37 -157 -31 194
5330 194 72 11 174 -155 142 -128 400 -218 0 89 155 -241 39 69 30 -34 -76 -60 89 49 -90 13 -1
5353 -1 85 -52 34 -90 157 107 -41 -38 -55 132 -86 269 74 -14 -136 110 228 88 -15 -214 -114 -172 -55
5376 -55 11 -74 -73 127 -145 142 251 347 -37 -111 -169 -43 -51 -21 229 -220 -72 -7 146 28 -30 145 -224 -16
5400 -16 -17 164 95 121 11 116 168 -79 -34 91 -180 -57 -246 -183 107 -24 32 128 -52 132 83 17 -67 104
5424 104 -134 -29 -255 212 -31 277 -128 171 -64 12 28 78 -15 150 2 110 221 -25 85 -30 191
5445 191 314 -11 157 283 29 -17 39 -46 79 6 194 -163 200 -198 -108 41 -29 -81 -175 -74 -146 176 -63
5468 -63 339 -201 113 47 -56 31 -91 111 -2 154 -372 57 -104 74 -122 12 -54 217 4 107 44 121
5490 121 35 52 424 -237 -83 258 232 -107 70 -24 -51 -132 -2 12 -138 27 -45 133 13 132 163 -42 49
5513 49 136 100 -243 331 -322 133 9 5 -26 94 -34 -25 -13 26 238 133 203 4 271 94 39 -288 -34 -68
5537 -68 -94 -13 -112 17 110 107 177 137 -299 -126 -264 117 -136 95 339 -20 127 27 73 -80 -66 -77 190 75
5561 75 155 -109 -62 -10 -49 -218 234 -160 -207 66 58 202 -330 176 -86 250 97 -31 269 -28 76 -167 89
5584 89 -138 -12 -72 191 -24 -81 -91 -54 -98 -14 -19 -77 -14 -98 30 -110 158 -4 22 -94 34 2 -74 269 -89
5609 -89 233 -88 26 163 77 -134 -23 -162 174 106 -126 74 -49 202 -292 -11 114 1 82 33 14 78
5631 78 -141 180 -195 -219 107 48 -56 37 43 455 -260 -215 157 42 552 38 157 -239 -347 -195 -791 -245
5653 -245 393 150 399 330 -73 15 816 93 535 -72 289 13 82 -13 70 -60 -146 39 61 -15 -82 160 -35
5676 -35 -49 42 -224 -188 199 64 -29 -90 -2 -11 -160 161 101 96 -157 198 -173 -163 -51 -153 -2 133 144 72 -8
5701 -8 -359 158 274 149 -42 89 190 109 110 -96 108 -170 -47 -99 151 -7 -69 115 -67 -112 66 -38 39
5724 39 60 -18 196 -48 85 -99 -83 -260 -67 -104 80 17 145 124 -13 -89 -42 179 124 -70 -270 -87 -186 159
5748 159 -65 159 214 0 -43 -82 147 -49 193 18 -87 -273 -92 -23 -224 86 274 307 -75 179 -34 143
5770 143 -44 13 118 -151 -96 4 -134 -205 -85 -55 119 -3 130 1 275 56 -41 -31 117 90 -177 -31
5792 -31 -195 207 -21 119 131 290 -7 81 55 86 -134 -64 223 -132 174 133 -56 -157 93 -79 3 -18 -35
5815 -35 142 -206 -34 -211 -18 -46 169 -241 -10 -11 134 -104 17 145 11 -116 -118 147 32 -39 -149 218
5837 218 -164 -238 14 -114 117 -219 14 -333 -16 -228 -222 -43 171 -20 164 40 -106 301 -264 244 54
5858 54 -65 4 32 47 -18 341 135 -391 41 174 274 -96 -322 -91 -200 637 -297 -369 -136 106 101 454 30
5881 30 342 94 -390 272 258 -110 -53 331 141 -134 -36 420 749 515 397 -575 856 309 214 -300 318
5902 318 -190 -261 416 174 -341 -637 -273 264 936 -303 -41 -190 -40 -306 153 24 188 74 3 128
5922 128 227 -51 62 -9 125 117 44 -173 -154 123 17 -254 -68 -64 -84 -48 -59 91 85 -15 -97 -53 78 -79 -8
5947 -8 283 -106 324 -186 88 -232 94 -31 196 -24 -24 77 -203 147 -41 7 -187 128 -183 -21 -283 9
5969 9 14 32 48 132 26 129 -48 -86 173 -12 -44 47 104 16 -89 253 -253 117 -71 -37 146 196 -65 112 102
5994 102 -49 180 -134 -25 -46 -74 125 -9 -346 -201 -169 10 -51 -382 39 -88 -28 -166 164 59 46 -75
6016 -75 150 -173 211 -52 -127 132 47 203 -232 134 32 101 -409 68 -102 -55 79 -29 -6 -24 296 -39
6038 -39 262 190 119 23 112 -215 -116 69 16 66 197 250 -185 -6 -27 260 -95 -55 -457 30 85 127 -73 -399
6062 -399 188 -137 53 148 379 -230 -415 108 130 -82 71 -244 -62 -31 -289 -330 78 1 -239 397 -294 -275
6084 -275 -232 -44 409 35 498 43 85 389 77 -310 73 -1 -212 -478 115 -278 445 345 -683 475
6104 475 -277 276 -8 46 -353 134 -203 211 -138 383 654 -351 206 -655 -181 612 283 -171 380 169
6124 169 -373 78 -482 69 -911 578 -216 -481 -456 -144 -96 -455 -62 206 199 123 42 -177 16 -430 -252 151
6146 151 117 -69 86 -237 40 218 -7 -134 15 102 -49 200 -75 21 -123 118 -59 -142 -188 -52 202 -208
6168 -208 18 -1 191 83 227 -89 -29 -33 5 129 -20 123 76 58 -39 39 182 -45 -388 68 219 107 -233
6191 -233 -76 -253 166 35 188 412 -113 69 15 283 197 -694 517 -123 49 466 819 66 43 -463 301
6212 301 59 136 70 217 -61 -114 69 162 62 -197 -143 -7 28 53 221 22 8 103 27 -109 524 685 -312
6235 -312 -448 -491 -122 104 224 -230 -156 438 20 78 -38 -234 -182 -123 125 -5 -168 276 -58 -47 5 64 -197
6258 -197 68 -115 45 194 -224 152 -132 142 50 116 -127 -9 -149 -55 -16 -54 97 7 67 -213 -93 147
6280 147 321 -200 23 -19 -112 10 -296 35 87 34 -15 24 -225 8 193 -63 -31 -98 94 69 2 -102 31
6303 31 -42 229 -41 7 96 -231 199 -71 -194 -144 -60 -185 64 -93 39 57 242 22 118 -93 -48 86 -43
6326 -43 -33 -203 -322 -137 -43 -93 -83 -6 -119 73 -80 16 41 -208 -168 -249 17 -40 -86 -96 7 128 39 60 -38
6351 -38 -282 128 73 217 -52 241 -243 -305 -97 -9 58 -89 28 26 79 -58 24 217 94 -341 90 160 -3
6374 -3 38 52 56 61 -149 -261 -149 -125 -128 77 2 -33 169 439 256 13 0 14 -3 53 -196 27 -2 66 -113 137
6400 137 -198 95 5 -156 -10 90 51 4 54 -64 71 95 -154 21 -115 174 82 22 183 315 -78 24
6422 24 -302 25 -120 48 -94 -107 56 -137 192 121 201 -49 0 93 -75 -64 -29 -107 -37 137 53 130 -24 201
6446 201 6 15 193 22 -141 73 105 -88 -130 127 -138 -80 -73 -162 -87 -19 271 -184 112 -50 -14 265 -108 249
6470 249 8 157 38 172 27 63 -16 128 355 114 13 76 14 -56 42 300 382 -37 141 91 -3 21 -230
6493 -230 289 -280 -49 -114 344 535 44 48 -21 -144 31 -11 -137 49 -273 376 30 -79 160 277 -315 -106
6515 -106 -183 54 140 41 233 -435 -323 -265 -9 43 232 68 390 -313 -41 -96 -32 -82 -315 343 182 -134 102
6538 102 -164 -61 -372 -138 588 -39 49 233 363 -745 -150 -247 392 257 189 -65 841 -174 384 190
6558 190 -199 -572 -3 -220 135 -47 -270 493 70 274 590 287 -171 604 -190 136 -475 -359 169 -169
6578 -169 -113 245 -301 -579 37 -392 -597 -179 13 705 34 184 -651 -277 640 433 -352 410 -346 -296 -37
6599 -37 -213 353 128 302 604 -270 -387 878 27 142 213 -242 426 142 -119 -148 -22 557 147 -516 127
6620 127 171 591 -310 59 211 335 -289 449 -146 -194 55 12 -561 -300 67 -139 -453 -14 -333 100 -234
6641 -234 -246 -82 -191 181 117 -611 -21 592 0 -467 104 267 329 -522 -282 171 -100 242 193 -142 -202 -161
6663 -161 263 50 -410 -114 84 216 -146 59 -244 -324 235 -354 -51 -243 -16 186 56 18 23 -1 150 44
6685 44 10 190 -186 132 9 125 16 -90 38 -288 -39 318 14 -94 23 200 -152 -183 88 -123 275
6706 275 67 -97 -206 164 -218 -22 -48 84 129 -3 321 -210 43 -175 138 -139 96 -73 158 64 -40
6727 -40 116 -41 21 -364 89 -74 188 -67 120 -124 -124 -62 34 207 39 166 -79 206 6 -16 5 153 123
6750 123 35 11 59 198 114 -101 162 347 -49 -178 85 202 39 76 -122 69 104 64 -6 169 -114 -50 -14
6773 -14 -116 -31 74 -44 76 -239 70 173 -158 246 94 138 83 241 -119 -48 -55 -91 -116 100 192 194 -178 26
6797 26 -294 99 -58 -64 -21 -142 -6 -152 136 -52 213 91 -54 25 11 -50 -202 54 -69 55 -62 -56 -208
6820 -208 46 319 29 -24 -102 189 167 -48 -172 -10 -21 128 -83 -84 -113 31 -73 -90 36 -78 -183 50 -107
6843 -107 25 194 24 -13 -207 -8 -223 -12 58 123 40 110 -99 -87 35 79 43 -14 32 126 -171 -144 23 238
6867 238 151 -57 110 8 107 1 -43 248 314 23 69 186 57 231 -83 -53 -40 75 -218 27 -55 -220 301
6890 301 -190 162 42 -204 59 54 42 -159 -100 -8 172 31 247 47 -172 52 -112 82 30 241 -11 -160
6912 -160 -398 -5 -19 121 -181 -37 78 90 -64 31 8 89 -21 166 247 56 -27 -16 180 58 44 -18 192
6935 192 194 123 -144 -23 -36 -287 -177 131 -158 -55 -244 -150 80 -132 11 101 57 -16 43 157 -17 373 60
6958 60 124 -208 -186 19 67 12 57 99 -8 85 124 -9 11 -169 -185 -112 -100 33 253 -21 -24 -8 -158 -21 78 -293
6984 -293 -65 352 10 -229 42 42 87 19 135 166 78 1 -61 136 98 -36 -27 -192 82 27 -43 -177 255 57
7008 57 104 212 -56 -112 150 61 27 -27 -79 -8 217 49 36 72 -120 -50 127 124 -77 -52 -270 -154 169 54 -38
7033 -38 331 -21 71 342 -107 30 -116 29 31 -84 188 -84 -30 -148 -122 -76 47 78 112 -94 -88 79 141 135 18
7058 18 -99 122 -151 109 -32 -100 -124 47 -86 241 106 45 -40 321 143 49 145 92 -56 -26 37 219 -96
7081 -96 -49 185 -252 119 -303 -76 -145 167 -182 88 49 -108 469 55 34 142 173 13 -125 126 -199 173
7103 173 52 50 89 -94 -106 -168 159 -76 13 271 -178 -98 273 -142 72 -39 106 544 -75 129 -462 257
7125 257 672 353 602 407 109 46 -543 293 -74 -136 395 -595 -5 462 133 -1499 297 -241 554 762
7145 762 691 161 49 -433 -522 -120 -294 -190 65 -55 282 204 -255 -4 -202 301 239 209 -59 -152 321 -123
7167 -123 -97 419 142 236 72 -381 72 209 48 -35 380 280 189 -203 -261 150 268 -244 -166 100 -37 13
7189 13 5 -4 -120 174 -97 -35 43 -154 180 84 117 107 -87 -85 94 -219 -162 -25 -153 22 16 -150 -204 55 268
7214 268 -151 -153 159 -18 -11 185 -160 -74 -107 43 35 -90 35 -1 15 -42 -25 32 86 68 282 9 -14 123 176 -7
7240 -7 21 -73 72 41 -77 -119 100 68 207 37 -186 -18 91 -8 -152 367 118 206 13 -13 -79 -90 122 -98
7264 -98 1 -98 -99 57 123 -30 85 194 -159 99 -101 20 -116 -36 -182 -63 39 87 44 52 160 -23 38 -169
7288 -169 -27 -177 49 -178 13 72 236 -32 280 -100 -184 88 72 -30 -371 69 6 257 100 103 -86 -84 2
7311 2 418 276 -143 164 -1 211 13 -108 38 168 110 -92 120 173 163 -102 -28 -38 -55 40 10 -50 249 -88
7335 -88 125 -94 -2 21 12 17 -179 154 -105 98 -56 -139 21 -283 -281 267 62 166 197 117 156 -76 77 223
7359 223 117 -92 81 -20 -108 27 -63 173 19 122 46 -241 43 79 -39 99 257 86 22 -137 158 234
7381 234 -82 3 -64 -249 14 38 26 227 -188 84 -44 77 -166 -29 -87 41 92 -64 -77 337 32 -182
7403 -182 82 9 -37 -25 -132 -100 -185 96 -132 -11 75 -134 114 -48 22 -65 8 26 -118 24 -120 -17 16 68
7427 68 96 49 185 -82 65 -144 -8 -124 341 315 -27 30 -42 139 -118 71 15 84 -67 -35 -44 -47 -159 -75 -10
7452 -10 101 -129 -145 41 -91 330 -2 55 -177 48 -256 -137 -123 -177 93 -167 39 255 -87 -256 73 68
7474 68 36 -180 -50 -193 -81 183 -294 78 -223 -12 -143 59 9 -93 79 -72 -241 -173 -160 89 -84 165
7496 165 -31 -117 83 -55 267 68 -22 37 67 162 -156 -54 172 86 -70 -133 -150 68 -70 5 147 20 77
7519 77 -17 337 -196 24 -16 -57 124 230 -112 61 26 -177 60 12 265 281 -115 250 132 -55 220 41
7541 41 -117 -76 -191 -192 69 -130 -363 -100 -202 -150 28 259 147 222 -82 -107 285 283 36 53 20 -185 28 214
7565 214 50 28 -78 18 104 90 -94 -82 -232 100 -282 105 -134 123 -67 -55 48 118 -212 45 -382 -279
7587 -279 435 -122 15 23 -73 131 -10 -374 -22 -21 -553 -163 245 -33 -79 -398 -67 91 -91 -128 -737 228
7609 228 248 193 104 -262 -40 114 -55 388 85 -87 -20 -127 240 -443 -193 -321 -357 181 155 29 699 -470
7631 -470 -253 -64 365 746 467 336 -591 -9 -866 45 422 66 -154 -264 862 -180 -399 273 610
7650 610 218 -266 38 502 118 238 251 358 -5 275 183 129 -320 -226 -642 -71 -509 -329 -134 10 -43 47
7672 47 -12 -60 -10 -10 -18 134 -84 -203 51 -145 2 -129 -21 -79 39 123 -245 83 -124 -139 145 163 -158 103
7696 103 120 -69 -23 -154 27 -24 -198 -18 74 -17 -260 92 -95 12 -16 -29 -60 -211 40 -148 -84 18 -341
7719 -341 36 102 180 -78 -12 368 327 -1 11 -358 -180 53 -35 143 -72 208 282 -134 101 69 77 22 90 -236
7743 -236 74 24 118 -98 83 99 -72 -32 132 89 -252 124 19 126 66 -38 80 27 -104 171 -256 -70
7765 -70 5 17 -17 -161 306 -190 47 -24 38 -92 42 -110 40 -190 32 100 9 44 -151 -139 115 42 -28 208
7789 208 -204 45 -63 -289 -88 -174 46 109 20 -146 -7 71 -53 74 97 -66 -88 -163 48 132 -30 115 -9
7812 -9 63 -18 218 -131 -258 44 72 -49 87 -197 -6 -143 -142 202 -116 -104 175 155 118 36 -422 -128 -101 -5
7836 -5 -11 -14 40 211 30 -38 55 211 3 34 -21 267 136 63 190 -139 28 104 52 150 -11 -59 67 97 86 -124
7862 -124 7 -157 65 -77 144 -136 131 14 -92 226 -15 30 -198 -71 -46 155 -100 118 -71 -28 -133
7883 -133 114 -116 129 139 -20 62 48 -288 100 -313 324 31 240 -195 -10 29 222 55 -92 119 110 -174
7905 -174 -140 -185 197 95 -99 111 4 292 -85 32 -90 109 -59 65 -27 -9 104 -13 -109 48 46 -72
7927 -72 -81 77 27 2 -50 -196 -12 59 81 38 145 212 -28 -7 127 -135 -104 99 35 -23 146 -10 183 -124 -317
7952 -317 72 192 -231 122 4 162 110 68 162 133 207 39 22 -123 51 64 -35 60 6 23 30 -39 229 -94 -143
7977 -143 10 -22 114 -8 60 -93 -20 136 -59 242 68 -76 129 122 -13 -259 -347 184 9 -69 2 80 -120
8000 -120 -65 130 -138 -29 -54 13 -21 -114 -23 -153 -209 7 92 3 -176 12 94 -172 44 5 37 251 47 -65
8024 -65 93 54 -35 62 36 -133 -25 199 -75 -13 -91 56 61 167 219 -99 95 121 204 147 69 8 175 62 140
8049 140 -21 -88 86 184 56 265 -88 99 -5 -137 147 -109 -209 -129 11 -6 23 169 -158 -143 -104 -60 17
8072 17 183 -12 -68 131 -366 530 155 90 -16 384 -20 388 159 -207 89 79 393 -222 -95 -181 -43 -405
8094 -405 -193 -2 138 83 71 202 195 112 45 -95 -280 -58 -265 298 311 501 100 116 213 -278 181 49 23
8117 23 -45 202 488 -163 373 154 -37 61 383 -60 -215 -27 -390 221 225 -76 409 385 276 -285 56 -239
8139 -239 479 -20 231 -353 -263 -270 46 103 48 -457 -575 -171 -271 -352 -152 200 -54 96 -22 7 376 -173
8161 -173 -288 596 528 81 101 -254 -250 1008 567 122 -341 -282 -153 215 -242 492 489 109 46 849 29 -232
8183 -232 371 -350 -178 322 472 54 364 517
8191E17
$$ Imaginary data points
##PAGE= N=2
##DATA TABLE= (X++(I..I)), XYDATA
0 0 0 0 0 0 0 0 0 0 0 0 0 0 0 0 0 6 -8 8 -8 8 -14 16 -16 23 -24 31 -38 42 -47 55 -65 76 -86 99 -111 126 -142
37 -142 160 -181 201 -225 253 -280 312 -347 383 -424 469 -516 571 -628 691 -761 840 -925 1022
56 1022 -1129 1248 -1388 1548 -1734 1954 -2224 2553 -2983 3561 -4393 5748 -8571 32001 -28652
71 -28652 34472 24268 -5093 47612 -4020 26549 28363 -14823 38809 755 -8930 43345 -23493
84 -23493 25416 -15018 325 9909 -13904 5045 220 -30971 20233 -16569 -23414 26783 -38373
97 -38373 15390 -8426 -19473 12823 -8668 2404 12769 -22347 21444 -4059 -2219 33030
109 33030 -25696 36312 -5689 3084 22065 -9034 22035 17590 -12272 27093 -7570 1310 31058
122 31058 -20748 23288 -4793 871 4699 -1846 533 4316 -3849 3562 -10215 -4975 10075 -17784
136 -17784 16563 -15859 -698 3900 -9721 3089 3352 -9884 15491 -7764 -4776 17512 -16886
149 -16886 21956 -7178 2034 6162 -1224 8285 2619 -1222 10701 -6624 5217 6338 -12087
162 -12087 20272 -13346 5739 -3113 -5614 3815 -912 -4126 -665 -6272 -3930 2795 -12029 8714
176 8714 -11313 2935 -6869 -4169 -2821 -504 -83 1474 -5843 -251 3300 -11348 14755 -12234
190 -12234 8452 -177 -3621 2010 5 1217 5139 -2172 37 2898 -6265 11934 -10340 9446
204 9446 -6174 1871 -369 -3732 3737 -1093 619 430 -704 -5373 9099 -8187 7728 -5431
218 -5431 883 -1761 315 880 -1375 2562 -1274 1861 -5483 7109 -7536 8160 -4771 1370
232 1370 -1099 -2885 2611 -1760 1043 -669 -894 -5036 5372 -9202 8406 -6590 2295 -3279
246 -3279 -2458 2293 -5034 2369 -2886 -512 -3013 2798 -8179 7205 -7256 4625 -3717 -1596
260 -1596 1616 -3835 3823 -2297 1800 -2980 3860 -6097 6634 -5375 4839 -2757 1126 1702 -3128
275 -3128 4331 -1661 1959 -2080 3000 -5358 7715 -6074 4888 -2241 427 2379 -2672 5267
289 5267 -1939 2594 -197 2987 -3604 6425 -4892 6521 -2814 2321 2104 -3188 6021 -3338 3096
304 3096 -1428 1843 -3600 4779 -5291 4965 -3966 1271 -585 -3758 3793 -5372 2183 -3024 535
319 535 -4292 2963 -5638 3949 -4186 1419 -739 -3520 4325 -4717 3821 -1569 1706 -2321 4237
334 4237 -4275 5671 -3327 3154 355 -2146 5375 -5063 4615 -2284 1602 -1934 2824 -4195 4226
349 4226 -4318 2369 -1448 -2815 3449 -5909 3871 -3516 1308 -2651 2662 -3814 4101 -3383 3459
364 3459 -384 -721 5082 -3896 6139 -1391 3716 193 4351 -1592 5779 -1990 4632 417 221
379 221 5043 -4471 5570 -3261 2164 -1598 1242 -3487 2112 -4802 1487 -3729 -2635 1327 -7256
394 -7256 3063 -6499 384 -3584 236 -4043 1479 -4375 2172 -2073 -611 2803 -4334 5705 -3128
409 -3128 3566 -931 3404 -850 4827 -1986 4466 -289 1180 3895 -3674 6157 -3784 3476 -1501
424 -1501 936 -2122 2006 -3908 1640 -3646 -664 548 -5368 3464 -6417 2366 -3299 609 -2758
439 -2758 1341 -2340 2286 -1623 772 2691 -2074 5947 -3104 4809 168 4005 192 4544 -571
454 -571 4669 329 1859 3210 -2526 5956 -3753 3430 -2333 1173 -2030 693 -4044 706 -3473
469 -3473 -984 -1506 -5483 1956 -6952 2076 -5542 -488 -2796 -276 -3208 307 -2228 574 1351 -2664
485 -2664 3744 -3384 4778 -1048 3272 -612 4039 -72 3601 311 1836 3387 -1120 5036 -3770
500 -3770 3995 -1461 2167 -1065 1053 -2075 1461 -2309 -437 -608 -3037 2638 -5693 2585 -4615
515 -4615 2016 -2067 346 -1621 493 -795 703 332 -1176 3879 -2674 4530 -2369 3662 -91
530 -91 3656 -463 2562 393 1831 2580 -1488 3966 -2722 3974 -2652 1699 -1830 1398 -1801 317
546 317 -2889 -250 -904 -2649 746 -6044 2658 -5024 944 -3536 -767 -1847 -255 -1732 -1175 -770
562 -770 -910 2037 -3452 3095 -3032 4021 -1491 2447 -435 2207 913 857 1580 -867 4115 -1715
578 -1715 3835 -1452 3203 -64 3262 -1615 1377 -758 466 -227 -2404 1971 -3173 3665 -4736
593 -4736 2122 -2781 1313 -515 -686 -1007 -288 312 -716 1050 -2590 3655 -2946 3248 -2849 2548
609 2548 -202 1767 254 -497 1538 -703 2457 -2195 3050 -2353 3237 -2280 868 -1336 977
624 977 -654 -589 -925 -1986 1663 -3295 2188 -4591 2032 -3242 221 -2262 -550 -229 -999 -635 -1708
641 -1708 740 -1911 3189 -3413 2966 -2567 2640 -740 728 847 514 1712 -994 2363 -1182 3588
657 3588 -1312 2943 -1945 2409 -493 1599 85 246 920 -591 1541 -2306 2855 -2685 3293 -2731
673 -2731 1089 -1017 494 195 -339 218 -1106 1066 -1868 2132 -2373 3610 -2945 2170 -1975 214
689 214 534 -532 974 -1817 759 -1772 2120 -2485 2330 -2766 1711 -2112 161 -504 -346 856
705 856 -1820 829 -2499 2313 -2692 2523 -2795 1842 -1516 374 47 -444 1082 -646 1003 -1772
721 -1772 2100 -2143 3363 -2772 2061 -1849 492 375 -681 1232 -1053 1261 -1696 1477 -2043
736 -2043 2568 -1988 2373 -1799 917 10 -195 1584 -1082 1778 -1415 2436 -1901 2983 -1411 2697
752 2697 -804 1026 409 262 1759 -473 1665 -1342 1979 -2326 2814 -2348 2277 -2047 14 -790
768 -790 -1742 563 -2015 722 -2630 438 -2978 1153 -3015 1451 -2604 427 -1058 -1273 790 -1330
784 -1330 1831 -1660 1661 -1977 2622 -1614 2844 -1004 1593 109 213 1660 -250 2330 -939
799 -939 2097 -1808 2284 -1818 2453 -1475 754 -584 -848 745 -1482 1229 -2063 1159 -2424 1257
815 1257 -2667 2173 -1898 1138 -574 -708 934 -1278 2230 -1305 2261 -1441 2289 -1368 2680
830 2680 -668 1951 267 439 1633 -384 2553 -1119 2281 -1746 1997 -2070 1867 -1698 768
845 768 -1086 -1006 -83 -2152 632 -2311 746 -3126 360 -3215 831 -3016 381 -1359 -808 204
861 204 -1906 1422 -1978 1933 -1462 2037 -1339 2524 -468 2024 64 1049 1446 -342 2572 -822
877 -822 3033 -1200 2632 -1547 2173 -1086 1490 -223 -202 411 -1529 1174 -2072 1215 -2175 1384
893 1384 -2258 981 -2065 897 -864 -438 538 -1392 1685 -1751 1877 -1479 2002 -1208 1879 -788
909 -788 1824 75 835 1189 -560 2259 -1008 2751 -1392 2099 -1583 1608 -1350 774 -736 -450
925 -450 -29 -1728 530 -2651 914 -2841 824 -2910 675 -2580 262 -1308 -950 -216 -1850 892
941 892 -2302 1348 -1486 1889 -1282 1339 -606 1974 162 1107 1230 72 2498 -803 2843 -896
957 -896 3176 -803 2087 -405 1218 308 288 414 -591 1075 -2022 1679 -2659 1259 -1976 1044
973 1044 -2142 147 -835 -425 169 -1718 926 -2132 1824 -2065 1384 -1280 1705 -1008 1255 46
989 46 666 784 -51 1378 -1280 2904 -1746 2221 -1602 1501 -1132 670 -533 -43 141 -1003 768
1006 768 -1705 1303 -2882 1542 -2691 311 -2083 -121 -1734 -683 -224 -1531 826 -2420 1947
1021 1947 -2449 1174 -1035 1578 -686 1527 156 556 624 -457 1175 -1125 2843 -1033 2323 -1087
1037 -1087 2245 27 1191 184 239 691 -247 807 -756 1843 -1781 2221 -2094 1652 -1240 676
1053 676 -585 -659 -321 -842 313 -1672 1365 -2130 1106 -1897 1273 -1497 532 -283 309 454 -142
1070 -142 659 -1398 1846 -1965 1700 -1390 1449 -1331 352 -379 -259 31 -1322 681 -1513 1204
1086 1204 -2050 1340 -2104 1097 -1518 281 -637 -225 376 -1170 924 -1259 1550 -1336 1471 -1560
1102 -1560 1470 -867 1256 -575 482 649 -357 1133 -1033 1727 -1457 2303 -1221 1377 -660
1117 -660 1144 120 -30 531 -242 1309 -877 1144 -1544 1895 -1691 1622 -1319 604 -188 -43
1133 -43 467 -857 1116 -1216 1304 -1720 1322 -1118 1436 -1139 761 -689 -6 248 -835 283
1149 283 -1631 1384 -1575 857 -2165 798 -951 -79 -794 -455 180 -465 1030 -1896 1063 -1452
1165 -1452 1549 -1902 1219 -870 1556 -733 -96 733 -515 1410 -307 1798 -1079 1711 -959
1180 -959 1265 -932 1421 76 155 7 -561 1193 -1001 1127 -1143 1210 -1112 828 -1544 555
1196 555 7 308 269 -471 629 -889 1499 -1437 1199 -1280 1855 -877 1272 -191 246 774 -175
1213 -175 1070 -887 1535 -933 1523 -1069 1337 -1244 779 -605 99 -42 -998 434 -1861 897
1229 897 -2034 881 -1909 596 -1705 83 -1329 -473 -433 -881 229 -1214 1032 -1720 1221 -1329
1245 -1329 1351 -983 1017 -226 447 798 -129 1276 -564 1636 -680 1832 -402 2033 -658 1372
1261 1372 -354 472 367 -541 778 -1032 1231 -1462 1195 -1407 981 -1350 494 -809 -378 -64
1277 -64 -715 189 -1124 1073 -1444 1218 -1348 1380 -1066 964 -66 500 606 -20 1105 -443 1336
1294 1336 -894 1822 -961 1413 -910 1041 -336 259 129 -506 511 -1197 947 -1926 352 -1814
1310 -1814 270 -1625 17 -1146 -275 -788 -1000 16 -1525 867 -1515 1132 -1427 1198 -805 835
1326 835 -413 198 593 84 1290 -499 1790 -387 2061 -447 1836 -386 1347 -19 771 599
1342 599 58 1042 -814 1389 -1310 952 -1088 659 -1319 332 -984 -76 -442 -1067 52 -1359
1358 -1359 465 -1577 780 -1569 922 -790 704 -219 110 341 -110 960 -653 1518 -690 1640
1374 1640 -953 1240 -584 1039 -129 573 417 -412 531 -1028 846 -1453 692 -1600 410 -1427
1390 -1427 -3 -894 -498 -661 -928 -16 -1262 393 -1882 920 -1416 948 -1123 708 -221 340 468
1407 468 -191 1179 -250 1653 -432 1791 -483 1786 -409 1530 178 697 781 86 971 -654 1227
1424 1227 -1063 1081 -983 908 -1224 358 -952 -122 -291 -763 227 -1234 607 -1497 791 -1510
1440 -1510 781 -1253 351 -392 94 20 -253 673 -519 870 -831 1483 -869 1287 -775 1005
1456 1005 -374 545 414 -310 465 -763 872 -1138 989 -1175 649 -1181 300 -715 -93 25
1472 25 -576 68 -1033 565 -1337 1116 -1080 1184 -1027 548 -472 270 387 36 754 -544 1102
1489 1102 -596 1454 -752 1459 -615 1043 -107 460 606 -125 726 -244 881 -1020 1154 -992
1505 -992 747 -822 666 -693 387 -200 -437 300 -898 625 -1294 913 -1264 728 -1146 342
1521 342 -520 265 43 -458 112 -644 760 -1149 886 -1026 1153 -847 727 -699 175 25 -744
1538 -744 587 -619 606 -1252 866 -1232 842 -467 768 -489 257 -48 -352 700 -735 929
1554 929 -693 1426 -1059 818 -602 745 -147 445 97 -104 845 -563 810 -755 1098 -1233
1570 -1233 1289 -684 670 -449 237 -122 -590 808 -412 798 -723 938 -734 846 -682 793
1586 793 -450 357 52 -14 465 -678 978 -935 970 -1000 827 -593 671 -500 199 -163 -217
1603 -217 304 -781 454 -885 692 -1267 490 -1185 552 -649 137 -487 -582 230 -767 296 -908
1620 -908 656 -902 679 -728 571 -443 464 25 -15 800 -361 1151 -435 1437 -638 1105
1636 1105 -453 806 128 540 225 -42 300 -177 840 -710 828 -1053 744 -848 523 -464 201
1653 201 -107 -188 146 -906 600 -883 721 -1289 702 -924 362 -442 535 -140 -58 560 -293 1131
1671 1131 -445 1194 -598 879 -469 529 -290 455 81 -73 373 -538 714 -1030 657 -1329 717
1688 717 -1202 130 -761 -235 -625 -632 32 -856 400 -1232 461 -1384 715 -1017 340 -206 156 32
1706 32 167 503 -308 949 -511 1386 -293 1378 -58 1132 114 868 296 519 676 -198 952
1723 952 -625 1047 -795 991 -1065 401 -619 -302 -442 -317 135 -718 248 -1140 440 -1102 557
1740 557 -1166 265 -540 37 -299 -43 190 -336 980 -695 1142 -426 1233 -514 687 -277 261
1757 261 332 146 137 -296 739 -758 632 -879 649 -1064 388 -712 143 -420 -388 -180 -1019 165
1775 165 -1220 390 -1002 431 -1144 532 -593 299 -13 56 381 -117 950 -502 1108 -221 1387
1792 1387 -439 1271 294 576 397 407 509 64 1062 -682 1016 -632 919 -1007 747 -582 -60
1809 -60 -157 -286 -162 -654 293 -1235 277 -1146 445 -1066 698 -783 -155 -76 -191 430 -534 587
1827 587 -823 794 -742 804 -515 992 -356 453 178 59 442 -246 586 -838 872 -903 935
1844 935 -833 778 -811 -2 -263 -261 31 -805 348 -1000 729 -908 338 -1019 708 -785 368
1861 368 103 -211 345 -277 1044 -752 795 -710 1003 -297 1039 -346 729 428 123 541 -69
1878 -69 833 -549 1114 -684 818 -524 647 -703 34 -184 -454 -50 -537 200 -1077 512 -1102
1895 -1102 569 -1009 409 -914 53 -278 -431 15 -658 566 -769 845 -789 638 -828 592
1911 592 -298 405 39 -43 401 -249 709 -896 1254 -776 805 -541 622 -530 276 -98 -193 149
1929 149 -454 457 -794 852 -904 675 -536 834 -257 447 -67 -50 197 -614 484 -426 906
1946 906 -660 770 -732 774 -381 537 -159 -58 346 -144 526 -662 897 -746 702 -593 721
1963 721 -523 316 -196 -117 71 -312 338 -895 698 -763 627 -744 620 -839 214 -313 -325 232
1981 232 -161 463 -854 958 -935 587 -992 573 -890 182 -169 -100 208 -523 359 -737 796
1998 796 -888 590 -673 699 -603 68 -29 -37 331 -341 393 -399 1064 -648 919 -683 994 -507
2016 -507 590 -23 -9 625 -303 795 -765 707 -784 753 -676 414 -744 471 -430 -302 116
2033 116 -410 488 -509 780 -1065 605 -649 365 -653 150 -339 -54 214 -546 555 -657 734
2050 734 -661 937 -484 694 -241 251 -72 -58 189 -220 618 -690 535 -800 655 -729 377
2067 377 -459 297 -705 -138 -68 -621 468 -958 437 -1094 779 -850 474 -402 415 -161 -84 227
2085 227 -275 651 -384 683 -509 1023 -497 830 -160 634 -86 318 538 -310 1069 -163 567
2102 567 -587 796 -732 320 -496 336 -299 43 -13 -662 426 -943 507 -1042 377 -819 493
2119 493 -521 158 -303 -175 -19 -366 367 -678 633 -549 1053 -567 716 -351 516 91 104 148
2137 148 -182 707 -564 650 -559 744 -643 561 -345 442 -531 -322 -187 -673 92 -627 441 -1117
2155 -1117 350 -903 575 -452 -140 -302 9 129 -109 673 -161 877 -293 974 -376 501 -130
2172 -130 589 203 294 621 -156 689 -196 806 -411 717 -691 573 -260 392 -64 100 122 -441 24
2191 24 -782 616 -890 593 -887 257 -469 235 -254 -179 -19 -354 63 -620 707 -610 824 -726
2209 -726 785 -400 246 65 174 148 -104 748 -551 852 -499 889 -406 656 -446 191 -310
2226 -310 59 -84 -530 340 -702 448 -876 356 -1011 221 -845 11 -146 43 107 -255 557 -532
2244 -532 600 -661 897 -530 688 -352 584 11 550 359 -299 695 -435 962 -622 628 -420
2261 -420 592 -259 378 -374 -315 175 -186 33 -1186 619 -1087 506 -741 388 -398 -173 -780 -319
2279 -319 328 -627 966 62 736 -978 -1 254 10 -755 161 767 317 605 163 160 -255 266 -1408 671
2299 671 389 1572 -884 -216 117 446 626 863 645 -1052 996 -552 623 -1172 654 -277 575
2316 575 -492 -374 -330 -910 11 -726 833 -720 3 -112 1665 -1059 167 -178 27 420 154 188 -119
2335 -119 286 -216 618 -699 189 -212 356 -863 -626 450 -746 -649 -805 637 -198 1358 -948 -410
2353 -410 -917 180 -298 -688 -494 -147 -168 -474 312 -995 219 -447 466 -416 255 -296 -165 68 -98
2372 -98 133 -565 426 -447 449 -402 393 -214 503 -127 41 84 -281 236 -320 559 -622 520 -492 362
2392 362 -254 334 111 208 242 -210 364 -366 306 -475 408 -532 562 -416 353 -98 -73 196 -38 395 -608
2413 -608 502 -504 315 -544 324 -328 500 -280 -175 106 -260 370 -183 505 -660 515 -736 349
2431 349 -466 380 -493 -99 192 -256 326 -421 595 -632 737 -573 439 -370 324 -441 -147 72
2449 72 -293 332 -739 395 -446 545 -800 482 -441 401 -338 38 188 10 405 -418 506 -421 722
2468 722 -378 760 -93 517 -116 319 293 -10 498 -5 791 -393 667 -328 426 -483 236 -320 87
2487 87 219 -281 49 -610 249 -722 291 -755 446 -698 287 -370 -50 -199 -331 308 -530 435 -664
2506 -664 607 -421 388 -341 393 -224 222 52 -55 343 -423 535 -358 465 -124 239 -561 -3 -40 50
2526 50 259 -234 -25 -521 -79 -1057 167 -835 186 -231 -193 -512 212 411 -402 -106 -575 684 -524
2545 -524 731 -404 1044 -343 477 107 218 121 23 380 -122 775 -289 596 -381 699 -387 225
2563 225 -69 43 -19 -277 279 -676 250 -549 208 -614 345 -704 88 -505 -212 -57 -201 -19 -658 352
2583 352 -837 423 -440 515 -307 545 -22 269 -33 104 558 -286 581 -376 811 -475 466 -422 505
2602 505 72 170 130 -17 209 -473 367 -351 366 -790 230 -526 132 -377 -61 -6 -235 482 -433 491
2622 491 -425 395 -385 564 -334 641 53 425 227 -142 586 -322 769 -353 589 -145 378 -301 404
2641 404 -27 170 -18 -258 299 -372 284 -749 155 -773 323 -798 -16 -655 -240 -34 -446 44 -797
2660 -797 -12 -612 168 -332 357 -316 252 -25 197 -140 222 261 -270 525 -378 654 -76 287 -140 659
2680 659 -134 158 285 -160 65 -336 192 -536 389 -674 673 -635 139 -219 -51 17 -301 334 -408
2699 -408 124 -378 271 -423 454 -307 715 -123 287 47 72 374 -256 569 -408 605 -53 686 -243 388
2719 388 -65 349 -74 -59 64 -580 314 -440 467 -480 301 -484 78 -435 -165 -199 -258 362 -447 312 -583
2740 -583 361 -474 348 -509 413 -359 294 -52 -139 24 -419 476 -570 706 -238 638 -378 522 -178
2759 -178 481 112 -243 190 -110 418 -267 527 -488 627 -265 94 -64 90 -12 -268 210 -317 437
2778 437 -542 169 -480 639 -148 331 -279 -38 94 -113 325 -419 244 -297 371 -376 341 -342 135 -341
2798 -341 145 -53 -272 223 -25 278 -573 275 -596 192 -516 258 -354 -79 -107 -313 116 -397 439 -470
2818 -470 564 -525 230 -327 331 -340 -9 -93 -86 400 -344 289 -408 598 -540 503 -328 377 -348
2837 -348 61 -97 23 154 -440 213 -619 525 -342 444 -85 343 -201 289 7 -166 432 -249 658 -524
2857 -524 489 -187 564 -306 237 -262 -57 -126 -33 276 -46 506 -509 120 -417 546 -416 300 -113 -81
2877 -81 122 -233 317 -575 34 -344 641 -291 376 -251 514 71 250 -58 -178 -22 -534 852 -193 460
2897 460 -669 799 -405 360 -323 308 6 -201 -134 -56 476 -400 311 -382 670 -708 276 -368 303
2916 303 -150 -212 322 -376 51 -703 323 -112 428 -557 303 -314 275 183 -299 203 165 651 -299 526 -245
2937 -245 609 34 130 56 173 246 -273 46 258 202 -824 471 -637 309 -2 -151 -429 -43 -798 -106
2957 -106 208 -124 -50 -317 489 -262 -10 -755 24 -226 377 -300 -304 -276 -686 738 -483 -498 -212 191 60
2978 60 539 -489 198 175 44 682 -220 -231 -1340 602 -552 229 -907 15 -655 -111 700 148 -321
2997 -321 74 260 -734 564 -795 715 -580 346 -240 66 269 291 623 1201 755 202 474 -1038 1046
3016 1046 496 511 -433 -455 862 70 -237 -508 238 -976 386 -263 305 -793 -280 -757 -37 27 401
3035 401 -190 -498 -62 154 51 -658 -80 -604 -506 -754 489 -498 -36 -285 181 609 -90 659 228 424
3055 424 -452 613 -35 737 268 -502 452 -594 121 176 199 -603 453 -62 817 -311 105 -246 29
3074 29 146 -513 93 -435 764 -348 490 -967 534 -321 357 33 -421 431 -43 862 -799 470
3092 470 -545 459 -189 759 -282 -783 241 -163 1 -380 476 9 456 -518 149 -678 156 256 324
3111 324 -244 -75 567 -200 472 -819 449 -413 75 -227 67 -243 620 -238 253 3 -323 442 -640
3130 -640 571 -236 602 -387 388 35 465 189 276 20 -109 408 -243 386 -271 303 -280 259 -163 106
3150 106 -90 156 6 -332 366 -586 282 -347 359 -386 358 -318 277 11 224 120 -194 242 -489 543
3170 543 -472 424 -343 319 -209 179 109 -58 264 45 374 -564 415 -580 504 -478 232 -37 -41 -312
3190 -312 -92 152 -196 83 -517 375 -418 339 -547 167 -423 243 49 43 51 30 410 -206 326 -381 287 -308
3212 -308 384 -71 235 38 35 -37 -289 265 -168 388 -238 315 -127 195 -325 246 -166 249 202 30 107 -389
3234 -389 451 -593 246 -120 319 -23 255 137 -75 223 -115 268 -405 386 -374 490 -261 306 -230 65
3254 65 -24 170 -61 -357 256 -258 153 -85 325 -230 139 -392 127 -164 145 150 -98 181 -393 348 -276
3275 -276 413 -355 184 -172 73 132 47 57 -177 441 -348 419 -460 338 -424 397 -170 509 65 178 306
3296 306 -330 219 -338 142 -307 282 -261 126 -189 79 5 -259 222 -223 441 -205 378 -97 298 -465
3316 -465 534 -120 75 145 -432 299 -260 107 -31 377 -45 243 -369 -2 -476 151 -54 -188 -105 -58 198
3337 198 -369 318 -510 47 -680 399 -322 122 -163 -106 98 -285 318 -456 382 -101 472 -342 432 -158
3357 -158 341 -42 220 41 -318 530 -452 372 -116 330 -278 332 -232 15 104 15 57 -52 -103 -200 259 -282
3379 -282 313 -402 291 -202 237 -158 -110 -148 74 385 -269 70 -160 253 -114 367 -220 351 -277 156 395
3400 395 7 367 -363 197 -430 328 -295 85 -400 201 -83 -329 -131 -237 151 -274 113 -450 68 -471
3420 -471 196 -393 14 -55 212 231 -55 97 -157 300 -244 72 -93 387 -204 253 -69 121 374 -87 431
3441 431 -268 290 -4 382 -178 379 -162 82 -134 -126 -118 -294 239 -268 213 -363 26 -656 248 -273 432
3462 432 -30 -275 134 -162 147 -337 192 -384 350 -255 537 -230 157 -27 154 158 -103 139 -434 233 -154
3483 -154 307 -414 137 -334 122 -177 -151 30 -425 89 -304 65 -252 363 -258 186 -378 112 -127 8
3503 8 5 -66 52 -277 259 -314 346 -286 323 10 331 -15 253 52 73 327 -222 326 -307 559 -317 155
3525 155 -156 118 -280 179 -5 -274 165 -340 123 -185 276 -316 492 -226 30 -192 160 -16 -322 190
3545 190 -17 198 -575 530 -354 335 -163 33 89 184 21 23 194 -176 176 -307 252 -259 416 -184 178
3566 178 -229 -25 -167 -387 198 -274 234 -126 353 -565 35 -251 245 -25 22 -57 -253 273 -254 488 -356
3587 -356 313 -44 206 -238 362 104 115 102 -119 416 -272 429 -211 449 -270 278 -378 -6 29 -60 -13 80
3609 80 137 -382 279 -96 304 -275 390 -297 129 147 -30 -42 -157 -220 -300 289 -383 355 -384 70 -244 387
3631 387 31 65 19 -137 50 -156 161 -339 437 -356 262 -109 200 40 -6 -52 -422 -106 -520 66 -283
3652 -283 349 -219 88 -268 -101 -273 53 -117 -260 377 -307 321 -320 587 -137 305 -338 338 -136 -74
3672 -74 -69 -38 343 25 280 -282 296 -245 181 -335 112 -18 159 110 -246 175 68 188 -440 91 -275 396
3694 396 -240 368 -39 -26 24 28 364 -69 221 -391 255 -103 246 -310 -39 -123 5 -64 -204 126 -214 83
3716 83 -395 46 -336 227 -263 -84 -121 -117 88 -132 116 -93 288 -198 154 -299 517 -40 95 48 10 70
3738 70 -56 208 -246 141 -244 320 -137 -8 -136 210 -209 29 -11 -302 -125 -417 203 -267 217 -204 216
3759 216 -209 68 -188 171 -172 -143 149 -45 75 -171 264 -130 262 19 209 -211 349 168 -43 -3 -163
3780 -163 256 -375 147 -303 161 -208 186 -132 -147 117 -126 31 -425 -121 -377 146 -289 268 -430 22
3800 22 -245 51 -131 -302 190 -292 338 -375 271 -258 86 157 138 -128 15 44 -84 127 -63 269 -186
3821 -186 601 -259 181 -207 81 42 64 30 -211 104 -248 22 -170 246 -392 100 -178 78 -49 12 -152
3842 -152 -23 55 -91 279 -171 286 -288 169 -50 89 97 248 -86 191 -205 -19 168 -259 220 -552 136
3863 136 -340 4 -74 -92 -308 -241 221 -242 -59 -346 -86 -344 289 -94 186 -149 190 222 -204 -127 -193 133
3885 133 -146 338 -119 565 -118 193 -78 -118 259 25 292 -141 313 -194 385 -87 397 -241 168 69 103
3906 103 -176 -55 85 -322 389 -174 130 -73 -21 -351 114 58 55 -251 -52 -41 -205 -21 -140 213 -221 311
3928 311 -191 321 -176 262 -57 -98 213 57 336 -22 40 -317 129 152 434 -110 -105 -199 -122 224 -436 -92
3950 -92 -267 11 -301 -37 -460 211 -220 -147 -226 -214 252 -120 133 17 100 -477 57 292 250 -184 406 39
3972 39 -82 174 155 102 -331 -163 -79 168 81 141 108 688 -118 -199 917 -362 166 431 57 -424 247 217
3994 217 176 259 178 114 26 506 -235 73 -257 434 -89 156 -67 74 -280 -129 -39 277 111 -262 378 -317
4016 -317 19 -419 375 204 240 -55 -238 -154 -3 60 -523 281 -179 331 39 -46 -372 221 88 331 -119
4037 -119 -178 278 -210 -93 45 238 -95 138 -285 272 -185 51 -171 114 261 -80 -44 -85 386 -221 366
4058 366 -189 343 69 127 2 -58 262 -286 308 -171 348 -143 221 -104 -155 123 159 -26 -106 52 -95 165
4080 165 -179 194 -171 197 -171 171 -124 173 -87 -202 215 -174 123 -372 113 -310 163 -266 453 -375
4100 -375 88 52 44 33 -167 113 -214 392 -340 279 -82 75 -234 226 56 -65 107 -47 253 -22 113
4121 113 -123 16 -137 -10 -137 221 7 97 131 -268 275 -113 62 -98 261 -132 217 -67 180 83 -28
4142 -28 285 -83 242 -10 247 -378 215 -413 286 -283 -24 -24 0 81 -117 486 -106 -65 -314 -64 -287 132
4164 132 -158 652 -375 83 210 -512 117 -124 207 39 -54 29 254 -262 -107 -298 -211 28 -218 209 -6
4185 -6 595 -504 373 311 368 26 167 -164 -32 412 109 -96 76 388 80 520 -101 194 345 -102 -537
4206 -537 35 -263 378 -197 -217 -176 -743 -105 -332 470 -358 -235 -45 -553 4 250 -132 -334 -104 -282 264
4227 264 -46 372 -449 476 -133 18 384 160 299 -478 257 226 225 -160 811 -419 -125 -355 264 19 -271
4248 -271 234 -30 80 -668 241 -581 128 202 -306 -474 185 -33 5 -408 -205 483 -77 -339 -460 229 195
4269 195 532 -103 -395 -594 -171 85 -297 245 71 -95 -28 286 36 301 -16 -64 510 -83 188 -867
4289 -867 -31 194 262 4 -159 -240 22 77 -79 -318 -257 42 -252 316 -184 438 -257 508 395 457 73 -46
4311 -46 433 106 428 159 253 335 197 -314 16 -140 -283 -263 -74 172 -575 412 21 103 13 248 -98 -198
4333 -198 -116 265 -128 -65 162 -8 94 23 -65 -516 -7 -11 108 -690 50 -354 343 126 588 261 78 547
4355 547 -265 849 87 -52 -21 196 87 227 -426 23 483 2 702 -334 270 -209 -28 -304 163 -438
4375 -438 -247 711 -260 239 83 224 39 48 -183 -271 -676 -223 -366 92 557 -440 312 -194 -765 -385 329
4396 329 243 174 -707 90 -73 -37 447 -175 -347 -353 -210 22 174 -169 -363 18 -60 66 42 37 48 279 -134
4419 -134 392 132 170 -253 227 136 394 -347 -118 609 -145 600 6 -31 140 25 53 55 -328 467 -111 85
4441 85 298 -239 -191 75 58 -329 204 8 209 71 -5 -243 47 250 -209 19 -206 326 -172 364 -465
4462 -465 128 116 159 92 1 -170 -358 86 -205 -49 -42 379 -115 111 -13 -11 174 -20 -117 -197 124 -26 159
4485 159 -271 143 -133 218 -26 -97 315 -84 12 -121 107 158 31 -233 221 -184 186 -64 -147 126 -71
4506 -71 136 -48 353 117 245 -12 224 82 159 -223 209 -171 56 -64 5 83 0 77 -234 87 -253 -9
4528 -9 94 128 -19 -6 12 -336 27 -383 113 -120 100 27 9 -14 -69 -93 -145 207 -115 38 -87 204 -161 -112
4552 -112 -408 116 -77 -266 82 146 -88 111 -53 -207 -40 -256 268 227 188 117 325 -34 -42 76 -145 274
4574 274 -126 258 -139 395 19 327 -172 91 -5 -50 26 -101 280 -64 214 -152 96 161 289 -151 -115 111
4596 111 139 -51 -72 121 -225 -83 -228 -157 -439 41 29 193 -17 -5 -62 -60 57 193 40 96 138 -216 141
4619 141 -33 -19 75 -70 -229 -121 208 -4 75 -122 52 -120 75 -103 308 -130 -86 -6 -73 9 -106 -158 -363
4642 -363 -141 -341 276 -169 -81 50 -30 63 -116 166 -73 63 158 12 -153 -66 -126 -91 20 -89 194 -100
4664 -100 376 -251 -50 -137 102 -183 122 47 161 -115 -23 -75 -259 32 -426 225 -300 19 -390 -103 11
4685 11 106 64 108 390 -382 193 -141 167 -23 128 -80 207 -337 -14 -205 70 225 138 144 -165 177 -104
4707 -104 67 -356 215 -270 -44 -63 73 -114 -65 242 -122 79 18 255 -49 -11 120 198 -32 -25 81 15 96
4730 96 -113 5 -53 131 -293 -29 -151 216 198 133 105 -49 169 -53 11 -247 89 -267 -18 17 209 25
4752 25 -78 -146 62 -17 -261 126 103 -96 21 -67 -305 377 117 143 267 2 45 -179 472 -133 56 107 -322
4775 -322 -132 149 -85 -154 53 -10 -15 -231 298 -182 200 48 164 -211 -70 -193 -112 159 -7 -219 189 -96
4797 -96 -26 118 -30 216 -43 -178 38 56 -111 -149 371 -219 40 -238 209 -43 380 34 109 30 -27 92
4819 92 -132 53 -80 175 85 194 -251 -18 -238 109 71 -73 -62 54 288 -183 209 81 -128 55 -216
4840 -216 -145 101 -106 162 51 -120 18 -40 291 -137 101 -161 -94 -141 381 -90 -99 -7 -167 179 40 59 -93
4863 -93 260 -240 -125 -351 -35 -105 13 161 19 -65 -342 194 -138 248 -12 74 -192 128 69 114 204 -140
4885 -140 251 -143 234 1 228 -57 150 -125 101 -117 -15 221 48 6 -111 -58 -164 146 -146 95 -243
4906 -243 139 -112 -37 77 95 128 -155 30 -263 165 -141 116 -105 157 -114 -4 100 -158 63 -413 355
4927 355 -143 -74 -310 315 -117 113 -32 -112 -288 -188 31 -298 12 56 69 29 210 -139 4 186 12 179
4949 179 13 96 68 46 -241 129 97 62 -14 141 66 225 30 -57 260 -87 96 -234 -75 119 -8 -76 120
4972 120 -7 -127 -68 -13 126 17 239 38 191 -91 166 -243 -36 33 -102 9 319 50 -176 229 14
4993 14 -8 -166 102 200 61 -66 43 -31 -181 52 -250 -8 6 50 -237 160 -337 156 -45 -54 -33 110 -27
5016 -27 -261 128 -55 -62 -323 187 -13 234 186 143 152 -13 -239 -144 101 -194 253 -70 92 -140 10 170 150
5039 150 -60 38 222 40 50 -227 11 -44 165 -28 -84 45 -88 76 10 264 -163 -17 10 269 -151 177
5061 177 -67 20 -142 -21 -7 -74 125 -241 -42 -155 93 -57 -94 -317 250 -283 237 132 -12 100 56 -22
5083 -22 -459 192 9 411 68 -3 -196 11 -45 -178 244 -82 -190 -39 229 -32 111 -187 117 -144 86
5104 86 100 245 58 248 284 -65 209 -41 59 -107 86 93 -17 68 54 -6 -117 398 -113 87 119 37 -233
5127 -233 76 -188 -119 227 -113 47 -122 251 -100 -66 -199 59 -246 255 -248 -77 -7 -13 33 -423 112 104 166
5150 166 32 257 -2 -54 -71 11 -240 102 199 -261 47 -174 15 -33 -66 50 30 -236 -174 -20 -136 92 -356
5173 -356 -99 -75 74 -287 226 189 -85 -172 -180 -220 179 -198 -78 209 -323 122 -174 24 -78 101 -62 173
5195 173 130 66 189 -119 60 -287 96 105 313 -32 145 129 67 -228 100 196 -310 176 -263 166 -340 47
5217 47 -28 -43 -235 -41 231 43 -26 -61 -45 75 375 139 -131 67 116 12 -171 -67 -138 -5 23 116 -77
5240 -77 -10 -97 170 -6 9 61 -92 66 -17 130 138 -39 21 249 -7 34 -39 -12 -15 126 52 -42 15 23 179 -100
5266 -100 18 55 212 2 193 -50 340 313 -170 44 -219 -36 -46 120 6 84 -280 -17 2 113 -15 -135
5288 -135 140 -152 197 -34 60 -160 119 -237 13 -1 -31 -57 -53 267 -202 21 -234 12 -124 -111 -186 -63 79
5311 79 -138 113 -71 -50 -229 61 -36 169 -52 247 -11 285 -95 -33 53 149 104 49 -81 -145 -26 -374 29
5334 29 -282 163 -30 -81 1 62 -90 -181 130 -61 125 -182 -19 -237 -61 75 41 235 73 87 4 -11 -229
5357 -229 100 -98 297 -257 45 -138 -4 48 175 203 -65 84 -97 53 -22 195 -156 82 -32 -83 -124 9
5379 9 -133 153 167 51 67 -390 -83 -56 188 -145 152 -118 262 -200 -42 108 -66 36 -277 178 -106 55
5401 55 -135 198 -72 35 159 -66 306 107 64 -91 -139 -108 6 -73 161 -104 -100 120 -474 86 -8 175 -182
5424 -182 115 -214 -73 -14 300 -273 110 179 -55 195 -52 268 -307 -131 -265 49 -240 -185 -127 -241 -6
5445 -6 -92 89 -36 72 -205 -111 -33 -41 -92 -149 82 36 12 -180 75 -188 60 11 142 -38 11 -150 -98 133 169
5470 169 329 -129 53 135 15 -235 198 -32 -118 -88 295 147 -66 294 131 242 -129 35 9 -8 102 127
5492 127 -23 7 -75 -14 294 -108 14 96 151 -159 262 -140 129 -102 -87 54 -269 48 62 -21 -203 193 -139
5515 -139 71 -143 -21 -37 -163 80 -16 -45 -254 207 85 -34 -6 232 -132 -41 -235 28 -93 -77 34 -22
5537 -22 -31 80 38 142 104 -50 -64 -122 76 -104 -83 -33 -208 -195 -106 112 -57 239 100 73 -104 -21 225 -163
5561 -163 -222 -32 52 -130 308 4 148 100 185 -37 46 -15 -144 241 -37 -153 -207 -53 36 238 56 145 -101
5584 -101 39 -115 29 92 -254 -83 -165 261 -106 -68 -168 -26 -102 -35 31 9 -24 183 4 -46 56 -11 -90 -411
5608 -411 -3 12 -195 -6 185 88 65 -73 11 67 107 -72 21 115 -50 45 -13 -41 91 0 -11 76 83 -40 -80 -80
5634 -80 170 291 142 -51 -93 334 118 232 -334 18 31 281 -89 229 12 -136 434 -160 -60 -10 276
5655 276 181 -173 20 171 479 239 -715 -90 -254 -25 227 -35 248 -64 -97 -134 -148 -330 29 -167 -55
5676 -55 99 -130 -5 123 10 -270 -94 20 -30 -405 46 268 182 -44 9 76 -135 93 63 73 70 134 -28
5699 -28 83 88 204 36 48 47 -143 6 182 232 -106 -39 32 257 -170 40 115 -20 -200 -245 159 -171 66 103
5723 103 -29 -129 10 -98 -25 -67 30 173 -171 276 3 82 82 251 -136 79 -201 -57 54 -53 -84 -140 -3
5746 -3 102 150 -86 87 -1 113 3 29 -58 81 -193 21 338 -100 -76 -219 -151 -139 214 187 -86 -98 -168 127
5770 127 -1 -113 -193 42 -253 306 30 279 89 -8 -98 165 -23 -83 51 -52 325 65 -4 -84 110 188
5792 188 -48 143 192 45 79 -70 31 143 -71 64 30 -88 -5 55 -227 -140 -9 -108 -146 -36 -36 -89 26 -92
5816 -92 167 171 250 -29 118 289 19 2 54 140 -21 230 -39 239 174 16 93 -85 43 -27 -139 -104 289 -27
5840 -27 -36 -67 -184 197 -109 142 -85 147 70 320 23 -78 -144 -71 -348 -61 62 -514 -152 -155 -52 -9 83 -26
5864 -26 258 -50 126 99 202 246 -133 292 -181 -300 267 538 -209 -352 -401 300 259 -300 -170 352 -29 258
5886 258 100 -237 -31 -384 -104 -382 -75 268 -496 -254 129 -229 786 501 -220 248 -265 -1096 -146 128
5906 128 -351 391 -396 521 -455 179 -30 100 253 -84 -53 258 264 -20 -149 -252 275 295 247 -44 -118 27
5928 27 -118 71 52 -161 -175 8 -280 -222 -143 286 165 -236 57 -261 144 -67 127 111 -29 -136 14 228
5950 228 -111 179 39 -114 -168 12 28 -136 -76 -62 -20 123 55 -187 -53 -121 -96 -51 -99 283 129 -83 -84 -49
5974 -49 15 -110 -160 -67 172 136 -181 -207 56 156 -96 28 100 -60 5 -149 288 7 122 -80 -103 -10 20 56
5998 56 72 -185 -70 12 -146 5 -66 -143 -125 306 -46 -4 83 77 62 -41 50 -172 103 17 -207 -179 143 -203 150
6023 150 0 -44 -248 46 -120 194 -30 -209 39 -132 86 -72 292 -78 134 56 -47 -35 2 -220 185
6044 185 252 -277 91 -192 0 -149 46 32 -84 156 -113 -217 -229 12 -201 -222 68 295 -331 108 251
6065 251 -120 -252 -262 77 -453 232 -85 288 151 -64 12 564 -9 353 34 -436 -363 -317 35 -388 -156
6086 -156 -60 -304 -40 -17 -296 -61 15 353 233 123 23 -356 5 -166 68 481 173 -43 -305 -230 100
6107 100 -107 193 273 -395 -31 33 476 -716 35 648 280 -397 -194 822 664 413 377 399 231 299 -235
6128 -235 296 -141 283 -51 -38 -60 463 181 28 154 -303 85 -316 140 360 -227 86 304 -32 -38 116
6149 116 71 209 -268 283 -75 -99 -88 28 154 135 137 -56 119 -244 -161 102 -33 -36 -24 -58 130 -170 -233 7
6173 7 43 53 3 135 72 6 23 84 54 -10 79 -174 111 118 -181 -102 167 -239 332 -41 33 -305 161 116 -89 -31
6199 -31 -473 55 -207 151 -268 -284 146 -186 -338 452 208 -295 21 -243 6 40 -105 101 21 7 -100 -261
6221 -261 299 19 140 11 70 97 -375 140 149 215 77 266 360 -40 285 -223 -199 -13 274 371 260 -268 71
6244 71 298 129 369 -30 -308 13 187 -400 157 -59 79 -81 -5 -201 -55 -79 83 30 -183 62 -108
6265 -108 -7 -52 -24 -189 70 -224 97 131 27 -185 82 61 13 56 -290 73 84 336 -59 199 175 -174 208
6288 208 19 133 79 4 114 32 -180 51 87 81 103 -201 13 32 4 77 -73 212 4 92 279 -263 -169 -189
6312 -189 172 -92 16 53 38 20 -120 50 -114 147 38 36 154 79 -97 -89 -4 210 12 -127 -153 -12 -8 -225
6336 -225 151 208 6 -128 -6 -13 -35 -41 -172 105 -89 176 -37 -129 -128 -139 81 2 98 -59 -15 143 -83 -284
6360 -284 155 -147 104 -2 160 26 -1 205 -190 152 -56 210 -155 -5 -194 23 44 111 -30 62 31 -140
6382 -140 1 -42 -16 -204 -207 -171 236 -108 59 8 47 -88 9 93 74 376 -262 -50 -131 126 -10 -150 -145 149
6406 149 -47 207 -95 -79 -103 -59 129 -229 151 30 257 128 289 -79 -108 114 182 167 -24 -156 -68 318
6428 318 -65 126 63 76 150 -140 46 -89 38 -6 194 -7 128 -8 119 2 54 57 -195 108 -60 234
6450 234 -199 84 -36 132 -132 220 -54 86 103 -104 -173 92 166 -119 179 -63 170 -98 120 -154 35
6471 35 -194 254 78 -94 -126 -52 -92 10 -107 -120 218 -68 -136 -266 -22 133 -293 123 -19 462 -333 344
6493 344 -178 -178 -8 -188 -142 -286 90 -34 157 -4 -129 -83 426 38 414 -102 -58 -283 -214 249 57 83
6515 83 -364 -202 -441 -3 141 -60 -172 -242 165 -293 271 -500 55 352 -25 184 209 104 -49 -339 -20
6536 -20 186 207 -77 -433 -363 -99 -97 88 83 -428 225 -395 -327 516 33 106 624 572 -397 -254 77 67 477 -382
6560 -382 50 -155 207 -415 -309 149 115 -224 183 5 377 970 -166 -245 401 -307 -246 313 -588 21 143
6581 143 671 249 314 230 -188 49 369 455 419 123 -465 -263 -9 139 113 -23 37 122 216 600 268 -399 -64
6604 -64 -435 106 -528 280 169 442 219 517 462 -98 1055 -59 318 18 408 187 -224 -224 255 217 -508
6625 -508 -927 -110 -20 207 -301 6 -741 13 161 191 336 -334 62 165 304 458 -311 64 -48 161 -64
6646 -64 -50 246 179 744 29 105 285 506 390 8 -32 251 343 -169 -61 296 0 404 -47 -157 -15 20
6668 20 185 125 -48 -201 -358 -57 206 36 122 205 142 8 -108 319 -212 73 -356 147 39 170 -69 10
6690 10 40 63 -47 -149 -416 47 -226 -230 -141 -73 -48 96 20 -7 -180 98 142 -82 -152 321 41 142 -51 149
6714 149 -67 136 345 -145 86 -21 -9 52 35 -153 262 61 12 49 73 -102 -167 -172 141 225 -4 -178 -32
6737 -32 -18 -105 -10 -247 -84 78 -129 38 122 -117 -108 -34 -221 -52 279 -145 -114 113 -59 -81 -289 8 262
6760 262 40 -105 -46 18 89 -118 -74 179 57 17 -90 187 89 81 -53 -34 -8 186 -117 -114 -32 -39 122 -18 -211
6785 -211 -8 117 -13 22 -127 202 353 163 -97 43 -13 84 242 -71 99 -111 -33 -9 66 74 -165 95 13
6808 13 -48 -91 122 230 -5 64 -160 -179 67 -76 139 100 -30 58 -127 142 -149 -86 259 -12 136 122 86
6831 86 -3 155 -89 13 216 -149 201 56 41 252 126 113 241 60 187 -194 37 -2 95 93 55 -78 -150
6854 -150 -52 78 55 27 71 46 22 75 2 -18 87 128 -28 62 -135 42 57 -14 141 89 186 -17 -202 -306 25
6879 25 161 -58 -168 124 -33 172 -229 48 -95 15 77 -41 25 -207 -25 -196 137 40 -60 -36 -79 78
6901 78 -69 -25 52 6 -83 11 -88 62 85 7 -16 33 -61 -143 70 104 142 101 -49 186 220 -72 184 72 44 141
6927 141 -24 45 -75 -31 64 96 43 -51 -54 45 7 3 147 88 -156 -64 146 -75 6 -74 159 86 38 -243 -66 -199
6953 -199 156 -99 43 -5 -54 70 177 35 -37 109 31 49 89 53 70 -114 112 -80 9 190 -290 3 -74
6976 -74 52 20 -262 55 133 -100 131 57 202 -75 188 67 134 87 -91 -49 -101 7 -15 129 -84 26 94
6999 94 11 -27 -217 -127 22 75 121 77 16 163 20 132 -176 -33 34 53 -182 -28 107 -152 3 -130 61
7022 61 120 -122 53 -90 103 -64 59 -164 -134 -7 -117 -171 -83 -53 -68 114 -154 -69 57 288 144 -92 -190
7045 -190 79 23 282 -192 -43 90 -231 137 30 -167 -1 -277 -67 -222 -41 -101 -223 188 44 -158 -354
7066 -354 -213 118 10 -45 -29 17 117 134 -11 -214 -25 181 175 -1 99 -69 131 36 0 134 83 123 -83
7089 -83 -48 146 -131 12 -3 -193 -135 33 -39 -324 11 213 161 -162 34 -305 -360 -51 -28 84 45 192 209
7112 209 382 -325 166 101 179 227 -44 -306 357 67 297 583 480 -301 186 404 510 700 844 158 -4
7133 -4 -169 810 92 -134 285 68 234 -330 483 -453 -195 96 -161 -303 223 -199 -237 164 182 149 -357 -306
7155 -306 29 311 496 -100 401 -86 -76 -517 -210 463 97 -317 363 -141 -52 144 61 -293 232 404 -380
7176 -380 308 125 261 -39 -235 20 395 115 -114 -116 -197 -63 -1 -11 135 -92 -106 26 47 -139 96 278
7198 278 -38 -25 50 111 40 88 -105 174 -145 244 -39 40 -164 -139 -20 80 -36 2 195 -84 85 -11 138
7221 138 12 -117 32 -91 8 -98 23 233 86 -300 131 -137 233 72 116 -187 -66 215 133 -91 -133
7242 -133 68 -48 294 -214 31 96 -196 147 -64 -297 -117 151 130 169 -44 85 88 61 71 -222 -369 -95
7264 -95 25 -33 54 -107 -6 -106 208 177 79 17 -119 -77 33 -18 141 22 69 158 167 -69 -99 168 -138 -24
7288 -24 117 61 254 -16 -183 -76 148 203 -238 -33 134 103 154 -9 -47 -91 -43 1 61 56 155 35 0 10 -3
7313 -3 10 -25 -126 -103 -159 61 144 244 -2 -201 31 -90 26 111 178 36 141 -38 11 2 27 35 40 85 149 118 -180
7340 -180 64 -72 -274 -232 -277 -241 137 173 -309 -24 -166 -90 168 -281 -1 -17 87 -191 -173 55 -41 -13 -211
7363 -211 24 -84 189 -12 -175 116 115 -66 -21 -70 0 90 199 158 -142 62 121 -82 43 -288 87 -36 -249
7386 -249 146 -213 -87 -41 287 31 -68 -25 84 -74 -39 -169 95 -166 219 -10 173 -157 32 92 17 150
7408 150 -55 36 -33 75 -73 3 -123 101 -3 202 -42 55 28 -138 121 -184 -23 93 190 -177 -10 45
7430 45 -64 183 82 143 -192 -22 -2 -87 26 -40 -35 -223 -12 22 43 -267 43 -27 -94 -167 131 67 35 -156 112
7455 112 -9 -63 4 96 30 70 328 13 97 -97 -75 11 90 -235 302 -13 -11 311 -3 208 219 7 -108 -114 -23
7480 -23 -141 82 231 144 132 122 -184 -5 23 -12 121 -104 103 157 -52 -91 -8 -65 -154 -149 75 -6 116 -59 -93
7505 -93 -80 135 9 46 -69 -34 22 43 -84 -132 128 67 93 161 27 -59 68 -56 74 -104 86 87 -179 331
7529 331 -113 -9 -330 -46 27 -173 221 11 -46 58 -137 -324 -166 -56 -43 -105 201 -157 -535 6 17 9
7551 9 -16 72 64 71 48 -60 169 261 83 195 -118 142 83 -199 -28 -72 -136 16 235 -34 -68 -54 177 106 51 -156
7577 -156 8 -34 -8 71 -74 -324 -19 -251 -16 9 -100 37 -398 95 364 405 -185 46 225 -210 307 85
7599 85 -178 -167 -190 -532 62 81 619 57 -515 40 -143 117 -233 -47 -79 96 -532 285 -190 -304 -129 68
7621 68 0 -75 40 -247 -103 -40 398 -515 100 -407 322 -5 307 -273 -185 376 557 8 1131 -37 -570
7642 -570 523 -305 601 330 -96 262 -53 6 175 442 582 184 -33 112 -649 -80 439 -4 92 -355
7662 -355 346 -46 -95 -142 -353 -230 -113 245 37 58 165 -38 17 58 -56 -23 -47 -49 112 149 174 112 -94 39
7686 39 100 104 118 173 -95 -74 87 -63 -57 49 -95 159 -178 12 -17 21 -49 10 261 23 -42 -20 32 -36 -68 -175
7712 -175 -48 -146 161 -93 131 -70 90 329 63 58 108 -23 70 -51 -194 264 187 -11 2 131 164 -30 -54
7735 -54 16 108 43 -126 27 30 -2 -14 -44 -188 74 -88 -90 190 166 -93 234 -102 -74 -221 -24 188 -16 -43 -57
7760 -57 38 -106 108 234 104 -29 39 66 217 -40 57 -120 -143 19 297 102 -83 161 -174 -135 -108 132 -48
7783 -48 -262 0 95 -93 -2 29 -124 88 35 233 -47 -2 72 17 229 -167 -170 -253 -8 124 132 -124 149 151 21
7808 21 -66 -45 389 5 -86 33 -87 52 72 49 -2 -144 159 -138 -258 102 -99 -138 -68 130 -66 -70 -91 103
7832 103 -283 204 -2 -157 -30 57 111 88 -70 -262 177 -84 8 158 -19 -161 82 -110 6 28 -8 260
7854 260 -191 149 165 -126 -168 13 39 -131 7 164 -13 -58 115 121 -175 -173 86 26 -21 -82 131 -164 115 80
7878 80 64 23 274 -161 191 326 -114 57 -29 183 -82 -35 24 -13 -45 -167 -114 -132 50 27 -143 110 -184 -12
7902 -12 85 -102 84 130 96 -5 -150 -108 -75 -71 25 -94 -8 40 -95 -21 79 -20 63 56 -86 28 85 85 -188 -92 4
7929 4 245 -25 62 -49 99 -125 -4 56 83 64 -151 -230 152 -70 64 149 -311 213 -81 -68 -166 -6 13 76
7953 76 251 46 -228 30 170 138 152 305 12 187 -84 -109 -334 17 -95 102 -184 22 88 228 -180 72
7975 72 -20 129 224 -93 82 -113 114 -92 48 -67 39 176 180 -2 -9 78 6 59 147 41 -145 -183 326 -118
7999 -118 -164 192 47 1 36 267 21 -121 -188 1 54 -79 -29 -9 29 81 263 42 20 -19 172 50 4 -41
8023 -41 -165 38 -183 133 -144 154 -36 -160 10 -288 25 -97 64 164 119 3 148 50 78 -42 39 -105
8045 -105 148 -228 -110 110 7 -128 62 104 -52 232 34 94 13 -126 182 103 108 5 -141 -39 107 -330
8067 -330 -46 99 -243 -20 222 147 -94 -180 7 -113 -278 85 -26 -133 -119 176 -89 487 147 -22 -66
8088 -66 -283 -390 -197 19 -274 212 284 26 -75 694 -49 495 119 200 174 -240 -91 51 -312 45 -67
8109 -67 -101 142 -196 176 -179 199 -393 -95 -213 -112 -122 640 565 -19 -241 -106 -73 162 -187 639 -209 -329
8131 -329 -404 224 176 -133 -188 142 218 -10 -247 620 -524 207 171 -79 98 130 237 -332 285 -689 -588 -316
8153 -316 -26 -27 -32 425 -452 -350 177 151 95 185 -52 417 9 178 21 -337 441 -731 -93 -45 -451 237
8175 237 -126 -508 -575 476 249 -362 -1356 99 742 -127 96 -229 -244 -363 -114 -127
8191a27
##END NTUPLES=NMR FID
##END=
