##TITLE=1H_Ser S-4
 CDCl3,8 sc, 
 3.02.2021
##JCAMPDX= 6.0         $$ Bruker NMR JCAMP-DX V2.0
##DATA TYPE= NMR FID
##DATA CLASS= NTUPLES
##ORIGIN= UXNMR, Bruker Analytische Messtechnik GmbH
##OWNER= root
$$ XWIN-NMR		Version 3.5
$$ Wed Feb  3 10:42:07 2021 Russian Standard Time (UT+4h)  she@DPX200
##.OBSERVE FREQUENCY= 200.1315066352
##.OBSERVE NUCLEUS= ^1H
##.DELAY= (6, 6)
##.ACQUISITION MODE= SIMULTANEOUS
##.ACQUISITION SCHEME= undefined
##.AVERAGES= 8
##.DIGITISER RES= 18
##SPECTROMETER/DATA SYSTEM= spect
##.PULSE SEQUENCE= zg30
##.SOLVENT NAME= CDCl3
##.SHIFT REFERENCE= (INTERNAL, CDCl3, 0, 15.7039)
##AUDIT TRAIL= $$ (NUMBER, WHEN, WHO, WHERE, WHAT)
$$ ##TITLE= Audit trail, XWIN-NMR		Version 3.5
$$ ##JCAMPDX= 5.01
$$ ##ORIGIN= Bruker BioSpin GmbH
$$ ##OWNER= she
$$ F:/spectra/data/she/nmr/H-F/1/audita.txt
$$ ##AUDIT TRAIL=  $$ (NUMBER, WHEN, WHO, WHERE, WHAT)
(   1,<2021-02-03 10:41:08.37 +0400>,<she>,<DPX200>,
      <created by zg, POWCHK disabled, PULCHK disabled
       configuration hash MD5:
       00 E9 B6 7A A2 85 ED C7 34 08 36 98 17 FE 4E 26
       data hash MD5: 16K
       55 F9 4F 76 2F FB BB 24 49 8A CD 1A 06 45 A4 91>)
$$ ##END=
$$ 
$$ hash MD5
$$ 14 1E 07 BC F1 17 2C 50 E6 EE F1 D6 FA EF 24 FA
##$RELAX= 
##$RELAX= 
##$RELAX= 
##$RELAX= 
##$RELAX= 
##$RELAX= 
$$ Bruker specific parameters
$$ --------------------------
##$DU= <F:/spectra>
##$EXPNO= 1
##$NAME= <H-F>
##$PROCNO= 1
##$TYPE= <nmr>
##$USER= <she>
##$AMP= (0..31)
100 100 100 100 100 100 100 100 100 100 100 100 100 100 100 100 100 100 
100 100 100 100 100 100 100 100 100 100 100 100 100 100 
##$AQSEQ= 0
##$AQ_mod= 1
##$AUNM= <au_zg>
##$AUTOPOS= <>
##$BF1= 200.13
##$BF2= 200.13
##$BF3= 200.13
##$BF4= 200.13
##$BF5= 200.13
##$BF6= 200.13
##$BF7= 200.13
##$BF8= 200.13
##$BYTORDA= 1
##$CFDGTYP= 0
##$CFRGTYP= 5
##$CHEMSTR= <none>
##$CNST= (0..31)
1 1 145 1 1 1 1 1 1 1 1 1 1 1 1 1 1 1 1 1 1 1 1 1 1 1 1 1 1 1 1 1 
##$CPDPRG= <>
##$CPDPRG1= <>
##$CPDPRG2= <>
##$CPDPRG3= <>
##$CPDPRG4= <mlev>
##$CPDPRG5= <mlev>
##$CPDPRG6= <mlev>
##$CPDPRG7= <mlev>
##$CPDPRG8= <mlev>
##$CPDPRGB= <>
##$CPDPRGT= <>
##$D= (0..31)
0 1.2 0 0 0 0 0 0 0 0.06 0 0.03 0 0 0 0 0.0002 0 0 0 0 0 0 0 0 0 0 0 0 
0 0 0 
##$DATE= 1612334467
##$DBL= (0..7)
120 120 120 120 120 120 120 120 
##$DBP= (0..7)
150 150 150 150 150 150 150 150 
##$DBP07= 0
##$DBPNAM0= <>
##$DBPNAM1= <>
##$DBPNAM2= <>
##$DBPNAM3= <>
##$DBPNAM4= <>
##$DBPNAM5= <>
##$DBPNAM6= <>
##$DBPNAM7= <>
##$DBPOAL= (0..7)
0.5 0.5 0.5 0.5 0.5 0.5 0.5 0.5 
##$DBPOFFS= (0..7)
0 0 0 0 0 0 0 0 
##$DE= 6
##$DECBNUC= <off>
##$DECIM= 32
##$DECNUC= <off>
##$DECSTAT= 4
##$DIGMOD= 1
##$DIGTYP= 9
##$DL= (0..7)
0 120 120 120 120 120 120 120 
##$DP= (0..7)
150 150 150 150 150 150 150 150 
##$DP07= 0
##$DPNAME0= <>
##$DPNAME1= <>
##$DPNAME2= <>
##$DPNAME3= <>
##$DPNAME4= <>
##$DPNAME5= <>
##$DPNAME6= <>
##$DPNAME7= <>
##$DPOAL= (0..7)
0.5 0.5 0.5 0.5 0.5 0.5 0.5 0.5 
##$DPOFFS= (0..7)
0 0 0 0 0 0 0 0 
##$DQDMODE= 0
##$DR= 18
##$DS= 0
##$DSLIST= <SSSSSSSSSSSSSSS>
$$ [...]
##$SUBNAM2= <"">
##$SUBNAM3= <"">
##$SUBNAM4= <"">
##$SUBNAM5= <"">
##$SUBNAM6= <"">
##$SUBNAM7= <"">
##$SUBNAM8= <"">
##$SUBNAM9= <"">
##$SW= 16.9725356469052
##$SWIBOX= (0..15)
0 0 2 0 0 0 0 0 0 0 0 0 0 0 0 0 
##$SW_h= 3396.73913043478
##$TD= 16384
##$TD0= 1
##$TE= 0
##$TE2= 300
##$TE3= 300
##$TEG= 300
##$TL= (0..7)
0 120 120 120 120 120 120 120 
##$TP= (0..7)
150 150 150 150 150 150 150 150 
##$TP07= 0
##$TPNAME0= <>
##$TPNAME1= <>
##$TPNAME2= <>
##$TPNAME3= <>
##$TPNAME4= <>
##$TPNAME5= <>
##$TPNAME6= <>
##$TPNAME7= <>
##$TPOAL= (0..7)
0.5 0.5 0.5 0.5 0.5 0.5 0.5 0.5 
##$TPOFFS= (0..7)
0 0 0 0 0 0 0 0 
##$TUNHIN= 0
##$TUNHOUT= 0
##$TUNXOUT= 0
##$USERA1= <user>
##$USERA2= <user>
##$USERA3= <user>
##$USERA4= <user>
##$USERA5= <user>
##$V9= 5
##$VALIST= <valist>
##$VCLIST= <CCCCCCCCCCCCCCC>
##$VD= 0
##$VDLIST= <DDDDDDDDDDDDDDD>
##$VPLIST= <PPPPPPPPPPPPPPP>
##$VTLIST= <TTTTTTTTTTTTTTT>
##$WBST= 1024
##$WBSW= 4
##$XGAIN= (0..3)
0 0 0 0 
##$XL= 0
##$YL= 0
##$YMAX_a= 66133
##$YMIN_a= -39606
##$ZGOPTNS= <>
##$ZL1= 120
##$ZL2= 120
##$ZL3= 120
##$ZL4= 120
##$ABSF1= 10
##$ABSF2= 0
##$ABSG= 5
##$ABSL= 3
##$ALPHA= 0
##$AQORDER= 0
##$ASSFAC= 0
##$ASSFACI= 0
##$ASSFACX= 0
##$ASSWID= 0
##$AUNMP= <proc_1d>
##$AZFE= 0.1
##$AZFW= 0.1
##$BCFW= 1
##$BC_mod= 2
##$BYTORDP= 1
##$COROFFS= 0
##$CY= 11.3945322036743
##$DATMOD= 1
##$DC= 2
##$DFILT= <>
##$DTYPP= 0
##$F1P= 15.9154993809931
##$F2P= -4.1035820241983
##$FCOR= 0.5
##$FTSIZE= 0
##$FT_mod= 4
##$GAMMA= 1
##$GB= 0.15
##$INTBC= 1
##$INTSCL= 1
##$ISEN= 128
##$LB= 0.24
##$LEV0= 0
##$LPBIN= 0
##$MAXI= 10000
##$MC2= 0
##$MEAN= 0
##$ME_mod= 0
##$MI= 1.114404
##$NCOEF= 0
##$NC_proc= 0
##$NLEV= 6
##$NOISF1= 3.799351
##$NOISF2= 2.8
##$NSP= 1
##$NTH_PI= 0
##$NZP= 0
##$OFFSET= 15.70392
##$PC= 1
##$PHC0= -10757.68
##$PHC1= 10.00095
##$PH_mod= 1
##$PKNL= yes
##$PPARMOD= 0
##$PSCAL= 0
##$PSIGN= 0
##$REVERSE= no
##$SF= 200.130013532006
##$SI= 16384
##$SIGF1= 3
##$SIGF2= 2
##$SINO= 400
##$SIOLD= 16384
##$SREGLST= <1H.CDCl3>
##$SSB= 0
##$STSI= 0
##$STSR= 0
##$SW_p= 3612.71676300578
##$SYMM= 0
##$S_DEV= 0
##$TDeff= 0
##$TDoff= 0
##$TI= <>
##$TILT= no
##$TM1= 0
##$TM2= 0
##$TOPLEV= 0
##$USERP1= <user>
##$USERP2= <user>
##$USERP3= <user>
##$USERP4= <user>
##$USERP5= <user>
##$WDW= 1
##$XDIM= 8192
##$YMAX_p= 0
##$YMIN_p= 0
$$ End of Bruker specific parameters
$$ ---------------------------------
##NTUPLES= NMR FID
##VAR_NAME=  TIME,          FID/REAL,        FID/IMAG
##SYMBOL=    X,             R,               I
##VAR_TYPE=  INDEPENDENT,   DEPENDENT,       DEPENDENT
##VAR_FORM=  AFFN,          ASDF,            ASDF
##VAR_DIM=   8192,          8192,            8192
##UNITS=     SECONDS,       ARBITRARY UNITS, ARBITRARY UNITS
##FACTOR=    0.0002944,     1,               1
##FIRST=     0,             0,               0
##LAST=      2.4114304,     0,               0
##MIN=       0,             -39606,          0
##MAX=       2.4114304,     66133,           0
$$ Real data points
##PAGE= N=1
##DATA TABLE= (X++(R..R)), XYDATA
0@%%%%%%%%%%%%%%qJ6j6J6j6J6k4L2l2M0m8N6o4P2q8J00j11J26j43J63j83K04
36A08k31K58k86L21l58L98m38M82n35N90o51P16p88Q68r54J051j159J278j411
55g41J561j730J926k155K424k744L136l629M264n122O339q204J1444j8581N8824
70D7012K400p8195P2540n4050J1845L3883j2911l7346O3250o7102J5657N7093
82E4076p7338M8604k1320p131K3565n386k9370L0466l237l6675O6682o2002K6471
95G405N289l1105L3536m711j9885M831K8794n1777M8623k3893j4765M4046m4486
108a8098J8926N043l558j9575L1694k7582J1158K0821m7116M4888k7353L764Q934
121A946Q40r275N346j845j5753M1115m6441K9246m774j5597K0678j5343O686l073
$$ plain form
0 0 0 0 0 0 0 0 0 0 0 0 0 0 0 0 -8 8 -8 8 -8 8 -16 16 -16 24 -24 32 -32 40 -48 52 -59 67 -76 87 -96 108
36 108 -123 135 -151 170 -188 210 -228 254 -281 309 -342 374 -414 454 -500 551 -608 670 -741
55 -741 820 -910 1016 -1139 1285 -1459 1677 -1952 2312 -2810 3529 -4675 6769 -11812 47012
70 47012 49412 -28783 43757 -10293 1552 35435 22524 -14822 48428 -18674 -3017 54076
82 54076 -23262 25342 4022 -3109 20456 15070 -14300 16166 12929 -23746 42936 -19066 7405
95 7405 12694 -18411 15125 10414 -9471 -4640 24154 -27623 21000 -2893 -17658 26388 -18098
108 -18098 828 5871 2313 -17262 14432 -13150 -1992 18829 -28287 16601 -10752 -6988 1946
121 1946 2786 -6489 -1143 -2988 -18741 22374 -24067 5179 405 -15192 5486 -9857 -3171 -6244
135f244J0216k4761L6454k8007k067K3657k9225L2496k1024j88J607J1156j6082
148a2012J4705p91k4674L8882l4631K5909l857j7640J2405K872j023l003J4118
161A1260l3699L7102k0581Q12K3202l1247J6649l666L914p711J7213k5539J8166
174E875O181k9234L6508k7861J0931K750l998l566R834q580q184L0019l7914K8460
188A1221j0615q751J6808j2091K663Q55P266k3823L1334k3349M826J4783k7007
201a5880K3913j1184J977k568J1872k0251J5328J621j9074L1617l0772J5149J404
214C152n306J463N645o710l369K0498l1418L0178j5125m318J7083j4917O866k486
228A236M254j2860K4919k4651J0528P887k3145K6858j7182O043k327L853j0383
$$ plain form
135 -6244 3972 -20789 15665 -12342 -14409 9248 -19977 12519 -8505 -8693 -7086 4070 -12012
148 -12012 2693 1902 -22772 16110 -18521 7388 3531 -14109 -1704 1168 145 -2858 11260
161 11260 -22439 14663 -5918 -5106 18096 -13151 3498 -168 3746 -3965 13248 -12291 5875
174 5875 12056 -17178 19330 -8531 2400 5150 1152 -2414 7420 -1160 -9344 20675 -17239 11221
188 11221 606 -8145 8663 -3428 -765 90 7356 -16467 14867 -8482 -3656 11127 -15880
201 -15880 8033 -3151 -1174 -3742 8130 -12121 3207 4828 -14246 17371 -13401 1748 3152
214 3152 -2154 -691 4954 -1756 -5125 15373 -16045 14133 -992 -5310 11773 -3144 3722 1236
228 1236 5490 -7370 17549 -7102 3426 11313 -11832 15026 -2156 3887 1560 5413 -4970
241d970J3965n054j2283K4708k9432K2069p634m235O433l896q66r03J0737k2515
255a3876K5230j9672N547R697j7798J4771q697M567o603J2946j7207J2097O7j4089
269a3020K3475k2419J2987l830O31j839N300m516m155J6354k3523K3592j3830
282d793O46Q144r063O356l137N839j3436K0214j9002J0585L742j5049J8604j3878
296d228P671m271O814j1492J1739m046q135J9637k3725J8185p527l21K318L86
310C005k855o72R683j9203K2680j7608N288O327j1729R858n819L653p549J3884
324H943j7141J2244j235j1353J8416j7441J0050m166K407n341P845n671k958J3443
338H042k0786K0051j2268J929L956m322J824j318N770j3160J8266j7385R947J552
$$ plain form
241 -4970 8995 3941 -8342 16366 -13066 9003 1369 -2866 3567 -329 -1195 -2098 8639 -13876
255 -13876 11354 -8318 -2771 6926 -10872 3899 -4798 -231 -6834 6112 -11095 1002 1069 -13020
269 -13020 10455 -11964 1023 -2807 -2176 -4015 1285 -3231 -7386 8968 -14555 9037 -4793
282 -4793 -4147 3997 -5066 1290 -1847 3992 -9444 10770 -8232 2353 6095 -8954 9650 -4228
296 -4228 3443 -828 5986 -5506 6233 2187 -5948 13689 -10036 8149 622 301 2619 3005
310 3005 150 -522 9161 -10042 12638 -4970 318 6645 -5084 4774 -1045 2608 -4941 8943
324 8943 -8198 4046 2811 -8542 9874 -7567 2483 -1683 724 -4617 3228 -2443 -5401 8042
338 8042 -12744 7307 -4961 -3032 924 -3398 -1574 -2892 2878 -10282 7984 -9401 546 2098
352B098j0403J2444r799O664n531Q817j2169J1058l997o017J5320j7567J3812
365D730p188L192k102L535l319m22Q623j5813J8920j4914N767J838m379M780l582
380c34L764q435J3883j4516J0449j798p542J2291j1579Q376m974M105p010Q881
394E561o278k075J0797j7984J6164r778M014j23k183l56j52M889j1019J4649j5480
409i354Q920K54p037Q565p761N309m290P393j0961J0731o121k983J1413j3957
423i879J2553q283M231k983N070m472J091N650j2306J6558j2993O890o89k429
437a991L802j852L943p688J2195j3585J1419l253m093Q905r114P572n797P363
451G826q757R264o260p32Q605j3450J3308r504N259k635K014k836R01L675j0708
$$ plain form
352 2098 -8305 4139 -5660 1004 -4527 4290 -7879 3179 -818 -6835 8485 -9082 4730
365 4730 -2458 734 -1368 2167 -1152 -1574 7049 -8764 10156 -4758 1009 2847 -1532 3248 -334
380 -334 3430 -5005 8878 -5638 4811 3013 -4529 7762 -3817 4559 -415 3690 -3320 5561
394 5561 -717 -2792 8005 -9979 6185 -3593 421 298 -1885 -2241 -2393 2496 -8523 6126 -9354
409 -9354 -434 -180 -7217 1348 -6413 -1104 -5394 1999 -8962 1769 -4352 -7335 4078 -9879
423 -9879 2674 -5609 -1378 -4361 709 -3763 -2672 2978 -9328 7230 -5763 1127 438 -1991
437 -1991 1811 -41 3902 -3786 8409 -5176 6243 2990 -1103 7802 -1312 6260 463 7826
451 7826 -931 8333 2073 1341 9946 -3504 9804 300 5559 2924 4938 2102 3003 6678 -4030
466d030J4263j3709Q722k544l700M948m200L849o093Q447j2645J1575n559k850
480c526P480j0706R940o550N018o237O284n393J483M944j0509J3509j3021P653
494C69k067l24M86j122K925n726J0984j3384J0878m748r51N884p004N785n774
509c789P363p689R088p263J034O089r416J0745r316O353m265L946l294J113L372
524D071q817J1956j1509Q871m886K61K112k462L451o223Q904j1181J0396o643
538a699L34M912p588P272n956N407p143Q604o781K101L350r557J2190r990N989
553A445l546K643j806J141J504o523J0800j2389J0594m759o01L052m481N050m301
568b177O287r637J0208p155K517L729q533R226p849O214m481M432n394L320K031
$$ plain form
466 -4030 10233 -3476 5246 2702 -998 3950 -250 3599 -2494 5953 -6692 4883 -676 -3526
480 -3526 3954 -6752 3188 -3362 1656 -4581 1703 -3690 -2207 2737 -7772 5737 -7284 369
494 369 -1698 -2022 -1536 -2658 267 -5459 5525 -7859 3019 -1729 -2680 3204 -3800 1985 -3789
509 -3789 3574 -4115 4973 -2290 -1256 4833 -4583 6162 -3154 3199 -1066 2880 -414 699 4071
524 4071 -4746 7210 -4299 4572 -314 -53 2059 -403 3048 -3175 5729 -5452 4944 -1699
538 -1699 -1365 3547 -4041 3231 -2725 2682 -4461 4143 -2638 -537 2813 -6744 5446 -4544 1445
553 1445 -2101 542 -1264 -123 1381 -5142 5658 -6731 3863 -896 -1497 1555 -2926 2124 -2177
568 -2177 4110 -5527 4681 -2474 43 3772 -4761 4465 -3384 2830 -1651 2781 -2613 707 2738
583B738o842J0049j1460R085m782K001p35o58K470n328Q538j0282R538p068K152
598e84K837m923N285o477O872o957P906o795K865J678o074Q967q692O634n061
613b519M217l151J661R59n465R354j0022Q265n546K291L08j773K825m581P089
628C912r473R753o959K700J733n327O963o498N346n801O452n744L351N09n725
643d808R272r423P778n540L087k081J482J084m027P059r574R848p066K584J236
658I11l089M266m531N486p112Q286p345M591O17m996P228p454O664n234M653m319
674a378L040P1l555P170q875Q365o323L472o28p84J469l500O265q292Q799p558
690b242L980K10l538M957n489N534o431O778o194L779o78l919P080q363P440n865
$$ plain form
583 2738 -4104 5945 -5515 3570 -1212 789 54 -604 1866 -3462 5076 -5206 4332 -2736 -584
598 -584 2253 -2670 2615 -3862 3010 -3947 3959 -2836 29 1707 -4367 4600 -4092 2542 -2519
613 -2519 1698 -1453 208 1167 -4298 5056 -4966 3299 -2247 44 352 -1421 1404 -3177 3912
628 3912 -5561 4192 -2767 -67 1666 -3661 3302 -3196 2150 -3651 2801 -2943 408 917 -4808
643 -4808 4464 -4959 2819 -2721 366 -1715 -233 851 -3176 3883 -5691 4157 -2909 -325 911
658 911 -2178 2088 -2443 3043 -4069 4217 -3128 1463 2080 -2916 4312 -3142 3522 -1712 2941 -1378
674 -1378 1662 1733 -1822 5348 -3527 4838 -1485 1987 1359 575 2044 -1456 4809 -3483 5316 -2242
690 -2242 1738 1948 -1590 3367 -2122 3412 -3019 3759 -2435 1344 666 -3253 3827 -4536 2904 -2961
706b961M137l237K258n53l033O456q957Q987o883L625j067q60K129l308M857p062
722e472Q459p316M264k39k876N527o102N818n754N929n185M042r72k974O573q020
738d298P821n832M134k531J542j48k051N426p827Q722p320M681r61j849L381m180
754a290M918o201P108o874M970j388k460N279o734O536n833M856m308L204j322
769D61j828N063p654Q078p142M683k211M36O49k659M458o717P888p284M784j470
785d65j582L869n118N180n684O195n683M400k255j006M276o689P045n866M882
800A499l636K582o85j718M436o960Q204p209M866k107J65J460k822M568n756P283
816D170p269N460k240j186M123n432N885n427M997m864M457k231r20M421o714
$$ plain form
706 -2961 1176 -2061 197 -356 -3389 3067 -5890 3097 -3786 -161 -1228 -2088 41 -3267 1590 -5472
722 -5472 2987 -4329 -65 -304 -3180 2347 -3755 2063 -3691 2238 -2947 1095 123 -2851 3722 -4298
738 -4298 3523 -2309 1825 -706 836 688 -1363 4063 -3764 4958 -2362 2319 1358 -491 2890 -1290
754 -1290 3628 -2573 4535 -2339 2631 1243 -1217 4062 -2672 3864 -1969 2887 -1421 1783 461
769 461 -1367 3696 -3958 4120 -3022 1661 -550 -114 535 -2124 2334 -4383 3505 -3779 1005 -465
785 -465 -2047 1822 -3296 1884 -3800 2395 -3288 1112 -1143 -2149 2127 -4562 2483 -3383 1499
800 1499 -2137 445 -240 -1958 2478 -4482 3722 -3487 1379 -728 -563 897 -1925 2643 -3113 4170
816 4170 -3099 2361 121 -1065 3058 -2374 3511 -1916 3081 -1783 2674 443 -477 3944 -2770
831b770P380o695N056l207J672l9j758M063o382P456p450N429k643N6K006l991
847a817M617n478O054o151N119k940o30L337n344N924n760N060m466L428k165
862a212o17L751o324P143o890N236l261J548L48k331L904n354O951p152N776l257
878a741L45K507m125M781n121N572n477M859k446J50K802n232O464o167N370l909
894a368K839j240l79K883n201O816o932N862l357J369O35k245L187m744O147o081
910a809N214l692P12K049m224N356n603N311n092M088k890O61K054m717O212o644
926c014N523m168K250r13o27K586n033O175o793N849l978J640O74k580M022m976
942c363N577o004N412l359Q43J504l635N556n847N517m803M015k548Q22J872m201
$$ plain form
831 -2770 4610 -2085 2971 -236 1436 1397 -361 3702 -2680 4776 -2674 2755 112 168 2174 -1817
847 -1817 2800 -2678 3376 -2775 2344 -596 -1226 2111 -3233 2691 -3069 1991 -2475 953 -1212
862 -1212 -1829 1922 -4402 2741 -4149 1087 -2174 -626 -278 -2609 1295 -4059 2892 -4260 1516 -1741
878 -1741 -1396 1111 -3014 1767 -3354 2218 -3259 1600 -846 -696 2106 -3126 3338 -2829 2541 -1368
894 -1368 1471 231 -148 2735 -2466 4350 -2582 3280 -77 1292 1927 -318 2869 -1875 4272 -1809
910 -1809 3405 -287 425 2474 -1750 3606 -1997 3314 -1778 2310 -580 81 2135 -2582 3630 -3014
926 -3014 2509 -1659 591 -322 -949 1637 -3396 2779 -4014 1835 -2143 -503 171 -2409 1613 -3363
942 -3363 2214 -3790 1622 -1737 -894 610 -3025 2531 -3316 2201 -2602 1413 -1135 -313 1559 -2642
958b642N920o291N463l665K277p12o18K472m213N739o499O111m186J613J283l360
974a308M468m865N107n276M762l732J679J135l750N454o409N859m805L427k193
989d47M55J661l858N240o419O006m670K522m08j617L179m565N237n705N192m077
1005b274J944L17k606M402n355N227n066M494k960J194J025l294N222n874N420
1020A816m399L079j343k2J789l616N240o078N789m205K454j13j575L130l953M720
1036B713n391N460m383K538L89k771M363m927M946m660M028k750J254O15k865
1051a441M623n608N715m728L032j133m83J739l140M636n526N189m447K542m88
1066D82j706L426m469M775n094M601l794J978O7j985L931n355N501n042L943k504
$$ plain form
958 -2642 3278 -3013 2450 -1215 1062 350 -268 2204 -2009 3730 -2769 3342 -844 769 2052 -1308
974 -1308 3160 -1705 3402 -1874 2888 -844 835 1970 -1780 3674 -2735 3124 -1681 1746 -447
989 -447 8 1669 -2189 3051 -3368 2638 -2032 490 82 -1535 1644 -2921 2316 -3389 1803 -2274
1005 -2274 -330 -13 -2619 1783 -3572 1655 -3411 1083 -1877 -683 342 -2952 2270 -3604 1816
1020 1816 -2583 496 -847 -869 920 -2696 2544 -3534 2255 -1950 504 391 -1184 1946 -2007 2713
1036 2713 -2678 2782 -1601 937 1326 -1445 2918 -2009 2937 -1723 2305 -445 809 1424 -1441
1051 -1441 3182 -2426 3289 -1439 1593 460 -23 1716 -1424 3212 -2314 2875 -1572 970 482
1066 482 -1224 2202 -2267 2508 -2586 2015 -1779 199 266 -1719 2212 -3143 2358 -2684 1259 -1245
1082a245N25R17k339M090n657N719m702L229j305n19K236l564M312n154N257m101
1098b301K616o02j438L114m257M972n012M529l286K141r2k038L822m663N311m820
1114b004L797k163P99O49k404M256n346N586m565L186j163n42J900l235M269m853
1130a833M921m363K832p53j231K985m281M859m858M007l051J610l0j696L040m672
1146b514N501m950L562k279N26Q02k426L562m525M874m471L320j467n86K104l589
1162b556M294m513M387m062L058j203j041K752l861M779m674L971k823J416m5
1177a21j553L306m206M600m526L646j918N86J007k416L567m160M718m464L507
1192A573j639j42K079l301L972m381M349l766K915j370m40K311l769M931m990
$$ plain form
1082 -1245 -720 197 -2142 1948 -3709 2010 -2692 537 -768 -1287 949 -2615 1697 -3457 1800 -2301
1098 -2301 315 -287 -1725 1389 -2868 2104 -2908 1621 -1665 476 384 -1654 2168 -2495 2816 -2004
1114 -2004 1793 -370 429 1078 -1326 2930 -2416 3170 -1395 1791 628 86 1986 -1249 3020 -1833
1130 -1833 3088 -1275 1557 804 -427 2558 -1723 3136 -1722 2285 -766 844 814 -882 2158 -2514
1146 -2514 2987 -1963 1599 -680 -154 648 -1778 1784 -2741 2133 -2338 982 -485 -1071 1033 -2556
1162 -2556 1738 -2775 1612 -2450 608 -595 -1636 1116 -2745 2034 -2640 1331 -1492 -76 -121
1177 -121 -1674 1632 -2574 2026 -2500 1146 -772 -186 821 -1595 1972 -2188 2530 -1934 1573
1192 1573 -66 -208 1871 -1430 2542 -1839 2510 -1256 1659 289 -151 2160 -1609 3322 -1668
1207a668L865k483J000K64j690K967m262M873m677L543k161K79J448k869L582
1222B011m303M454m127L213j528m41J813l539M524m524L924l513K497j180k97
1237a016J981l757M873m760L900k547J009L36j734L093l919M317m168L509k135
1252a018L95J554k581L305l824M115l962L234j871K91J529k778L843m179M075
1267B128l197K136o36q49K371l663M527m536M065k797J189K37j476K750l843M505
1283B911m543L752k154M60Q69k544L547l995L757l367K742j742J89J462k933L917
1299B328m529L874l349K121p28q65K030l002L894m132L476k807J413K76j642K679
1315A037l537L733l752L482k204Q08O73k350L672m121M087l393K562j237J82J294
$$ plain form
1207 -1668 2197 -286 714 978 -712 2255 -2007 2866 -1811 1732 -429 -150 1298 -1571 2011
1222 2011 -2292 2162 -1965 1248 -280 -721 1092 -2447 2077 -2447 1477 -2036 461 -719 -1016
1237 -1016 965 -2792 2081 -2679 1221 -1326 -317 19 -1715 1378 -2541 1776 -2392 1117 -1018
1252 -1018 -623 931 -1650 1655 -2169 1946 -2016 1218 -653 -362 1167 -1611 2232 -1947 2128
1267 2128 -1069 1067 431 -418 1953 -1710 2817 -1719 2346 -451 738 975 -501 2249 -1594 2911
1283 2911 -1632 2120 -34 426 1295 -1249 2298 -1697 2060 -1307 1435 -307 -118 1344 -1589 2328
1299 2328 -2201 1673 -1676 445 -283 -1148 882 -2120 1774 -2358 1118 -1689 -276 0 -1642 1037
1315 1037 -2500 1233 -2519 963 -1241 -433 240 -2110 1562 -2559 1528 -1865 697 -540 -358 936
1331I36l075M183m161L625k782J905n06n85K007l098L773m014L575k200Q94N21
1347I98j716K979l335L588l668L150k148O40Q97k442L533l976L518l096K546j492
1363b4K15J078k242L053l947L783l114K051n30j085K085l027L543l723L285k687
1379a286J350P2j505K611l316L201l009K624j858O48O86j938K886l689L825l287
1395a985K261r71J14J178k326L106l653L809l233J932l23j012K391k993L465l250
1411a490K811k245J403k12j197K694l291L524l183K885j836N34N84j697K674l491
1427a533L714k922K173j165p8J083k181L034l347L234k920J883m59j087K043k813
1443a341L304l330L039k531J509r9j522K573l377L455l172K259j512Q41K75j839
$$ plain form
1331 936 -2139 2044 -2117 1508 -1274 631 125 -460 1547 -1551 2222 -1792 1783 -417 477 998
1347 998 -718 2261 -1074 2514 -1154 1996 -152 488 1385 -1057 2476 -1500 2018 -1078 1468 -24
1363 -24 191 1269 -973 2080 -1867 1916 -1198 853 323 -762 1323 -1704 1839 -1884 1401 -1286
1379 -1286 64 136 -1369 1242 -2074 1127 -1882 742 -1116 -468 218 -1720 1166 -2523 1302 -1985
1395 -1985 276 -695 -581 597 -1729 1377 -2276 1533 -1700 232 -91 -1103 1288 -1705 1760 -1490
1411 -1490 1321 -924 479 267 -930 1764 -1527 1997 -1186 1699 -137 397 981 -716 1958 -1533
1427 -1533 2181 -741 1432 267 189 1272 -909 2125 -1222 2012 -908 975 516 -571 1472 -1341
1443 -1341 1963 -1367 1672 -859 650 551 -971 1602 -1775 1680 -1492 767 -745 96 371 -1468
1459a468K763l627L818l067J845p21o02J520k151K886l238L054k583J682m51p89
1475a129K078k981L389l248K937k290J416P6j121K167l013L423l140K733j757
1490d60Q62N38j843K740k966K841k598J805q48o4J101k172L051l413L350k447
1506e23J494o57p66K113k838K934l034L001k290J246j30j641K447k810L100l116
1522a470K224j356O00L10j480K226k957L306l078K095j091j49J347k268K650l063
1538b154K950k683J928o10p30K025k565K979k987K772j939J053m36n53J918k667
1554a699K998k936K646j442K59R28j614K349k679K969k450J934j360J31J128k307
1570a145L132l092K991k369J320l22m80J150k010K905l062K646k136J220l61q51
$$ plain form
1459 -1468 1295 -2332 1486 -1581 264 -457 -1059 461 -1690 1196 -2042 1012 -1571 111 -340 -1129
1475 -1129 949 -2032 1357 -1891 1046 -1244 172 248 -873 1294 -1719 1704 -1436 1297 -460
1490 -460 402 940 -903 1837 -1129 1712 -886 919 71 7 1108 -1064 1987 -1426 1924 -523
1506 -523 971 314 -452 1661 -1177 1757 -1277 1724 -566 680 550 -1091 1356 -1454 1646 -1470
1522 -1470 754 -602 -2 308 -1172 1054 -1903 1403 -1675 420 -671 -820 527 -1741 909 -2154
1538 -2154 796 -1887 41 -569 -1299 726 -1839 1140 -1847 925 -1014 39 -397 -950 968 -1699
1554 -1699 1299 -1637 1009 -433 -174 754 -860 1489 -1190 1779 -671 1263 -97 34 1162 -1145
1570 -1145 1987 -1105 1886 -483 837 515 35 1185 -825 2080 -982 1664 -472 748 387 -464
1586d64K036k886L119l096K597j560L96N42j566K310l110K965k635K110r53l55
1602e50J283k298K619k623K603k289J365q12k2J350k512L201l194K499j766Q23
1618c23P0o79J355k144K711k797K491j644N77P44j731K241k312K767k491J833
1634F68j068L74R26j926K332k879L100k198J490q05k31J498k217K603k727K630
1650A570k028J065%r67J806k382K851k840K405j783O71M34j531K228k482K512
1666A529k328J804j069j86Q97j903K519k820K646k201J365m79m38J243j772K391
1682A198k631K437j743N73L0q78J573k089K605l036K794j654P50M47j579K176
1698I73k680K712k327J723j013L18P44j567K338k374K484k201J627m20n66J282
$$ plain form
1586 -464 1572 -1314 1805 -1291 1306 -254 142 684 -882 1428 -1682 1283 -1352 758 -195 -550
1602 -550 733 -1565 1054 -1569 1034 -1255 110 -702 -724 626 -1886 1315 -1879 620 -1146 -323
1618 -323 -253 -932 423 -1721 990 -1807 684 -960 -383 361 -1370 871 -1441 1326 -1165 668
1634 668 -400 -26 900 -1026 1306 -1573 1527 -671 819 14 -217 1281 -936 1667 -1060 1570
1650 1570 -458 607 607 -360 1446 -936 1915 -925 1480 -303 368 802 -729 1499 -983 1529
1666 1529 -799 1005 -64 -250 647 -1256 1263 -1557 1089 -1112 253 -226 -664 579 -1193 1198
1682 1198 -1433 1004 -739 -166 -136 -1014 559 -1530 1075 -1961 833 -821 -71 376 -1203 973
1698 973 -1707 1005 -1322 401 -612 -294 450 -1117 1221 -1153 1331 -870 757 337 -229 1053
1714A053k123K598k542K371j686O74J47q84J839k195K248k132J851j326M56M25
1730G74j478K173k558K662k258J757j209K29Q78j913K349k835K944k337J266l44
1746A00m82J097j900K088k666K722j843Q34L9r18J724k415K489k583J810r98O33
1763b69L97k151K592k209K415k370J803o01q56J474j603K775k671K348j982J301
1779C93m22o76J471j905K543k882K264j499O68M06j456K194k547K985k471J886
1795I52j022Q71q1j175K186k978K892k248J280o16j02M66q69J666j764J670j385
1812b57Q49J07n83N77j547K490k670K103j907J066j97o89J800k515K627k436K262
1829A080j773Q56R4j105K196k825K672k320K010q28l17O08j446K309k914K678
$$ plain form
1714 1053 -1070 1528 -1014 1357 -329 345 492 -392 1447 -748 1500 -632 1219 -107 349 774
1730 774 -704 1469 -1089 1573 -685 1072 -137 92 970 -943 1406 -1429 1515 -822 444 100
1746 100 -382 715 -1185 903 -1763 959 -884 -50 -11 -929 795 -1620 869 -1714 96 -902 -269
1763 -269 128 -2023 569 -1640 775 -1595 208 -393 -1249 225 -1378 1397 -1274 1074 -908 393
1779 393 -29 -705 766 -1139 1404 -1478 786 -713 -45 361 -1095 1099 -1448 1537 -934 952
1795 952 -70 801 720 -455 1731 -1247 1645 -603 677 61 -41 425 -444 1222 -542 1128 -257
1812 -257 592 699 116 693 -854 1636 -1034 1069 -838 228 31 -658 1142 -1373 1254 -1182 1080
1829 1080 -693 163 257 -848 1348 -1477 1195 -1125 885 57 -260 348 -1098 1211 -1703 975
1845I75j575J365r86l24J381k386L489k849J570j566J666q69r65K467k509K234
1861A118j759J783j522O89m01r01K007k455K495j701J613p74m61J419j602J334
1877H82k311K683j750P02L35o97J447k612K576l043K864j903J024N00p24J353
1893A326k206K089k957K696j332J93J92j048K045k377K299k367J712j307M38M94
1909a10j603K414k811L529k960J188n74NJ731k098K006k214K210j890J201P9k51
1926a48J362k645K633j989R78r58J003j08m83J303j726K390k416J267L70r30J164
1943A067j582J930k247J484j125J317p53k98J466j803J717k224K698j631O58o39
1959C5k92J614j871J265j939K784j856O46M03j624K116k231J688j355J221j362
$$ plain form
1845 975 -600 765 -221 -545 836 -1550 1939 -910 660 -906 760 -109 -1074 1393 -1116 1118
1861 1118 -641 1142 -380 309 -92 -993 1014 -1441 1054 -647 966 192 -269 1150 -452 882
1877 882 -1429 1254 -496 206 541 -156 1291 -1321 1255 -1788 1076 -827 197 697 -27 1326
1893 1326 -880 1209 -1748 948 -384 -191 1 -1047 998 -1379 920 -1447 265 -1042 -604 -110
1909 -110 -1713 701 -2110 1419 -1541 -353 -927 -922 809 -1289 717 -1497 713 -1177 24 103 -148
1926 -148 1214 -1431 1202 -787 191 -767 236 128 -355 948 -778 1612 -804 463 833 -97 1067
1943 1067 -515 1415 -832 652 -473 844 91 -207 1259 -544 1173 -1051 1647 16 674 35
1959 35 -257 1357 -514 751 -1188 1596 -260 386 789 -835 1281 -950 738 -617 604 -758
1975g58R69j06j614K682k529J574k337K266j56k49K39k335L748k738J692j157
1991h09K12N48o52J465k488K745k914K797k038J288N6n85K92k352L285j369J356
2008H37j587Q42Q22k038K965l161K556j470O04m25L82J355k162K127k478K133
2024A302j092J144r29l51J394k292K168l282K808j607J642l72r47J986k488K623
2040A707k437K157j442J27R84k301L636l528K076j380Q93o01j47P04k122L344
2056A670k945K058j648M95Q48j386J560k400K826k547K198p86n41N30j310K124
2072G46k716K550j259O28j101P77J315k170K348k649K742j728R95m70j02O92j742
2089a144K598j863K022k778J441L6p29J741k143K401k232J041k73J90l03m07J766
$$ plain form
1975 -758 211 105 -1509 1173 -1356 218 -2119 147 -9 -258 -19 -2354 1394 -1344 348 -809
1991 -809 -597 -49 -701 764 -1724 1021 -1893 904 -1134 154 210 -375 -83 -2435 850 -519 837
2008 837 -750 92 914 -1124 1841 -1320 1236 -234 370 -55 327 1682 -480 1647 -831 1302
2024 1302 210 1354 425 74 1468 -824 1344 -1938 870 -737 905 533 -414 1572 -916 1707
2040 1707 -730 1427 -15 112 1096 -1205 2431 -1097 979 -401 492 -109 -256 448 -1674 1670
2056 1670 -1275 783 -865 -370 478 -908 652 -1748 1078 -1469 729 -57 -598 -68 -1378 746
2072 746 -1970 580 -679 -51 -1152 -375 940 -1230 1118 -1531 1211 -517 478 8 -94 598 -1144
2089 -1144 1454 -409 1613 -1165 276 312 -417 1324 -819 1582 -650 391 118 308 5 -402 1364
2106A364k576K726k732K235j174M99P64j499J944k569J721j521J122r20K75J106
2122G65j390J575k429J840r06Q83m24p14J351k066K239j711J727j408L02M82j008
2139h92J816k412K492k343J762j202M95O77j269J567j881K596k418J671j055j98
2155e94J127j383J865k279K175j375P64mp29J522k040K156k016K012j592N42K60
2172D11q70J630k160K345k151J809r99P6R24j568J878k072K194j908J033l38m24
2189a90J195j471J729k368J914j362Q67j13o27J264j978J956j869J516r95N20
2205a2qp71J612k266K102k002J654o32M0M38j289J770j960K151j969J103j32l87
2223e58J060j558K011k263K103j289O77r7n84J401j891K284k273J843j319N38
$$ plain form
2106 1364 -1212 1514 -1218 1017 -157 342 1106 -393 1551 -1018 703 -818 304 -616 -341 765
2122 765 -625 950 -1479 361 -545 338 -86 -800 551 -1515 724 -987 740 -668 -366 116 -892
2139 -892 924 -1488 1004 -1339 423 -779 -284 393 -876 691 -1190 1406 -1012 659 -396 -594
2155 -594 533 -850 1015 -1264 911 -464 300 296 -433 1089 -951 1205 -811 1201 -391 151 411
2172 411 -459 1171 -989 1356 -795 1014 15 91 1015 -553 1325 -747 1447 -461 572 234 -190
2189 -190 1005 -466 1263 -1105 809 -553 314 201 -426 838 -1140 816 -1053 463 -532 -12
2205 -12 -20 -791 821 -1445 657 -1345 309 -323 -283 155 -1134 636 -1324 827 -1142 -39 -171 -558
2223 -558 502 -1056 955 -1308 795 -494 183 86 -498 903 -988 1296 -977 866 -453 85
2239H5M28r91J465j911K078j776J419p67O7N66j456J951j798J767j756J477l44
2256E04o78J014j418J787j806J461j098N76J13p20J101j621J889k124J638j057
2272d39L41O39j137J326j877J924j655J118r21L35N20j063J710k040J780j466
2288i05Q60m36l5Q93j337J618j805J631j016O54l4q29J407j834K149j758J612
2305H35r19J08L59p58J341j853J950j691J283o44K9P92j406J743j703J753j566
2322c47Q54j77l97P14j277J953j929J676j572R09j42m50R23j374J798j904J269
2339E27o05K11N1r23J535j684J537j702J344p08J77L26j051J521j648J455j269
2356i06R63l46l31Q18j484J907k023J945j671Q91R1p24J422j628J587k040K059
$$ plain form
2239 85 513 -478 987 -924 1154 -622 797 30 97 663 -793 1158 -640 1127 -629 848 504
2256 504 -174 840 -578 1209 -597 864 -234 342 455 -265 836 -785 1104 -1020 618 -439
2272 -439 -98 541 -596 730 -1147 777 -878 240 -681 -346 174 -889 821 -1219 561 -905
2288 -905 -45 -481 -516 377 -960 658 -1147 484 -532 122 88 -741 666 -1168 981 -777 835
2305 835 -84 24 383 -375 966 -887 1063 -628 655 11 40 832 -574 1169 -534 1219 -347
2322 -347 507 330 -67 647 -630 1323 -606 1070 -502 407 265 -185 738 -636 1162 -742 527
2339 527 -78 133 184 -739 796 -888 649 -1053 291 -417 -240 86 -965 556 -1092 363 -906
2356 -906 57 -289 -620 198 -1286 621 -1402 543 -1128 -237 -146 -870 552 -1076 511 -1529 530
2373E30j352J109l02p03Q16r41J368j614J878q91K63L65j164J573j998J614j280
2390g29J169n36j93J095j388K041j979J268j124M19L91j095J501r73J193j373
2406c13J292r54J82J76q63J477j746J865j924J244o22L80O90j206J203j979K086
2423I88j168P09m65j15O46j175J498k053J797j323O02l2l26O71j259J755j933
2440a183J432j048Q88J90q83J294k003J884j653J305m32N7L26j073J572j842J877
2457G08j093O59o1o14J057j307J265j406J402m03K7l22k7P22j233J716j452J122
2475G60j048P62k62m04Q35j286J679j818J334o30L05M43j428J438j399J684j512
2492e47N51J40p8P4p87J505j761J622j559J049O0p28J161j779J754k164K207j071
$$ plain form
2373 530 -822 287 -15 -718 98 -843 525 -1089 789 -102 161 526 -638 935 -1063 551 -729
2390 -729 440 -96 -289 806 -582 1459 -520 748 -376 43 434 -661 840 -133 1060 -313
2406 -313 979 25 207 383 -480 997 -749 1116 -808 436 -186 194 884 -322 881 -1098 988
2423 988 -180 529 64 -51 595 -580 918 -1135 662 -661 -59 -91 -417 254 -1005 750 -1183
2440 -1183 249 -799 89 279 -604 690 -1313 571 -1082 223 -209 -152 174 -899 673 -1169 708
2457 708 -385 274 213 -401 656 -651 614 -792 610 207 234 -88 -115 607 -626 1090 -362 760
2475 760 -288 474 212 -192 643 -643 1036 -782 552 -78 227 670 -758 680 -719 965 -547
2492 -547 4 144 66 140 -647 858 -903 719 -840 209 269 -459 702 -1077 677 -1487 720 -351
2510c51K76L02j025J277j566J908j937J228j04m24L65p89J574j639J218j238R75
2527E0Nm52J167j181Q93j040J165o38R9K42q30R56q53J140j237J287j613J246
2545D06n4m08L08q35J212r65M73o32N60L72p43J339k127K062j059O64n02j6N32
2564E87j644J288p16J098j311O21P8o22J136r65J143j484Q86l76q61J072o15J108
2582D23j010J268j198N63q57L63Q11j145J321j618J593j043M75k51m83Q75r81
2599h94J494j302J347j287Q46m27k58R34j242J637j583J121q24M79L01j49M48
2616F41j379J835j489N46j90J08O1q30J079r75J690q36M12l09k79M15k87N90j618
2635h15J655j315J313m50k39O28j438J303j770J848j204M34L09m99J043q49R10
$$ plain form
2510 -351 -75 227 -798 479 -1087 821 -1116 112 8 -416 -51 -840 734 -905 313 -925 50
2527 50 55 -397 770 -411 482 -558 607 -31 68 310 -520 436 -417 723 -514 773 -840 406
2545 406 352 -56 252 -583 629 -336 137 -495 65 437 -306 1033 -1094 968 -91 573 71 55 587
2564 587 -1057 231 -485 613 -698 -77 1 -621 515 -450 693 -791 95 -281 -1142 -70 -685 423
2582 423 -587 681 -517 46 -811 -448 363 -782 539 -1079 514 -529 -54 -305 -788 87 -894
2599 -894 600 -702 645 -642 204 -223 -481 453 -789 848 -735 386 -438 41 342 193 641
2616 641 -738 1097 -392 154 -36 72 133 -697 382 -593 1097 261 673 364 85 500 213 803 -815
2635 -815 840 -475 838 388 149 777 -661 642 -1128 720 -484 -50 259 -240 803 -46 864
2652H64j856J289p08L71K44m50J063j467J498j409J072r80L24M35p64Q23j271
2669i22J084r99J045o76l62Q13r37J382q48J118j316O50k1p03J464j304J003p25
2687b54M67r71J001M24p39Q61j285J099j109Q99k12o4N56j166J280j156J183j081
2705b67O34j0n21Q37n60R05j511R87o42N53po47O95j473J628j112R76o49Q4L17
2725B17o57J200j471J128j146R76n22j53P54j108J569j875J353r24N00j67j17
2742d43R59j415J743j726J372j027N07K89q27J180j064R70j352R58n37L54N32
2759D73j053J413j241J201j283R12j05l02N49q89R58j210J482r49J29K66o0N48
2777H39j565J186q05J062j173N18M78j07N12j734J526j187O19k71M26K20j065
$$ plain form
2652 864 -992 297 -411 -40 204 -246 817 -650 848 -561 511 -469 -145 290 -474 349 -922
2669 -922 162 -837 208 -468 -830 -17 -954 428 -420 698 -618 32 11 -692 772 -532 471 -254
2687 -254 213 -758 243 667 -72 789 -496 603 -506 393 181 117 673 -493 787 -369 814 -267
2705 -267 367 357 -164 673 113 1018 -493 494 -148 405 398 -249 446 -1027 601 -511 465 -184 -100 217
2725 217 -440 760 -711 417 -729 247 -275 -428 326 -782 787 -1088 265 -659 -159 -326 -443
2742 -443 516 -899 844 -882 490 -537 -30 259 -568 612 -452 518 -834 124 -413 -59 473
2759 473 -580 833 -408 793 -490 422 317 15 564 -325 633 -577 905 -44 85 351 291 839
2777 839 -726 460 -345 717 -456 62 540 433 945 -789 737 -450 169 -102 324 544 -521
2794e21R81r34J404j010K12r0p40J151r43J376j854J116p68P20M48j169O43j267
2812a245K051j881J725j531J192p02l88P38j352J601q82J210p38l18J175j399
2828g44J065q16J509j769J070n21p0Q82j574J535j361J175l81J95l05L0N84r58
2846d54J153q07O51r52Q84k26l65J064j469J320j123R09n15J02L02p71R05j419
2864h11J702j291L78j23j42J090j103R42j254R48r75R25p72N55J31r02R34j592
2882a360J893l03l70Nl43Q50j382J526p63K89L55m34O87j109J283j505J879j421
2900b23O67m13r6O80j461J426j083J755j424Q51o23J52K47j217J384j218J690
2917A094j323Q24m92j32O38j182J293j000Q28n31J77J48p22J235j421J434j377
$$ plain form
2794 -521 460 -474 930 -80 132 42 -698 453 -490 886 -968 148 -620 100 548 -621 22 -1245
2812 -1245 806 -1075 650 -881 311 -391 -779 -41 -1393 208 -674 536 -202 -520 655 -744
2828 -744 321 -495 1014 -755 315 -206 -276 606 -968 567 -794 381 0 195 -110 -80 504 -454
2846 -454 699 -108 543 -409 475 249 -116 948 -521 799 -324 585 70 172 474 -297 608 -811
2864 -811 891 -400 -22 -145 -287 803 -300 642 -612 336 -639 286 -486 69 200 -702 232 -1360
2882 -1360 533 230 -140 -135 -478 372 -1010 516 -247 42 397 -37 650 -459 824 -681 1198 -223
2900 -223 444 31 -65 615 -846 580 -503 1252 -172 679 56 208 455 -762 622 -596 1094
2917 1094 -229 595 103 -29 609 -573 720 -280 548 17 194 342 -380 855 -566 868 -509
2934e09J028m41m25O28p25J116j270J324j301O69k89j42O11j005J386j158Q82
2951C79p00K73Km46J034j284J164j178R80l15l33M32n92J080j430J471j265P52
2969B4p0j03N10q75J077j474J177o36L97K00m44Q99j382J341j176J300j172N91
2987A84l4m59J125j228J442j440Q66m44nL39n46J034j332J026p79P53n54K36K14
3006C98j044J401j318J219j112J003k30l34N28j064R62j182J302r92N14K31n7
3023B25L40j141J137j332J310r97N50R7r41O30m94J216j454J054j080j79J505
3040D46j019P44j128J137n32J01J56n21J261j684J538j389J555j008J03P16n63
3057h7Q70j402J324r55N85j49M27n24j42Q44j730J860j537J078o41lR52j127J202
$$ plain form
2934 -509 519 78 -347 281 -444 672 -598 726 -575 94 -195 -337 274 -731 655 -503 379
2951 379 -321 -48 -46 -492 542 -742 422 -756 224 -91 -424 8 -584 496 -934 537 -728 24
2969 24 -46 -149 361 -514 563 -911 266 -370 27 227 -217 682 -700 641 -535 765 -407 184
2987 184 150 -309 816 -412 1030 -410 456 12 7 346 -200 834 -498 528 -251 502 -52 184 398
3006 398 -646 755 -563 656 -456 547 317 -17 511 -553 409 -773 529 -463 51 282 225
3023 225 565 -576 561 -771 539 -458 92 189 -752 -122 -616 600 -854 200 -880 -1059 446
3040 446 -573 171 -957 180 -352 -251 -95 -616 645 -1039 499 -890 665 -343 -240 476 -87
3057 -87 783 -619 705 -250 335 186 613 89 -53 791 -939 921 -616 462 -179 -182 770 -357 845
3076H45j417J185o17K90l29j86O83r50J268j143J073r27N52l7r76J333j209R78
3094D16n94Q01m50k99l31j12R25j036Q81r65J141m91q4k56M4O83r60R91o50L72
3114B6o45M52O82j139J315j384O64n55L46M69p34Q45q52J447j215M66k61K10l1
3133A06n83J373j556J849j537J117p90J01J47r24J725j865J570r28M19p3L25j38
3151C38o49J796j551M44l85Q0l8m63N12j84K354k719J266m38J58K93j564J869
3169A119k005J235j082J076k66n74N95p11Q72o48R54j140M04P67r43N85m97R48
3187F89j523J157j60K60q7j068J319j168R94j176Q94n24P1N94m02L29j064J034
3205A69j056J055k18p0O71p50Q15j092P11o74P62k68m9O00j053J216j186J148
$$ plain form
3076 845 -572 613 -4 286 -43 -229 454 -496 772 -371 702 -225 327 290 -686 647 -562 416
3094 416 -178 623 173 -126 -457 -569 356 -680 201 -764 377 -114 -198 -454 -410 273 -687 304 -346 26
3114 26 -619 -167 515 -624 691 -693 -29 -584 -238 231 -503 342 -510 937 -278 188 -73 137 106
3133 106 -477 896 -660 1189 -348 769 -21 80 227 -697 1028 -837 733 -195 224 151 476 338
3151 338 -311 1485 -66 378 -7 73 35 -428 84 -100 2254 -465 801 363 521 814 -750 1119
3169 1119 -886 349 -733 343 77 -497 98 -613 259 -389 565 -575 -171 596 -347 238 -259 689
3187 689 -834 323 163 423 336 -732 587 -581 413 -763 131 -393 -322 272 -130 199 -865 169
3205 169 -887 168 -50 -120 551 -199 616 -476 235 -439 323 55 6 606 -447 769 -417 731
3223G31r31M25l8k42O63j221J496j119P52n29QN03o41R68j263R29p41O73k75l54
3243b06M89p98J282j414J070j074O76m6k34M41r00J228j430J327p09o4K01j94
3261c55P75j046J002j051R62m49J33Q8n89R34q50R31j116R53n06l9N64q47R10
3280D04j067J416j187J036o83k8N52r77J305r24P19n76K40j04k96N89q75J124
3298F68j037R20o59J08L66q56J378j500J099p11N87m19j82M74p82J015j007R93
3316D55q32Q20l40k11L79j038J409j145Q97p67N28k08l84O06r85J100q18O55n35
3335d14M17l8m17P68j161J318j243J077l28k11O93j128J083r55R99q06M70j96
3353g2j85N98p30Q64r65J150q86K94J28n11P36p70J062r90P78m80%J83m70Q08
$$ plain form
3223 731 -200 225 187 -55 608 -613 883 -236 516 -13 -5 498 -143 825 -438 491 -250 423 148 -206
3243 -206 283 -515 767 -647 423 -651 25 -21 -255 186 -714 514 -916 411 -298 -362 -161 -355
3261 -355 420 -626 376 -675 287 -162 -29 59 -530 404 -446 485 -631 322 -184 -223 341 -506 404
3280 404 -663 753 -434 602 -81 -109 443 -534 771 -153 566 -10 230 126 -170 419 -456 668
3298 668 -369 551 -108 0 366 -490 888 -612 487 -224 363 -56 -238 236 -546 469 -538 455
3316 455 -377 443 103 -108 271 -767 642 -503 394 -373 155 -53 -437 169 -816 284 -534 121 -414
3335 -414 3 -35 -452 316 -845 473 -770 307 -21 -232 461 -667 416 -539 460 -346 124 -72
3353 -72 -257 341 -389 475 -490 660 -226 68 196 -315 421 -349 713 -277 501 21 21 204 -266 542
3373E42j010R26p10P58n17Q0K29o23Q69r56J035j062Q87m46l90O39n89R03j178
3392f13J092n78J46J46o07Q00j070J113j215J040n29L35o2l61N96o72J007j280
3410g12R09k29j17N91j031P77q11J250j348J012m82j84L56m98N95n52J030p08
3428a52L11j93j76N45j46L81j289J487p82k19O98o79R65j075J137m72L31q85M25
3447B12j19o43R09l53P06r14P54k47q1p42L52J166j509O73q62K024m76j729J099
3466B20m48J169j150N88l77J3J36n28R24j129M75r00J209l05j19M40o80P84q78
3485e56P81q62O18m56M38r1k66J050j362Q35r01N56L40K99O43q75L72q57O19p65
3505d40K87O02o83P12o74P84r38O12o9J31j6o17J258j046N69p83P78J21m90N50
$$ plain form
3373 542 -468 458 -252 506 -11 69 298 -325 544 -412 623 -439 448 2 -388 251 -338 565 -613
3392 -613 479 -99 47 193 -414 386 -684 429 -786 254 -275 60 -2 -363 233 -439 568 -712
3410 -712 197 -32 -149 442 -589 188 -623 627 -721 291 -191 -375 -19 -517 78 -474 556 -152
3428 -152 159 -34 -210 335 189 570 -719 768 -14 -233 465 -214 751 -324 813 341 672 -213 212
3447 212 93 -550 359 6 712 -202 552 305 224 -518 -166 1000 -509 164 -698 1326 850 -879 220
3466 220 -228 941 -209 379 2 15 151 -377 547 -582 -107 -1007 202 -103 -222 218 -462 322 -556
3485 -556 225 -637 -19 -475 -37 -128 -394 656 -706 129 -772 -216 124 423 1066 191 563 -294 325 -440
3505 -440 -153 449 -234 478 -196 588 -350 262 193 324 308 -309 949 -97 472 -311 467 588 98 648
3525F48j483R52m3J00P2m56L00l11Q07p08Q55j022L77k00K79L5m30M94p60J097
3545F03j143R07n63P9K73p36P76q76R98o40K20j1k02O96r72P34o42N81l53J97
3565g4Q8n52R24r37J196j136O62l72KK50m99P95r16J073r11O99k70p9L67m61N03
3586C52o83J036q68L38k2j55L29n16R25r21O60o96K07K14k24L82q89J182j014
3605c63Q68m02q6L31n15O01p76Q68r80R57p84J5N58o84Q32r96R99r50O10k75p7
3626b49M01m28N05o21N70o79L94J49k74L96m64O04j071J239q02J10L01l60K90
3645A1p66J054p75Q47m76j81O43p82J039j174P36l33M64m65L41J22o58Q82p39
3664b10O71n67M01j76k61O89q86P68o71M76k85J09L5j5J80o84R46o70N49o01J49
$$ plain form
3525 648 -835 117 74 174 246 -210 90 -221 586 -122 733 -289 88 -112 167 202 -228 266 -494 603
3545 603 -540 367 -196 -117 156 -580 196 -680 318 -322 -102 -113 -315 381 -591 143 -499 82 -271 -74
3565 -74 14 -538 386 -551 645 -491 171 -201 -199 51 -448 347 -569 504 -407 292 22 -57 310 -151 352
3586 352 -331 705 -163 175 153 -2 327 -189 736 -185 475 -221 -14 200 -24 358 -531 651 -363
3605 -363 505 103 17 348 -167 434 -342 526 -454 503 -281 -266 292 -392 440 -556 443 -507 103 -172 -249
3626 -249 152 -276 229 -392 178 -501 -107 42 -232 164 -300 304 -767 472 -330 -220 81 -279 11
3645 11 -755 299 -476 371 -105 -286 357 -425 614 -560 176 -157 307 -158 183 305 -353 529 -210
3664 -210 461 -106 295 119 -142 547 -339 429 -242 234 -51 58 93 78 258 -426 520 -150 399 -202 -53
3685e3J93l72O47q40P17o24M94M0l86M11o70J110j219J073m50p6J60k99J89m92
3705d47O78o64P29o01K23J31n46Q08q28J046r25M22o58M74j2k00N11n01Q93j122
3725e89O11J73l62M30k62K99p26R47p94M37rn18J296j634J265q02Q01p80K36M23
3745D42o46L12m27P86o21M17l55j94N24j11K84m37K80l12N25l99m1K28m47Q06
3765F14j159R57q45N92j95j25M51o54N10o92Q89o42J25J19k23K24l37P11o95O42
3785B67o27L54p0m93J041q57N68n43L40j95M1O02o98N87p03M67k6o5m18mR28r99
3807e03P29j011Q58K65n50O58p32J016r44O32r03O76J80k24P8n13P08m43O14p03
3827a12O10l62j32K30m15P87q79P50n87J27K11m75L14k64N94m78L11l17K71j57
$$ plain form
3685 -53 140 -232 415 -425 292 -332 162 202 -184 227 -443 667 -552 521 71 -5 155 -144 45 -447
3705 -447 231 -433 296 -305 -82 49 -497 311 -517 529 -396 26 -632 -158 -170 -370 141 -360 533 -589
3725 -589 22 195 -167 263 1 300 -426 521 -273 164 155 -363 933 -701 564 -238 563 -217 19 442
3745 442 -204 108 -319 467 -154 263 -92 -286 238 127 411 -26 254 -58 467 68 27 255 -192 614
3765 614 -545 412 -433 159 -36 -161 290 -364 146 -546 343 -299 -174 -55 -278 -54 -391 320 -375 267
3785 267 -360 -6 -76 -569 472 -385 183 -360 -20 -215 -174 428 -270 317 -386 81 55 -10 -428 -432 496 -503
3807 -503 226 -785 73 338 -212 446 -286 730 -214 418 -485 191 371 147 225 -288 420 -23 591 -112
3827 -112 498 136 4 234 -181 606 -273 477 -110 17 228 -247 67 -197 397 -81 230 -87 184 27
3847B7n26R46o73N23o86O20n63k9N65l73M23p10O90o96N53k02J1L62r92R61p05
3868d74P02n45K95J35l52M85q59Q51n70N16l04N5L06l48M88r81R00k77K43n3q6
3889A27J45m08P94q42M14m89O53n69j97M27j30O81r33P75m28M04m94j84N03o29
3909c80Q51o82O28p48M85m5n40N98o30P32o77L39l02M58J2n40P04o11N80p22N62
3930G2l82l1M61o22R05q64M49j39K49r2m38L63k47N33q95R87n71L37n0n31J046
3951E40r60J019j008Q31n86J90K38n86N63n94P89p23J39K43J19J81n71N82o16
3970b10P99p65L23k4l56M95m33O12p31N13m36N38j92k51L93n11Q12p01M30l85
3990h0qJ37m71P17n75M49o05O39l22J26K17m91N95n17M05l83R9j58mJ28l43P80
$$ plain form
3847 27 -499 447 -226 297 -389 231 -332 -361 204 -169 254 -456 234 -462 91 -111 -100 262 -730 231 -474
3868 -474 228 -317 -22 113 -239 246 -613 238 -332 184 -120 -65 241 -107 381 -600 300 23 266 213 127
3889 127 272 -136 658 -184 230 -259 394 -175 -372 55 -75 606 -327 448 20 424 -70 -254 249 -380
3909 -380 471 -211 417 -331 154 109 -431 167 -463 269 -408 -69 -371 87 99 -441 263 -348 232 -490 72
3930 72 -310 -341 120 -502 403 -461 -12 -151 98 6 -432 -69 -316 217 -678 309 -262 75 25 -506 540
3951 540 -420 599 -409 422 -164 26 264 -322 241 -353 436 -287 -148 95 214 395 -176 406 -210
3970 -210 589 -176 147 123 -233 262 -171 441 -290 223 -213 325 133 -118 275 -236 576 -125 305 -80
3990 -80 -88 49 -422 295 -280 169 -436 203 -119 7 224 -267 328 -189 216 -167 -68 -226 -230 -102 -445 335
4012C35o11L87o7o4O0j86N17o88O25n68N41n08J82K30l27O97j028Q90n49L20j80
4033Hj24M84o45O53m40O23o42L68j18j80N08o56N61n73M24l21P3L91o49M97n36
4054b94L65j59L31j25m4L75n56N63p49M93m66M91k47J35K48p59O39o70N25n35
4074d39L42J33m36P29o74M36o06O02m91K99K5o1J26n51P71n92M06k21N8K99l07
4095a52M12o70O58n61M00J40J92J76o67L28p63J396j094n16Q17P7O03r07M12m08
4115a27J185j380l5N96m09N25l65o1o1P76m98j57n8n97N19k66O12m53N95l99p5
4136a33L63k98M63o82N77n92L70q3oJ17l54O29o68P87p95J75J16k15N99q61Q90
4157C99q24M98j06j68L24j99M16r46N10l48O06k48L8K14k08O19q35N39o00L45
$$ plain form
4012 335 -276 111 44 -20 40 -146 371 -317 308 -260 281 -227 -45 185 -142 555 -473 417 -132 188 8
4033 8 -116 368 -277 376 -64 559 -83 285 167 -13 495 -161 400 -173 251 -70 3 394 -255 242 -294
4054 -294 71 -88 243 118 74 449 -107 456 -293 200 -266 225 -22 113 361 -398 241 -429 96 -439
4074 -439 -97 36 -400 329 -345 91 -515 87 -404 -105 -80 -141 -15 -566 205 -387 19 -202 -144 155 -152
4095 -152 260 -410 248 -313 87 227 419 595 -72 256 -507 889 -205 -721 96 173 776 -131 281 -127
4115 -127 1058 -322 -357 239 -170 355 -10 -71 -132 644 146 -11 -69 -666 -147 -413 199 -254 341 -58 -133
4136 -133 230 -68 395 -287 290 -302 68 -15 -21 96 -258 371 -297 490 -305 -130 -14 -229 370 -491 399
4157 399 -425 73 -33 -201 123 -76 340 -606 -96 -444 162 -86 -48 166 -42 577 -258 281 -319 26
4177B6j23j60O77m15M09p67O26p90O75K08m95J26j71M98k86J22j79m73J357q83
4197a8k15j33J070k6q38P5L64L73j613J235m78M40l97J24J96l37M28o71O31n39
4217c29O37k82r5M59m15K66m02L78m17K67j86R4l2k45R17q11L83n82L55Mk33L52
4239H3k53M24p80P62l80J68K77m64L28l73N82n77M85m41J84K11k42N12r00R93
4259E99p21L25l08N50n5m89N43n52M19m00N02m74J38K83n43N86p05O90o41M17
4279A64J00j71L68o31O46r45Q11j89l1k76j49L55m02O73m21L41l78l04O50k13
4299bP51m84J00k38k96J87M50m82l71P27p22P75o54o0N5k12O52m17N22p88O75
4320A68j98j05K24k90L41n92P71m26L79n56K90K43n36N53n27N20m97L32j71J98
$$ plain form
4177 26 -97 -257 420 5 414 -353 273 -517 158 366 -129 -3 -174 324 38 160 -19 -492 865 -18
4197 -18 -233 -366 704 678 -160 -85 279 652 -961 274 -204 236 -161 -37 159 -178 250 -421 210 -329
4217 -329 308 26 -69 390 -25 241 -161 217 -200 67 -119 -25 -57 -302 615 -196 187 -395 -40 -36 -269 83
4239 83 -170 254 -526 236 -144 24 301 -163 165 -208 374 -203 282 -159 25 236 -6 506 -394 599
4259 599 -122 203 -105 445 390 -99 444 -108 311 -89 413 -61 77 360 -183 403 -302 388 -253 164
4279 164 264 93 461 -170 476 -469 342 153 122 -154 -303 52 -350 323 -98 243 -135 -439 211 -2
4299 -2 749 265 365 127 -169 18 468 -14 -385 342 -380 395 -259 -319 -264 -476 176 -241 281 -507 168
4320 168 -30 -135 89 -201 140 -452 319 -107 272 -284 6 249 -287 266 -261 259 -238 94 -77 121
4340A21j65k57N95n22N25m09L84j15k09K83n94P21j91J36n04K19k1J30J0m80O90
4361C47l93L3K0K65k50k73M13m83N33o24P24m89K3L76k25J92m91M32k04K18j04
4382D0j62N18q62R60n63k5o3K41l00j73P11o12L41m02K47q8J76j01r5N19n53M07
4404A61l68L78K2j40K7j94Q52j168N36l50L85J65m47L72j44K98l88J35k73J74
4424C3P0j60L08j87M0l87N35l65K47K89r16M56l25O16n58M36J46m30M96q79L56
4445a79k43O85j72L10m34k0L31p15N63k80P35j070L40Qj61L99n01P77q64Q40n41
4466a92r9Q35q20J4L69K66o07L90k94k94M29k48P42q75O46l42K33J16l80L20n70
4487c61J114j049L65m47p7O23o80K78J04K85L4k55l38N65J02l21M6j59K32K43
$$ plain form
4340 121 -44 -301 294 -228 297 -112 272 157 -52 231 -363 358 167 303 -201 18 -3 127 137 -343 347
4361 347 -46 -13 7 272 22 -251 162 -321 212 -412 312 -177 -154 222 -3 189 -302 130 -74 144 40
4382 40 -122 396 -466 494 -69 -94 -157 84 -216 -389 322 -290 51 -351 -104 -192 -16 -117 -212 307 -246 161
4404 161 -207 171 193 53 80 -114 738 -430 106 -244 141 306 -141 231 87 385 -3 132 -141 33
4424 33 103 -57 251 64 104 -283 252 -113 134 423 -493 -37 -362 254 -304 132 278 -152 344 -535 -179
4445 -179 -422 263 91 401 -33 -53 278 -437 126 -154 581 -489 -149 -141 -302 97 -404 373 -491 349 -192
4466 -192 -291 544 -276 -262 107 373 -234 156 -138 -432 -3 -251 491 -384 262 -80 153 269 -111 209 -361
4487 -361 753 -296 69 -378 -455 168 -512 -234 -130 155 189 -66 -404 161 263 -58 -12 -171 61 304
4507C04k14n82N78L1n58N26K06p16P22J78j6j130K62J57R22m51r25J190p94P07
4527C97q66O19m57O72o19N93m44j23J00p1L13l21O23n37K03l32J55p8%M73m47
4548a47L70m25L35j78P1J59o25P35m90P39q16K45K2j54O70n32K10l25K15p8K98
4569B99j15k86K24k54N68l67J42l87Q9k9J36K66n76Q05n10j10Q7q1O2L0K49n97
4591c55J67j99M48j52q8J95m75N49m11L88k33L5p7m8K98l96M26m65L09q4j19O31
4613C44n96M10k27O2J1K29m40r1N56p48N43k14K26l40M58k11j36L32m32O90m96
4634g0M29o47K73O1k51M59k42M16o72P01m64Q2ml81N16k56K35j38K5J03r3N9n05
4657c64O61m76L54k54J47J2k94K97k55K35k39K45k40J52N8k27K24k07K67j73K4
$$ plain form
4507 304 90 -492 86 117 -441 85 291 -425 297 475 459 -671 -409 -252 670 219 -706 484 -310 397
4527 397 -469 150 -307 365 -254 339 -105 -228 -128 -199 114 -207 416 -121 82 -250 -95 -173 -173 300 -147
4548 -147 223 -202 133 -45 26 185 -440 295 -195 544 -272 -27 -5 -159 511 -21 189 -136 79 1 299
4569 299 184 -102 122 -132 436 69 211 -176 -87 -116 20 286 -290 515 5 -105 -18 -99 -37 -7 242 -355
4591 -355 -188 -387 61 -91 -179 16 -459 90 -321 67 -166 -131 -208 -256 42 -354 72 -393 -84 -168 -287 344
4613 344 -252 158 -69 -7 4 233 -207 -298 258 -490 53 -161 65 -275 183 -28 -164 168 -264 426 -70
4634 -70 359 -288 -15 46 -205 254 12 428 -244 457 -7 75 71 -310 206 -50 185 47 72 175 82 141 -364
4657 -364 297 -179 175 -79 68 80 -214 83 -172 63 -176 69 -171 -19 39 -188 36 -171 96 -77 -53
4678e3j80L93N6l84M45n14N39l41J7K9j63M02l02K8j73L49l92L61J05m31K66k72
4700b15M77n82N49m05J09L74m24K87m33O36l52o1J93j13J57k54J90K9qk82K00
4721G2j38J87J35m74M98k44K37l75L5K59m83K62j83O38m25l1K15m78M00j25J36
4742A18m48M06k62L77k47j59K98l25M29n03N68m01K67l39J03J04j76N25o36O93
4762C92n74J18K2k81K19k75N44m57L79k53kK07j10K85m60O18k19P5n91J64L93
4783A94l56L16k86K60l2k73L54j29O6l60L93k2O8l88N09l43J62j76N3K15l29K63
4805A59k19J11K0j40K75m31M22l25R4j15R7K35q08O85j64J83k13K11J34j97k6
4826a2j17M56m31J81k14J00K79k77J26k16K49l04K36j16m7N3k38N76j78J80n29
$$ plain form
4678 -53 -233 160 216 -168 277 -237 302 -39 -22 7 -156 246 -56 -28 -201 148 -244 117 222 -209 57 -215
4700 -215 262 -320 229 -176 -67 307 -117 170 -263 373 21 -40 153 40 197 -57 133 162 154 -128 72
4721 72 -66 121 256 -218 280 36 273 -102 -67 192 -291 -29 -212 426 1 -30 185 -293 107 -18 118
4742 118 -330 76 -186 191 -56 -215 83 -242 187 -316 252 -149 118 -221 -118 -14 -190 335 -301 392
4762 392 -182 -64 -42 -323 -104 -379 165 -292 87 -166 -168 39 -71 214 -246 372 153 228 -363 -199 194
4783 194 -162 154 -132 128 96 -177 177 48 114 -246 147 125 193 -195 314 -29 133 -43 10 225 -104 159
4805 159 -60 51 71 -69 206 -225 197 -128 -34 -149 -52 183 -625 60 -104 79 -134 77 211 14 -12
4826 -12 -129 327 -104 77 -137 -37 242 -35 91 -125 124 -180 56 -60 -107 -54 -292 284 106 286 -243
4847b43O49m65%J1j76M92m20N99m63J50k72j33M87n25Q41q38N57l24K39p7m44
4868c55M17k84K62l08N17j33j07L1k39L26m05M05k35M52m82j17N82m10L02l51
4888a32M03m01K96j90m92M75j04L13l02J11q5J92k0j61L60l38K11l69M55l30L23
4909B15p3l11K72k87N40n85J5l9K66P2k88L61l67K35q4m2K07k73M57l66k1L2j91
4932b55L71j18o2m6P8j94M90l83L39j49l06N85m57L32j85L52o59L33R6j50K62
4953B74m01K3kM66j75N4k15R1O2l01L50k54K24m9l43K7J22L22m91L23k49O2O4
4976a6%p6p4K53k86N04n14L73k79K98j47k94M01m79O37l16J17j61j06L80l71L64
4998B08k95L23k17o3j28J63K72l95M57n21M18k55N7j93K40J5j03N37p88N66n54
$$ plain form
4847 -243 406 -59 -59 -48 -224 268 -152 447 -16 134 -138 -271 216 -309 532 -306 251 -73 166 89 -355
4868 -355 62 -222 40 -268 249 116 9 40 -199 127 -278 127 -108 344 -138 -255 327 -83 219 -132
4888 -132 271 -130 166 -24 -516 -41 -145 168 -134 -23 -108 84 64 -97 263 -75 136 -233 222 -108 215
4909 215 142 -169 103 -184 356 -229 -214 -253 13 85 -203 158 -209 26 -58 -100 107 -166 291 -75 -96 -64 -255
4932 -255 116 -2 -64 -110 -32 -226 264 -119 220 71 -235 350 -107 225 40 392 -267 66 162 12 274
4953 274 -127 -104 -106 360 185 239 24 115 177 -124 226 -28 196 147 -196 -169 -47 275 -216 107 -142 -80 -16
4976 -16 -16 -92 -166 87 -199 305 -209 164 -115 183 36 -258 143 -336 301 -15 102 -59 -165 215 -156 208
4998 208 -87 236 19 -44 -172 -9 263 -132 325 -196 222 -33 24 -169 71 86 -17 520 -268 298 -256
5019b56n8L86k5M9l19M56l13m0K36l02N15m05L69o35N88l18N1p9N6K7j32K62j13
5042@J34m92M10k1Kjj99L67k17J03j40j89L77k44J44m77L91j23K89N3j33K9j87
5065a24J70l43M83j69Q0k15r0M96m39K38l31M48l15KJ67k05K43k61K93k85K98
5086A41k27K49M3q9O3n07N60l12L36j98k98M37l31L82l18L88l38J97j64O4J47
5107B25l01K32k59K25k71K33j40j41N34l77J16j72K20j49k6O3j49K74o11N44j73
5128a03J41p4l51N12k34J47j30K74k44J23m0l7Q7l64M72k82L47n09K06m5J32J22
5150A50l73N55p16N10l04K28J43l76L68o74P08m25J68Q2j21K69m06K48k49N91
5170C76l52O2N0k50L49k96L04n10K77J45k96J88n6J27k27L96n61N25k90j35L90
$$ plain form
5019 -256 -314 72 47 96 -223 233 -80 -120 116 -186 329 -76 293 -342 246 -72 -21 -100 -44 -17 -149 113 0
5042 0 134 -358 52 31 33 32 -167 200 -17 86 -54 -243 134 -110 34 -443 -52 -175 114 167 34 63 -124
5065 -124 46 -297 186 17 97 -118 -208 288 -151 87 -244 204 -111 -109 58 -147 96 -165 128 -157 141
5086 141 -86 163 206 117 180 -327 233 -79 257 59 -239 198 -133 249 -69 319 -19 178 14 78 225
5107 225 -76 156 -103 122 -149 84 -56 -197 337 -40 76 -96 124 -25 -51 12 -137 137 -474 70 -103
5128 -103 38 -36 -387 125 -109 38 -92 182 -62 61 21 -16 71 -293 179 -103 244 -265 -59 -104 28 150
5150 150 -223 332 -384 126 -178 50 193 -183 185 -489 219 -206 -38 44 -77 192 -214 34 -215 376
5170 376 24 86 136 -114 235 -61 243 -267 10 155 -141 47 -9 118 -109 287 -274 251 -39 -174 216
5191B16m70L87l25N80n93K53m8q6M8j52L59n25M75Km8Lm4L02m71J67j27K12k22
5214a07j17L90l35M34l03k5j16K54j82J80j1k23N89m91L62l49O1lj92L36l6K31
5236C47k08l6n6M5j01j40K17k65L10j39J23j57J65j63K1K27l91M14l94J95J00
5257A14k41J41r3J52j90K28k35J89J49l7j67l08N05m66L49j55j08M5R3J64l20
5278a91J73k05J88j8j71J70k98N37l99J72j64J92j56q9K50j51M77n22M66l72R0
5299b1r7J77j9m53P16o00L01j63Q6K81l51M69l54J31k82K15n3j39K63k9K77l44
5321A1K82k73J95k03j10L06k39L05m81L35k70Q0O6j51L10l33J11o5K99l72K09
5342A2J1k70J48N9J73l07L50l47Q7K05j71L15m15N31o94M40k92J88Q1k84L54n63
$$ plain form
5191 216 -254 133 -192 388 -205 48 0 -86 -38 -190 169 -356 119 121 73 76 32 334 -137 30 -97 115 -107
5214 -107 -224 166 -169 265 -38 -63 -179 75 -107 73 62 -161 428 -63 299 -50 11 8 -184 152 116 347
5236 347 139 103 47 92 -9 -149 68 -197 113 -26 97 -60 105 -58 -37 190 -201 213 -181 14 114
5257 114 -127 14 -79 73 -117 111 -124 65 214 177 10 -298 207 -259 90 -65 -173 -128 -35 129 -191
5278 -191 -18 -223 -35 -53 -224 -54 -352 185 -214 -42 -206 -14 -170 -259 -9 -160 317 -205 261 -111 -21
5299 -21 -118 59 40 -413 303 -297 4 -159 -73 208 -143 326 -28 103 -179 36 -17 -156 107 78 355 11
5321 11 293 20 215 12 -98 208 -31 274 -207 128 -142 -62 4 -147 163 -170 -59 -124 175 -197 12
5342 12 23 -247 -99 -40 133 -174 176 -171 -84 121 -50 265 -150 381 -313 127 -165 23 104 -180 174 -389
5364c89M97k81K67k84K97J73n68M51l74L53k12J7J88k98L00j68J40q3J11j21N5
5385G1K78m02J82l14J37K9J72j49j10L99l24L41p0m64J56L19o1r8j5j40K88k98
5407g3M13m75L28j02j41L78m42L55m74J86k6J98n6j52K6m0K25m01K82J95j99R0
5429I5l15N71n75MJ30R0O6j05K29n70M62o43O88k91L79j70r8L24n43K03l07L78
5451Bj16J51Q4j94K99n25L67j52Q8O4q5K94k55k7N9LJ07r0l6m8J75m72N30l47
5475a24M37m17J57J97k66m9RK52l92M51k14l0Q3Qq7j70K87k25Rj32J23J53l26
5498b66L64m93N58l33Q8j43K00J08j14L14l74P0J8o8r0J61J83l94K42l95M60l0
5520F6j9j26J47K01l23K09j92J67j92r1K29l25L16j42J96j20J32J28j92p2k55
$$ plain form
5364 -389 108 -173 94 -190 107 280 -288 163 -211 142 -70 -53 135 -163 137 -31 109 26 137 16 71
5385 71 349 -53 129 -185 -48 -19 153 4 -106 293 -31 310 240 -224 -68 251 190 92 77 -63 225 -73
5407 -73 340 -135 193 91 -50 328 -114 241 -233 -47 -73 125 69 -83 -57 -97 128 -273 9 204 5 95
5429 95 -220 351 -224 -220 -90 0 66 -39 190 -380 82 -561 127 -164 215 45 -53 271 -272 -69 -376 2
5451 2 -114 37 121 -73 226 -299 68 -84 4 68 -17 277 22 -5 54 57 164 74 38 -10 165 -307 223 -124
5475 -124 313 -104 53 250 -16 -65 -56 196 -196 255 41 11 94 102 15 -155 132 -93 -84 -216 -93 60 -266
5498 -266 98 -395 163 -170 -82 -225 -25 83 -31 283 -91 -21 -3 -71 -161 0 183 -211 31 -364 96 66
5520 66 47 -79 68 269 -54 155 -37 130 -62 -153 76 -249 67 -75 121 1 133 261 69 -3 -258
5541b58M04k26J56O2Lj53nK21j51N8j71K13l04J35K4j7N0j60L18k88K30j58J01
5564H4J06m35N30l04L40n94M29k09j27K53r5J47l87L87k24n1K88k79J69P9n7l34
5586b84M03l38K98O1k12M38n95K42m23M91O4j23J47n58K40J52K49l97L69k13O8
5607G9O2m23N64l40L21j95Q4J16k88L56m17M17n30N25l86K1J16j46J91m35N45
5628B37j79J35j73j13L93l17K64m08L88l71K37L0j05K20l66J75j4J2k17K66K4
5649A18q7J84m05K06r4k7j36L69k48j19M03n09M41k22K31j95o5J36J03j64M4l1
5671f7r5L15r2l37K94j04K20k37J37J9J90l14J9L57m64N10m63K49o9n4j12J66
5693F8J25k70M29m08L0L39j75k6k36J46j64N03l67J99q9j17m0J4n2m13O59j34
$$ plain form
5541 -258 146 -80 76 138 141 -12 -17 204 53 111 -60 153 -151 -16 8 -9 41 -119 199 -89 141 -17 84
5564 84 190 -245 285 -19 321 -273 156 -53 -180 73 -22 125 -262 125 -99 -150 138 -141 28 107 50 -284
5586 -284 119 -219 79 140 -72 366 -229 13 -410 81 145 22 169 -389 -149 3 252 -145 224 11 79
5607 79 141 -282 282 -58 263 68 152 268 -20 336 -81 336 -194 331 -55 -34 82 -64 127 -308 237
5628 237 58 193 20 -93 300 -17 247 -161 227 -144 93 123 18 238 -128 47 33 45 -172 94 118
5649 118 31 215 -190 16 -78 -105 -241 128 -120 -239 164 -345 96 -126 105 -90 -155 -19 84 -80 -36 -67
5671 -67 -162 153 61 -276 18 -86 134 -103 34 53 243 -71 -52 305 -159 351 -112 137 68 14 -98 68
5693 68 193 -77 352 -56 -26 313 138 112 -124 22 -142 361 -6 193 104 -13 -53 -39 -91 -504 155 21
5715B1J00L67q77M37J38J28m92j24J40l2J10q7N69j243Q89K45n29J02k42L89k65
5736b56M47k98l02K16J32m57M50M12n55K93k86K25j72J10r0J69J91m39K92l58
5756b76Q89n49K35l82n17P05m00J24L95L38o89M20j84L44j102J132n97J39L90
5775D15k8q18J178j103N75l78L26k23K88m46K10J75k71K50j32K39l66K04R1l39
5795a53J60j98L53k81N6J61j84L51n03J43J32k1J6J74j89%K39k96M5j46L68l81
5817a54M0K61m18K05JJ10k57M35m17J58P0m7J65k09L62k51k52N2J67J81l75O6
5839a07j32N13l26J89k41j33N31l34R5j43L31n4k02N0j36R1j6q2o1L31k98K78
5861A44J59k78k4j67K20n8M3qJ53m18K67L15p26K93P3j10J17j62K74k53j88PK57
$$ plain form
5715 21 121 488 -389 48 186 314 -178 -302 -162 -194 -84 -171 398 -845 44 289 -240 -138 -380 9 -256
5736 -256 191 -107 -409 -193 -61 -518 -68 344 -211 82 -204 21 -151 -41 -131 38 229 -210 82 -276
5756 -276 613 64 299 -83 -600 105 -295 -171 224 562 -127 293 109 453 -649 483 -114 25 415
5775 415 387 -431 747 -356 219 -159 167 -56 232 -214 -4 171 -100 150 18 257 -109 95 186 -153
5795 -153 7 -191 162 -119 -63 98 -86 265 -238 -95 37 16 32 206 17 17 256 -40 5 -141 227 -154
5817 -154 -114 147 -271 -66 -65 45 -212 223 -194 -36 34 -13 152 -57 305 54 -198 -146 21 202 -173 -107
5839 -107 -239 274 -52 137 -104 -237 294 -40 55 -88 243 189 -13 37 -99 -8 -24 -106 -167 164 -134 144
5861 144 303 25 1 -166 54 -4 39 31 184 -234 33 348 -378 -85 -12 -122 -5 -167 107 -146 -334 -327 -70
5884g0J43j09M9j49J31L4J0m3p4J16n5k37J61K87k60K34l46K13RJ29J1n22O23
5907B85l60L12l57O3J26k60J61q0J55l05M53n48K51R7r2L2o3K02l17L58N6j15
5929E4J24j71J50l97L60j17m0J33k0j22k94N92l39K50m25J54Jl3q6m16R47n83
5951b78R93l60p48O68J89n04J40k90l49P59l02N14q36O58J11o29O01m06J78P8
5971A87k02K91p03M78k10M16m25L48k75M80k08l41n0K18N54m19k63K00M99o14
5991c9j96K70n12P88k04L5m66M27K46q07L96j86N20k53k11K21k55M60k15J85k78
6012g4n3J41J30R2k83J82k21J10Lj14o8J99J34j56K21m47L34k34J68q7J3k4j78
6035b12L88l03MJ41k8K95k59M8k48J57J71j38k65K67l8J99N9k86J40l0m6KJ01
$$ plain form
5884 -70 73 -36 13 -136 -5 29 39 -4 -78 38 -17 -254 -93 194 -66 168 -178 35 44 173 184 -338 285
5907 285 -75 237 -120 -57 69 -191 -30 -110 45 -260 193 -355 -104 -7 -99 -67 -130 72 -245 113 169 54
5929 54 178 7 157 -240 120 3 -37 96 76 -46 -340 252 -87 163 -262 -108 -107 -140 -226 -642 305 -278
5951 -278 715 355 -393 275 464 -40 100 -190 -539 220 -82 432 -404 254 365 -264 337 -69 109 187
5971 187 -15 276 -427 51 -159 257 -168 180 -95 385 177 -164 -214 4 558 139 -124 76 575 -39
5991 -39 -235 35 -477 311 107 142 -324 103 349 -458 -62 -248 272 19 -192 29 -226 234 19 204 -74
6012 -74 -127 14 144 236 -47 135 -86 24 27 -87 -155 44 178 22 243 -204 130 -104 64 -23 -10 -34 -212
6035 -212 176 -127 -123 18 -10 285 26 74 -174 -17 154 16 -249 18 -20 179 238 -48 92 62 16 18 119
6058A19k79P8N03m78J04lK1j67P5J42j05J10j30J61o2j50J61j46K69k21J58k44
6080h4N6J54r7L3k12K40k61L02p2k30K45q1J03k41K00k24L06j37p9K12l28M71
6102B76m72L66k48J85r6Mm9k5j1m7J20m3Q8j33J0qj05oj18L25k46J34J86j01r5
6127a09QK88j59J83l73J35J06j06K18J00Jn39K80j28k0K67k74M50o07L67n26M42
6149DK8K9J11k44J83k79M55j65p8j81J8L69m08L1L8k8n8O7L4PJ50l90K62P2j14
6174h7lJ92r5j30K73j38P7j06Q5k83R0J67k95M53j38j59J15m2l8j6j55L5L51M0
6198A93J29j33k07P2k19K45l10N08l28J83l89L99j29j84N30m25K48k20J24k32
6218a45L40j85p2J80l38L89k60L21L9j16k10O0K34k91J11j14J79j4j38J47k94
$$ plain form
6058 119 -160 -82 421 -57 47 44 65 -102 -27 115 10 120 -10 151 89 -61 100 -46 223 2 160 -84
6080 -84 -28 126 29 62 -150 90 -171 131 59 -171 74 -7 96 -145 55 -169 137 0 -79 133 -195 276
6102 276 -196 170 -78 107 11 15 -34 -59 -70 -117 3 -40 48 -85 -75 -83 -188 -194 -312 13 -233 -99 87 -14 -109
6127 -109 -101 187 28 211 -162 -27 79 -27 191 291 292 -247 33 -95 -115 152 -122 328 -279 88 -438 4
6149 4 32 61 172 -72 111 -168 287 122 44 -137 -119 250 -158 -127 -89 -117 -175 -108 -74 -67 83 -307 -45 27 -87
6174 -87 -90 102 7 -123 150 12 89 -17 68 -215 -125 42 -253 200 62 -97 18 -24 -62 -78 -233 -198 153 193
6198 193 322 189 -18 54 -165 80 -230 278 -50 133 -256 143 14 -170 360 -65 183 -37 87 -145
6218 -145 195 10 -62 118 -220 169 -91 230 269 153 -57 3 237 -54 57 -57 122 108 -30 117 -177
6239a77M43k77l3k3J06j24LK20l81N22k92r7J04N5Q4l56L23k27J61k2L4k29n7
6262b40J48N3J63j62J98k90m5K57l13K79j22L4K54pl01P4j7J90k59K8L85j57j36
6285A4%L5O1l85K58K91j59l38L40k06L0K86m60N83n65M42m23K54K0r3J30o0J1
6308F6j32Q6k15Q2o6K67K4l68K37k26K50L0P8l0j99k2kK25j44J94N5l40J86j36
6332a00J11l58O43k95n1J07k09L90k93J25k93N24l63L2Q2l87N59k58m9O9N0M4
6354H0l29N59k02q1m2J90m82J92J94k83N13l73Q6P7R0n9j41rQO9j99K69m71N97
6378B53l60J44j74Q0J18k36L10j55K69k95O8J41j77J13k6J08j96J98l93J04K25
6399A19j42J58l70J25J01k50M28k55K08l33M05k12k9m3J62r8r4K64j19L5j94J77
$$ plain form
6239 -177 266 -11 -44 -67 39 -85 -82 138 -243 279 -13 -110 -6 49 133 -223 100 -127 34 12 46 -183 -240
6262 -240 -92 -39 124 -38 160 -130 -175 82 -231 48 -74 -40 214 207 -94 -20 -37 153 -106 -78 307 150 14
6285 14 14 49 110 -275 -17 274 115 -223 117 -89 -59 227 -233 350 -215 227 -196 58 78 -15 115 55 66
6308 66 -66 20 -195 -113 -179 88 112 -256 -19 -245 5 35 113 83 -116 -138 -140 85 -59 135 190 -150 36 -100
6332 -100 11 -347 296 1 -50 57 -152 238 -55 70 -223 301 -62 -30 52 -335 224 -34 -83 -14 36 80
6354 80 -249 310 108 27 -15 175 -307 -115 79 -204 309 -64 22 99 189 130 -11 -20 -12 57 -142 127 -344 253
6378 253 -107 37 -137 -57 61 -175 135 -20 249 -46 22 163 -14 99 73 181 -15 183 -210 -106 119
6399 119 -23 135 -235 -110 -9 -259 169 -86 122 -211 194 -18 -47 -90 72 -26 -120 144 25 60 -134 43
6421D3j76P4K25m40L53k75M46m58M18k05J68j18J76J66l63N0j08J51l4k75N95
6442D13l55J1J47k59m7j82N83m60J69p4J48j47K98q1k19J05j48K57p8j20k3qR5
6465B5M4J07Kj84m6K13l5k88L43p7m8j64J30l29L51l9j05J15l21N30l15K60j19
6488E0k77K25j57L95j49M3m60K51Q7k06K90K5j70j8M12l40K21j96n1J06j17L07
6510B71k20j96J77Qm4r6K72j39rp2J48K18k73m5j57O8K5M13m85J48j6K09j64O2
6534A03n6j20K87m47J5M91m11J56k8M9k99K58k32L61l16J55L05n16L05L8O1j35
6556B4oR7j03j2K07o1n65M83M5j36J29j10l6R8r0j61L44q6k03K83j87K14k17q4
6580a33J13K4J34j25j5j0J72k03J05r4j30K74K65l21j26K21n43P19k16l1k36Q9
$$ plain form
6421 43 -133 -59 166 -274 79 -196 250 -208 210 5 173 55 231 397 34 84 -24 127 93 -182 413
6442 413 58 69 216 -43 -90 -272 311 -149 20 -54 94 -53 245 164 -55 50 -98 159 81 -39 -62 -70 25
6465 25 69 176 178 -6 -52 161 126 -162 181 104 56 -108 22 -307 44 5 -100 15 -306 224 -91 169 50
6488 50 -227 -2 -159 236 87 130 -330 -79 8 -198 92 117 -53 -71 341 1 222 26 -25 81 -36 271
6510 271 51 -145 32 40 -4 -100 172 33 24 -48 100 318 45 0 -157 -89 -64 349 -136 12 -4 205 41 103
6534 103 47 -73 214 -233 -218 273 -138 18 -10 39 -260 -2 -234 127 -189 -34 271 -245 60 98 159 24
6556 24 18 115 12 0 207 146 -419 64 109 -27 102 -8 -44 54 -36 -197 147 61 -142 141 -46 168 -49 -133
6580 -133 -20 4 138 13 -2 -12 160 -43 62 -32 -162 112 377 56 -70 151 -392 327 111 80 -156 -67
6602f7K29m11M77k32m8J48k07K0n6J05r2K79l5P2j58J73n5q2q5R3j28j92J90L4
6626b8J25j99M0K77l47K88qL3k04j70J41k43L82j43o5J81k61K72O0n0q0j35Q3
6649e1J31l69L39q1p5n4O4K23j65J20M3k65J75j79J76Rk3j19L88k64j87K58k53
6672a59K15K13k1k53p0K09k90Q7J92k4j71R9p0L21m88j02L49j35L41k15P7P7k56
6695g4j2k1J49j53J61k6k20L03j50O7n8J23j68Q7L0r5j08J57J98l03N6k8K06k55
6719a34J98J21r0j96j7K27j53K30k68K25jl3j80N8J88j15j98J26j84J58L8K10
6741B10j73k4lo7J02p1K8l48M49j47J08J5N9k31Q1K61N1k59k87J89O4J0m5J36
6765A08o4k25J05N4p0O0J47j85o0n5J23J4K62j87R6k17J48k65L60k63Q4P8k03
$$ plain form
6602 -67 162 -249 228 -4 -52 96 -111 -91 -147 -42 -134 145 110 182 24 197 142 60 -25 68 -60 -252 -62 -28
6626 -28 97 -102 -62 215 -132 156 148 181 -23 -193 -52 -295 87 -56 -121 60 -201 71 131 81 1 -134 -51
6649 -51 80 -289 50 -31 -106 -160 -96 127 -38 82 125 -140 35 -144 32 41 18 -101 287 23 -164 94 -159
6672 -159 56 269 248 -5 -75 134 -156 -69 123 99 -72 27 -43 278 -210 -312 37 -98 243 28 105 182 -74
6695 -74 -86 -107 42 -111 50 24 -196 107 -43 24 -34 89 -79 8 38 -57 -165 -8 190 -113 -57 -85 121 -134
6719 -134 64 185 95 -101 -118 109 -44 186 -82 143 142 109 -71 -13 175 60 -138 -12 -196 -38 0 210
6741 210 37 13 10 -57 45 -26 2 -346 103 -44 64 79 138 -93 -12 249 300 41 -246 -57 7 17 -28 108
6765 108 44 -181 -76 -22 -92 -32 115 -70 -130 -185 -62 -48 214 27 123 -94 54 -211 149 -114 -30 48 -155
6788a55K79j35L18m02L45l68J35lR8j18l90N96k58R0M9J6k10J84n3j56J86q2j53
6811a87K64j00l7N6K26j79p3K8j74j0J84P0j68L91k74p1J43j06o2K53q9k73J59
6834b9o6M7J70j94K88j33J66m24M63l34k9M9j54J15n8K46j95J8r2M4L25j90K07
6857B40k72PN5n9n7J06J4m09M28j57J45R3p9j00O5k17J18j5L9K21k66M34k38k9
6881F7j07J02Q6j67K7j50K34q3l9j2J12J40j27n4Q4l27l7L73j75J28N0k34j4l8
6905a61K56j16L4l0N2J19j57q2M6q7P6k16J85n7J7m1M0J62k50J67k08J55M3K4
6929b9K19J18k22k11K63j72j07J30K34j87m4J19l09N9J78k7j66K22P4q9O3jk43
6952a28J45r0L28l17lo9J67J17j88K01j51j37L16l79K48n2j02M1q4K18l2j79M15
$$ plain form
6788 -155 124 -11 307 -95 250 -118 17 14 112 -6 -396 200 -58 32 81 97 -113 71 18 -138 48 -34 -187
6811 -187 77 -23 -60 -4 222 43 -30 -2 -176 -186 -2 68 -100 291 17 -54 89 -17 -79 174 85 -188 -29
6834 -29 -95 -48 122 -72 216 83 249 -175 288 -46 -75 -26 -180 -65 -123 123 -72 -54 -146 -102 223 33 240
6857 240 -32 -25 30 -29 -86 20 34 -375 53 -104 41 134 55 -45 20 -197 -79 -94 -55 166 -100 334 96 67
6881 67 -40 62 148 -19 8 -142 92 9 -30 -42 70 210 83 29 113 -214 -251 122 -53 75 125 -109 -123 -161
6905 -161 95 -21 13 -17 35 154 -3 -85 -39 -126 -50 -266 -81 -138 -121 -162 -122 40 -210 -43 -251 -96 -53 -29
6929 -29 190 308 86 -125 138 -34 -141 -11 223 36 -8 111 -198 -139 39 12 -154 68 142 53 116 115 -128
6952 -128 17 -73 255 -62 -65 -134 33 150 -38 163 12 -125 191 -188 60 8 -94 -53 -137 81 49 -130 285
6975B85l29K37k07J33ql02P2O4J8J20L7j74J27j75L54j23m1%k83L01n2K23k75
6998BQ5k01L59k64j52L99j94R3r3N6k77J81K0r4J88l94L28k06j0j29L71j92J23
7021ar3K64j6l36N5n6P2K96l67J46j20K66PO3k29q7L92n37L29p4J68m66K21L04
7045B01j41q9N4M5J60k96P2j91K24K2O5k44L28l12J44Kk32K20K8j10K21J4j90
7068ej74M00P7k80L09k57L41k24l01M47K94n45J35k16K19n85Q5L59j26m9R3N54
7090E51p77M1k37M82K97l5q61O33M60m54k52N65n50M80p40P2m16L38j02P75o3
7111B07j10l42l37R48n35q59Q27M95m18L52p7o13N3P05k71n3j06J5J98K63m31
7132h9L79n28L12P1k67M1Q3l6j30K92k73P2N8k7K35k22K71J8l59l3J63j09K20
$$ plain form
6975 285 -44 193 -14 119 111 -191 -119 -55 -37 83 120 -54 73 -102 252 129 88 88 -195 106 54 277 2
6998 2 87 -114 245 -19 -171 228 34 127 34 90 -187 -6 14 -80 108 -286 42 -164 -174 -303 68 -124 -1
7021 -1 -94 170 154 -182 -127 -183 -111 185 -182 -36 -156 110 117 180 -49 -136 256 -281 48 -26 142 -324 -103 201
7045 201 60 -29 25 70 230 -66 6 -185 39 61 126 -118 210 -102 42 44 -188 32 60 -50 171 185 -5
7068 -5 -179 221 298 18 327 70 411 187 -114 333 627 82 217 1 220 -365 -280 79 -47 -96 -3 551
7090 551 -226 -185 -422 60 357 322 -539 94 554 100 -152 413 -137 343 -397 -325 -741 -403 -505 270 207
7111 207 97 -245 -582 366 -169 -1028 -201 294 -124 228 151 -462 -409 296 25 -28 -134 -119 79 342 -89
7132 -89 290 -238 74 145 -122 -81 2 -34 -164 128 -145 -73 -15 -42 193 -29 242 260 -99 -132 31 -78 142
7155A42k72L00J96o01L75K44m33P3n31Q2K49j43M31j99M9J44j12J73N3j22l5j37
7177g4L5K7k37K53L66j38o16K80R2k25K51j69N9RM87n38Q2o5J10l17N68q0m23
7200b63R7M74o9p8n51N70j23J20k35O69l08m42k96j51n73R61J102O9j054j097
7220a178J219k76R47o33j14J36m53Q3J13ON36j211J074m17M68m84L72p58M98J93
7240A21j15k37k20k27m37P05L15J95J02n55M27N4J40j25p37P06n6K03o26Q60p41
7261b48Q59j96o04L83l46k44P87n5m25k69M5N30k77J27M57m58J18k23j85O54n25
7282i5r6M58k66k10N40l81J50J64m33r3MP18p41J1J9R3K81p49L84P8L33N5l38
7305a14K90ll87K60k32K76j53O9o3J52l43J86J20j11j28J67r1J4J14l9Q8J67m52
$$ plain form
7155 142 -130 170 366 -235 140 384 -49 24 -507 -425 -176 -319 112 -87 -38 106 -6 167 220 98 63 -74
7177 -74 -39 -12 -249 4 370 232 -384 -104 -12 -237 14 -155 -96 -87 400 -138 -56 -121 -11 -328 240 160 -263
7200 -263 -166 308 239 161 -390 180 57 177 -58 611 303 -139 -435 -586 -1159 -198 904 973 -81 -1178
7220 -1178 41 -235 712 79 -35 101 -352 -269 -156 -150 386 -825 249 -168 300 -184 188 -570 -72 121
7240 121 6 -231 -451 -678 -1115 -410 -95 100 202 -353 74 128 268 143 -594 112 56 259 -367 493 -248
7261 -248 611 415 -189 194 -152 -396 391 336 -89 -358 -313 217 -60 67 524 66 184 -39 -224 430 -95
7282 -95 -191 267 1 -209 331 -50 100 264 -169 -262 -258 460 -281 -270 -251 -158 123 -626 -242 -164 169 224 -114
7305 -114 176 173 -214 46 -186 90 -63 6 -57 95 -248 -62 58 -53 -181 -14 -105 -91 23 -16 72 239 -213
7328b13J62M4k1J6K77j82N0l6J80l47J43l46M44j80p4K84m52KM40k37k9J08k72
7351b39K68N2l2l3K51m28L26j20ml5K7k17K48m4J25J62l25K1j59L98j56mj25J6
7375b7J39m3J53l44J50k78L27k82J05Rj18K85j78M9J43q4j70R1J60k16K6J82J1
7398I0N5l20K67k51J28K7K22l31K08K35k39j33L0K76k91Jj10N8K3L15k18J43l7
7421A48l44L31o7j08J78j15K92l06L4M1q0j45R0J96j67r0J81o5p0J78j21j29Q7
7444e1r0Q7J70p9J49j57MQ9l07J40k62K9M96l92K05J06k12j4q1J09lNJ53k06J95
7469H3l37M02k53L5K78j42k43o6M79k00j02K19j94M3k06J97J51k33J11K25k62
7490a5K56l33J42q7k04M78l95J75qj56L6K95l02J8K4J82N3l40P8K75j98K38l72
$$ plain form
7328 -213 -51 -7 -28 -12 265 83 133 97 277 -70 73 -273 171 -9 -83 201 -251 -249 191 -46 -75 33 -239
7351 -239 29 81 49 16 267 -161 165 45 41 6 33 -184 64 20 145 307 -18 3 -156 242 86 82 -43 -27
7375 -27 112 69 222 -122 28 -250 77 -205 -100 -91 -209 76 -102 -53 90 6 -164 -73 87 -129 -103 79 90
7398 90 145 -175 92 -159 -31 -4 218 -113 95 330 91 -42 -12 264 -27 -26 -136 -78 -55 260 42 185 148
7421 148 -196 135 68 -40 138 23 315 9 43 84 4 -141 -51 145 -22 -112 69 4 -66 112 -9 -138 -51
7444 -51 -141 -54 116 37 186 29 33 122 -185 -45 -307 -278 218 -174 31 137 -75 -89 -170 -61 -64 -59 94 -112 83
7469 83 -254 148 -105 -70 208 66 -177 -243 236 36 -66 153 -41 2 -204 -7 144 -89 22 247 -15
7490 -15 241 -92 50 -37 -241 237 -158 17 9 -147 -111 184 -118 -100 -76 106 159 -181 -103 172 -26 212 -160
7513a60M0R3j35J96P5o7k2Q0k22K43JL8k28j0J06j21l7K35j3J2K4k27J38K7m66
7538d00N58k63k7J7O4l3L08j78j06J38j94L9l7K56j5k72J80j11J22J8j07J50j43
7561c6L15k92Q4k25L11j70l4j72R0R7j20J89j39J8L0p5j64K83J37r7JLk34J11
7585h9nK41k24J90j45j2K8j08MJ03n5j76N60l42k03K45J44l9%j48j06K19p6K65
7609B71l23J64l0K4O0k66M04l06M9j3J22k44K00j03K4L4k30K63k18M7P2l2n7j29
7633b17K97j31j24M44m75J91O7J0k42J61j07J27M15l27n8j23J91Rk24J54R6l18
7655a84N8Q9K9kJ27k27J87m4j77J80J93k70P5nR6L1k6j16l00L17N9k20J81j10
7679e9J25j25K21k23l7q6K41j11J63l37K21p3p5K5J59k85L9K04J72M2q4n1P7k62
$$ plain form
7513 -160 -120 -27 -162 34 109 42 20 100 -122 121 122 160 -68 -78 28 -93 -130 105 92 104 128 -99 39 66 -400
7538 -400 158 -105 -132 -115 -51 -84 224 46 -60 78 -116 -77 -114 142 127 -145 35 -76 46 64 -43 107 -36
7561 -36 279 -13 71 -154 157 -13 -47 -219 -129 -32 -152 37 -102 -84 -54 -129 -293 -10 127 30 31 34 -200 -89
7585 -89 -94 147 -77 113 -32 -44 -16 -124 -120 -17 -72 -248 312 -30 -233 12 156 117 117 -31 -137 82 6 271
7609 271 -52 112 82 106 166 -100 304 -2 47 34 156 -88 112 9 33 67 -163 100 -118 -71 1 -31 -88 -217
7633 -217 80 -51 -175 269 -206 -15 52 62 -180 -19 -126 1 416 89 31 -92 99 108 -116 38 134 -184
7655 -184 -126 -37 -8 -10 117 -110 77 33 -144 36 229 -41 34 29 125 156 130 14 -286 31 90 -130 51 -59
7679 -59 66 -59 162 -61 -98 -184 57 -54 109 -228 -7 -80 -155 -130 29 -256 -217 -13 159 201 117 66 143 -119
7703a19M93k25k40K15m09K29q5K97O9k1k00l46L54n9J12k58K87Nm5L1j13R3p8
7726a3p0R1J81j23j40L58j72q0J0J0j36l0o7M4R1Q7j62n2P6K02l79K16j4N0J44
7751A22j30J1j24j33P65m03o2k37M18r1j06K44k24l62J119j280M81N23l38k1m02
7772b30J26k21k72M80K30j34K57j14l50J31m80O72o5j70K10l7J45l61N00j86n1
7793H0k85L79j52R6l15J62K09j93M92j87q4l3l11M19J97q00K20Q51k92r90j48
7814f85P38j36j25J63Q1J20p20r4J069o85J72L10q60R35k0r22P88n36o15J110
7834H8L81k43k02K51j55l66o3L99r0J50O6Kq2k68rK20o9RN0j41K24l63K29K28
7858B46k48N8k36O9J58K40k16J08j37Q4k54J13k24O07j69L59J69n21j74k5p6j23
$$ plain form
7703 -119 374 149 -91 124 -285 -56 -141 156 225 204 4 -342 12 -47 65 -193 94 99 54 85 -28 65 -13
7726 -13 -83 8 189 66 -74 284 112 32 42 52 -84 -114 -181 -137 -46 41 -121 -173 -97 105 -274 -58 -72 -22 122
7751 122 -8 3 -121 -254 511 108 46 -191 227 136 30 274 50 -312 807 -473 8 531 193 172 -230
7772 -230 -104 -325 -597 -117 113 -21 236 122 -228 -97 -577 95 30 -140 70 33 178 -183 317 131 80
7793 80 -205 174 22 118 -197 -35 174 -19 473 286 202 169 -142 277 474 -326 -106 745 453 -537 -685
7814 -685 53 -83 -208 -45 36 156 -564 -658 411 -274 -102 208 -652 283 263 -659 129 -407 -1022 88
7834 88 469 226 24 275 120 -246 -309 90 0 150 216 218 136 -132 -141 79 10 19 69 -72 152 -211 18 246
7858 246 -2 56 -180 -111 47 287 71 179 42 126 -128 -15 -239 368 199 558 727 206 32 7 -69 -192
7880a92L21qn4oq0J69j53K5J63k01l08R7L46q7l34J87j37j8L77J65j20j77o2k93
7904c80L54Q3L3Q43N00j022L20L83j999J736q72o61N20P94K01q89k4j35R9P79
7924F63q83n08N81l55L26l5M33j162M09L22M04l70K32M57l26j25LL59J12n31J37
7945A43j04m44J76J81k13K47k7M11l43r4J52k22M16l49J40m4p0O9n9J97j71k03
7967b11K25O1J19j87J50Nj72P5k33M6J41P6l48L23J9j44l6J9jP0l65N3M09p8q4
7992f8P5n9J40j04QK1m5k95J80K33k25O9L8P6j88R1l8P4J74k68J93n6j12R8Q8
8017A00j80J16Q8j61J52j9j62j83M58m29K98O2j89n7J61r9J40N0q4n0N4O4k15
8040h5Q0k7R2k0j48K6R3j0l3J51j79j04M18l24k38K24OO2q7J89k40M6L94j61j24
$$ plain form
7880 -192 129 121 67 61 -19 150 -3 22 185 -16 -324 -227 119 32 -302 -115 -252 -270 107 272 152 -25 -87 -380
7904 -380 -26 57 90 933 1433 411 731 1114 -885 851 -21 -682 -162 632 833 -56 -80 -215 -116 663
7924 663 -220 -728 -147 -502 -176 -211 222 -940 -531 -209 195 -175 57 514 188 63 66 425 537 6 143
7945 143 39 -405 -229 -48 -261 -14 -41 370 27 -67 85 -137 279 -70 70 26 -44 25 -34 163 -8 -211
7967 -211 14 75 194 7 157 162 -10 65 -168 -122 19 95 -253 70 89 -55 -91 -72 -73 -3 -368 -315 94 16 -68
7992 -68 7 -52 88 -16 -8 13 -32 -327 -147 86 -139 -70 -32 44 -144 -53 -91 -17 157 -111 82 26 -86 12 100
8017 100 -80 36 124 -37 115 96 -66 -249 209 -220 78 140 -49 -106 55 -44 96 146 62 12 66 130 -85
8040 -85 -5 -32 60 40 -108 -82 11 1 -32 119 -60 -164 254 -70 -308 -84 -78 -16 -103 86 -154 -108 286 125 1
8065Aj44J28P9jj13j96K85q1n8J35mk88M36K1j06J37K4j84k5j99J43K84j59j86
8089g1Q7l30L42k43M18k24o7J13OK79l94J30K71l25K46k44q7J72J33j27r9J28
8111A14k00M13o00K71j42J87Mk55J37K33o8K3p9k18J75l48M89m0j13n3M9m5N0
8134a6R3n3o6O1j03j31J10P8Q6J18k83r9M24j7q8j64J83j73l30L43N06q76Q81
8157D84m88q87J044J6N86r76N90j70o64L23M33n57O77k67n77N05P2l58K75q4K41
8178B18m38M58L73j053J130n51q8k95K17q3K7J43K6
$$ plain form
8065 1 -143 -15 64 63 -50 -246 39 -42 -100 35 31 -257 179 200 94 231 255 71 46 -153 -10 274 115 -71
8089 -71 16 -314 28 -215 203 -21 -88 25 31 310 -84 46 317 -8 238 -6 -93 79 212 85 -14 114
8111 114 -86 327 -273 -2 -144 43 47 -208 -71 162 94 117 38 -180 -5 -353 136 96 -17 -70 -21 -66 -16
8134 -16 77 24 -42 19 -84 -215 -105 -27 59 177 -106 -205 219 202 114 -50 133 -40 -370 -27 479 -397 484
8157 484 -4 -891 153 169 755 -221 369 199 -465 -142 291 -266 411 144 -433 72 144 -214 61 -23 218
8178 218 -220 238 611 -442 688 137 49 -246 -29 -112 -85 58 84
8191H4
$$ Imaginary data points
##PAGE= N=2
##DATA TABLE= (X++(I..I)), XYDATA
0@%%%%%%%%%%%%%%%Qj6J6j6J6k2L0l2L9m7N5o3P2q7J02j18J34j50J68j92K18k43
37a28K72l08L48l89M33m82N33n90O55p23P98q81R72j073J182j301J431j575J740
56I14j923K129k365K635k950L324l774M333n049O002p356R483j3621M0850o1704
71b9072M8402O106l4947N5047k0185l4902L2349j683n0393R5411p6919R943K6572
84B5729l8732L3411r414j9938O132K8470n3640M9262j7908l1226N2276n1674L1923
97D671J011j9663m260L3113l4803P091K7456n4222N7115l1766m992K4515j3697
110h431r861J3862O388k6346M4866m7852K3711Q859k6128L0010j2778K093q975
123a0582J7404k3692L3523j9278j0401L4266l9539K9875j2212J423J188N782j2567
$$ plain form
0 0 0 0 0 0 0 0 0 0 0 0 0 0 0 0 0 8 -8 8 -8 8 -14 16 -16 23 -24 31 -32 40 -47 55 -63 71 -79 89 -103 115 -128
37 -128 144 -164 184 -205 228 -254 279 -311 344 -379 419 -462 510 -563 619 -682 749 -826 914
56 914 -1009 1120 -1245 1390 -1560 1764 -2010 2323 -2726 3276 -4080 5403 -8218 32632 -29072
71 -29072 19330 25436 -9511 45536 25351 -9551 22798 21115 -29278 66133 -10786 -843 25729
84 25729 -13003 20408 10994 -8944 -2812 25658 -27982 21280 3372 -27854 24422 -27252 4671
97 4671 5682 -13981 -18241 14872 -19931 -12840 14616 -39606 17509 -14257 -19249 5266 -8431
110 -8431 -18292 -4430 1958 -24388 20478 -27374 -3663 5196 -20932 9078 -3700 -1607 -10582
123 -10582 6822 -16870 16653 -2625 -13026 21240 -18299 11576 -636 787 1975 7757 -4810
136d810J0335P231l4723M4678l0198J4683R11k0139J7117r17j358r211K0588l5168
150b0981L1993j0482j0616K5010l5752K0369L00J383j1504J4575k1112J1091J4829
163I103l2917L8376l1198N520J0610n829j017M077l289r968L0878l9384K7479
176B441m048j4569K3069j6267N423j094P405j9775L1090k1882p28K1839l1018
189a8114K7691j2237J062O40Q134j5867J2123O964k5425L4558l0153J4448M087
202G911j1050O298K178l862p311K3959l1201K6501j1773r981K2915j9243Q608
215C949k287L548j3869K2693k0306N170J4305k9081K9492j6937K564J368J697
228B306p579J0411j468j7502K9961l0802K0194j889j1083J0405n652J369j868
$$ plain form
136 -4810 5525 12756 -21967 22711 -7487 7196 8107 -12032 5085 4168 2810 -6401 14187 -20981
150 -20981 11012 530 -10086 14924 -20828 -459 -159 1224 -10280 4295 -16817 -5726 9103
163 9103 -23814 14562 -16636 -11116 -506 -6335 -7352 -3275 -6564 -16532 14346 -25038 2441
176 2441 -1607 -16176 6893 -9374 -3951 -5045 2360 -17415 13675 -8207 -8935 12904 -18114
189 -18114 9577 -2660 -1598 -958 7176 -8691 3432 10396 -15029 19529 -10624 3824 7911
202 7911 -3139 3159 5337 1475 -5836 18123 -13078 13423 1650 -8331 14584 -4659 3949
215 3949 1662 5210 -8659 14034 -6272 -1102 13203 -15878 13614 -3323 -759 609 2306
228 2306 -5273 5138 3670 -13832 16129 -14673 5521 3632 -7451 2954 -2698 -1329 -3197
241c197J2807k5181K5708j4904o62J6060k2633J7303q509M220n628J2280j5555
254g891Q370N616j8860K6957k3331J1344l45l069Q00K971j351p564J9315k4802
268a1840K1755j0010m227J2744j1993P829m697O664j3405J8974j6125N280R174
281A0123j9629K0780j4429P122k837M588q801P745K62j2289K2164k4220J6436
294G015n115l732N805l014O29l969J1898k0615K1714j4318P11J0728j5249J1991
308D479o835M316p788J2972j4880Q562L330j5874K1387j8063R418k218M83k964
322c675N173k509o455J6644k2253J9602r022k062P889p127L895k363O797j3565
336i031J8105j5309N994O364j4487J5751j0376N642m471P365j0186Q471k61r966
$$ plain form
241 -3197 9610 -15571 10137 -4767 -5429 10631 -12002 5301 -3208 1012 -4616 7664 -7891
254 -7891 479 6095 -12765 14192 -9139 2205 1860 -1209 -409 2562 1211 -6353 12962 -11840
268 -11840 9915 -95 -4322 8422 -3571 4258 -439 6225 -7180 11794 -4331 949 10123
281 10123 -9506 11274 -3155 3967 1130 5718 -3083 4662 4924 -7365 14799 -9421 7015
294 7015 1900 -1832 3973 959 1588 -2381 9517 -11098 10616 -3702 -2991 7737 -7512 4479
308 4479 -2356 1960 -5828 7144 -7736 826 4156 -11718 9669 -8394 1024 -1194 -711 -3675
322 -3675 1498 -1011 -7466 9178 -13075 6527 -2495 -4557 3332 -3795 100 -2263 4534 -9031
336 -9031 9074 -6235 -241 6123 -8364 7387 -2989 2653 -1818 5547 -4639 3832 3571 -6395
350f395J8480j9900J3900n459L11R64P22q49m330J1651j7533J7937j2009K352
364a58N368q935P319n575N061r146J3264j3644P749J725j1001J4627j3819Q995
378A830m874L328n112N271j340o501J3444j7545J5202q408J333K730k755M13j786
393d770P016j2121J5561j3911O625L579r177J0433q847N259m875R515j0838P998
407A447k022o062J3766j4191J0332n875K213l41K548k376k012R226j5184J7130
421H599j1974M270K449o116O126l872M957q963J2444j2719R174n41p857J1373
435G350j0719Q337n116M816p061O867k817l305J0565j4986J3432q187K930l1p5
450B000qk041O668j1818J4615j2865O197R60n398O552n583M860o876R748j1460
$$ plain form
350 -6395 12085 -7815 6085 626 937 1901 2623 1774 -2556 9095 -8438 9499 -2510 -158
364 -158 5210 -3725 3594 -1981 3080 -6066 7198 -6446 1303 3028 -7973 6654 -7165 1830
378 1830 -3044 284 -4828 443 -897 -7398 6046 -11499 3703 -4705 -3372 -642 -3397 -2984 -4770
393 -4770 2246 -9875 5686 -8225 -1600 1979 -7198 3235 -5612 -353 -5228 4287 -6551 1447
407 1447 -575 -6637 7129 -7062 3270 -2605 -392 -733 1815 -561 -2573 6653 -8531 8599
421 8599 -3375 895 3344 -2772 3354 -518 4439 -4524 7920 -4799 4375 3834 -4023 7350
435 7350 -3369 4968 -148 4668 -2393 4474 1657 -1648 8917 -6069 7363 -824 2106 2075 2000
450 2000 1992 -49 6619 -5199 9416 -3449 2748 3708 -1690 4862 -721 4139 -2737 7011 -4449
465d449R070k509n286J0902j2341Q956n836M013m459M473l906j471R190j3663
479g316J3537j0762N058R18l097J147q18M060p625J0675j2254Q881k296m524Q226
494C810p677O237n571O255p006P866m715j917Q944j2151J2293r045M342j816K334
509B183p37j496M854j0117J3641j1157O912k060k333M773m802N076p003R192j0558
524c632Q521l180k548O454r401Q924o851N453o182N605l573j244O283j0972J1889
539E546j0290N504j964k15k5q82L623q673J1486j2159Q468k567l590N407n248
554e579N332n832O928r145Q770m876p83P004j0382R762p401N716l479L399l443
569d009O64M867q924J2062j1448P347k089m53K854l188L381n137R422j0450Q730
$$ plain form
465 -4449 4621 2112 -3174 7728 -4613 4343 -1493 2520 -1939 2534 -1372 -2843 6347 -7316
479 -7316 6221 -4541 517 1435 -1662 -515 -1333 2727 -4898 5777 -6477 2404 108 -4416 3810
494 3810 -3867 2370 -3201 3054 -3952 3914 -801 -2718 6226 -5925 6368 -2677 1665 -151 2183
509 2183 1446 -50 4804 -5313 8328 -2829 4083 2023 -310 4463 -339 4737 -2266 6926 -3632
524 -3632 4889 1709 -839 5615 -3786 5138 -1713 3740 -2442 3163 -410 -1654 4629 -6343 5546
539 5546 -4744 760 -1204 -1419 -1444 -2326 1297 -7376 4110 -8049 419 -2148 -5738 -331 -5579
554 -5579 -247 -6079 849 -8296 474 -4402 -5185 1819 -8563 1199 -6202 -486 -3965 -566 -4009
569 -4009 -3345 1522 -7402 4660 -6788 559 -1530 -1983 871 -2317 1064 -4073 5349 -5101 3629
584C629m874l26N910p888O987o077O298o545O527m436K12M090q383J0768r095
599c203N486m020K690q30p13K827p180R979j0383Q162m198k71K431l616M564n738
615d013P279q841Q224m672k28M281o715P808p080N725m909N361m239J353L805
630C139p933R839r296P365l535J086n0k42K739n517Q442r849R045m763L22L103
646C895m988N672n052O076p108O966n277K165K838p332Q846q120O220m215K996
661C582k708Q23J750n548Q942j0272Q067m803J254R99k796L055m799P054q505
676c905Q094o242J517K425n082O015o645N664n652N876m963K012J559n533Q350
691C490q768O842m603K730j681N31K172n217P469r078Q736n706J726J555l012
$$ plain form
584 3629 -1245 -1571 4339 -3549 3438 -2639 3659 -2886 3641 -795 -583 3507 -4876 5892 -3203
599 -3203 2283 -1737 953 123 -590 2237 -4943 5036 -5347 2815 -1383 -1654 777 -2839 1725 -4013
615 -4013 3266 -5575 2649 -2023 -2251 2030 -4685 3123 -3957 1768 -3141 2220 -2019 -666 3139
630 3139 -4794 5045 -4251 3114 -421 665 615 373 3112 -2405 6037 -3812 5233 470 792 3895
646 3895 -1093 4579 -473 5603 -1505 5461 184 2349 5187 -2145 6701 -1419 4801 586 3582
661 3582 874 1697 3447 -2101 6841 -3431 4636 -167 1087 2086 -710 2345 -2454 4600 -3905
676 -3905 4189 -2053 -536 1889 -3193 2822 -3823 1841 -3811 2065 -2898 -886 673 -4860 3490
691 3490 -5278 1564 -3039 -309 -1990 -1459 713 -4504 2965 -6113 2623 -3083 -1357 198 -2814
706b814M205m818N949o977P329n622K487J894m959O389o254N721m928N009m267
721a656K410P83m465P843q744P631m946K536o41r49K221l798O300q033Q332o096
737a272K551P93l635M793n097N452o063O219n702L169P93m660P004p945O770n307
753b137M115l203J337P13l716O528q468Q024o140L331m34j778K776m316N852p254
769d770P716o806L749K58l774N888o360N949n613N516m898L248j72l165O271p249
785d212O927n524L772j570L58J123l103N624p341P778o121L679o03j624L260m183
801a760N625o397O811o223L887k29l075N452o623O295n693M992l868K662m23k890
817a457N877p803P619o063L842j933l58J548k871N152p226P500o962M047p67k063
$$ plain form
706 -2814 1391 -3427 2522 -4455 2874 -2748 -261 1633 -3326 3063 -3191 2530 -2398 2611 -1656
721 -1656 754 1537 -2928 4915 -3829 3802 -1144 1392 751 -198 2023 -1775 4525 -3508 4824 -1272
737 -1272 1279 2072 -1563 3230 -1867 3585 -2478 3741 -1961 1208 2001 -2659 4345 -3600 3170 -2137
753 -2137 1978 -1225 112 825 -2891 3637 -4831 3193 -2947 384 -50 -1828 948 -3368 2484 -4770
769 -4770 2946 -3860 -111 147 -3627 2261 -4099 1850 -3763 1753 -3145 103 -69 -3234 3037 -4212
785 -4212 2715 -2809 963 -607 -249 874 -2229 3395 -3946 3832 -2289 1390 787 -837 2423 -1760
801 -1760 3865 -2532 4279 -1944 1943 1714 -1361 4091 -2532 3763 -1930 3062 -806 1856 1433 -1457
817 -1457 4420 -3383 4236 -1827 2015 82 -276 1272 -1599 3553 -3673 3827 -3135 912 145 -1918
833a918L746m669M861n576N879n421L820j212k263N041o616O465n511M494l332
848b212J922Nk211M853o673P330o283M201j639n57K478l287M625o073O984o052
864b589M396j689j424M216n173N741n522N181m554L378j127j644M722o558O655
879D009n754M547l043J494L16k451M523o226P159o631M434j916l58K172l653M550
895C172n379N980n785M241j967j090L685n263N560n590M790l964K685j012j446
910a383M020o473P331o465M756k852P54P57k377M038n619O584o313M848k676j01
926a171K640m220M868n132N476n481M199k036m52L271n634O231n817N278m235
941b215K420p38j173M082n724O434o387N179k928P61R13k308L856n367O220o128
$$ plain form
833 -1918 1828 -2841 2020 -3556 2323 -3098 722 -490 -2753 2288 -4328 2137 -3374 1120 -2212
848 -2212 -290 -285 -2496 2357 -4316 3014 -3269 932 -707 -1264 1214 -2073 2552 -3521 3463 -2589
864 -2589 1807 118 -1306 2910 -2263 3478 -2044 3137 -1417 1961 834 -810 3912 -2646 4009
879 4009 -1745 2802 -241 1253 1569 -882 3641 -2585 4574 -2057 2377 461 103 2275 -1378 3172
895 3172 -2207 3773 -2012 2229 262 -828 2857 -2406 3154 -2436 2354 -1610 1075 63 -1383
910 -1383 2637 -3836 3495 -2970 1786 -1066 -312 445 -1932 2106 -3513 3071 -3242 1606 -1070 -1171
926 -1171 1469 -2751 2117 -3015 2461 -3020 1179 -857 -1309 1962 -3672 2559 -3258 2020 -2215
941 -2215 205 -533 -1706 2376 -3348 3086 -3301 1878 -1050 -289 624 -1684 2172 -3195 3025 -3103
957c103M962k640j26K748m244N141n391N214m665L570j898l70K967n121O150o233
973c039N032l350K094q34j244K947m656O269o684N656l485O07J652l045L569m772
989c283N798n632M634l206P42J911m150N328n612N236m706L484j604n3K271m702
1005c544O162o165N516l874K094k02j284L155m691N680n726N145l194R26J389
1020A387k922M096m844N433m835M120k562L65K040l721M960n480N152l922K942
1035B209j694l13K484m353N948o437N126l247J572J47j694K772m125M976n665
1050b294N166l645J239R28l298M230m693M771m755M027l041J062J131l382M956
1065B402n870N250m145K508j013n06K100l802N308n517N004m125J883O15k144
$$ plain form
957 -3103 1859 -781 -907 1841 -2403 2738 -2653 2561 -2104 1466 -432 -802 2165 -2956 3194 -3039
973 -3039 1993 -1357 737 -97 -1341 1606 -3050 3219 -3465 2191 -1294 -687 965 -2080 1489 -3283
989 -3283 2515 -3117 1517 -1689 -947 964 -3186 2142 -3470 1766 -2940 544 -1060 -1113 1158 -3544
1005 -3544 2618 -3547 1969 -1905 189 -13 -1297 1858 -2833 2847 -2879 2266 -928 -2 1387
1020 1387 -1535 2561 -2283 3150 -1685 2435 -127 238 2278 -1443 3517 -1963 3189 -733 2209
1035 2209 515 202 2686 -1667 4281 -2156 2970 -277 1295 1442 -252 2520 -1605 3371 -2294
1050 -2294 2872 -773 466 1394 -1904 2326 -2367 2404 -2351 1676 -1365 -303 828 -2554 2402
1065 2402 -3468 1782 -2363 145 -868 -1374 726 -3076 2232 -3285 1719 -2406 -523 92 -2052
1080b052L621m646M966m574M277l198J738M59k269M189m976N090m367L303j960
1095c99M06J589l128M573m977M938m068K685j095o16K356l567M753n348M934l794
1111g58J834L78k140L227m073M481m824M827l606J409O15k817M331m965M561m390
1127a910L164j968M19J103k933M427n481N105m005K371o21r48K298l589M362m762
1143b968M684m466K600J60k036L344m449N002m733L977k907J440M25k171L817
1158A719m889N061m345L411j739M46J180k740M119m837M902m087L107j078r11
1173f81K593l488M315m585M270l493K193m18j361L012m263M700m195L599k660
1188d62J383J61k178L801m744M858m294L248j899j63J521k428L679m861M901m225
$$ plain form
1080 -2052 1569 -3077 1889 -2685 1592 -1606 132 591 -1678 2511 -2465 2625 -1742 1561 -399
1095 -399 7 1596 -1532 3041 -1936 3002 -1066 1619 524 -92 2264 -1303 3450 -1898 3036 -758
1111 -758 1076 1454 -686 2541 -1532 2949 -1875 2952 -654 755 1370 -1447 2884 -2081 2480 -1910
1127 -1910 1254 -714 -295 808 -2125 2302 -3179 1926 -2079 292 -329 -1277 1021 -2568 1794 -2968
1143 -2968 1716 -2750 -150 10 -2026 1318 -3131 1871 -2862 1115 -1792 -352 73 -2098 1719
1158 1719 -3170 1891 -2454 957 -782 -336 844 -1896 2223 -2614 2288 -1799 1308 230 -681
1173 -681 1912 -1576 2739 -1846 2424 -1069 1124 706 -655 2357 -1906 2794 -1401 2198 -462
1188 -462 921 1082 -1096 2705 -2039 2819 -1475 1773 -126 -289 1232 -1196 2483 -2378 2523 -1702
1204a702K818j125r28K268l655M596m659M042l609K613q57j378K870m026M578
1219A846m250L441k621J133K86j636L109m209N080m636L249j583r0J586k425L389
1235A669m228M675l994K653r21o44K379l364L773l854M010l320J847k83j280L001
1251B119l955M534m095L180k251J269K88j675L105l962M276m242L118j365k66
1266G8J417k514L210l661M049l843K683j352m40J850l199L799m217L918l079J625
1282C24k67j069K283l655M174m340L439k128R62L12j848K962l826M355m201L194
1298F71j493N4J171k719L560l788L711l278K602j329p7J824l109M080m188L697
1314A389k722K086o97r79K410l495M382m224L634k446J199M78k036L302l802M106
$$ plain form
1204 -1702 1116 -9 -937 1331 -2324 2272 -2387 1655 -1954 659 -198 -1576 1294 -2732 1846
1219 1846 -2404 1037 -1584 -451 -165 -1801 1308 -2901 2179 -2457 792 -791 -881 705 -1720 1669
1235 1669 -2559 2116 -1878 775 -146 -790 1589 -1775 1998 -1856 2154 -1166 681 398 -882 2119
1251 2119 -1836 2698 -1397 1783 -468 801 1089 -586 2519 -1443 2833 -1409 1709 344 78
1266 78 1495 -1019 2191 -1470 2579 -1264 1419 67 -373 1477 -1722 2077 -2140 1778 -1301 324
1282 324 57 -1012 1271 -2384 1790 -2550 889 -1239 -277 35 -1813 1149 -2677 1678 -2523 671
1298 671 -822 -768 403 -2316 1244 -2544 1167 -2111 491 -838 -915 909 -2200 1880 -2308 1389
1314 1389 -1333 753 56 -923 1487 -2008 2374 -1850 1784 -662 537 1015 -1021 2281 -1521 2585
1330B585l748K818j538K05J175k518L219l576L661l189K388r48m58K084l661L861
1346B360l938L510k734J520m37q85J925l171L786l597K697j981O37M73j529K544
1362A180l279L691l568K824j941N89R69k528L332l751L517k772K068j031j25J491
1378F66k817L637l699L605k508J313k04j021J895k800L786l715L405k263J042
1393C22L31j666K799l254L621l304K692j774M24J230k360L151l461L474l080K182
1409A327r61m88J891k847L513l846L568k742J454j93j332K266k876L375l464K648
1425A293j764N34M97j451K354l384L575l555K613j380L19O90k106L155l444L330
1441A276k775J913j085l40J556k433L257l419L338k595J239m60p23K154k794L355
$$ plain form
1330 2585 -1163 1655 117 322 1497 -1021 2198 -1378 2283 -906 1482 534 76 2160 -1501 2360
1346 2360 -1578 1932 -802 718 281 -604 1321 -1850 1936 -1661 1036 -945 -308 165 -1364 1180
1362 1180 -2099 1592 -1976 848 -1093 -504 465 -2063 1269 -2482 1035 -1737 331 -700 -825 666
1378 666 -2151 1486 -2213 1392 -1116 197 -7 -1028 867 -1933 1853 -1862 1543 -720 322
1393 322 653 -1013 1786 -1468 2153 -1151 1541 -233 191 1421 -939 2212 -1249 2225 -855 1327
1409 1327 366 -122 1769 -1078 2435 -1411 2157 -585 869 676 -656 1610 -1266 2109 -1355 1293
1425 1293 -471 63 560 -891 1463 -1921 1654 -1901 712 -668 -349 341 -1765 1390 -2054 1276
1441 1276 -1499 414 -671 -1011 545 -1888 1369 -2050 1288 -1307 -68 -528 -1251 903 -1891 1464
1457A464l281L176k434Q75N46j453K701l174L146k729J996j194L99P23k099L161
1473A823l412L345k537J793p89m51J459k303K878k907K963k649J489j95j042K289
1489A754l011L090k947K579j961Q49K21j533K384l064L367l152K388j205J85O84
1505F28j967K572k995L090k809K102j123l21J514k454K949k970L026k694J671
1520B19l62j000J951k552K916k909K750k115R01M74j671K681k909L091k693J942
1536G14j070K61J031j939K462l135L356k546J765o99l91J371k114K701k642K400
1552A525k385J676l9q45J954l027L148k859K307j630Q65K15j226K106l187L518
1568B116l026K228j390J7J104j773K170k912K891k446J735p24n41J419k256K799
$$ plain form
1457 1464 -1817 1359 -1075 -200 346 -1107 1594 -1580 1566 -1163 833 -361 38 761 -1338 1823
1473 1823 -1589 1756 -781 1012 223 -228 1231 -1072 1806 -1101 1862 -787 702 507 -535 1754
1489 1754 -1257 1833 -1114 1465 -496 353 574 -959 1425 -1639 1728 -1424 964 -241 -56 628
1505 628 -1339 1233 -1762 1328 -1481 621 -502 -823 691 -1763 1186 -1784 1242 -1452 219
1520 219 -143 -1143 808 -1744 1172 -1737 1013 -1102 -201 273 -1398 1283 -1626 1465 -1228 714
1536 714 -356 -95 936 -1003 1459 -1676 1680 -866 899 200 -191 1180 -934 1767 -875 1525
1552 1525 -860 816 777 -68 1886 -1141 2007 -852 1455 -175 690 905 -321 1785 -1402 2116
1568 2116 -910 1318 -72 -55 1049 -724 1446 -1466 1425 -1021 714 -10 -551 868 -1388 1411
1584A411l338K849k008J078j51q31J616k492L033l033K486j720R21R3j562K365
1600G17k708L125k601K054j392J43R32j449K221l072L359k685J965q93k24J140
1616F32k063K653k654K715k016J206j52q24J945k673K912k394K171j813Q69L01
1632H15j257K389k960K913k984K208j040O7J089j929K390k865K664k172J794j105
1648A7l13J532k333K893l213K585j921J018j20j024J904k547K841k794J891j425
1664a009J124K10j479J955k516K937k711K110j486L66Q10j945K400k559K967k577
1680a403J882r49j31J327k094K506k588K499k147J449o20k29J747k509L071k867
1696a056K169j471O79J16q42K009k737L128k717J949j117J41Q01j723K457k880
$$ plain form
1584 1411 -1927 922 -1086 -8 -159 -990 626 -1866 1167 -1866 620 -1100 -179 -86 -1648 717
1600 717 -1991 1134 -1467 587 -805 -662 270 -1179 1042 -2030 1329 -1356 609 -284 -508 632
1616 632 -1431 1222 -1432 1283 -733 473 321 -503 1442 -1231 1681 -713 1458 -355 514 815
1632 815 -442 1947 -1013 1900 -1084 1124 84 151 1240 -689 1701 -1164 1500 -672 1122 17
1648 17 -296 1236 -1097 1796 -1417 1168 -753 265 145 -879 1025 -1522 1319 -1475 416 -1009
1664 -1009 115 325 -1154 801 -1715 1222 -1489 621 -865 -499 311 -1634 766 -1793 1174 -1403
1680 -1403 479 -470 -601 726 -1368 1138 -1450 1049 -1098 351 -269 -498 1249 -1260 1811 -1056
1696 -1056 1113 -358 321 437 -405 1604 -1133 1995 -722 1227 110 251 1052 -671 1786 -1094
1712a094K844k469J837j194K17R16j986K731k974K444k133J385m04n66J629k436
1728a253K725k816K265j547O18J17r88J618k148K546k700K090j156J90N60j520
1744a399K218k390K558k423J461m34n05J185j907K800k630K227j874J160p27l1
1760g11J269k209L084k611K234j968J178J93j157J831k353K449j827J554j119
1775a63L56M19j270K483k554K546k491J747n57k75Q70j841K466l014K849k189
1791f18J187q6n56J298k227K841l101K240j180N96J57j113J906k525K674k154
1807f61K149j773L8J199j792J906k820K698k023J847j085k50J339k515K565k229
1823a407K386j829N57m42J61J369j461J838k438J890j040L12M62j291J744k667
$$ plain form
1712 -1094 1750 -719 1118 -76 141 1057 -929 1802 -1172 1272 -861 524 120 -446 1183 -1253
1728 -1253 1472 -1344 921 -626 -8 109 -879 739 -1409 1137 -1563 527 -629 -439 121 -1399
1744 -1399 819 -1571 987 -1436 25 -409 -914 271 -1636 1164 -1466 761 -1113 47 -680 -711
1760 -711 558 -1651 1433 -1178 1056 -912 266 459 -698 1133 -1220 1229 -598 956 -163
1775 -163 193 612 -658 1825 -729 1817 -674 1073 516 241 1111 -730 1736 -1278 1571 -618
1791 -618 569 483 -73 1225 -1002 1839 -1262 978 -202 394 551 -562 1344 -1181 1493 -661
1807 -661 1488 -285 -247 952 -840 1066 -1754 944 -1079 768 -317 -567 772 -1743 822 -1407
1823 -1407 979 -850 -293 -735 -574 795 -666 1172 -1266 624 -416 -104 358 -933 811 -1856
1839a856K852j876J831j063j24J272j775K051k293K239k233J585o35L76Q78k079
1855h50J901k214K175j995J552p43o83J898k068K871k357J631j673J257n7j465
1871h20J254k198K970k908K215j149K6Q73j294K184k838K487k302J985r51m86
1887i52P16j000K036k429K813j902N79l77m16J158k145K928k629K125j342R48
1903A11k67o60J766k373K486k432K516r91k00N75j049K186k636K703k337J395
1919G93j203O12Q52j434J266j831K482j455K81L49m63J411k451K381k284J828
1935A134j259O87k8r59J570k444K574j828J701q69p1L22j666K502l007K987k256
1952i10R71o87J9J273k803K997k697K538j737J206L0n78O70j986K635k727K763
$$ plain form
1839 -1856 996 -880 951 -112 -236 1036 -739 1312 -981 1258 -975 610 -25 351 1229 -850
1855 -850 1051 -1163 1012 -983 569 -174 -857 1041 -1027 1844 -513 1118 -555 702 645 -820
1871 -820 434 -1764 1206 -1702 513 -636 -610 263 -1031 1153 -1685 802 -1500 485 -466 -952
1887 -952 -236 -1236 800 -1629 1184 -718 -139 -516 -932 226 -1919 1009 -1620 505 -837 111
1903 111 -156 -816 950 -1423 1063 -1369 1147 156 -44 531 -518 1668 -968 1735 -602 793
1919 793 -410 202 1054 -380 886 -945 1537 82 363 712 249 1660 -791 1590 -694 1134
1935 1134 -125 562 534 -425 1145 -1299 1275 -553 1148 279 208 530 -1136 1366 -1641 1346 -910
1952 -910 61 -626 -607 666 -2137 860 -1837 701 -1036 170 200 -378 292 -1694 941 -1786 977
1969I77j496M11O82j644K559k919K376j792J211p45M85M64j806J687k180L215
1985A485j708P47k66q17J328k804L131k239J955j491J928j065j63J621l073K952
2001A521j946J382r25j17O37n54J943k735K061j743J327n24J50O07j844K624k172
2018c08K136k090J110j105L52L91k230L428k761K412k619J969j104N6J040k516
2034a839L204k569J926j859J643r19j92J152k025K073j436J205o92J41O29j148
2050g06J530j716K036k597K155j180K88K44p70K126k591K572j820J353j002m93
2066e71J592k176J884j324Q08q73m7J109o50J432k351K840k881K516j453K96m15
2083b64k52J969k245K118k062J352m49m0N36j270J977j602O45q51Q34l38m93J288
$$ plain form
1969 977 -519 -108 574 -1070 1489 -1430 946 -846 365 -380 105 569 -1237 450 -1730 1485
1985 1485 -223 524 258 -559 769 -2035 1096 -1143 812 -679 1249 184 21 1642 -1431 1521
2001 1521 -425 957 32 -85 552 -2 1941 -794 1267 -476 851 327 477 1084 -760 1864 -308
2018 -308 1828 -262 848 -257 95 486 -1744 1684 -1077 1335 -1284 685 -419 -363 677 -1839
2034 -1839 1365 -1204 722 -1137 506 -413 -605 547 -1478 595 -841 364 -328 -187 442 -706
2050 -706 824 -892 1144 -1453 702 -478 -190 54 -716 1410 -1181 1391 -429 924 -78 -571
2066 -571 1021 -1155 729 -595 213 -660 -707 402 -248 1184 -1167 1673 -1208 1308 -145 151 -264
2083 -264 -516 1453 -792 1326 -736 616 167 127 663 -607 1370 -232 413 -438 396 58 -435 853
2101H53k247K366j848J595j232P33l5j364J822k032K421k131K312k083R41m1j231
2118a201J743j308J626k322K066m14q95P85j703L020k505J869j548J293o11m44
2134e49J479k045K262k135J757j354Q43k6j016J935k024K265k004J216p56N40
2150C88L65j455K029k148K425k090J318o95Q4P76j689K141k371J994j605R24q3
2167C08m45J204j828K127k350J996j441O00L23j376J749k165K356k068J583r00
2183c27o5O03j129J666j906J937j808J689r18nM32j290J895k037J904j349P32
2200B4l60l49J097j669K058k019J784j189N69M09r64J510j870J955k060J968j233
2217c39L21O13j380J758j926K141j655Q33k37k73Q92j458K086k154K028j781J063
$$ plain form
2101 853 -1394 972 -876 719 -513 220 185 -1179 643 -1389 1032 -1099 1213 -870 71 30 -1201
2118 -1201 542 -766 860 -1462 604 190 -705 80 -1623 1397 -1108 761 -787 506 -105 -549
2134 -549 930 -1115 1147 -988 769 -585 258 232 -784 1151 -873 1392 -612 604 -152 388
2150 388 753 -702 1327 -821 1604 -486 832 137 221 997 -692 1449 -922 1072 -533 391 308
2167 308 -137 1067 -761 1366 -984 1012 -429 171 494 -882 867 -1298 1058 -1010 573 -327
2183 -327 -392 211 -918 748 -1158 779 -1029 660 -258 -263 169 -1121 774 -1263 641 -708 24
2200 24 -336 -685 412 -1257 801 -1218 566 -623 -54 355 -609 901 -969 986 -1074 894 -339
2217 -339 -18 595 -785 973 -953 1188 -467 366 129 -144 748 -710 1376 -778 1250 -531 532
2234E32k56l98J226j806J896k177J918j375O63J76j053J669k016K099k145J707
2250F60r74L13M22j045J406k017K170j576R40m83P0N30j663J887j743J765j464
2267h02Q51l4n24J166j677J978k101J802j407P84K35j120J412j599K018k130J579
2284D31p05q1Q21j149J663k180K173j635J146o21k5Q11j082J637j826J691j554
2301d85J021m37k41J033j385J566j804J901j412N92j40o77J404j473J676j771
2317f32J432j037M00L67j052J395j907J940j916J365n23l49N58q28J492j623J515
2334E97j546R81l24k66Q77j409J628j672J541j427J003J43r71J337j907K005j855
2351a265J863j234L52K48r43J544j398J870j808J325o68l11O97j030J826j730
$$ plain form
2234 532 276 -122 1104 -702 1194 -983 935 -440 223 399 -654 1015 -1001 1098 -1047 660
2250 660 -314 -1 421 -624 782 -1235 935 -641 299 -184 -114 416 -1247 640 -1103 662 -802
2267 -802 49 15 -509 657 -1020 958 -1143 659 -748 36 271 -849 563 -1036 982 -1148 431
2284 431 -274 -355 466 -683 980 -1200 973 -662 484 -137 -162 649 -433 1204 -622 1069 -485
2301 -485 536 99 -142 891 -494 1072 -732 1169 -243 349 209 -468 936 -537 1139 -632
2317 -632 800 -237 163 530 -522 873 -1034 906 -1010 355 -168 -517 41 -787 705 -918 597
2334 597 -949 32 -292 -558 319 -1090 538 -1134 407 -1020 -17 126 -845 492 -1415 590 -1265
2351 -1265 598 -636 -284 -36 -979 565 -833 1037 -771 554 -114 -425 272 -758 1068 -662
2367f62J786j729J049k31k25R30j570J798j656J443q32J79K83m14J596k108J625
2384A262j574J189p74K57P3r09J425j333J356j227J024n59j78O68r18J277j483
2401d24J155j138M55M9m29J049j319J122j512J692j664J122k05p24J125j419J874
$$ plain form
2367 -662 1124 -605 444 213 -12 918 -652 1146 -510 933 101 280 563 149 1745 -363 1262
2384 1262 -312 877 103 360 433 -476 949 -384 972 -255 769 210 32 700 -218 1059 -424
2401 -424 731 -407 48 97 -332 717 -602 520 -992 700 -964 158 -47 -771 354 -1065 809
$$ [...]
8191B88
##END NTUPLES=NMR FID
##END=
