##TITLE=1H_Ser S-3
 CDCl3,8 sc, 
 3.02.2021
##JCAMPDX= 6.0         $$ Bruker NMR JCAMP-DX V2.0
##DATA TYPE= NMR FID
##DATA CLASS= NTUPLES
##ORIGIN= UXNMR, Bruker Analytische Messtechnik GmbH
##OWNER= root
$$ XWIN-NMR		Version 3.5
$$ Wed Feb  3 11:10:00 2021 Russian Standard Time (UT+4h)  she@DPX200
##.OBSERVE FREQUENCY= 200.1315066352
##.OBSERVE NUCLEUS= ^1H
##.DELAY= (6, 6)
##.ACQUISITION MODE= SIMULTANEOUS
##.ACQUISITION SCHEME= undefined
##.AVERAGES= 8
##.DIGITISER RES= 18
##SPECTROMETER/DATA SYSTEM= spect
##.PULSE SEQUENCE= zg30
##.SOLVENT NAME= CDCl3
##.SHIFT REFERENCE= (INTERNAL, CDCl3, 0, 15.7039)
##AUDIT TRAIL= $$ (NUMBER, WHEN, WHO, WHERE, WHAT)
$$ ##TITLE= Audit trail, XWIN-NMR		Version 3.5
$$ ##JCAMPDX= 5.01
$$ ##ORIGIN= Bruker BioSpin GmbH
$$ ##OWNER= she
$$ F:/spectra/data/she/nmr/H-F/1/audita.txt
$$ ##AUDIT TRAIL=  $$ (NUMBER, WHEN, WHO, WHERE, WHAT)
(   1,<2021-02-03 11:08:51.65 +0400>,<she>,<DPX200>,
      <created by zg, POWCHK disabled, PULCHK disabled
       configuration hash MD5:
       00 E9 B6 7A A2 85 ED C7 34 08 36 98 17 FE 4E 26
       data hash MD5: 16K
       A0 52 34 0F 56 DA 73 A4 CB 30 73 62 EB 61 91 A8>)
$$ ##END=
$$ 
$$ hash MD5
$$ 9F 97 C7 14 1B A5 12 C7 86 CD E2 37 31 B2 4A 13
##$RELAX= 
##$RELAX= 
##$RELAX= 
##$RELAX= 
##$RELAX= 
##$RELAX= 
$$ Bruker specific parameters
$$ --------------------------
##$DU= <F:/spectra>
##$EXPNO= 1
##$NAME= <H-F>
##$PROCNO= 1
##$TYPE= <nmr>
##$USER= <she>
##$AMP= (0..31)
100 100 100 100 100 100 100 100 100 100 100 100 100 100 100 100 100 100 
100 100 100 100 100 100 100 100 100 100 100 100 100 100 
##$AQSEQ= 0
##$AQ_mod= 1
##$AUNM= <au_zg>
##$AUTOPOS= <>
##$BF1= 200.13
##$BF2= 200.13
##$BF3= 200.13
##$BF4= 200.13
##$BF5= 200.13
##$BF6= 200.13
##$BF7= 200.13
##$BF8= 200.13
##$BYTORDA= 1
##$CFDGTYP= 0
##$CFRGTYP= 5
##$CHEMSTR= <none>
##$CNST= (0..31)
1 1 145 1 1 1 1 1 1 1 1 1 1 1 1 1 1 1 1 1 1 1 1 1 1 1 1 1 1 1 1 1 
##$CPDPRG= <>
##$CPDPRG1= <>
##$CPDPRG2= <>
##$CPDPRG3= <>
##$CPDPRG4= <mlev>
##$CPDPRG5= <mlev>
##$CPDPRG6= <mlev>
##$CPDPRG7= <mlev>
##$CPDPRG8= <mlev>
##$CPDPRGB= <>
##$CPDPRGT= <>
##$D= (0..31)
0 1.2 0 0 0 0 0 0 0 0.06 0 0.03 0 0 0 0 0.0002 0 0 0 0 0 0 0 0 0 0 0 0 
0 0 0 
##$DATE= 1612336131
##$DBL= (0..7)
120 120 120 120 120 120 120 120 
##$DBP= (0..7)
150 150 150 150 150 150 150 150 
##$DBP07= 0
##$DBPNAM0= <>
##$DBPNAM1= <>
##$DBPNAM2= <>
##$DBPNAM3= <>
##$DBPNAM4= <>
##$DBPNAM5= <>
##$DBPNAM6= <>
##$DBPNAM7= <>
##$DBPOAL= (0..7)
0.5 0.5 0.5 0.5 0.5 0.5 0.5 0.5 
##$DBPOFFS= (0..7)
0 0 0 0 0 0 0 0 
##$DE= 6
##$DECBNUC= <off>
##$DECIM= 32
##$DECNUC= <off>
##$DECSTAT= 4
##$DIGMOD= 1
##$DIGTYP= 9
##$DL= (0..7)
0 120 120 120 120 120 120 120 
##$DP= (0..7)
150 150 150 150 150 150 150 150 
##$DP07= 0
##$DPNAME0= <>
##$DPNAME1= <>
##$DPNAME2= <>
##$DPNAME3= <>
##$DPNAME4= <>
##$DPNAME5= <>
##$DPNAME6= <>
##$DPNAME7= <>
##$DPOAL= (0..7)
0.5 0.5 0.5 0.5 0.5 0.5 0.5 0.5 
##$DPOFFS= (0..7)
0 0 0 0 0 0 0 0 
##$DQDMODE= 0
##$DR= 18
##$DS= 0
##$DSLIST= <SSSSSSSSSSSSSSS>
$$ [...]
##$SUBNAM2= <"">
##$SUBNAM3= <"">
##$SUBNAM4= <"">
##$SUBNAM5= <"">
##$SUBNAM6= <"">
##$SUBNAM7= <"">
##$SUBNAM8= <"">
##$SUBNAM9= <"">
##$SW= 16.9725356469052
##$SWIBOX= (0..15)
0 0 2 0 0 0 0 0 0 0 0 0 0 0 0 0 
##$SW_h= 3396.73913043478
##$TD= 16384
##$TD0= 1
##$TE= 0
##$TE2= 300
##$TE3= 300
##$TEG= 300
##$TL= (0..7)
0 120 120 120 120 120 120 120 
##$TP= (0..7)
150 150 150 150 150 150 150 150 
##$TP07= 0
##$TPNAME0= <>
##$TPNAME1= <>
##$TPNAME2= <>
##$TPNAME3= <>
##$TPNAME4= <>
##$TPNAME5= <>
##$TPNAME6= <>
##$TPNAME7= <>
##$TPOAL= (0..7)
0.5 0.5 0.5 0.5 0.5 0.5 0.5 0.5 
##$TPOFFS= (0..7)
0 0 0 0 0 0 0 0 
##$TUNHIN= 0
##$TUNHOUT= 0
##$TUNXOUT= 0
##$USERA1= <user>
##$USERA2= <user>
##$USERA3= <user>
##$USERA4= <user>
##$USERA5= <user>
##$V9= 5
##$VALIST= <valist>
##$VCLIST= <CCCCCCCCCCCCCCC>
##$VD= 0
##$VDLIST= <DDDDDDDDDDDDDDD>
##$VPLIST= <PPPPPPPPPPPPPPP>
##$VTLIST= <TTTTTTTTTTTTTTT>
##$WBST= 1024
##$WBSW= 4
##$XGAIN= (0..3)
0 0 0 0 
##$XL= 0
##$YL= 0
##$YMAX_a= 69900
##$YMIN_a= -34542
##$ZGOPTNS= <>
##$ZL1= 120
##$ZL2= 120
##$ZL3= 120
##$ZL4= 120
##$ABSF1= 10
##$ABSF2= 0
##$ABSG= 5
##$ABSL= 3
##$ALPHA= 0
##$AQORDER= 0
##$ASSFAC= 0
##$ASSFACI= 0
##$ASSFACX= 0
##$ASSWID= 0
##$AUNMP= <proc_1d>
##$AZFE= 0.1
##$AZFW= 0.1
##$BCFW= 1
##$BC_mod= 2
##$BYTORDP= 1
##$COROFFS= 0
##$CY= 11.3945322036743
##$DATMOD= 1
##$DC= 2
##$DFILT= <>
##$DTYPP= 0
##$F1P= 15.9154993809931
##$F2P= -4.1035820241983
##$FCOR= 0.5
##$FTSIZE= 0
##$FT_mod= 4
##$GAMMA= 1
##$GB= 0.15
##$INTBC= 1
##$INTSCL= 1
##$ISEN= 128
##$LB= 0.24
##$LEV0= 0
##$LPBIN= 0
##$MAXI= 10000
##$MC2= 0
##$MEAN= 0
##$ME_mod= 0
##$MI= 1.114404
##$NCOEF= 0
##$NC_proc= 0
##$NLEV= 6
##$NOISF1= 3.799351
##$NOISF2= 2.8
##$NSP= 1
##$NTH_PI= 0
##$NZP= 0
##$OFFSET= 15.70392
##$PC= 1
##$PHC0= -10760.4
##$PHC1= 18.20095
##$PH_mod= 1
##$PKNL= yes
##$PPARMOD= 0
##$PSCAL= 0
##$PSIGN= 0
##$REVERSE= no
##$SF= 200.130013532006
##$SI= 16384
##$SIGF1= 3
##$SIGF2= 2
##$SINO= 400
##$SIOLD= 16384
##$SREGLST= <1H.CDCl3>
##$SSB= 0
##$STSI= 0
##$STSR= 0
##$SW_p= 3612.71676300578
##$SYMM= 0
##$S_DEV= 0
##$TDeff= 0
##$TDoff= 0
##$TI= <>
##$TILT= no
##$TM1= 0
##$TM2= 0
##$TOPLEV= 0
##$USERP1= <user>
##$USERP2= <user>
##$USERP3= <user>
##$USERP4= <user>
##$USERP5= <user>
##$WDW= 1
##$XDIM= 8192
##$YMAX_p= 0
##$YMIN_p= 0
$$ End of Bruker specific parameters
$$ ---------------------------------
##NTUPLES= NMR FID
##VAR_NAME=  TIME,          FID/REAL,        FID/IMAG
##SYMBOL=    X,             R,               I
##VAR_TYPE=  INDEPENDENT,   DEPENDENT,       DEPENDENT
##VAR_FORM=  AFFN,          ASDF,            ASDF
##VAR_DIM=   8192,          8192,            8192
##UNITS=     SECONDS,       ARBITRARY UNITS, ARBITRARY UNITS
##FACTOR=    0.0002944,     1,               1
##FIRST=     0,             0,               0
##LAST=      2.4114304,     0,               0
##MIN=       0,             -34542,          0
##MAX=       2.4114304,     69900,           0
$$ Real data points
##PAGE= N=1
##DATA TABLE= (X++(R..R)), XYDATA
0@%%%%%%%%%%%%%%qJ6j6J6j6K4l2L2m0M8n6O4p2Q8j02J16j32J49j68J90k14K40
36A27k70L02l35L75m18M62n12N67o26O90p62Q40r23J014j115J231j358J494j651
55h68J827k026K258k525K839l216L677m255N002o008P440r653J3525k2156P3380
70E9241J0659r8491P9028o2002J0798M1222k8906k8457O9001p3411K5918M8154
82E2754q5259N9973j9912q613L3099k3348k5457L4997j4075j9806N9803o7476
94b3320L0728p10k0789M1790k5381j6649J7184J3580l4161M0395l8020N770L2557
107B2974m8974L8861o744j3939K940J4623k7114K5978q41l3064M9906m4446J4438
120e402J5365j9717K870J3759j2268k611K3786m8445M5962j3242j7862L0793k3847
$$ y = [0, 0, 0, 0, 0, 0, 0, 0, 0, 0, 0, 0, 0, 0, 0, -8, 8, -8, 8, -8, 16, -16, 16, -24, 24, -32, 32, -40, 48, -54, 62, -70, 79, -89, 101, -113, 127, -143, 159, -176, 199, -219, 243, -269, 298, -328, 362, -400, 440, -483, 531, -584, 647, -711, 783, -868, 959, -1067, 1191, -1334, 1505, -1711, 1966, -2289, 2713, -3295, 4145, -5508, 8017, -14139, 59241, 69900, -28591, 50437, -11565, -767, 40455, 11549, -16908, 52093, -21318, 4600, 52754, -32505, 27468, 7556, -1057, 32042, 8694, -16763, 18234, 4159, -15647, 44156, -23320, 7408, 6698, -14091, 27699, 2318, -14331, 2853, 16433, -17728, 22667, -15353, -9583, 22974, -26000, 12861, 6117, -7822, -4882, 9741, -17373, 8605, 7764, -25300, 24606, -19840, -5402, 9963, -9754, -6884, 6875, -5393, -8004, 15782, -32663, 13299, 57, -17805, 12988, -10859]
133a0859L980M348k475r299L5301m0990J1067J8081l4622M0215k3983k253J1614
146A25k799j1439K2345j6241j2611L9555m2180L0401p673j7620K3943r442n488
159i124R977L534k5990L7927k9589J0519J6193l6233L0605p007k649J338N065
172D566k0050K5704p355j7035L5367l8363K1193J067j0912Q117K551r485L918
185g17J3555l2547L6071k1854m64J8015k0219J1141k999r17p214K3070k7005J4439
199B355L775k1597K9024k2148P604K643p00r457J5236r029o803K4079l2285K6665
213I362r343o325J1735o408k815M900O492k0523K9000k5589J0074J1227k3113
226a1326K0315q548L0k85J0118k0476K0430p037j2758K9036k9120J6204k689n124
$$ y = [-10859, -6879, -2531, -5006, -14305, 20996, -19994, -8927, 9154, -25468, 14747, -9236, -11489, 125, -2674, -14113, 8232, -8009, -20620, 18935, -23245, 7156, -517, -18137, 5806, -3636, -9124, 853, 4387, -21603, 16324, -13265, -2746, 13447, -22786, 7819, 812, -1837, -499, 4566, -15484, 10220, 2865, -14170, 21197, -17166, 4027, 5094, -5818, 2299, 4850, -4635, -717, 12838, -19709, 16362, -5492, -5956, 12059, -8160, 2981, -18, -935, -8149, 14921, -12084, 2355, 6130, -15467, 13557, -8591, -987, 1656, 956, -8501, 6735, -2294, -9097, 14982, -17303, 9362, 19, -6306, 5429, -979, -3794, 1106, 7598, -12925, 16075, -9514, 560, 11787, -11326, 8989, 441, 471, 186, 10304, -10172, 10258, 3221, -9537, 19499, -9621, 6583, 3894, -1230]
240a230L214O651j1264L411J1283k6397L1136k1171K697J1048j5084R469j499
253B264j848p316J9878k4860J6990q01j6779K3654j9290Q527p24L96p333J3609
267F367j0383k693J8062k7093K4227j1788j675P852n343j482M234K940j5101K4110
281A2234k3278J1914M889j5929J6042q387K744j890R008j5504J5932p692p041
294f958K0198k2516J5981n552j011R9N546q540L226Q550j9280K4147j9357O643
308A176N398r954P228k420R80o755J6066k0597J5957m145j0300J7781j6025Q887
322C277k922K076p690J2268r913K97J2057k1372K1188j2710K121L209k849j239
336b202L257J764j1880J9822k1102J2949j69r330J1548q628L844k599P603j3827
$$ y = [-1230, 1984, 8635, -2629, 782, 12065, -14332, 16804, -4367, -1670, 9378, -5706, 3763, 2264, 416, -6900, 12978, -11882, 5108, 4307, -12472, 11182, -8108, 419, -305, 91, -7242, 6367, -4016, -6709, 11353, -15740, 8487, -3301, -4976, 2876, -2467, -3949, 285, 3225, -11876, 12234, -11044, 870, 5759, -10170, 5872, -2515, 229, -1661, 7347, -8157, 7775, 83, -6958, 13240, -9276, 6705, 1153, 142, 241, 5787, -2753, 473, 9023, -10257, 13890, -5467, 1176, 6574, -3380, 3848, 1428, 2408, -4347, 11719, -8878, 7079, 2934, -7366, 10415, -5610, 3277, 355, 2431, -5259, 7009, -2904, -2607, 9450, -11922, 9266, -3444, -1323, 1886, -963, -2202, 1055, 2819, -9061, 10761, -10341, 2608, 2439, -6891, 4657, -3971, -127, -2726, 4877, -8950]
350h950J5274r165k412J3961j8940J4940p759K594j243M782p005L473M841j4621
364a0230K0432j7523Q954K12n219N231k674J539n815J2428j5945J4566o419m735
378e198J1747j1928Q821m945L937p828J0751q861K171P846j6004J7154j2003M898
392E58M8n67k963L386J784r392J5931j8434J2237k410m561P694o596K856l105
407c534P375j2735J4066r939L61R202j4378J3407q056K876k784N378o653N096
421c18R38j0769J6941j5308J0408l461k966M261j616O95l199R067j3563J4847
435E957q633J23P552j0643R169n034M621n090P694q924M751M418r449J2572j2597
450c513Q892l104J925k374Q09K577n222J0125j3254J1430o217M21K919l575M449
$$ y = [-8950, 6324, -2841, -5253, 8708, -10232, 4708, -3051, -457, -1700, 3082, -3923, -450, 4391, -10230, 10202, -7321, 1633, 1845, -3374, 1857, -817, 722, -5093, 7335, -8610, 5956, -463, -5198, 6549, -5379, 3442, -1503, 2434, -5394, 5357, -3504, -1333, 6513, -9491, 7663, -4340, 558, 606, 39, -2924, 462, 2246, -7146, 8785, -9649, 2588, 178, -4383, 3311, -3285, -429, -3534, 3841, -8894, 5172, -4767, -4406, 4796, -9582, 3825, -4231, -1355, -4139, 1239, -5414, -318, 620, -10149, 6792, -8516, 1892, -1569, -4535, -274, -1890, -1195, -4394, 4673, -8890, 5957, -2676, -2553, 4999, -5644, 3525, -1509, 3112, -1978, 5716, -3208, 1543, 5961, -3488, 9084, -3513, 5379, 2275, 4200, 1826, 2635, 5212, -10, 10115, -3139, 8291, 2074, 2495, 5414, 1839, 6288]
465F288n761P082j0438J0726o738O87L540q399R269o611M579o642P055n641L099
480B095J1q456J3824j2366O496l695J039K79L44j409k660Q711j2908J2390q526
495d831R01N915p407M936k992L392m814Q618j0368N983K159q490J2525j1263P155
510A419k098O64k316L814j21k255O069j1858J4309q845K527J746l633N372m124
525F70L866p926J0101q162O296j513n392R798r609P802o317M194l363K614j617
540A442k878Q089j0710Q818p843N278j206j718J164l961P626r592Q045p101L833
555g14Q22l148K476m723O826p693Q421q589L934K169n585O571p090O209m174L959
571c29n361N397r08m417Q206j0788J1126o145J151J89J11J755k647L850p274J1224
$$ y = [6288, 527, 7609, -2829, 7897, 1159, 1846, 5386, -3013, 6256, -355, 4224, -2418, 4637, -1004, 2095, 2106, -6350, 7474, -4892, 1604, -2091, -1052, -773, -429, -1838, -4498, 4213, -8695, 3695, -4831, -3930, 1985, -5422, -486, -3478, -86, -4900, 3718, -6650, -667, 1492, -6998, 5527, -5736, 1419, -679, -15, -2331, 1483, 1362, -893, 5176, -6682, 7627, -1218, 1309, 3055, -578, 4794, 670, 4536, -3390, 6711, -1451, 4845, 3332, -2060, 7738, -1871, 5931, -386, 3808, 445, 3059, 1442, -1436, 6653, -4057, 4761, -3082, 2196, 990, -728, 436, -3525, 4101, -5491, 2554, -4547, -714, 108, -3040, -564, -5287, 1539, -6154, 2267, -6322, -2388, -219, -5804, 767, -6323, -114, -4288, -329, -5690, -293, -1201, -5618, 2588, -8200, 2926, -3219, -2068, -1879, -1768, -13, -2660, 1190, -6084, 5140]
587E140r668N582n67m392Q198p206M496l888N045m788M967l689q80P541j0864
602d973R724p324M137l61r72M7j016M004o869Q784r326P198k070l189N164n944
618b986N838n148M717n791N724k432j686M558o264P434o907M970m467K675O79
633I14k693M126n427P550p053M537l375J388J231l099N502p446Q120o925M267
648A617j270r29K671k938L519m975O680p448N313j915j626N778p422O646n109
663a408M379l920K913k010J61M366o685O599p508N458k970J281K169l333L688
678C180n117N599o641N983l070n01L098n145N520m299M312n149M025k984J696
693E07J575n922Q341p729L977k007P17J043j644K420l775M732n800O580m473J427
$$ y = [5140, -4528, 1054, 487, -3905, 4293, -2913, 1583, -2305, 2740, -2048, 2919, -770, -1650, 5891, -4973, 4751, -2573, 1564, 1203, 231, 278, -738, 3266, -3603, 5181, -4145, 3053, 983, -2206, 2958, -2986, 2852, -2296, 2421, -3370, 2354, -78, -1764, 2794, -3470, 3964, -2943, 2027, -2440, 235, 914, -1779, 2347, -3080, 4470, -2583, 1954, -1421, -33, 1198, -1901, 3601, -3845, 4275, -2650, 1617, 347, -582, 2089, -849, 2670, -2305, 4375, -3073, 2240, 325, -1301, 4477, -2945, 3701, -1408, 2971, -949, 1964, -46, 115, 4481, -2204, 4395, -3113, 2345, -625, 656, 2825, -508, 3180, -1937, 3662, -2979, 3004, -66, -567, 2531, -2614, 2906, -1393, 2919, -2230, 1795, -1189, 507, 2082, -3840, 4501, -3228, 749, -1258, -541, 502, -1142, 1278, -2497, 2235, -3565, 3015, -1458, -31]
709c1N41l781M418n495N375m031M113k368M57K087m817O579q202O911m492K704
725c2n01j600K683m192O697o712N375m156K716K9j929M061n483N607n486N341
741B418k337k95K084l650N035n187M965m706L671k211M94J967l991N486o617O782
757C908n490K884n71p72J916l527N653o372N778n139K410M84k837M036m438M322
773B245m895M764l640J623O94l667N463n805M964m325K922j985J247Q68l089M886
789B270n841O120n093J779j6j110K490k961M354n085M869l936K035N19k623M578
805B349n740N588m565L888k991J203J299k552M422o052N771m465L762j841l58
820b82J982l133M757n554N800n350L271q73q93K660l885M526m855M819m154K110
$$ y = [-31, 510, -3271, 1147, -4348, 1027, -3004, 1109, -1259, -802, 1285, -3532, 3047, -5155, 1756, -2736, -32, -533, -2133, 550, -3642, 3055, -3657, 1718, -2438, 278, 307, -1622, 2439, -3044, 2563, -2923, 2418, 81, -214, 1870, -1780, 3255, -1932, 3033, -1673, 1998, -213, 281, 2248, -1743, 3743, -2874, 3908, -1582, 1302, 731, -41, 1875, -1652, 4001, -2371, 3407, -1732, 678, 1162, -1675, 2361, -2077, 2245, -2650, 2114, -1526, 97, 791, -2876, 2587, -3218, 1746, -2579, 343, -1642, -395, 473, -2616, 2270, -3571, 2549, -2544, -765, -781, -1891, 599, -2362, 1992, -3093, 1776, -2160, -125, 394, -2229, 2349, -3391, 2197, -2368, 1520, -1471, -268, 1031, -1521, 2901, -3151, 2620, -1845, 1917, 76, -282, 1700, -1433, 3324, -2230, 3570, -1780, 1491, 618, -275, 2385, -1500, 3026, -1829, 2990, -1164, 946]
836I46J1k327M020n064M770m062L340k501J049O58k860M605n691N781m970L194
852H99j416l52K085l431M009n042N616n060L240r82j187K940m481N030m503M070
868A435l393K326o97j327L488m900N362m978M088k160N39P12k189L666m808N550
884B714m961L949k068l33K327l529M580m519M383m012L288j402o43K492m424N335
900C177m992M429l138J228M31j641L152m486M780m334L731k893J256P93k653L972
916B812n108N277m437L149j791k50J835k956L638m724M880m397L177j262j183
931a340L089m267M896n009L558k413J578r25p88K724m229N318n575L972j569k0
947a000J061k481L040l022L906m591M180k527N10J991m664N561m354L603l119
$$ y = [946, 957, -1370, 2650, -2414, 2356, -1706, 1634, -867, 182, 840, -2020, 2585, -3106, 2675, -2295, 899, -517, -869, 1216, -2215, 1794, -3248, 2368, -2692, 548, -434, -1621, 1319, -3162, 1868, -2635, 1435, -1958, 368, -329, -1656, 1832, -3068, 2294, -2684, 1404, -756, -217, 495, -1694, 1972, -2836, 2714, -2247, 1702, -366, -699, 1628, -1901, 2679, -1840, 2543, -1469, 1819, 417, -226, 2266, -2158, 3177, -1815, 2614, -524, 704, 1135, -506, 2646, -1840, 2940, -1394, 2337, -556, 700, 1493, -1160, 2812, -2296, 2981, -1456, 1693, -98, -348, 1487, -1469, 2169, -2555, 2325, -2072, 1105, -157, -1340, 1749, -2518, 2378, -2631, 927, -1486, 92, -833, -1621, 1103, -3126, 2192, -3383, 589, -980, -1000, 61, -2420, 620, -2402, 1504, -3087, 1093, -1434, -924, 1067, -3597, 1964, -2390, 1213, -1906]
962a906K022n83R7J181l389N151n084M610l633J398J263k100K774l635L929l611
978a516L610l307J810R24k735M057n335N248l158J700j294k3J344k012L296m826
994b217N098m003K611j055j428L371l926L622l925L222k237J689j018r49K987
1009A842l973M390m957L789j559o9J167k834L294k777L270m303L999k120L83J183
1025G25l519M846m398L520k863J724o8l04Q49k662M417m527M214l502J736J506
1041A694k927K720l228L760l036K855l136K158J69k076L608m795M755k941J501
1056A081r03J7J255j882K527l913M622l814K278q96j489L266l387K910l262K993
1072A403k035J302r30q61K956l631L932m497L449j470k59J052j839K733l094L093
$$ y = [-1906, 116, -467, -370, 811, -2578, 2573, -2511, 2099, -1534, -136, 1127, -973, 1801, -1834, 2095, -1516, 2094, -1213, 597, 1521, -1214, 2843, -2492, 2756, -402, 1298, 4, -19, 1325, -687, 2609, -2217, 2881, -1122, 1489, 434, -994, 2377, -1549, 2073, -1852, 1370, -867, 822, -196, -1145, 1842, -2131, 2259, -2698, 1091, -468, -537, 630, -2204, 1090, -1687, 1583, -2720, 1279, -841, -458, 725, -2794, 2052, -2346, 1174, -1689, 35, -33, -337, 512, -2150, 2267, -2260, 1954, -1548, 188, 1694, -1233, 1487, -1741, 2019, -1017, 1838, -1298, 860, 1029, -1047, 2561, -2234, 2521, -420, 1081, 178, 195, 1450, -432, 2095, -1818, 2804, -1010, 1268, 372, -1117, 2149, -1238, 1672, -1590, 1403, -632, 670, -260, -1121, 1835, -1796, 2136, -2361, 1088, -382, -641, 411, -1428, 1305, -1789, 1304]
1088A304l466L171j903L62J133k912M021l960L297k657J902m31l91P54k439M085
1104A870l969L507k958J468Q41j860K392k926L380k706K073j992J390K43j634
1119h81K921l967M441l418J789p23l12J454k036K395l052L578l513K487q92p58
1135d87K432l497L282l024K926k204J161n62l94K178l898L806l746L125j396O9
1151b29N19j594K589k801K837l449L165j946K29J405k752L503l562L095k663J842
1167A88p50k08J048k231L430l517L276k525J289J32j262K122k790L213l095K687
1183A007j879J043K84j373K530l394L570k919K206j069k55J309j894K609l062
1198a287L193k833K321j185j73J566k704L336l358K630k087J232k80n97J687k802
$$ y = [1304, -2162, 1009, -894, -532, 601, -2311, 1710, -2250, 1047, -1610, 292, -139, -530, 224, -2215, 1870, -2099, 1408, -1550, -82, 759, -1101, 1291, -1635, 1745, -961, 1112, -880, 510, 753, -881, 2040, -1927, 2514, -904, 885, 162, -150, 1304, -732, 1663, -1389, 2189, -1324, 1163, 271, -487, 1945, -1552, 1730, -1294, 1632, -572, 589, 27, -367, 1811, -2087, 1719, -2027, 1098, -298, -229, 290, -1304, 1285, -1516, 1321, -2128, 1037, -909, -680, 725, -2027, 1476, -2086, 1009, -1654, 188, -562, -770, 278, -1953, 1477, -2040, 1236, -1289, 0, 132, -1130, 992, -1798, 1415, -1680, 1007, -872, 171, 455, -918, 1612, -1782, 1788, -1131, 1075, 6, -249, 1060, -834, 1775, -1287, 1906, -927, 1394, 209, 36, 1602, -1102, 2234, -1124, 1506, -581, 651, 371, -226, 1461, -1341]
1214a341L407l163K601k120P70M39j555K448k681K625k909K549j514P7J218k412
1230a561K858l061K695k348J685o88j93J409k461K808k895K371j557R33M4j024
1246i85J834k617K827k662K543j937O20N67j744K972l045L140k952K103j044M82
1262A02M11j649K934k969K684k306J523o73r3J112j963K820l123K946k237J377
1278H96l28p78J544k097K376k358K348j967P70N14j515K289k635K705k974K463
1294A253j526K36Q66j674K344k855K576k029R96k28o98J293j604K168k501K315
1310I32j987R23k06q97J734j857J657j682K169k079J025L95j536K737l311K957
1326I74k535K892j895N04N87j963K164k054K987k460J272r07p7J393j632K522
$$ y = [-1341, 2066, -1097, 1504, -616, 154, 593, -962, 1486, -1195, 1430, -1479, 1070, -444, -367, 851, -1561, 1297, -1764, 931, -1417, 268, -420, -613, 796, -1665, 1143, -1752, 619, -938, -5, 39, -985, 849, -1768, 1059, -1603, 940, -997, -377, 190, -1554, 1418, -1627, 1513, -1439, 664, -380, 102, 513, -1136, 1798, -1171, 1513, -793, 730, 57, -36, 1076, -887, 1933, -1190, 1756, -481, 896, 568, -210, 1334, -763, 1613, -745, 1603, -364, 406, 920, -595, 1694, -941, 1764, -1210, 1253, -273, -37, 829, -845, 1499, -1356, 1220, -809, 187, -41, -739, 554, -1050, 1118, -1383, 932, -1055, -132, -338, -1235, 499, -1358, 299, -1383, 786, -1293, -268, 127, -1409, 1328, -1983, 974, -1561, 1331, -564, -60, 527, -1436, 728, -1326, 1661, -799, 473, -434, -511, 882, -750, 1772]
1342A772k974K512j658O19L0p59J380k295L234k873K474j727M35K71j231K528
1358A738k709J737j348K041j398N8N98j679J960j438J580j437K87K5m82J469j591
1375e89J729k768K499k005Q22L72r02K046k540K498k128J192j255J298J13j523
1391a141J914k054K150k272J960j342M31Kn71J114j408J966j890K098j161L40
1407A36M84j671K148k015K111j157P55m16q02Q40j328K454k753K520j472N59k33
1424A60r37J853j432J652k215K120o92k75J371k040K243k788K099j352R18J64
1440H49l49r4p52J258j739J997j946J216Pr04R38j815J898j196J336j375P33L3
1458I5p07J890k719J878j726J460j340N00K81k33Q88j454J621j764J910k69j785
$$ y = [1772, -1202, 1310, -348, 271, 301, -458, 922, -1373, 1861, -1012, 1462, -265, 170, 441, -790, 1738, -971, 766, -582, 1459, 61, 119, 717, -962, 998, -440, 1140, -297, -10, 15, -467, 1002, -589, 1140, -1628, 871, -1134, -312, 60, -842, 1204, -1336, 1162, -966, 226, -1029, 269, 382, -1141, 773, -1281, 869, -1403, 557, -785, -354, -352, -923, 191, -1217, 749, -1141, 957, -204, 136, 620, -1051, 1097, -918, 1193, 36, 791, 375, -427, 413, -915, 1539, -1214, 1306, -166, 393, 160, -777, 1076, -356, 1296, -919, 1201, 509, 234, 1605, -435, 1808, -980, 1119, -233, 685, 849, 500, 406, -346, 912, -827, 1170, -776, 440, 447, -457, 481, -1334, 564, -632, 704, -671, 62, 95, -612, 1278, -1441, 437, -1289, 171, -1169, -669, -388, -621, 267, -1187, 434, -1330, 580, 311, -1474]
1475a474K647k110J848k261K029j279J328o84j04O39p41J568k347J934j015P59
1491G37n94j52J043q98M70p71J100j438J267j79q14J520k309K201j136J79j63
1508F3M18K72j186J380j631K308j633O60K06j709K726j410q4j326J847j834J888
1525I55j027J95Q13k352K210j301J340j402j39M60m8P28j607J310j246J601j178
1542f88L2J171j899J998k112J789q97N05j22o61J644j785J916k401K150p18qL98
1560C12j070J626j531J042j294J943j265M17K43j175J972j904J802j615J088j01
1576D90m70L28o92J285j509J584j661R06J36p24J143j731J992j729J206j170R65
1593C49j63m46R32j572J843j575J164p73k23R00q54R94j661J720j554J476q54
$$ y = [-1474, 1173, -937, 911, -1350, 679, -600, 728, 44, -60, 579, -162, 1406, -941, 993, -22, 737, 143, -9, 1034, 136, 606, -165, 935, -503, 764, 585, -229, 1291, -1018, 1183, 47, 226, 63, 481, 753, -433, 947, -684, 1624, -9, 651, 857, -852, 1874, 464, 380, -946, 901, -933, 955, -72, 123, 936, -1416, 794, -507, 833, -569, -708, -248, -296, 432, -1175, 135, -1111, 490, -688, -656, 515, -1384, 614, -1498, 291, -606, -101, -223, -884, 760, -1025, 891, -1510, 640, -78, -86, 312, -758, 868, -663, 379, -915, 1028, -237, 180, 423, -752, 1220, -684, 1118, -497, 591, 490, 20, 348, -344, 941, -568, 1016, -645, 261, 397, -327, 816, -915, 1077, -652, 554, -616, 349, 186, -260, 672, -900, 943, -632, 532, -241, -464, 436, -418, 576, -1085, 635, -919, 557, -297]
1610b97k02Q51j504J802j648J510r09L69m29J53O66j223J477j720J621j106N42
1627d7J02m29R15j245J477j497J252q38L29M05r84J345j456J754j474Q28j66m14
1645a43N10o83J357j612J742j562P54K3l72J021j512J496j505J407j004N23o6
1662C74o20J042j390J785j984J358p19K21J96p87J188j504J585j303R61o48L2
1679b13N98j015J344j495J206j063Q22l11n83J044j452J793j616J256r66Q29k80
1696a02m86J062j430J433j410J214o73K28M78q51J167j475J378j155J192q98L12
1713a6M57j310J808j578J291r54O55m7l43P67j178J183j469J376o88L72J85m16
1731I5N14j230J451j496J217q35M27J80n66J073j419J312j234Q95l05j9M34j127
$$ y = [-297, -499, 352, -1152, 650, -998, 512, -397, -28, -457, -304, 362, -861, 616, -1104, 517, -589, -47, 55, -374, 541, -704, 773, -724, 528, -310, 19, 424, -560, 785, -671, 1083, -391, 437, 271, -143, 367, -316, 1041, -571, 1171, -391, 363, 386, 14, 1035, -477, 1019, -486, 921, -83, 440, 374, -246, 796, -594, 1191, -793, 565, -154, 67, 263, -524, 664, -840, 745, -558, 403, -245, -213, 385, -630, 714, -781, 425, -638, 184, -127, -710, 334, -1118, 675, -941, 315, -651, 178, -102, -588, 474, -956, 477, -933, 281, -392, -164, 314, -537, 630, -845, 533, -622, 570, -328, -16, 441, -869, 939, -639, 652, -302, 353, 306, -37, 730, -448, 735, -734, 642, -46, 326, 511, 95, 609, -621, 830, -666, 551, -284, 143, 323, -243, 830, -589, 723, -511, 384, 79, 60, 494, -633]
1749f33J369j736J498j036N75l44O2P33j316J445j346J337j081L37k2n53R89j147
1767h69J309j188J125o11m2N17p84J028j544J943j714J006m54N1K98o37J180j283
1785f69J185r59P23l68k58J092j526J378r12Q35n48K22mn37J060j375J432j382
1803f11J218q44J73O00j106J363j280J483j660J034l37o1N37j244J548j362Q81
1820C32q83P99m47j83P41j131J284j076J068j036M57J40q28J226j417J391j250
1837h13J192n51K04l9n58J096j274J351j259P83l98QN63p91J132j265J145j170
1855f44Q31k19l06R70j204J443j492J345j097N31J3j73R49j348J282j275Q04m05
1873EK53K59q38J052j036J173j364J001l99kM36q18R92j154J248j117R57m70k28
$$ y = [-633, 736, -1000, 498, -538, 37, -307, -245, 488, -828, 617, -729, 608, -473, -136, -158, -711, 278, -869, 440, -748, 377, -234, -276, 241, -543, 485, -1059, 884, -830, 176, -278, -227, 71, -566, 614, -669, 516, -443, 280, -88, -346, 746, -780, 598, -314, 521, -27, 195, 191, -346, 714, -661, 771, -611, 607, -237, -64, 536, -570, 793, -487, 996, -664, 370, 33, -28, 509, -735, 813, -549, 332, -551, 248, -199, -382, 359, -772, 512, -564, 504, -532, -75, 65, -763, 463, -954, 437, -813, 379, -172, 32, -7, -565, 531, -743, 608, -651, 132, -266, -258, 305, -486, 646, -619, 526, -644, 187, -32, -338, 632, -572, 871, -621, 724, -373, 158, 171, -2, 947, -401, 881, -394, 410, 5, 258, 517, -321, 731, -305, 868, -496, 505, 106, 104, 540, -278, 714, -440, 808, -309, 648, 178, -50]
1892e0M97q76J131j469J403j015O74m3q67J157r24Q83j126R30n50L16R2o36J047
1911E74j551J174r80R54l95j38M26r00J132j332J365j045P98k77l65J234j557
1928h83J174o88O09o83L27q2n6N45j057J266j203J260o17K3M26n78N58p69R13
1947D85q92J111r33K60M61j004J428j682J325n57L34o1k69N42p58R73j251J226
1965G38r13K83Q4o69R38p45J035j090N88m85M24k02l95P50r53J155j137O30j88
1984a52J7%m07J081j164J112j166Q32k92j55O92j181J089p84Q00o36K19r9m6N70
2004C30j019J277j415J361o25j5K24l14L94n95R07r53J017p27Q8P14j093J254
2022H10j529J287j331J752n55j28K48o05J303j966J867j544P16k41k80O37q54
$$ y = [-50, 447, -429, 702, -767, 636, -379, 295, 252, -615, 542, -382, 501, -625, 305, -245, 71, 163, -473, 574, -977, 197, -783, 171, -224, -362, 64, -836, 296, -1036, 329, -716, 82, -195, -560, 674, -883, 291, -397, 212, -471, -144, -226, -282, 263, -794, 472, -731, 529, -88, -65, 361, -217, 341, -428, 485, -407, 704, -229, 31, 492, -512, 916, -766, 559, 2, 336, 275, 6, 548, -210, 763, -488, 738, -175, 108, 192, -477, 461, -284, 751, -339, 249, -236, 188, -14, -409, 341, -612, 543, -594, 36, -152, -135, -135, -542, 539, -625, 487, -679, 153, -139, -294, 398, -783, 306, -478, 322, -314, -95, -194, -240, 330, -689, 588, -827, 534, -91, -106, 118, -196, 198, -397, 510, -443, 574, -153, -65, 649, -444, 810, -719, 568, -763, 989, 434, 306, 554, -51, 1252, -714, 1153, -391, 325, 84, -196, 441, -413]
2039d13P83n88O38n81M39j76l46R39j281Q78n50N98l79k53L33n44Q67r31R41j083
2059g09P11K3l39P38j004J112j129Q79o19L74j4k43L79r97J321j234J218p57K15
2078g5M78n61M81j107J236q48Q30m53K34M05j158J231j116Q11o47O72k33j89L88
2097C79n50M51r75J156q96O06J67o10R62j049Q97q25O81m34J87Q4o02J090j166
2116d47R39j022O43k48o6L35m59O38p87Q66q66P38k50k07N64q21R83r12P24q51
2136e06O36j84k81N28o40J003j176R05o28K94J20m48Q44q16O42p38Q56n51k28
2155c68L90m43J033j184J045p67N54k03j53N60r16Q10p13P15m82M23P9m08N20
2174D92q91J140j155J041q98L74M4k02P17q99Q79j005J181r97K97J41o52Q95q04
$$ y = [-413, 370, -218, 420, -161, 278, 102, -244, 695, -586, 292, -258, 340, -39, -292, 41, -503, 364, -567, 374, -709, 2, 25, -314, 424, -580, 532, -597, 282, -337, 37, 23, -220, 159, -838, 483, -751, 467, -290, -75, 403, -158, 323, -784, 452, -396, 434, -19, 215, 620, -538, 693, -423, 388, -259, 413, 180, -9, 379, -171, 280, -695, 461, -435, 171, 338, -272, 690, -359, 538, -287, 394, -40, 147, 231, -371, 719, -447, 492, -530, 113, -135, -201, 134, -325, 313, -474, 392, -474, 264, 14, -193, 371, -450, 533, -379, 345, -506, 130, -54, -335, 193, -447, 556, -620, 285, -343, -49, 71, -377, 467, -349, 293, -445, 411, -140, -368, 22, -421, 612, -572, 473, -294, 260, 57, -96, 464, -452, 358, -355, 360, -122, 301, 380, -28, 492, -399, 741, -414, 627, -271, 103, 147, -55, 662, -237, 642, -363, 818, -179, 118, 259, -393, 502, -302]
2193c02N75m92M77k05m76Q13n15O26j176J428q29M23n19K4M86o32P64r62N52j68
2213a08J31ll90P32j109J367j000N86j22m74J73j84R73j296J379j159J81M13p52
2232f62J295q77J054j190P79m35O4J95m8O65j060O76j132R26o15P24m08K5M64
2251D40l92Q34j246O52k60K91j54j22J36o61J154j284J217n64o83R00p03J258
2269H13j339J396j306K92L32QN9o52O41j88J25J028j231O03j321N95m19J413j271
2288d22J83M40M9J83l48J02m51R14j291K93M95r2k67n73Q47m01J347q80j58o25
2308f55Q9O32k96Q50j138J173p53Q19o45K82J51r62J148q92M59J15k30J29o39
2327c63N97p42J000k32P27j334j66J298l94j25r78J665j298Q72k48J54k44p80
$$ y = [-302, 273, -219, 258, 53, -423, 390, -125, 501, -675, 753, -76, 347, -172, -148, 338, -294, 470, -492, 60, -108, 23, 20, -370, 362, -747, 620, -380, 206, 84, -390, -217, -401, 572, -724, 655, -504, -323, 90, -662, 633, -244, 810, -380, 399, -36, 28, 223, 175, 840, -220, 456, -676, 250, -365, 359, -49, -24, 440, 48, 882, -364, 288, 28, 319, 165, 43, 179, -482, 672, -612, 605, 41, -642, 258, -445, 813, -526, 870, -436, -144, 188, 196, 255, -397, 244, 56, 181, 1209, -22, 581, -740, -145, -564, 849, -422, -239, 201, 250, 433, 85, 187, -264, 650, -641, -348, 147, 55, -212, -785, 62, -339, 1008, 128, -30, -655, -566, 66, -230, 620, -518, 655, -98, 721, 76, 358, 509, -453, 695, -197, 262, 377, 147, 276, -363, 234, -508, 492, 260, 987, -347, -513, 785, 391, 266, -712, 953, -345, 527, 279, 433, 189, -591]
2345e91J806r86j49j055R92k76N8J114j363R64p49J475r57l59J136j533P74j68
2363A33n20K57L89l53n95P59p23J307j193nJ248j007J2r1N31o20Q99r90M44K05
2383H7j5P98l70Mk208K548j112P52r80O18M76k07J95o00P52n39J30k18j2K57n46
2404a90J014p35M39n24M32n96J053o64m97Q99o25J5l5m43Q79Q1k25k50Q79j152
2424b45L33k03K10k66m42R96r45R43n30J2O3N77j74m91N49j170J138o42J23J32
2444c2o41N54M06L42r28N76n31K13k84J25M81q62Q99l97j09k6L34K48l63L08n13
2465b00N61q22J105o54K95N9o15O34m61M06o86Q92k44Oj99n73Q78j132J125p60
2485c85N07K30l24L68n37K16l15M07m67K82m6jR22j475P78o79L34j2K34j11j01
$$ y = [-591, 1215, 229, 80, -975, 17, -259, -201, 913, -450, 514, -235, 1240, 283, -76, 1060, -473, 301, 133, -387, -130, 259, -94, -689, 70, -653, 654, -539, -544, 704, -303, -291, -382, 149, -471, 428, -562, -118, 87, 72, 870, 500, 504, -1704, 844, -268, 484, -496, 122, 598, 391, 586, -14, 738, 199, 329, 111, 99, 356, -190, 824, 89, 528, 4, 436, -160, 893, 229, -268, 631, 6, 21, -14, -457, 422, 503, 278, 28, 907, -245, 88, -115, 95, -171, -613, 383, -562, 381, -149, -137, -74, 503, 329, -162, 387, -783, 355, -287, -164, -32, -673, -119, 287, 629, -299, 277, -254, -41, -325, -200, 281, -581, 318, -79, -188, -214, 120, 368, 5, 313, -200, 361, -461, 644, -10, 285, 344, -271, 363, -98, 308, -378, 514, 270, 276, 77, -496, 382, -750, 375, -385, 122, 352, 28, 396, -141, 75, -240, 167, -300, -18, -64, -65, 857, -618, 160, -519, -185, -197, 37, -74, -175]
2506a75N43q66P45n85K35m0K02K1J14L80q59M96l64K78n55NP02m69K28k29O44
2527D51n90L93j41j54M48l15N18r82N92l57L40q4k77N40l53k59LJ76k35J86M37
2548C37j16J71r81Q19m42K47j81J8K78l61N74o80M55m14L74j1l27N59p41N46q7
2569C7K30k66k10M06n19N23m67M54m52K0K93l72O93p96O75q67R85o70L30k8k50
2590b51L70p35P77n90N55k79O7J82k05K60m57P72n38L94m44K72q6k52N11p62Q22
2611C83m15K79k23Q8O3l59N18n47M53j21j5o8P8j04k93Q53p67O10n70L26j64q0
2633g5N00o61O78o06K79k59R3J32k62M14o73Q04n50R0J46K0n4m75O27l93M19l01
2655a07K98q3l97M10k77K59m01L79q4j81J42l24M88n73Q51o15K92m16L81J10l48
$$ y = [-175, 368, -498, 247, -338, -103, -143, 59, 80, 194, 574, -285, 211, -153, 125, -430, -425, 277, -192, 36, -193, 451, -139, 254, 113, -41, 407, 92, 610, -372, 220, -137, 203, 119, -158, 382, 29, -230, -227, -51, -286, -100, 337, 221, 392, -589, 230, -212, 35, -146, -128, 150, -211, 363, -317, 138, -276, 98, 87, -240, 319, -422, 124, 37, 267, 1, -209, 197, -322, 201, -266, 188, -264, -244, 49, -323, 370, -426, 249, -618, 367, -303, 27, -1, -251, 119, -616, 161, -429, 126, -153, -86, 96, -109, 151, -306, 466, -72, 322, -122, 150, 64, -188, 323, -439, 383, -32, 247, 24, 112, 175, -184, 334, -213, 240, 119, 104, 36, 114, 10, -283, 570, -197, 413, -157, 169, 5, -75, 425, -236, 442, -164, 115, -144, -51, 81, -181, 233, -440, 364, -186, -96, 50, 70, 16, -459, 168, -225, 194, -107, 191, 108, -289, 121, -156, 103, -298, 81, -3, -184, -42, -366, 122, -451, 400, -215, 77, -339, 42, 152, -196]
2676a96M87q39O25j95J73Q3k06M20n22M37q09R82q30N13j61J91k68k40Q75j180
2696f60J033n04M50Rm12J31m63R22o79K06K0k27N55p83J071o45R7k03L02l23M31
2717C28k2n87M95m55j51M77m54n18N69p0M95p6o00J021l82q6O04j542J139j95
2737a0L74m96J91L03O19j203l64Q03m57l71J01J264p77m3Q45j215J110j169R78
2756D83q72N32J28L99o02l86O23k94Q5n10N30J29n50N63n53O89n60K68oL82j70
2777C08k41N94o07l3l87J96O8J58N5k89M19p35P91l76L92l56j45L59k40K68l35
2798a36K28o0j40N2k01N36n23N59l08L2l67M59j55j41L71k67M16n52J83o5l1J49
2820C9k50M69n67M37l10K00J14j81K96l57m9k6N57o50L02J51j19k2l64O40n19
$$ y = [-196, 291, -548, 77, -118, 55, 138, -68, 352, -170, 267, -542, 440, -390, 123, -38, 153, -115, -355, 520, -660, 373, -131, 319, 328, -84, 47, -416, 506, -173, 33, 53, -174, 381, -402, 669, 24, 121, -82, 220, -103, 328, 306, -281, 214, -241, -392, 85, -369, -887, -318, -388, 107, 31, -569, 452, 70, -16, 588, -954, 185, -10, 364, -132, 59, 362, 981, -222, -586, 217, -240, -611, -510, 754, -23, -66, 779, -436, 674, -495, 483, -389, 143, 271, 670, 68, -318, 305, 11, 96, -414, 116, 245, -305, 258, -295, 394, -166, 102, 96, 478, 308, 67, 661, 54, 21, -366, -170, -102, 56, 111, -178, 241, -494, 297, -79, 313, -43, -188, 171, -69, 199, -136, 92, 32, -108, -56, -257, 279, -244, 315, 7, 39, -328, 131, -24, -165, 206, -61, 355, -197, -14, -79, -110, 39, -211, 258, -309, 128, -182, 18, 132, -49, 247, -110, -159, -185, 372, -278, 24, 175, 56, 34, -330, 310, -209]
2841b09K30j95k8K93k9L12m73M32o26K95M9k26N52n89M24k29K87n50M99n1k06
2862c8K11l35K08k42L40l74L86k51N6K72l85L85n12M77j75j15J54l69N56o56P80
2883C73n82L16k47J04J18l91O86o94P71p73K18J41k41L14l7l8k47L70J4l26J10
2904d1k23L11k90N82k19K04m03K18p3k0L64n82K63m97P26k3l15J6L2K01l55K50
2926A26k04M13m64k4N08n02L71m54M96k43R2J3r9J24k45J11J1J96l71P9K05k67
2948a28J96j53M46p10L48j77J87j81j43L06j24K81m07L89j1j07J59n40N84k73
2968e8J47j47J16j96j04N25m52L53k34K81k83j14M19k52L50m95K44m02N92k65
2988B5p2O14o49J44k42L87j42MJ2j20J21r2J70o04O02j54K36j46k17J59LL93o82
$$ y = [-209, 21, -174, -202, 91, 62, 374, -99, 333, -293, 2, 51, -175, 377, -212, 212, -17, 270, -280, 219, 168, -38, 173, -162, 46, -196, 144, -230, 156, -95, -39, 233, -152, 233, -279, 198, 23, -92, 62, -307, 249, -407, 373, -209, 107, -140, -36, 82, -309, 377, -317, 454, -319, -101, 40, -201, 113, 76, 38, -209, 161, 175, -151, -41, -264, 47, -243, 339, 120, 324, -79, 139, 66, 46, 410, -172, 91, -406, 320, 297, -18, -2, 30, 231, -124, 126, -78, 335, -129, -153, 355, -147, 224, -230, 266, 23, 115, 128, 29, 153, -92, 19, 30, 226, -145, -66, 139, -128, 68, -85, 361, -349, -1, -178, 9, -172, -315, -9, -133, 148, -259, 130, 119, 12, 171, -369, 215, -58, 89, -58, 58, -138, -242, 283, -169, 184, -50, 231, -52, -166, 253, 1, 351, -144, 100, -302, 290, 25, -47, 567, -82, 62, -180, 207, 65, 69, 81, -39, 82, -10, 160, -444, 158, 4, 240, 94, -123, 36, 39, 432, -250]
3011b50Q02m19j16J64l33L54k57P5l0r2R7k9J05k23J38j65M62n62L11k61L68j6
3033A23l51L73l78K23j94J42J80l06M04m62M60l12J93L2k33K90k87J27l21L88
3053I1l61M54l43J18K12l42K49j62K85j86K38m09L33K08m47K67m87M88k13J04
3073I7l24N84j42j87K53m49O31l42j29m4j6P3j31K59m20N16k55lJ03l3J82o02
3095c79N50l95K57k03O3L12m57L72K9Mn23P34m24J0K47l90J92q4p8m2J11l6k34
3118c64N9J71M08m93K09j09R6J69j92J81q2K91m64P0j16J62R5k81L88k71K67l74
3140a80K53O5j43K33l98N6k23P10n31P0O5j06L48m05M56m87K82J4J90j56m46L18
3162a5j93N36l23J1N9j75K28k80k3o4L04j53N8P6L7l9m72N74l82O3%J55k01J8
$$ y = [-250, 552, 133, 17, 181, -152, 202, -55, 20, -10, -102, -5, -34, 71, -152, -14, -179, 283, -279, 32, -229, 139, 123, -228, 145, -233, -10, -204, -62, 118, -188, 216, -246, 214, -98, 95, 127, -106, 184, -103, 24, -297, 91, -270, 184, -159, -41, 171, -171, 78, -84, 201, 15, 253, -156, 177, 385, -62, 205, -282, 206, -7, 97, -227, 357, 215, 28, 281, -168, 463, 121, -8, -52, -68, 5, -126, 133, -287, 229, -26, -29, 74, 41, 223, -379, 171, -224, 33, -170, -107, 205, -252, 120, 149, 153, -370, 364, -60, -50, 197, -193, -1, -85, -163, -205, -94, -130, -364, -305, -134, 274, -219, -10, -119, -23, 146, -46, 135, 53, 344, -120, -50, -166, -4, 91, -190, 198, -73, 194, -180, 73, 138, -5, 228, -170, -114, -337, 373, -158, -88, -23, -129, 219, -186, 270, -217, 65, 79, 269, 113, -333, -15, -208, 328, 5, 16, 75, -100, 128, -152, -175, -239, 65, -88, -30, 46, 83, 44, -428, 146, -236, -173, -173, -18, -219, -201]
3186b01K94l54J90m5M10l33K39k15r3L25o50N15k66Q8J47k13J08J22J57m84N56
3207B97l67J7om0J70j39K05j20o6n4J59j04lJ80k03J85l76L30j11J1K88l99K93
3230A47j96K69j54J33l23J46k5k84M22k34M14k48O1j10R1j6l03N70k66J9j00J32
3252A45l5l39K65l01M09m88K90j97M60j85j71M04l24N58p90L55n1O0P4n17M39
3273F1j73P3k0Q3l4L9J31j59k6k31N25k72K16r1J0K99m44J58j44J60j70J56P5
3296B22j51j29K74k61l78P18j47k07n9j24K74R8j68K3J58j43q4N8M8j13Q1J97
3318A87l36J26j07k6k8j14N62j56P4k03M7o2J1M6k17M50n32J86NJ34K2k79K56
3341D6k64J79K12k77J64l02M65k30P3k56J15l3k4J15j76L33m20L54j79k4K02q3
$$ y = [-201, 93, -261, -71, -116, 294, -39, 200, -15, -108, 217, -433, 82, -184, -96, 51, -162, -54, 68, 225, -259, 297, -70, -53, -59, -99, 71, -68, 137, 17, -49, -103, 56, -48, -51, 129, -74, 111, -265, 65, -46, -35, 253, -146, 147, -49, 220, 66, 199, -124, 22, -3, -287, 135, -99, 315, 67, 128, 18, 109, 93, -210, 360, 94, 113, 13, 145, 110, -229, 36, -265, 144, -344, -54, -251, 209, 24, -147, 257, -67, 491, -299, 56, 5, 65, 139, -378, 61, -112, -39, -59, 24, -10, 29, 160, 1, -25, -256, 269, -3, 213, 122, 132, 431, -13, 145, 1, 161, -9, 147, 222, 71, -58, 216, -45, -423, 295, 148, -59, -118, -242, 32, 130, -38, -15, 143, 0, -84, -26, 22, -91, -10, 187, -149, -23, -130, -156, -184, -298, 264, 108, 182, -21, 26, -36, -25, 21, -196, 254, -278, -92, -87, 47, 69, -210, 46, -218, -39, 173, -104, 60, -242, 223, -7, 66, -190, -75, -108, -132, -17, -193, 140, -280, 74, -105, -129, 73, -10]
3363a0r9P4j68m4M01l56N39k07m1J06m04L58k10L31l06P5J36L5o5m23N77l94L74
3386B79j69j72M6J26kr8J70m18L73j11M2K37l92K01n6M1l1k96L72j44q9j75N06
3409B40m85O8K35L05k63o2%j74J01k79M74k16L75l90m0K26k14L46l24K89l90J69
3431iJ85r0j47p2P7j86L75j22o4O5o4R3%P1j08R2r1J31K6k33K25l24K36k88L70
3456A48p8k24L84m39N17k80L2k74K28j04RJ52k14K26k72K80N5k25J79l09K36m3
3478a6n5q1N09j8m13P2j25J17JK41l34J34j16J80k5k31J25k13K20j84K50p6k24
3501b62N23m37L71k18J15j90J35Q6k48L77k39J01q6k52q5K74R6Lk22j11M10r0
3523E1j93J52J96j05l6J11j68kr9J14O3k01J0J31M8nP0P5k75R8N3q3j92L22m47
$$ y = [-10, -109, -35, -203, -247, 154, -202, 337, 130, 89, 195, -209, 149, -61, 270, -36, 39, 175, 210, 145, -278, 299, -95, 279, 110, -62, -16, 110, 108, 10, 180, -238, 135, 24, 66, 303, -89, 112, 56, 97, 66, -230, 142, -2, -91, -266, 240, -245, -177, 58, 363, 100, 38, 38, -136, -35, -314, 160, -56, 319, -71, -111, 115, -99, 247, -77, 212, -178, -9, 176, 86, -61, -133, -56, -242, 133, 11, -53, 12, -52, 41, 41, 112, 4, 96, 5, 136, 162, -71, 154, -170, 66, -222, 148, 70, -154, 230, -209, 308, 28, 60, -214, 14, -90, -81, 71, -143, 83, -189, 91, 146, -79, 100, -209, 27, -16, -71, -152, 357, 339, -74, -2, -127, -10, -9, 232, -102, 32, -84, 96, 71, -160, -35, -248, -28, -212, 38, -38, -262, 261, -176, 195, -23, 92, -98, 37, 123, -125, 252, 13, 114, 28, -224, -309, -35, 61, 64, -158, -269, 141, 51, -142, 10, 206, 101, 65, 176, 8, 6, -93, 21, 84, -117, -107, 24, 72, 67, 137, 212, -63, 35, 88, 5, -187, 135, -312]
3548c12L03j42L8Q6m1M24n56L16j14K04j44J15k45k6J59j60K02n5N0R3l13J41
3570B3l5M5J56q7j42K9j81jJ70j98L94k73K76k74J27K82l09j12K8J68j13L67m18
3593g8J40K37n41L75r7N1J0r5n5j57K29j28P5j14J38J07Kk32J72P0L5j45j69M36
3617B66m12J45j74K37r5q5Q8k87M04r1j92J33j16L78l07J6L8N8k46K71P8l47K77
3640C7j3j0O4J07l68K19p6oj1j99K34K21l14L2k7K23k02R5J55j52j35L05j09J2
3664H2J44k69no7N3m7Q1N3k71M10j07k2k0J8j81L04j48j25K57l14K87k40M5k5
3688a07K57K72m84J52j58p0K97l39m3K75J12m65K78M3J09j42k46K84j63J88rJ86
3710B27n10K93PK2J05j93R3l0l3R7j78J91j50L10k77L52k29J30n6p7k60K10k39
$$ y = [-312, -9, -151, -113, -27, -68, 356, -200, 116, 2, 206, 62, 177, -68, -94, 65, -95, 107, 52, 102, 195, -118, 23, -12, 33, 189, 102, -40, -11, -192, -193, -23, -221, 173, -100, 176, -98, 29, 311, 2, -110, -82, 86, -27, 340, -78, 62, 299, -242, 133, 36, 87, 97, 2, -53, -210, 19, -109, -34, -148, -10, 97, 99, -133, 39, 109, 144, -1, -170, 266, -146, -1, -175, 62, -33, -118, -30, -317, 87, -4, -196, -63, -179, 199, -108, -92, -54, 4, -242, 29, 107, -240, 37, 24, 14, 78, 185, -183, 36, -40, -46, -57, -256, -22, 199, -115, -83, -110, 113, -89, 6, 161, 9, -126, 179, 70, 82, 226, -43, -48, -115, -62, -109, -28, 25, -246, 164, 57, 35, 15, 33, -148, 156, 8, -117, 140, -174, 113, -127, -82, -107, 150, 422, -62, 90, -68, -138, 159, -180, -223, 52, 164, -301, -23, 20, 129, -13, -259, 25, -138, 50, 41, 227, -283, 10, 17, 39, 144, -49, 44, 14, -19, 78, -100, 91, -59, 251, -26, 326, 97, 227, 171, 94, -166, 44, -195]
3733a95M1K59k54J38n6nK75k51n2N0j64K45j75J24k02P1J43K64l95J35k09J30
3755h3Q5K1K2j3k2q2K09k5P9k50j74K59J03k4k29j0M3L54j80o82N53M05n00K96
3779A55J46Q9jJ14k73K32r25K86R62j062L28m5M32p73K51K04P3j63j96q9M64j85
3801B4l77L91p5K63j13p7O9k28J94q9n8J30M69m42m30N68L1l66K45k07m35P38
3823B25l0n5p9K0j59K0J03K57l49J2l66M68k54KL70J44n32q3Q5R9J78r2J46k95
3847a65P7L14r8p0j43j10O1J41N8J5q0J84j28m2j95P1K33Q0j86o3j38K69m19O98
3871C64m71q7J00k2L22n42J56M0L15K6m96M82p0M2K75n40L12p4k29q8K08m9M29
3894D03k86Q6k52m0k6L0J52K1R8K60j79n01p4K3o5J03Q08r10O73M85j187O27p42
$$ y = [-195, -154, 105, -149, -11, -67, -72, 203, -48, -100, -50, -214, 31, -144, -20, -222, -151, -8, 256, -139, -4, -213, -83, 2, 23, 45, 32, 10, -72, 137, 112, 191, -59, -233, 26, 129, 105, -124, -134, -91, 263, 83, -599, -46, 359, -141, 155, 301, 390, 389, 503, 230, 462, -463, -177, 785, -277, 51, 6, 438, -335, -84, 120, 193, 30, -166, -255, 209, 24, -353, 38, -37, 226, 113, 36, 105, -123, 71, -18, -76, 54, 523, 81, -349, 219, 250, -116, 129, -78, -513, 225, 195, 140, 61, 81, -78, -58, 45, 302, -47, -35, -401, 67, -187, -185, 185, 329, -203, -286, -201, -102, 76, -16, 130, -165, -88, 226, 128, 58, -85, -195, -134, 7, 65, 80, 0, 184, 56, 14, -181, -110, 123, 203, 17, -46, -184, 85, -334, 364, -107, -194, -94, -116, 206, -336, -180, -140, 175, 201, -295, 187, 117, 159, 434, -106, 206, 132, -97, -185, 23, -26, 403, 117, 203, -49, -89, -115, -85, 67, 88, 186, 446, 267, -234, -308, -285, -350, -247, 561, -349, 324, 809, -378, 249, -493]
3917d93N73k55r6J19j85L36j49M73M4j02O6r6m3J00r16N63j72P25m81j48K42l99
3939b94R54q10N34o8N79q51l80K93k90Q44J33o76n87M33L41m37j52Q33j489R79
3959a11L79ok8o61N70O3K5m22K18K35K14K37p90j76K70q4O3K88R08r08M92o35
3981A41M28r08N67L60M54o59l07l66R13q70l33N67J03L47p67p6K7P03j45MMo47
4003d60J292m56l29l50J96O26o61O60m49qJ23l01k08J07l79P36K52m24J59k20
4023i4L01Q0l80K53K34m85O0k05N39m01L3K38k8k79K16o4Q2J97j03r6j80%Q3j4
4047a3J56ok84K30q2k53J40K02k75j02R5M57k85j02j4L01k05O45l77j93k62P2
4069a55J87j34L17n6N28m59n9j62k63Q3J1l0J77m37L64N99k93l80N4L94k22n6
$$ y = [-493, 80, -175, -271, -152, -337, -1, -150, 323, 367, 265, 331, 235, 192, 292, -624, -61, -233, 492, 11, -137, 105, -294, 660, -150, 384, 316, 895, 44, -336, -43, -333, 511, 644, -32, -619, -186, 155, -282, -434, 399, -1090, -111, 268, 262, 234, -427, 143, 206, 231, -191, 27, 262, 476, 713, -77, -253, 17, -67, -4, 284, 1192, 284, 776, 141, 569, -339, 228, 588, 1042, 383, 76, -290, 623, -247, -580, -13, 90, 437, -330, -406, -379, 324, 179, 183, 187, -460, 832, 376, 47, -303, -107, 519, -142, 518, 69, 61, 184, -117, -325, -218, -597, 139, 391, -33, 126, -94, 207, 287, -93, 160, 394, -91, -31, -236, 303, -98, -65, 173, 145, -134, 82, 18, 100, 297, 194, 98, -82, -82, 1, -13, 143, 137, -147, 83, 1, -252, -112, 90, -185, -287, -192, 265, -20, -122, -136, 165, -40, 605, 228, 35, -227, -155, 32, -102, 215, 159, 687, 228, 169, 7, -256, -173, -162, -192, -15, -452, -88, 511, 218, -162, -108, 286, 64, 8]
4091Hp7Q5M51l39k31L15J14j46l00K38J52M6l43P0k48M57l71J42k52M09j69K22
4113B33l31J55L55k34J01l32J13no3K88J94l17K64R8j185N57N51k87m12k63Q44
4134C24J04l03l10N52j98k46J93j62N39q99J239j215J84K56k82q4L30L5r9M40
4154C98k86M64j58m93J29J51K80p35o4J089N01n77r6p34N24J13p73Q38l33l77
4174a39K88o8j00L23r0m54N3j96Q05o33n1O75p41L14P3J84l07J14M6M74j12j66
4196B92p78R15n23L89l71k05l61N94K80l25n63O05J0n61R87k70M13j074Q17m58
4216a87M29l89P1r2K38l11L98j09j95K81j83K26J34o8l5k50K5J76m93M36n71N08
4238C9m39R90l22n90Q59Pk09L8m14j1L01n14L11O9n62J33l7K10m5J48m42K81K61
$$ y = [8, -69, 16, 467, 128, -103, 212, 326, 180, -120, 118, 270, 316, -27, 43, -205, 252, -119, 23, -229, 180, 11, 233, -98, 57, 412, 178, 279, -53, 60, 55, -8, 280, 474, 157, 421, 519, -666, -109, 442, 155, -257, -520, 324, 428, 125, -185, 367, 169, -77, 116, -46, 493, -406, 833, -382, -198, 58, -224, -308, 22, 57, -42, 398, 112, 576, 418, -75, 54, 205, 485, -250, -314, 775, 1276, 699, 603, -131, 393, 506, -267, 571, 238, -139, 149, 81, -19, 304, 214, -240, -187, -383, 422, -211, -262, 413, -328, -14, 59, 243, -64, 50, 96, 570, 458, 292, -486, 429, -94, 295, -76, -281, -642, -48, 232, -93, -656, -51, -41, -602, 385, 115, 528, -546, 271, -187, 242, -147, -76, -168, 70, -241, 157, 48, -147, 134, -49, 177, 311, 243, 208, -42, -17, 159, -334, 102, -469, 39, -400, 590, 268, -322, 537, 544, 335, 373, -41, -52, 249, -265, 46, 115, -447, -314, -351, -141, -186, -38, -480, -199, 62]
4261F2j51K97j51L6l4K03l25J02J51k56j85J31J20j55K30j58L30k1l57K31j15
4282a5J22l15J38L67k70l16rK95k01K66r6K79j33m48M05Nk57k3K87n8P3J00k18
4305b2K16j79p9K31k04K2j3Kj31J65P1k95K69M3L1m16J03J32RL3K88k29m4p3J22
4330E2L9j30j35L89k22J20L9J04k07N3k28J92p3j3P4j28L16l93M5p2k0M26m71
4353b43Q7J02P6o9K02j97K02j90o5O4l09M89k11PM9k0N7p5J04k11R2rl0J41p0
4378b7K20k92J10J3j67L09J2j48j1J6J78j75L3j74L9J1L0j9J51j86P2P3J0p5q5
4403h2J6J41rpL2l06K98k23J50j86L99l83JK22R7o5j72N1q3j08J30J18J94m36
4427b11M17k23k08L32m45N23k85K10l59K20K9p8J11M2R6k57k5K40n3N3r3J67p7
$$ y = [62, -89, 208, 57, 93, 59, 262, -63, 39, 190, -66, -251, -120, 0, -155, 75, -83, 247, 226, -131, 100, -15, 107, -208, -70, 297, 27, -289, -298, -3, -204, 62, -34, 245, 112, -336, 69, 74, -183, -206, 81, 23, 96, 196, -22, 194, 15, -64, 167, -37, -15, -28, -26, -157, 8, 79, -216, 53, 96, 127, -289, -186, -54, -45, -12, 276, 47, 3, -70, 52, 91, -39, -174, 215, -7, 113, 152, 256, 49, 102, -126, 66, -7, -20, 54, -74, 242, -151, -106, -178, -198, 228, -243, -156, -54, 22, -47, 155, -42, 160, -30, -95, -31, -340, 149, -62, -55, -6, -26, 31, -44, 60, -151, -59, -68, -98, 43, -27, 193, -99, 11, 24, -143, 166, 178, 30, 19, 35, 213, 38, 71, -103, -64, -53, -23, -42, 109, -77, -5, 68, 78, 3, -82, -66, 75, 66, 59, 91, -215, 83, -140, 10, -176, 223, -160, -159, 63, 160, 95, -77, -26, -109, -217, -87, 31, 225, -211, 206, -17, -225, 107, -338, 185, -100, 110, -249, -29, 0, -78, 33, 75, 171, -86, -111, 129, 76, 129, 36, 203, 126]
4450A26K9l38J32J70N3j24k2K00n50L81j28K62L2r2K5j83l6L5J33l07N43k07r6
4473C8K17m25K33l25J86r3J46j66K17j7Q4k8N4j86j06K91q7j10J63k53N12m61
4495a16N5k4q6K21q1K02k30O3k06K43j43J79qJ61j46J5N0l24J5m9J61q5j38L62
4519I1j42M4q9M21l57j02m4j0K99m87N08j37j44J37L0j14K07l4k40M40l32p4K39
4542A10j26j15R7j33j35K81J28J27k12NQ9m3O9j87M8K8n2K8k5m2mJ94o4p3p5K38
4568A56L5pk41k4L52j49k9k42p2M98j98J02l6j36o0L0p4M3L35m44J17j50R9J81
4592H6kK0j43P0J7j14L5k1R1j44J15k36L39r8J8p1q9K93n8j3j08J51l81K67Q2
4617A06k27K42J6p7j21J50k7Q2N2l78J42J08M5k78J22j3KK58j00j32j44M26l34
$$ y = [126, 155, -183, -51, 119, 172, 48, 26, 226, -324, 57, -71, 191, 223, 131, 156, -27, -63, -28, 105, -202, 341, 134, 38, 255, -170, 63, -262, -76, -169, -23, -189, 28, 11, 95, 67, 121, -65, -171, 120, 33, -77, 86, -167, 345, -116, -61, -85, -171, 50, -31, 171, -59, 4, -202, 41, -102, 77, 69, 230, 84, 99, 149, -175, -160, -209, -48, -133, -271, 91, -51, -7, -96, 325, -32, -134, -178, -188, 111, -376, 132, -5, -149, -12, 18, -96, 111, 77, -163, 277, -55, -129, 110, -16, -131, -34, -167, -302, -21, 107, 234, 22, 27, 116, 73, 142, -45, 3, 31, -21, 7, -18, -60, -64, 130, 66, -7, -82, 156, 191, 184, -57, -81, 271, 122, 93, -149, -221, 277, 79, 181, 145, 9, -51, -21, -95, -52, 283, -161, -44, -194, -95, 86, 84, 104, -39, 31, 48, -66, -31, -52, 39, -105, 10, -226, 113, 15, 33, -38, -127, 166, 108, 95, -13, 138, -243, 24, 106, -121, 121, 137, 60, -61, 89, 62, 144, 196, -182, -40, 68, 113, -165, -43, -56, -54, 204, 104, -28, -172, 254, -80]
4640h0J74k67J18J07j77o3J27J01o9Q7l00J64J79j67M6p0K23l77M69j58RN9k17
4663h2J15K9qm0N7P1j4j89R2k27J80qJ16k6j98Q4k50J36J97J6J75k65L0K12j64
4688C9P1j68J52j48pM8r8J39J20k65J97l14j26L6L01k3o07N18J92m71M31M1J87
4711B45k57L0j44J57j4j31L64j07k7K03m57L03l03J99J7j65m2k9J97j3k1q2K37
4734A60j78R3k49Q3j8R0O3j73K43k18K13j75J96qm2J9mJ4Ol09J09j18M70k22k80
4759b35L02j27O0N2p9j08j15J80k5j12L90k30L2K19j32L7r3L6J23j58j82J19J5
4782c1K07j39j43K58k60K02r8q7L92n14J17Q5J94j98k8J34j78K15j26N7oK14l81
4805a14O5J1J16R5l52O8P7J55k6k36J38j7Kl02M05o7LJ14k01N2J13j20j20J6J31
$$ y = [-80, 94, -173, -55, 52, -125, -188, -61, 40, -29, 58, -242, -78, 101, -66, -20, -90, 133, -244, 225, 67, 76, 135, -82, 33, 62, 54, 14, 71, 142, 128, -61, 31, -196, -16, -24, 92, 66, -132, -48, -298, -162, 35, 51, 226, -39, -9, 203, 39, 110, -58, 94, -54, -61, -13, -111, 28, 148, -117, 80, -234, -360, -324, -23, -46, -653, -135, 57, -414, 17, 58, 245, -12, 18, -126, 31, 17, -114, 250, 143, 116, 319, -138, 165, -138, 61, 78, -87, -129, -158, 39, 26, 5, -77, 160, -18, 75, -174, -91, -109, -19, 44, -129, 114, -104, 109, -66, 130, 122, 80, 99, 95, 109, 115, -194, -85, -203, 267, 45, -235, 67, -60, 0, 52, -27, -135, -250, -70, -95, -207, 183, -47, -15, 204, 72, 109, 16, 52, 175, 17, -165, -46, -31, 176, 37, -106, 152, -108, 94, -4, -91, 301, -213, -96, -11, 183, -15, -43, 91, -87, 128, 2, 59, 53, 267, -114, -49, -38, 78, 173, -179, -111, -34, 121, 95, -141, -3, -20, -18, -320, 85, 18, 21, 135, -66, -14, 99, -21, -141, -125, 6]
4830FP8K52j97k52K52j93q2J41j49J90j70J0M8J80r5l69K43R3J63k33N8k7M0L4
4854B1q2K63k25k9j19K23l0p5K51j6l65K63m1j29k5J09j0N7j07J61J69k11M5l59
4878b61J42Q7K02k94J06K9op5n9l3l2N7K44P7k12j37L75m76L19j39k09K54N5m
4902A0j66L06q1J79m69J20R4J93m3J02k36j78J68K9k95m4L59mL0K22k28l3k9J38
4926A44j15K3J27k28J09j34j54J58j34K56o8l4Q9L21l08j8J36j21k47p2K97J7
4948D4k27K7J68k39L05Kl09K96P7l06O0k4J8%J97k05J73j15L60k37j47m1K9N4
4972d0N9J78j44K26k85l02L35j66L74k31n6J04m1m0Q7j2K8k03j31L96l2R7N4l63
4996a08K30j52J60r6j22o9J04Q8K8J1j10pj56J25K48j56j5j6l6j5K40k8k73j10
$$ y = [6, 84, 336, 139, -113, 139, -54, -136, 5, -144, 46, -124, -114, -66, 114, 19, -350, -107, -14, 149, -84, -26, -53, -13, 21, -61, 202, -23, -52, -171, 52, 22, -53, 198, 182, -183, 80, 39, -90, -115, -6, -16, 41, -66, 95, 264, 53, 98, -261, -119, -32, 170, -124, -18, 11, 5, -70, -129, -162, -194, -137, 107, 184, -28, -165, 210, -266, 53, -86, -295, -41, 14, 10, -156, 150, 69, 248, -221, -101, -7, 186, 143, 245, 9, -169, -1, 28, -267, -311, 48, 44, 74, 296, 68, 35, 6, 144, 29, 52, 179, -49, 60, -74, -228, -70, -204, 52, -16, -50, 39, 360, 52, 34, 170, 49, -198, -270, 27, 44, -183, -156, 12, -227, 78, 80, -229, 67, 144, -162, -102, -126, -108, -108, 89, -116, 57, -58, 302, 65, -82, -123, -94, -40, 19, 197, 53, 279, -6, -308, 27, -139, 235, 4, -52, 52, 11, -29, 58, 46, 74, -129, -260, 136, 104, 201, 255, -108, 122, -30, 130, 34, -88, -157, -53, 35, 63, 74, -36, -43, -199, -74, 174, 18, 3, -13, -49, -64, 176, 148, -125, -235]
5020b35Q8J07Q4k41K1J22kq4N4j39J2L79l7l39J33P8J00J36k62j18%L74l58P4
5044e3k61J54K58L6J23l89L6p5m1K56L9m6q4K12j34j60J70j03J64k05n6Q4J30
5067E5j55J98j23K05k44J08MJ41j89%P5j77J84n6j14p1J70j38J73N6J5j90k0j38
5091b31M93k78J07j32J21k1l89K83J20n1J17k80PJ11K82l80O9J09L3j92j8Q1r
5114d8N19k29k94j44J27n4j65J96M10q68P50l02R3k27M01k04M40l36N41K42q18
5135C0k36K75J37l45L77l45J68j36J96j88P8O7k27K53R9j82J85J66n70J48l2J34
5157E2J71l73L50j04n5j01q5J64j65L37k54J31l54L79K4k52J78k18J66q8P6l71
5179c92M16p6j15L14j53j41J68K9j85K8L28j76k05Q9L54m28K72p6J32o2o0K3k63
$$ y = [-235, -147, -40, 44, -197, -176, -54, -56, -140, -86, -225, -213, 166, 129, -210, -77, 1, 101, 237, -25, -143, -143, 231, -127, -53, -314, -160, 98, 134, 257, -132, -96, -171, -212, 44, 83, 37, -47, 165, 31, -129, 41, -62, 102, -103, -159, -75, 55, -100, 98, -25, 180, -64, 44, 48, 189, 0, 0, 75, -102, 82, 26, -88, -159, 11, -127, 46, 102, 117, -73, -93, -231, 262, -16, 91, -41, 80, 59, -330, -47, 73, 22, 139, -141, -134, -23, 259, -121, -52, 57, 90, -102, -120, -39, -48, 471, 242, -52, -196, -69, -123, -288, -92, 318, -550, 200, -102, -9, -236, 165, -39, 401, 65, 606, 848, 30, -206, 69, 206, -139, 238, -107, 61, -75, 121, -67, 11, 78, -149, 104, 203, 21, 206, 372, -198, -50, -82, 52, 223, -150, 200, 96, 41, -60, -145, 19, -146, 191, -63, 68, -286, 93, 117, -135, 43, -175, -9, -97, -21, -392, 24, -52, -167, 147, -6, -147, 21, 50, -135, -107, 221, 45, -160, -71, 283, -145, 127, 51, 183, 121, 61, 84, -179]
5202a79M6J82n0j84k1K22O2j01o3p6J32O6Mj13K12j85K42k60J91j44N8k49K47
5225C9J2j61J4J14k4M1J9j37K01j78k8N6J11j03J71j50p4N2M6r0K9j2P5m4N3l6
5251dm7K7l8K15k06L70o2j65k22k5J46l02L29k11L7K97j31L8j43J44j40J77o9
5274A5j77j0J24m6n3L26k65M5j29J07K06n8p1n3M4j02n1L05r6k3J7k1n6Q1M2k5
5300G6L8J55k81j41J97j79J72q3m8R1K35j29j30l6M7L3j02J16p3p4Jn6L82l97
5324a86Q6K67j63j41L26k32n8K39q2l5n1J59M2j29J26l51K99k58J63r9J41J39
5346B02j99K82k62QJ76j84K6RP7r0O3l03L24j32J00P9k88K2L5K10n8j85M7rm3
5371i3K22j09m7P4p1K08q0o7J22L7o8j69K64j83k9K8j96J35j51K7K38k16P2NO7
$$ y = [-179, -133, 49, -1, -185, -206, 16, 78, -23, -86, -162, -30, 36, 40, -73, 139, -46, 196, -64, 127, -17, 41, -208, 39, 51, -110, -96, 18, -6, 35, 54, -83, 118, -60, -88, -32, 79, -24, 147, -3, -77, -25, 21, -69, -40, -52, 23, -21, 32, -4, -51, -24, -62, 153, -53, 317, 255, 90, -132, -157, -11, -313, 16, -195, -158, 139, 8, 46, -97, 47, -93, 84, 15, -162, -172, -48, -94, -147, 179, -86, -41, -170, -63, 143, 85, 14, -39, 5, -97, -148, 157, 61, 38, 55, 34, -22, 59, 101, 76, 114, 269, -12, -153, 44, -135, 37, -46, -94, -3, 232, 103, -27, -63, -16, 17, -85, 31, -42, -116, -115, -171, 211, -186, -100, 167, 4, -137, 189, -43, -101, 138, 56, 21, -30, 129, 171, 42, 168, -183, 116, -142, 21, -78, 63, 202, 3, 285, 23, 31, 207, 23, 49, 58, 135, 45, 108, -195, 129, -3, 97, 176, -112, -90, -55, 155, 97, -88, -41, -50, -93, 129, 20, -27, 47, -24, 184, 104, 37, 159, 196, 128, -41, 223, 40, 11, 39, -157, -22, -173, -146, 92, -124, -52, -47, 20]
5396B0M1J95k87J09j23L0P4r1K32m30M84k84p1oL9K13m00Q0J32J83l07J70J92
5419A95j14L7j71K45n3J53n02K65j72J37R0j80K97k97J2J70k6k53J93J81k07r
5441ij53J44J8J54o3R9j07k27m1L22M6l96K23P0l5K46l74RJ10J0J4l43N41m42
5465a84L72j55k1j39M4K14j24K0R0k34J35j13K41J12k49R8M9l18O2pK40J5p8Q9
5489A59r2Or2J6l0Q0p4K52j72j85K12j58K22k16K0p4K26j52J18J12l32K26j87
5512a15K06m2l5j94n0Q5J68Q5q8J08k84O6O2j87L39k65L30n2Q5j83M4Q3k93J63
5536C6o9J0j84K55j47K69k78R6j63P9K29k47L4J2Q2n4M6k9K8J16k1r6J85k29Q6
5561D6j74J49K9k87J85J09J53j48J71k27m0J98r9J4K0j95J93j9J09m5j65l5K39
$$ y = [20, 61, 256, -31, 78, -45, -15, 59, -32, 200, -230, 254, -30, -101, -107, -68, 145, -255, -175, -43, 140, -167, 3, 195, 81, 118, -53, 192, 139, 292, -210, 55, -117, 20, 110, -70, 227, -70, -58, 112, 86, -167, 26, 207, 0, -9, -162, -18, 0, 154, 91, 190, 83, -144, -185, 137, 183, -213, 10, 80, 45, 291, -83, -74, 36, 46, 60, -283, 258, -184, 188, 33, 12, -127, -83, 131, 7, 27, 117, -117, 18, -95, 146, 258, 9, 107, 156, -162, -100, -107, 133, 148, 70, 159, 67, 73, -19, -3, -33, 47, -27, 225, 53, -132, 80, -78, 144, -72, -52, -126, 100, -52, 66, 178, -154, 72, -115, 91, 49, 14, -180, -230, -145, 23, 108, 20, 128, -156, -90, -28, -215, 124, -141, 189, 137, 222, 39, 83, 166, -127, 36, -33, -23, -207, 48, -99, 170, -108, -12, -175, -96, 133, -114, -80, -68, 14, -40, 6, -23, 5, 121, 100, 4, 189, -40, 46, -128, 21, 50, -237, -52, 57, 210, 62, 233, 6, -34, 164, 65, 79, 99, -96, 97, 78, 187, 142, -23, -58, 181]
5584A81r7J49m26K93l6j49O0j05K03m08M69k77L26M0k57K04j39L3j29P6O5j35
5606e9j39m8J75q4P0N0J9qj23j05L46j81O9J86k29M00k91Mj23J95L3j97J89l29
5630a80K32l24K35k5o1J58N8L2k66J4J97j88Q8q0K45j69L63o0l22J09R4j54Q6
5653H2R6k21K28j5k62O9%J41k62J47j43J40l3m5K51M0J2k70n5j10K09r0K24p9
5677E4j38K92j29r3j41K17m7j33N6r2J84J38l85L16j60J62q1rj54L26l96r1J90
5700a14K49p7k07J55k44K73j8Kj63J09j07J09oo9M83l59K9j14J46o8m8n8m5K41
5724I9r4O3k70J96J49l06P8J48J13j28K09k98K9j03K03ok51K56Lj21L5j57J76
5747B3Ml8n2Q9oj92L05j53J99m12K11j6K15k86j64P0R8L39k42J2N7l3j38K49j9
$$ y = [181, 84, 233, -193, 100, 64, -85, -25, -130, 73, -335, 134, -143, 183, 223, -34, 170, 31, 64, -65, 11, 76, -59, -198, -246, -71, -155, -85, -35, -16, -24, -147, -252, 94, -87, -18, 168, -61, 339, 48, 52, -71, 124, 157, -40, 149, -180, 52, -272, -37, -62, -123, 35, 93, 125, -141, -127, 70, -118, -30, -110, 135, -34, 329, 269, -53, 56, 150, -4, 82, 178, -43, 185, 170, -92, -23, -23, 118, -144, 3, -140, 0, -33, -78, 173, 213, 225, -45, -100, -210, -1, -91, 133, 54, -84, 208, 79, -14, -155, 62, 15, -118, -62, -154, 30, 168, -217, 99, -61, 101, 20, 11, -143, 183, -213, -304, -114, 135, 58, -149, 6, -238, 35, 17, 19, -144, -35, -142, -33, -39, -108, 375, 16, 45, -69, 77, 9, -39, -97, -142, 99, 5, 68, -202, -6, 143, -163, -85, 63, 176, 48, 257, -41, -12, -115, 88, 82, -169, 87, 90, -31, 4, -153, 23, 27, -11, -63, 26, 20, -172, 133, -20, 179, -233, -22, -38, 177, -109, -273, -203, -105, 234, -8, 4, 61, 28, -110, 139, 120]
5772A20j18j39K3J22R6m1j50J95j96j9K81r9k46K05r8K59n22K31p2O4r2J47K68
5795B19n13L56k03J70OO9k31m1K03J84r9k38J75j86K4NK23j14J66k37l5J54j53
5818i6K36k22L36o4k34J90l64Q5J22J56o4n7J1j30K41k66j20nP1J16K2Q7L5k2
5842F4j03j81L58k08J67n4J05o6j68k6N7L45k80R9j77K73j49o1n3j78N2J72J36
5865A24j68J54m26M11QJ00r0l8R1k53K01j10P3r6k1K24j35q2j17M76j71l68K98
5888H5j16m7J11L0j0k04L87m57L51j83K47l27J55j19P5n3J88p6l5l6m3R5n9J87
5912A46r2j00r1N2J01j29o9K07k74J96J44J9k51K19N5N5k26J77L47n35R8p4j29
5935a54j06J95K82j65Qm9M1l15L28k86K47R8k31K85k33J74r4O9O3j4p0J69q3k56
$$ y = [120, 2, -137, -114, 8, 104, 63, -87, 108, -88, -107, 174, 75, -171, 34, -64, 195, -327, -96, -168, -104, -196, -49, 219, -294, 62, -141, 29, 35, 104, -127, -168, 35, 219, 120, -118, 57, -129, -105, -100, 123, 9, 175, -62, -97, 57, -96, 140, -82, 254, 190, -44, 146, -218, -133, -11, 145, 81, 24, 35, -95, 146, -120, -240, -245, -174, -58, -36, 51, 86, 64, -39, -220, 138, -70, 97, 43, 148, 82, -86, -112, -55, 290, 10, 109, -68, 205, 56, -5, -58, -236, -184, -12, 124, -44, 110, -316, 95, 103, 203, 113, 75, 166, -87, 114, 4, 77, -19, -40, 184, 49, -33, -150, 326, 155, -213, 85, -31, -78, 33, 63, 53, -151, 236, -221, 130, -53, 194, -133, 22, -97, -22, -75, 113, 37, 2, -34, -77, 18, -41, 146, 54, -46, -137, -85, 16, -113, -182, 25, -249, -53, 91, 110, -141, 78, 133, 188, -38, 139, 486, -49, 49, -25, -154, -260, -65, 217, 52, 60, 11, 52, -263, 65, -221, 26, 124, -107, 178, -55, 119, 25, 94, 157, 143, 73, 242, 159, -97]
5959i7J74O0J42k90K93l58J76l20J63M72l97K6r9K7J21j59J15m51K44N0n0K66
5981A08L4k63K57j19j27K40m7j31K13k98J99k01M5L5J0K1K28j87q7p7R6N0k2p2
6005i5O5j41%J41l0j52K73j26J58opp6j03J69j20m8J11M2K84j77j19J22j13m5
6029GJ87O1l06J29qJ20l09L10L3k32J54j48Ll21M30l46K77q9K6K9p5J42jj25m0
6054i2K33m35K93J16N0l76K68J44n5q7m7j2k92J51N76n83K45r8j57J51k0k8q1
6077a36P8j41J33J40m7k2j38j93O00l48r5L66j50j01J04m3q9L49m44j06L81j99
6099a01J11K90l09P6k0J24k94K76m5l7j37Q3k49K92J2k11J83m6r2J2L08K39l67
6122I8k45J60k81J45J87n34M03j22kK32k07K3J98j07J49k4j38Q7j34J62j25O1
$$ y = [-97, 77, 137, 279, -11, 282, -76, 100, -220, -57, 415, 18, 44, -55, -28, 93, -66, 49, -402, -158, -108, -158, 108, 142, -121, 136, 17, -110, 130, 83, -48, 165, -133, 66, -135, -90, -55, -45, -24, 204, 17, -70, -147, -51, -1, -23, -95, -30, -171, -171, -30, -60, -212, 61, -65, 93, 87, 80, 4, -99, 70, -50, -98, 13, 55, 339, 162, 43, 165, 52, 7, 194, 255, -51, 78, 70, 190, -119, 191, 224, -8, 146, -2, 1, -320, 110, -236, 41, -48, -22, 7, -68, 74, 73, -52, -92, 141, -294, -1, 115, 165, -211, 57, 201, 146, 59, 12, 0, -292, -141, 435, -148, 97, -1, -158, -7, -27, -55, -136, -58, -199, -66, 74, 27, 5, -133, -326, 274, -74, -169, 197, 47, -54, 50, 7, -82, 267, -177, -283, 98, -101, 10, 300, -9, 67, 47, 171, -123, 153, 108, 71, -66, 17, -232, 60, 72, -139, 44, -2, -94, -82, 226, 465, 98, -147, 13, -268, -123, 64, -470, -67, -189, -191, 41, -166, -143, 55, -52, 97, 73, -65, 22, -112, 50, -75, -14]
6144a4p3L36k57R3l08K27J29QJ5k65J77m38M07j06N94k11l79o9j09m2K45m1L19
6167B38l38K01j43o7L83l24J66l76K67k5J7j23l5k14M53J9l44N02l55K62l47Q3
6189a00p6J81k57J47M65j77l06k7PL23m7L04l0o02J09L38l19K09n48J084n58j85
6211f5O93p76J59K94l95j27n5L02P89r26K35m29k20L51P78k74n96L20m16J014
6231F56j566J489J30K71n88j75j25M2j95P9l10P56o84o11Q29p6J34O25j128R6
6251c51M1J19M17m36q7P35j81J55r20M07LJ3J96N36n47j8N99p98J82P2n66J37
6273b92K05k41O22p21K76l18O19J62j62K3M3m65P49q26N73K95p05J25M6l48L47
6294GN79k91M49q39K76p9m62M53n43M80k70N93m18j14M67j85k72K27J29q94N50
$$ y = [-14, -87, 249, -8, 85, -223, 4, 133, 141, 156, -109, 68, -370, 37, -69, 525, 314, -65, -134, -243, -285, -40, -81, 238, -100, 101, -42, -109, 274, -50, 116, -260, 7, -18, -1, -124, -159, -373, 80, 99, -245, 257, -98, 164, -183, -100, -176, 5, -252, -105, 360, 183, -123, -150, -143, 180, 133, 437, 407, -195, -86, 252, -67, 142, -406, 678, 120, -65, 628, -148, 11, 305, -90, -217, -272, 30, 819, -107, 128, -301, -521, -170, 608, 334, -262, 58, -358, 656, -910, 579, 709, 980, 392, 217, 92, 134, -61, 18, -292, 464, -220, -831, -2, -78, 56, 681, -447, -351, -310, -191, 226, -210, -297, 438, 257, 412, -508, -101, -98, -85, 111, 647, 100, 82, 681, -117, 65, 137, -429, -292, -87, -328, 294, -427, -151, -469, 150, 312, 150, 173, 216, -249, 500, -326, 247, 542, -163, -38, 8, -340, 7, 586, 295, 744, -95, 181, 102, -360, 93, -450, 30, -240, 353, -65, -179, 288, 103, -169, 58, 187, -707, -157]
6315a57J93l54J30P80k36k28M92m66J67L8k11j48L34l25K57l93K52k35K29p74
6335f55J093k20J65n27K88L2o40N12r32J267r43M91N12j51p40k57O16L0k3J44
6355F2j78J107j205L31K45o74K12J69l81j13K44K83J04n19o5J58L16m57M09j81
6375a33k0L40l88p5ON07n34J70p5m70O92j37J3k87L80j3j95J77J97m91L51M17
6397D32p00M79J53j65k0k71j4J75M9l69N42n6k30J1m51Q62k79m66O76n47k26n9
6419d74O59J46k76j80j58L27k86O2l00Q78q12L03J11L45m16J06l16k13J139j036
6439c91K35l03K79K50O8J35m93K15L9M3j72J25K88q68P01n44J02k52P8L99J8m39
6461d87J003m33n7pn90m0L77K66o71L22R83j037l46J094r6n61J43k30O0J466j042
$$ y = [-157, 36, -318, -188, 592, 356, 128, 620, 154, 321, 359, 148, 0, 334, 9, 266, -127, 125, -110, 119, -655, 438, 218, 383, -144, 144, 176, -464, 48, -884, 383, -560, -69, 443, 292, -448, -705, -89, -59, -82, 62, -116, 991, -214, 117, 362, -312, -100, 69, -312, -425, -181, 102, 206, -313, -378, -220, 96, -361, 48, -133, -153, 187, -201, -276, -270, 237, -297, -127, -202, -672, 20, -117, -104, -391, -11, -24, -219, -42, 155, -336, 15, 432, -268, 211, 364, 199, 179, -92, -106, 69, 118, -251, 291, 235, 5, 16, -435, 427, 148, -318, 358, -189, -415, -474, 185, 331, 55, -125, -283, 44, -242, -180, -480, 398, -414, -111, 0, 345, -71, 35, -281, -494, 645, -391, -156, -459, -180, 70, 138, 273, -220, -5, 34, 77, -95, 30, 318, -550, 151, -393, -291, -543, -465, -66, -48, -487, 516, 83, 26, 19, -571, -611, -234, 32, -639, -317, 666, -371, -717, 377, 281, -280, -137, -367, -307, 1159, 117]
6482A17L81o02n93R66n57q3m01R54m26M04p52J90J35p2K06m93L77N09p23O94m97
6503b66N10k63j13P7j73P7K07J10n7k11l5K63K55k89L43o36K12j60j75K54k59
6524c29O41k48N00r60O34k68l36L71N19p53j48L52l77N48j86N00k73K05k42j55
6544em14Q67k97k38J88j71m32J144p13K11J61k07o00J0P08l97l7J34J88l29L7
6565a92J94J18j37j91J47Q7K72n49P24o30L15l29j2oM07l44J88J13k72oL22j18
6587A01K16l71O1J2o0L2J12n7j23l03K98L14m54J35Jj60N29j30k71J77J52m07
6609a96J68l21J8N87n32J18L9k71O26n2k68R80o59n81M39J37q9l6o28O81k49M08
6631C19j01r9N2n61N16l94M11m44L18k48O48m28J68j61p3M7k82J49L19J19L7j01
$$ y = [117, 498, -104, -697, 269, -288, -371, -772, 182, -244, 160, -592, -402, -267, -339, -133, -626, -249, 260, -463, 231, -266, 244, -19, -132, -55, -228, -151, 56, 166, 109, -102, -137, 126, 381, 92, 435, -201, 11, -149, -324, -70, -329, 312, 64, 564, -396, 238, -30, -366, 5, 524, -229, -377, -25, -402, 146, -40, 460, 187, 392, 150, -5, -419, 448, 151, -87, 101, -70, -502, 642, -71, 140, 301, 94, -506, -496, 212, -185, -222, -88, 100, -229, -192, 2, 120, -17, -208, -61, 26, 298, -251, 473, -157, 158, -171, -183, -189, 218, -126, 62, 175, -97, -103, 219, 101, 317, -54, 7, 19, -41, -9, 103, 46, -77, -380, -82, 232, -222, -87, -86, -246, 283, 153, -118, 59, 211, -196, -28, -349, -331, 256, -276, -158, -119, -390, 236, 184, -84, 896, 237, -344, 95, 232, 143, 107, -521, 160, -89, 319, 218, 119, 171, -390, 126, -268, 143, -301, 17, -231, 417, -11, 157, -4, -77, -30, -312, -163, 156, 275, 312, 211]
6653B11k56L69n39k13N90j66Q4j85N04k35l12q3J77o9K41l83L98j42l79L42M1
6674eJ72m22O6J05K6r7K55j64J82j47Q9j00J67n02L71M2R6j31R1L9J46n30L38
6697H7j86K56r4L07n00K29k67N07j06j84qp3J17l15L71k59O2J74l24J39P7n6j13
6720a59K43k63K37j36J49PJ18l4k00K7j05J76j90R9r5j12K53p4N5J01l4k86P9
6743a44L29k15M4L8j8J62j71n0N6N9K54l07j40L56r9l24J89L6K84l09K49j69l15
6766b05K73k61J31J15j59L37j70j34J47l3N6j33p7K48k10j59M27k45J52J1j3n2
6788D6l05L44j53J96k39K89j07k08%L33l72L77j33q3n4o1L35l67J5K37j03J78
6810A65k01J51j63O2m9J67l08jJ65n2O6QP2l0n4mj59L26m00K25kR8p2Q4r9n0J07
$$ y = [211, -45, 324, -215, -428, 162, -4, 80, -105, 399, 164, -148, -231, -54, -123, 118, -265, 133, -9, -388, -46, -5, 167, -255, -189, -84, -58, -155, 100, -64, 118, -29, 60, -40, 127, -375, -4, 38, 134, 3, 94, 133, 279, -251, 87, -99, 157, 63, 370, -130, 99, -168, 339, 233, 49, 41, -32, 85, -230, 141, -118, -56, 118, -206, -67, 10, -46, -159, 84, -179, 58, -78, 71, 78, 196, 162, -38, -11, -116, 60, -130, -31, -126, -238, 15, -59, -4, 97, 63, -223, -144, 185, -30, 14, 52, 34, 196, 25, -25, 31, 90, 344, 37, -103, 253, 154, -170, 19, 55, 339, 30, 279, 110, -205, 68, -193, -62, 53, -106, 231, 61, -73, 74, 41, 97, -36, -113, 135, -75, -234, 193, -52, 100, 111, 98, 46, -259, 85, -68, 128, -111, 178, 71, -137, -137, 196, -176, 201, 68, -15, -69, -130, 205, -162, -147, 90, -13, 165, -36, 115, -48, 14, -35, 132, -176, -177, -12, -64, 2, 10, 82, 52, -2, -6, -165, 161, -239, -14, -16, 82, 10, 94, -5, -55, 52]
6837E2l6q1k9K8j30n8K66k1J37l21L99m52M43j77K13k16J4O1k45J32J59p4p0M4
6861C8K42n05L16r8K93Rl40K10k48r3m1K40j33P8j90L36P4j56j1l19J81R0K34
6884B07k6k48K11k88K17q0j40L63j68J30j45N7j56m4J27r0J20j06J22q3m7J40
6906G3l5L0o5Q0j29N0L1J32j79L3J33k80J17r0J40k0o4J16m0j80J15r7L45j87
6930B9O7j07K8j8j93L91m61J63M54l58L2J90o0p0p0j60J59K3pO2L1o3M7l58K69
6955B0k48L53Q4l58K03l3m7k73J98n7K56p0m4O6k21J80j32K44j13r6j26L90j47
6978B9J72l73J8L26k86K59p6j40p4J99O8k01L00l36J09m9k7J58m18M93j89n4q4
7001a76P1J35M8K48k54j84j44O17k13j74J83l16K68k91K92J05j91j80l8K99K1
$$ y = [52, 16, -65, -94, -66, -196, -254, 12, -9, 128, -193, 206, -246, 197, 20, 233, 17, 31, 92, -153, -21, 138, 64, -6, 38, 280, -225, 91, -7, 286, 295, -45, 165, -83, -176, -217, 23, -110, -32, -222, 114, 188, 32, 21, -298, -117, -27, 207, 181, -67, 144, -144, 73, -7, -147, 216, 48, 178, 33, 90, -66, -110, 17, -73, 47, -59, 63, -20, -67, 73, 38, 68, 3, 83, -46, 4, 35, 167, -12, 21, 154, -126, -9, -99, 41, 21, -43, 73, 33, -147, -32, -129, 216, 29, 96, -11, 17, -1, -194, 197, -264, -101, 353, -5, 27, 217, 157, 87, 17, -143, 16, 39, 32, 94, 125, 62, 109, -249, 20, -228, 125, 209, -149, 54, 21, -26, -299, -101, -158, 98, 28, -16, 50, -171, 9, -123, 121, 8, -88, -214, 176, 29, 201, -172, -154, 172, -114, 145, 69, -71, -145, 54, 122, -79, 221, -115, -6, -55, -82, 76, -342, 151, -38, -92, -176, -105, 30, 78, 326, 72, -112, -256, 361, 148, -26, 157, -159, 109, -182, 110, 215, 24, -156, -194, 105, 126]
7022A26m2j9M3j41qm5m5K83k73k3j63J7L62k3o1j58L30l27K03N2k06N8J22j54
7046i2jJ48o2PM4L8m5j95l0J00K2j55Q4J96j99p8K04r3J88K4l7J33k66Q1k90M11
7072A37l22K89Q1l39J97n1k1l7L5j72K69M3j7R1j91r8K34l20N28l68r4N4L8L47
7096C13n06L9N3R2o7J82j61k37K65O5O7k36Q5k72J79J92J84j28m42K96j79K51
7118C5j17R7k7j02J48j64J79m4J20j60K8q1Q1J17L8k69N2J97m1j02l36K08J5L04
7142A76j70O4L0q9L1Q3r4M3mm8J12l88L59O4p1k4P7l13R1K05r7j3J09L1j65q3
7168h4O6L0J7L4j93O7O5o1k4Ql3rl9K5J97j12J98k4j48J2q7J47k24K7M9P2l2O5
7196Ij30J44mJ1j68M96n22M06q8l61m22P17k15p8J060p62j07k83J81N1K71p0j90
$$ y = [126, 84, 65, 108, -33, -41, -86, -131, 152, -121, -144, -307, -290, 72, 49, -12, -170, 160, -167, 36, 88, -118, -60, 62, -92, -93, 55, -7, 0, 44, 82, 37, -158, -188, -88, -66, -221, -137, 59, -140, -218, -14, -107, 81, 105, 68, 201, -65, 16, -274, 137, -185, 104, 185, -154, 43, -8, -29, -66, -31, -203, 66, 109, 92, 183, -8, -106, 128, -192, 336, -32, -126, -72, -34, 313, -193, -154, -101, -9, -76, 106, -55, -292, -27, 38, 105, -131, -46, -318, -139, 53, 237, 109, -333, -37, -216, 35, -82, 15, -12, -114, 34, -130, 49, 5, 125, -35, -7, -88, -7, 110, 148, -121, -69, 128, 87, -15, -351, -143, -128, 176, 6, 70, 100, 11, 42, 125, 31, 74, 70, 22, 134, -254, 105, 169, 98, 74, 151, -162, -71, 134, 37, 24, 133, 164, -1, -84, -18, 12, 29, 63, -130, -63, 2, -59, -83, -75, -108, -117, -156, -131, 66, -46, 152, 128, -20, -8, -95, 52, -172, -145, -96, -24, -56, 9, -121, 23, 19, 30, -138, 358, -164, 242, 154, -207, -629, 88, -127, -205, 855, 93, -14, -297, -116, -65, 206, 136, -54]
7219e4RJ34P4K8j34J89j13j36p9M4LO7j67j19L29j41J13q7J55Q1j67npoo0m0P7
7246a2l2j65M46l59j13n0N09j35l78O43p77K46R5p9K12j49R2j84K04L96n25k46
7268c61R1N91j22o42O80j14k81L05m61M11j9r9O8k6l19L12P7J07l17L12n37k31
7290e75L23K62l90O50M7l62K64o80O10m20N93R1m25J1k62M60Q0o0p1j51j63r1
7312b59J89n43O30kJ99j28j13J81K86N1o19M51k46m5J5k98p8mjN93l59J21J7j94
7336a56M11j80j99p1K56k06J72n60K62P82n77k83L16m64P47L1K88j34p80J87J33
7357b5L22N3k71j20K39m71O07r17N94M45m21L10k3p56L91J9k24L30k22L96J72
7378D28r2n86Q03q73N74o86M77k25N07m01n5L86K7r13N51L23q5j09l92M93J63
$$ y = [-54, -45, 89, 163, 191, 57, 246, 133, -3, -82, -38, -35, 32, -135, -254, 75, -66, 47, -40, 115, 196, 29, 24, 17, 11, -49, -89, -12, -44, -209, 237, -122, -235, -285, 224, 89, -289, 354, -423, -177, -82, -161, 51, -98, -6, -190, 14, 410, -115, -361, -270, 321, 199, -443, 237, 123, -158, 147, -314, 97, 78, -21, 47, 21, -298, 14, 91, 198, -119, 193, -344, -575, -252, 10, -380, 270, 317, -45, 219, -461, 149, -271, 322, 413, -12, -1, -263, 197, 277, 217, 146, -5, -168, -259, -70, -613, 17, 15, 214, 86, -27, 154, 440, 491, -128, 323, 77, 32, 47, -251, -329, -333, -334, 259, -100, 21, 38, -156, 255, 75, -124, -195, 61, -145, 27, -533, -271, 511, -66, -349, -33, -497, 250, 281, 569, 435, -345, -158, -25, 297, 350, 79, -41, 198, -273, 334, -583, 11, 456, 35, 345, 322, -434, -43, -24, -248, 82, -140, 256, 428, 336, -250, 553, -320, 254, -432, 45, -180, 327, -74, -129, 257, 284, -629, -78, 245, 160, 51, -341, 152, 315]
7399C15m92j52P9J79J72l96K91K31k64M1J03k26l2k28J9M12j44N83j85k34j24
7420e2M73q66L9N60l31J54P5K63l31j60J0M34p08O33j27k37m17N44K11Q9q9l02
7442a35J52n68O09M60p44L86j99J93j22N08p08o5K48O8l97L39J8J81n2l11K71
7463A32k60L70n97K91L48p3l30l4L21m60J13J96pk52K44J24o15O53o67P50r8K2
7485A71o11R86m99K5k28j43j30M38QJ74k87l06N02k14J18n5j00J47n3J28r4J32
7507A09o1J08j05k66K96M9k43J73J7k17K55k5J49k28M2nJ79m43K67Kl4j69L48
7530A98j47k50L10j11N0NN4k66Q7R8P1r7k64N87m17nQ3%L7k32J95p4qJ7k2k8j00
7557b29K6j9k2L79j70k9J95o0k09r3kJ76j91J96O1J18l72J66J34j18K42j84m0
$$ y = [315, -177, -329, -250, -71, 101, -295, -4, 227, -37, 4, 107, -119, -151, -379, -360, 52, -92, 491, 306, 72, -52, 421, -445, -406, 154, -177, -23, 52, 315, -16, -176, -166, 268, -440, 193, 66, -171, -588, -44, 167, 256, 167, -135, 17, -551, 58, 518, -226, 160, -39, 154, 32, 540, -168, -233, 15, 83, -314, 25, 43, 224, 172, -139, 132, -128, 242, -355, -64, 284, 211, -119, -153, 168, -292, -179, 17, 10, -242, 2, 126, -489, 164, -503, 247, 149, 171, -440, 546, 47, 72, -156, -299, -429, 9, 17, 191, -96, -402, 100, -114, 4, -51, -151, -4, -57, 71, -23, 109, 48, 156, 51, -215, 81, 130, -113, 60, 77, -140, 115, 90, 239, 11, 53, 48, 227, -216, 51, 53, 19, -150, 198, 51, -199, 111, 0, 50, 55, 109, -157, -70, 28, 99, 2, -262, 325, -92, -97, -14, -14, 23, -209, -14, -88, -96, -79, -101, -129, -229, -203, -222, -244, 135, -35, -64, 131, 71, -138, -231, -233, -57, -248, -52, 9, 127, -245, -79, 55, -63, 179, -5, -45]
7580d5k71M49m8%k72J68J48j58j49Q5J68j31q5K40j17Q0J63l32nJ90Jj6k59L2
7604a64N7K12K0j58o3K55k32LJ33q7o1O3l0j38J12j17M47m48K79r7J33K1k19J74
7628I5L2r7k55K31J82j96Qq5J49j6L9K5m25L64l01J62j36p1K50k96J97J67j52
7651a29j96J49L1K36j67P3J4j14L16m62n0K87J84k32R5q9L3Po0j13R7J16j37J78
7675F7P9j30N8K2m1j19J51j42K48j77J00j23J06k69J44m3m6R8J2J86j52j04J39
7698F4k12M44k19m6q4k8K44m41M23l44L44q1j48J51j20J35j88J35J69l34L65l35
7720a06L29j86K37m79Q1J24Lo0K16p2l34K56L04k91k79K11k7M4R0K6M3o1j9RP3
7745A32j29J20j62r1K62j27n0M28l17J50m7j66j01J09O4j10r1j08M61k90%J77
$$ y = [-45, -316, 133, 85, 85, -187, -19, 129, -29, -178, -93, 75, -56, -141, 99, -18, 62, 225, -107, -112, 78, 79, 63, -196, -164, -107, 105, 125, -33, -96, 159, -73, -70, 63, -24, -85, -22, -52, -190, -78, -195, 252, -196, 83, -14, 119, 140, -79, 95, 127, 30, -225, 6, 188, -8, 0, -85, 64, 48, 87, 112, -313, 51, -250, -88, -224, -295, -45, -341, -144, 23, -129, -325, -176, -145, 91, -76, -3, 11, -103, 213, -249, -299, -12, 172, -60, 35, -54, -21, -14, -74, -187, -90, 26, -111, 67, 146, 16, 74, 96, 55, -64, 87, -55, 193, 16, 116, -7, 99, -170, -26, -69, -115, -17, -5, 181, 29, -75, 64, -148, 296, 77, 31, -53, -81, 163, -278, 145, -199, 145, 64, -84, 67, -53, 82, -106, 29, 198, -136, 229, -106, 223, 37, 274, -205, -124, 0, 3, -57, 159, 87, -247, 9, 313, 22, -257, -46, -73, -29, 61, 87, 130, 69, 50, 59, 132, 3, 123, -39, -130, 132, 5, -45, 383, 66, 216, 169, 3, -98, 11, 75, -35, -126, -234, 227, -63, -63, 114]
7767A14j08PO2n2K02l51M76k49P7j58K92k77j98L00j21qR0p1N3J6l01J92j13m
7791a30K33o0o8j13j77K32K52k15O8l77L09n3J10J61m23K60j31J35NJ58r6J0J
7814I1j61o6N9n2K5RK05O8q8m3q6P8R5J35k98j30J49J20J19j24K6j20j73K23j07
7839d6O3n0M2j75J62J42j89J00k20J2J92j06m7J37p7j3J03k5J30M3k11j06k55
7862c94K60K49p6J05m61L54j19J93J73k62P6k77J85k3J25l6j47K20j43n0K89k00
7884D1k43M47k43J32k05O9M5k68r0K05m3M76k21j15k2J32k59p6J98N9PR7l76L62
7908A09k44K34q9l3K85l10J18k0J00j08J88k06k21K11n3m45Q30r2J29p11K52P1
7930en9k40K92M14m58M33l38Nj29l28O96o4j22l27M81m36M32K62n37R6j05J72
$$ y = [114, 6, 13, 75, 23, 225, -126, 350, 101, 178, 20, 312, 35, -163, 137, 16, 8, 98, 27, 80, 96, -205, -13, -126, -130, 103, 43, -25, -138, -315, -83, 169, -46, 22, -355, -46, -99, 11, 172, -251, 9, -122, 13, 18, 176, 80, 90, 91, -70, -136, -77, -129, -104, -95, 110, 178, 90, 47, -39, 39, 134, 269, -29, -159, -10, 110, 229, 105, 131, 11, -162, 61, -46, 17, -33, 9, -166, -4, 138, -51, 49, -171, -159, 33, -73, -120, 17, -60, -73, 30, 5, 135, 178, -33, -139, -394, -134, 115, 39, 144, -317, 37, -82, 111, 284, 22, 98, -179, 6, -17, 108, 72, -75, 145, 2, -48, 241, 41, -202, 245, 2, 134, -71, -2, 43, -225, -315, -110, -153, 323, 102, -13, -35, 97, -162, -238, -40, 19, 26, 123, -253, 109, -135, 99, 10, -23, 262, -48, 70, 50, 150, 42, 230, 24, -197, 14, -39, -484, 346, 254, 383, -328, -76, -5, -64, -304, -12, 402, -56, 377, 39, 44, -85, -413, 283, 219, 97, -230, 251, -185, 247, 509, -28, 68, -37, 135]
7952A35l17Q9p6J87O30j142N28k8j52J63J79N9l15k57J66P33n33n81M66o2J81
7973E3M23r38N44k6o25L07M68j06j88k09k09J2O65M31n6o64L49r4l36J95l04L19
7995A1k98L15k9J7R8k24J88j90J67k94J12K97k11Q3K2Jj13J28m6OJ61l07J70K7
8019I1n8m7k0p7L8N7j41J82lqJ2Q0k16J75p3j4K0K17J22k61J1m8j2j08K42k46
8045h5j34M40l37K47l09O7L39k49J7j10R5p9J30L5J3mQL8k33J22j28K60o6K7k6
8070G8j77J14J55k96K70k17p8kK07l17M01l0M4j51m4J65j71k19J77M3J99j35K2
8093C8l00K13J98j89J16j01j57K68j69Q4q5J11P3n4j18k27K47jj10R7J91J19l43
8116i9L89k49N8l7k88N32l63O8M6q2Q0jJ52n0j08r2J4q9M9J08j2K31j64r5P9l0
$$ y = [135, -182, -93, -169, 18, 648, -494, 34, 6, -146, 17, 196, 255, -60, -317, -151, 582, 49, -532, -66, -128, 53, 476, -462, 82, 56, -569, -262, 206, 100, -88, -297, -506, -494, 171, 602, 546, -118, 231, 137, -199, -4, -308, 11, -287, 28, -1, 16, 114, -110, 78, -112, 55, -239, -127, 170, -41, 42, 64, 65, -48, 80, 34, 40, 201, -106, 64, 91, 33, -14, -34, -111, -73, -16, -157, 25, 22, 14, 26, 106, -110, 65, -8, -22, -2, 215, 337, 76, 87, 39, 27, -81, 161, -85, -219, 221, -116, 131, -178, -111, 228, -21, -4, -114, -19, -98, 32, 67, 80, 76, 84, 122, -111, 11, -117, 143, 77, 104, 78, -99, 15, 170, -126, 144, -73, -151, -153, 54, -263, 138, 108, 152, 1, -43, 122, -49, -268, -91, -48, 151, 16, 38, -262, -49, 149, -40, 76, -25, -182, 86, -83, 1, -84, 27, 100, 46, -72, -299, -52, -53, -163, -66, 125, 244, -99, 290, 41, 99, 62, -226, 306, -57, 11, 57, -25, 55, 54, 206, 156, 48, -44, -30, -119, -70, 38, 26, 257, 93, -2, 77, 47]
8142D7J31j86q4J74n7j83K11R1J27l24J62o6k52J49J44l64J93J66n8o7J6p2J73
8165G1J69m6k53M8Q5j6k47L14j18K12j8%l05j80M34k18Q1j16K00M0M5k15J7n8
8189g4L22n1
$$ y = [47, 178, -8, -92, 82, 25, -158, 53, 144, 271, -53, 109, 43, -209, -60, 84, -280, -87, 79, 21, -46, -30, -102, 71, 240, 194, -59, -11, 74, 58, -189, 125, 7, 219, 201, 201, -104, -284, 150, -68, 13, -103, 97, 137, 182, -33, -16, -74, 248, 197]
8191A97
$$ Imaginary data points
##PAGE= N=2
##DATA TABLE= (X++(I..I)), XYDATA
0@%%%%%%%%%%%%%%mJ2j6J6j6J9k7L2m0M8n6O5p3Q8j04J20j37J54j77K02k27K58
36A37k91L28l69M14m62N14n72O35p03P78q60R49j046J153j272J400j540J697j873
55i83K068k283K529k813L138l517L968m516N198o074P252q947J1651j7017N2651
70D2305p1309M4333J3722m4875O8155l0789l3066M6171j2605m6498R3232q7542
82a8766K2177L1747m7292L8671j9013k6278K2732J6299m3583N1641l2470k1828
94b5963N0736m8655L9800j5129k5252J6902K0084l1446J3467N267l4353N7341
106B2799m5215J2674J9915l1140J0402J0194r046m017K9141m7565L9660r760k2486
119b4444M2292k8904M506R705M74j8114K9678k9899J0704K9270m8497L9329j5204
$$ y = [0, 0, 0, 0, 0, 0, 0, 0, 0, 0, 0, 0, 0, 0, 0, -4, 8, -8, 8, -8, 11, -16, 16, -24, 24, -32, 33, -40, 48, -56, 64, -73, 81, -96, 106, -121, 137, -154, 174, -195, 219, -243, 271, -301, 334, -369, 409, -451, 498, -548, 605, -667, 733, -807, 890, -983, 1085, -1198, 1331, -1482, 1656, -1861, 2107, -2409, 2789, -3285, 3967, -4980, 6671, -10346, 42305, -29004, 15329, 29051, -15824, 52331, 21542, -11524, 34647, 22042, -24456, 68776, -18766, 3411, 35158, -12134, 26537, 7524, -18754, 3978, 20277, -23306, 28335, -4135, -25963, 24773, -23882, 15918, 789, -24463, -7561, 12523, -18923, -5456, -189, -34542, 22799, -22416, -9742, 10173, -20967, -10565, -371, -9417, -13434, 15707, -31858, 7802, -1958, -24444, 17848, -11056, -6550, 3155, 3629, -14485, 15193, -14706, -4002, 25268, -23229, 16100, 896]
132H96p144J2198l91r313K0132j1395k4808M7593m0580K2929K450k6127K4715
145A1155o503p001O129O919l1026M1175k2945o609K6152l8314K8314n113r618
158g285M715R391k4142J9397J979k5768L9141l9626J7475J1431j8915O997R57
171d253p370M367J8101l6380L4771j8387p544K7851k6330J3392m46j457p495K0776
185I596k5439J4067J0907k9060L3906k1943N352M239l036l415J2772o606j2503
198a1163K8521l2064K4081n483j0600J5925q832j006J715R119k2072K7812k0809
211d856K661J6684k5968K0347q466r34n17J1256j8828J3605K89j8806L1131k9391
225a1793J3622K376r073L361M787p461j127J6292k9335L0308j5619n703J7286
$$ y = [896, -6248, 5950, 5559, -3754, 16378, 4983, -19825, 27768, -12812, 10117, 12567, -13560, 11155, 4652, -2349, 3780, 10699, -20327, 20848, -2097, -8706, 17446, -20868, 7446, 2333, -7285, -2570, 6821, -17321, 2076, 4055, -21713, 17428, -22198, -4723, 6708, -12207, -5210, -4253, -11623, -7256, 10845, -25535, 9236, -9151, -16695, 11156, -15174, -1782, -2228, -3685, -11180, 9596, -15843, -1776, 9131, -19929, 13977, -7966, -2614, 1625, -1411, -4826, 7946, 1340, -11163, 17358, -14706, 9375, 3892, -6708, 9217, 385, -621, 1094, 10213, -11859, 15953, -4856, -2195, 14489, -11479, 8868, 402, -532, -1049, 10207, -8621, 4984, 5273, -13533, 17598, -11793, 1829, 4205, -4868, -1507, 3280, -4181, -5308, 10984, -18351, 11957, -3662, -9365, 7921]
238G921j7532R454L62j368q415K0464k2102J1338N633k1130K6388j8658O728J941
252A024j543o231J2640p029p555K2830k9552K3167p173o550J1805o707k64K341
266A203N270j6600K3964k0609O592J0847k0343J8498r582K384n36P598j5318J4175
280G543l402j2653K4537k4885J4703k100m496K574L235n840N31J1522k2436K4735
294A3568j6991J878J0826j4451R038k126Q24q730J7481j9590J1189J840j5305
307a0549K0927j6548P701j611P10o436J0461o891m540J6327k3420K0732r885j222
321d244O360n135j3J135N114j4211K0384j8729Q800M670j3620J4698r240L722
335c09k580Q141j3607J3350m940p377J8432k0452J4711n750%J148L279n397J306
$$ y = [7921, -9611, -157, 205, -1163, -9578, 10886, -11216, 122, 5755, -15375, 11013, -7645, -917, 1024, -519, -6750, 5890, -1139, -8694, 14136, -15416, 7751, 578, -5972, 5833, -874, -1138, 1203, 6473, -10127, 13837, -6772, -180, 10667, -9676, 8822, -760, 1624, 1088, 8686, -6632, 7543, 4141, -8512, 16025, -8860, 5843, 3743, -753, 1821, 5056, -784, -253, 11269, -11167, 13568, -3423, -1545, 9281, -5170, 3868, 1742, 2566, -6164, 11317, -8273, 2916, 4756, -10549, 10378, -6170, 1531, -80, 630, -5806, 4655, -2236, -6776, 9551, -13869, 6863, -3022, -4244, 2116, -3019, -3032, -1897, 3217, -10994, 9390, -9339, -539, 4131, -9489, 5209, -4031, -309, -2889, 5252, -8355, 4995, 55, -7322, 11110, -9342, 5369, -381, -381, 767, 4046, -1351, -45]
350d5Q425j7615K1379j5838M460N310q848P463l361K178p101J3566j6398J2789
364F364k495r626J5208j4521R750m639K811o391Q505o264j587J0602j8217J7661
378G161j0644K497J743k952L4L92L865j0946J6502j6925R410P79q140J0128p410
393d506L915m052Q388j1917J1513o195l472J3194j5523J2503o560K138j596N050
407B880n491J920O177j3911J8340j4815P281J320n519N341k246K701n724J0592
421H846j4905J3709m624m418J0595j3033R767m451K909n277P635p618K527O031
435G693j3451J5270j2594N963l62j611M51q86J194o132J2416j3722R388m700j692
450b775O938p777M908o365Q033q578Q486n936j067P286j0107R877q206O378n499
$$ y = [-45, 8380, -9235, 12144, -3694, 766, 6076, -2772, 4691, 1330, 3508, -3593, 9973, -6425, 6364, 3869, -5757, 9451, -5070, 4680, 41, 2852, -3539, 4966, -1298, -2885, 7717, -10500, 7161, -3483, -986, 757, -2195, -2161, -1769, 2096, -8850, 7652, -9273, 137, 916, -7224, 2904, -4506, -591, -4643, 3745, -8172, 3341, -2854, -6326, 6868, -8655, 3848, -2712, -574, -2170, 2880, -2611, -691, 5486, -8425, 9915, -4900, 2381, 3701, -1818, 3523, 1277, 3978, -1746, 8846, -6059, 7650, 3026, -1392, 9203, -3830, 5937, 1486, 4395, -882, 6753, -865, 1662, 7693, -5758, 9512, -3082, 2881, 2519, 908, 1359, 473, 1667, -4465, 7951, -5771, 3617, -1083, -2775, 4163, -3614, 1294, -5071, 2962, -5616, 2870, -3066, -4133, 3153, -6954, 2923, -5283, 1095, -4404]
465d404M806l052k54N189j0216J2422j1467P965k266j416J370j500M737o961R456
480D409j2110J0651l762l092P313p871O748m933M747p507J0540p926K045M860
494D112j0806J3675j0382M107j018R66j826K283j019m944J2563j3531R345l932
508d07j905O735o335L099j449M368q151Q852p973M259L654j0226J0402q884P092
523C131l503J396k714L062R87n213Q683j1801J0895o180J837P40l290M689m981
538b262O002p953Q644p020K408J329m084P268q887O471n921P039n120J73K623
553G10m940P747q396N688m614M888l163N76J488n981J0510j0422P259m259J534
568a375J541k574K044l213P613j0188R438o572K755L507q226P751m568M897m956
$$ y = [-4404, 402, -2650, -2904, 2285, -7931, 4491, -6976, 989, -1277, -2693, -1323, -2823, 1914, -5047, 4409, -7701, 2950, -812, -3904, 3409, -4462, 2286, -2647, 2100, -5407, 5133, -2793, -748, 4112, -6694, 6981, -3401, 706, -312, 654, -1172, 1111, 92, -4852, 7711, -5820, 3525, -407, -2312, 4423, -1912, 1187, -262, 4106, -4045, 4807, -3166, 1093, 4747, -5479, 4923, -3961, 3131, -372, 1024, -1690, 1372, 2359, -2854, 5829, -5972, 4923, -1257, 580, 1320, -1970, 2719, -2262, 3740, -4213, 4431, -2589, -181, 1148, -2936, 4332, -4555, 1916, -4005, 3034, -2086, -1913, 710, -4230, 3517, -4879, 809, -3805, 1083, -2080, -1504, -16, -5997, 4513, -5909, 1350, -2909, -1375, 166, -2408, -364, -3577, 4036, -6152, 3286, -3286, -531, 2976, -5250, 2501, -2067, 2830, -2126]
583b126M654n323N154j81n991R940j0717R698m863K5J487n84J061k197M394q095
599c664J1190r249L422J546m880P314o993M135l771N459n658L537r00l222P123
614E389r779Q350n645L305j652n73J373k142M891q227P289n875M708j537k452
629b577M146m898O546p010O508n918L594M45l479L798m798O729o442N473m650
644b533K669J024l772N029m716N722n502K981j246R72Q12l679O213p991Q937o546
660a626J515J186j828L320m026M145n073O110o674N749p22l438M982o280N054
675B394l969K862k109K332j376j770N442p940Q379p253L669j022o44K100l153
690b058L404n486O742o410N247j721k356M043n960O045n084L933l898M908k052
$$ y = [-2126, 2528, -2795, 2359, 2178, -3813, 6127, -4590, 5108, 245, 270, 1757, 1173, 2234, 37, 4431, -3664, 7526, -1723, 1699, 3245, -1635, 5679, -1314, 2821, -950, 4509, -1149, 2388, 1488, -1734, 5389, -4390, 3960, -1685, 1620, -32, -605, 768, -1374, 3517, -4710, 2579, -3296, 1412, -125, -2577, 1569, -3329, 3217, -3793, 2715, -3203, 391, 836, -2643, 1155, -3643, 3086, -3356, 2117, -2533, 136, 1160, -2612, 2417, -2299, 3423, -2079, 902, -344, 628, 1440, -2239, 3974, -4017, 4920, -1626, -111, 1075, -753, 2567, -1459, 2686, -2387, 3723, -2951, 2798, 2076, -1362, 3620, -2660, 2394, -1575, 1287, -822, 1510, 134, -1636, 3806, -4134, 4245, -3008, 661, -361, -1005, 1095, -2058, 1346, -4140, 2602, -3808, 1439, -282, -2638, 1405, -4555, 1490, -3594, 339, -3559, 1349, -703]
705g03j828L561m688N882n732N119l660K305j79k662N259m978N253n238N321k157
721H75j031J939l571M668m590M358m930N093k409p84L157m041N528o098M895m183
737a124L153j165j182L238m547O324o788N067l258O70J068k381M192n554M955
752B668n083M769l254j86L166m546N017n701N644n612M366k198o57K873m597N706
768B375n621M895l806K648j398o85K668m327N768o078M971l388J280J117k854
783b435L481m526N785n350M618k596J96J985l291M694n042N040m232L447k014
798b40K9K157l609M966n462M898l738K048l05j496L079m364N594n862N517m223
814a011J354J484k575M065n153M973m579L708k554O42J588l844N133n731N337
$$ y = [-703, -2531, 1030, -3658, 2224, -3508, 1611, -2049, 256, 77, -2585, 2674, -2304, 2949, -2289, 3032, 875, -156, 1783, -1788, 2880, -1710, 2648, -2282, 2811, 402, -382, 2775, -1266, 4262, -1836, 3059, -1124, 2029, 864, -318, 2920, -1627, 4697, -2091, 2976, -282, 388, 1456, -925, 3267, -2287, 2668, -2415, 2354, -900, -1086, 2080, -2466, 2551, -3150, 2494, -3118, 1248, -950, -1607, 1266, -3331, 2375, -3246, 1649, -2157, 491, -907, -1592, 1076, -3251, 2517, -3561, 1410, -1978, -698, 419, -2435, 1046, -3480, 2305, -3045, 1573, -1023, -827, 1158, -2133, 2561, -2481, 2559, -1673, 1774, -240, -211, 1946, -1663, 3303, -2159, 2739, -999, 1049, 744, -752, 2327, -2037, 3557, -2305, 3212, -1011, 343, 1827, -748, 3317, -1836, 3137, -1442, 2266, -288, 354, 1942, -1902, 3231, -2500, 2837]
829B837m227K652j378o85K118l913N209n850N411m275K144K77k361K878l861M975
845A951n461M734l334J330Q86k771M322n005M575l892L656k790R82J183l262M987
861B091n599N742m556K687q10n92K117k981M231n057N462m107K414l04j771L720
877B687m577M754m617M365l005J824k4k006M005n255N426m781L330j732J76J249
893A819k820L765m317M317m321L118j568m28K176l834M867m967M212l907K094
908B06l25j254K590m167M698m716L873k914J312N80k241L429m479M593m177L377
924C85k203Q33R96k576M108n388N438l880K391o63j117K678l174L494m063M787
940B046m093K669m69j743M011m585M662l994L331k148J333m51q42L082m790N410
$$ y = [2837, -1390, 1262, -116, -801, 1317, -2596, 2613, -3237, 2174, -2101, 43, 320, -2041, 837, -3024, 1951, -3510, 1224, -2110, -780, 106, -2665, 1657, -3348, 1227, -2665, 991, -1799, -817, 366, -2896, 2091, -3508, 2234, -2322, 365, -445, -1037, 1080, -1901, 2330, -2727, 2735, -1372, 1042, 738, -1033, 2687, -1890, 2864, -1753, 2612, -393, 1431, 1407, -599, 3406, -1849, 3577, -1204, 2126, 394, 570, 1819, -1001, 2764, -1553, 2764, -1557, 1561, -7, -435, 1741, -2093, 2774, -2193, 2019, -1888, 206, -119, -1373, 1217, -2950, 1748, -2968, 905, -2009, -697, -117, -2358, 1071, -3408, 1185, -2992, 385, -1818, -985, 11, -2565, 1543, -3845, 1593, -2287, 104, -559, -1676, 1002, -2172, 1322, -2741, 2046, -2047, 622, 153, -1590, 2421, -2164, 2498, -1496, 1835, -313, 1020, 569, -273, 2809, -1981, 3429]
956C429n321L876j060p97J635k600L287l283L547m303L785j622m56K316m442N198
972C189m471L012k335J366j51o61J542l444M895n234M270l218J334R09k608K962
988A357l473M111l468K644k527J222J003l000L933m992N320l501J522n94o93K235
1004A099k852L205l914M599l724K187o33j328L436m152L949l820L446j668K75
1019A05l80m01K954m325M437m730L944j258r30J831k310L377l456K985l456L587
1035A974j856j22J363l378N356n014L293k253J310j8j183J381k520M414n208M235
1051A774l020J218J588l396L229l163L289k895K374k553J578O50k519L717m640
1066b769M515l029R41j76j99J611k596K679l348M182l583J876m80j104L352m117
$$ y = [3429, -1892, 1984, 924, 127, 1762, -838, 2449, -834, 2713, -1590, 2195, 573, 117, 2433, -2009, 3189, -1282, 1730, -605, 761, 610, -51, 1491, -1953, 2942, -2292, 1978, -1240, 94, 1003, -1605, 1357, -2116, 1995, -1473, 1171, -1356, -134, 869, -2131, 1802, -3190, 2130, -1371, 151, -443, -1136, 1099, -1753, 1452, -2462, 2137, -1587, 600, -33, -1361, 2075, -2077, 1872, -1948, 1498, -170, 105, -275, -676, 2278, -2047, 2390, -2340, 1604, 346, -584, 1247, -1063, 2314, -1142, 1843, -1613, 1974, 118, -4, 1359, -2019, 3337, -1677, 1616, -637, 673, 655, -528, 853, -1667, 2747, -2461, 1774, -1246, -28, 1560, -1836, 1393, -1770, 1519, -1376, 998, -1555, 23, 673, -1846, 1871, -2769, 1746, -1283, -342, -518, -717, 894, -1702, 977, -2371, 1811, -1772, 104, -376, -1480, 1872, -2245]
1082b245L638l186L009k107Q20k19p34K784l925M189l879L341j667k60J334k084
1098a191L112l209L042l010K652j725l9J585k891M539m401L095k000J284k05j105
1114d67J685k291L482m092L417k417J176O46k403L000l142K982k629K104k032
1129i81J373j8j911L225l883L982l176J501k09n93J332k148K396k988L710l595
1145a983K046r8j401K770l388L101k797K597j750O99l5r11K465l448L826l579
1161a886K827j253j95J008j713K760l268L413k918K195j154o7J547k438L149l391
1177a384K906k460J698l35o54J551k310L035l284K646j828J183L1j463K576l082
1193a174L047k819K055j342N17M91j703K576l458L591l012K023q19o11J313k102
$$ y = [-2245, 1393, -1793, 1216, -891, -71, -290, -1024, 1760, -2165, 2024, -1855, 1486, -181, -441, 893, -1191, 1921, -1288, 1754, -1256, 1396, -329, -368, 1217, -1674, 2865, -1536, 1559, -441, 843, 638, -467, 1218, -1073, 2409, -1683, 1734, -683, 493, 1139, -1264, 1736, -1406, 1576, -1053, 1051, -981, 392, 374, -1537, 1688, -2195, 1787, -1389, 112, -97, -690, 642, -1506, 890, -2098, 1612, -1983, 63, -35, -1436, 1334, -2054, 1047, -1750, 847, -903, -204, -239, -1150, 1315, -2133, 1693, -1886, 941, -312, -507, 501, -1212, 1548, -1720, 1693, -1225, 970, -184, -251, 1296, -1142, 2007, -1384, 1522, -938, 760, 425, -229, 1322, -988, 2047, -1237, 1409, -419, 764, 795, -668, 1908, -1174, 1873, -946, 1109, -233, 284, 775, -928, 1648, -1810, 1781, -1231, 792, -27, -638, 675, -1427]
1209a427K660k788K862k907J778m17p32J736k773L206k763K337j937J088j24j243
1225a444K202k977L540l287K581j309J92P20j630K427k617K859k529J913p85l18
1241d62J400k128K728k849K684k058J223m21n76J633k019K495k602K467j831Q36
1257E20L6q21J832k440K655k331J698j266L67M06j558K644k862K824k679J828
1273H53r32j69R79j651K439l074K801k464J674m18q68J861k428L061l285K292
1289F71j571N57K36p26J634k632K922k653K313j595J08J149j422K110k580K176
1305F97k028J811j188J21R83j658K727k634K066j555R47l22n96J389j854K349
1321A255k362K087j612J071k07q60J606j661J891k371K221q70n89J085j169J985
$$ y = [-1427, 1233, -1555, 1307, -1600, 178, -239, -971, 765, -2008, 1198, -1565, 772, -1165, -77, -201, -1444, 758, -2219, 1321, -1966, 615, -694, -502, 218, -1412, 1015, -1602, 1257, -1272, 641, -144, -462, 938, -1190, 1538, -1311, 1373, -685, 538, 117, -459, 1174, -845, 1650, -952, 1515, -316, 520, 556, -265, 1567, -873, 1782, -549, 1149, -117, 250, 656, -902, 1742, -1120, 1704, -975, 853, -79, -248, 731, -920, 1519, -1555, 1246, -1218, 456, 38, -830, 1031, -1397, 1664, -1621, 671, -900, -343, -107, -833, 801, -1831, 1091, -1562, 751, -844, -736, 413, -1009, 1101, -1479, 697, -1331, 480, -708, -587, 396, -1262, 1465, -1169, 897, -658, 289, -33, -629, 760, -1094, 1255, -1107, 980, -632, 439, 232, -628, 978, -683, 1208, -1163, 1058, 188, -401, 684, -485, 1500]
1337A500k122K157k060J479j007j1N99j536K309k149K204j963J175r95K50P85
1353F15j821K200k490K056j349J443m26j262J873k180K274k735K222p40j35K45
1369b10p61R37j451J958j933K136j227j69N88j691K848k433K255j617R98k25n59
1386e56J240j844K083j960K103k131J725j8j283K189k376K118j954J746j374R63
1402F71j94q58J810k366K262k320J702o38k51O52r79K280k459K095j684J278j405
1419d04L16Q91j910K603k393J478l21Q2j1n59J537k593K716k529J942j138o14
1436i07P99j122J478k586L518k054J720j563K48P08j549K671k744J790j981J673
1452I9r1l26P98j569J985k375K408j112L92m0o18R02j362J483m96N01j381Q45
$$ y = [1500, -622, 1535, -525, 954, -53, -64, 535, -1001, 1308, -841, 1363, -600, 575, -420, -170, 615, -1206, 994, -1496, 560, -789, 654, 228, -1034, 839, -1341, 933, -1802, 420, -320, -455, -210, -971, -34, -1485, 473, -1460, 676, -551, -720, -132, -1823, 1025, -1408, 847, -770, 228, 3, -556, 684, -1160, 923, -1037, 1066, -1065, 660, 642, -641, 1548, -828, 1290, -664, 1082, -292, 671, 477, -381, 1429, -937, 1325, -995, 707, 69, -182, 470, -509, 1771, -688, 1407, -277, 1001, -404, -88, 803, -1107, 1496, -897, 581, 260, 342, 331, -228, 1309, -1284, 1432, -1097, 845, -293, -907, -108, -1230, 248, -2338, 1180, -874, 846, -717, -469, 239, -1310, 1361, -1383, 407, -1574, 99, 8, -318, 480, -1089, 896, -1479, 929, -183, 209, 169, -449, 453, -909, 574, 78, 579, -802, 43]
1470D3R15j770J545j235K459k190L69J29J2J121j404J080j664J943k055J779j157
1487h0l96J513j733J955j911J276q21M04j09j69J623k229K872k956R91N12q2l97
1505B63j068J978j984J381j325J039p59J65K65j368K246k291J861j265N12J77
1521a73q09P32p74J668k028K432j947R44K35j304J715k116J727j367Q95q69P92
1538b47N40m79J241k107K037j705R97l90k34J001j212J222j154J569j577J248
1554G50o00j03J091k093K159j901J459q85M69O8o45J090j435J597j888K092j187
1571C8p4M57r78J655k035J716j400J349p61n4L18r70J760j816J349j188N41l2
1589a25j61J59o21J275j632J885j701R23ro62J148j244J546j599J187j081P42
$$ y = [43, 958, -812, 733, -502, 1957, -233, 136, 265, 277, 1398, -6, 1074, -590, 1353, -702, 1077, -80, -476, 1037, -696, 1259, -652, 624, -197, 207, 98, -71, 1552, -677, 2195, -761, 230, 742, 660, 263, -805, 1173, -811, 570, -755, 284, -475, -310, -45, -1413, 833, -1458, 403, -862, -350, -173, -982, -250, -1024, 644, -1384, 1048, -899, 45, 280, -1024, 691, -1425, 302, -1065, -170, -1039, -247, 293, -186, 1055, -1052, 985, -720, 277, -113, -347, 654, -558, 664, -490, 1079, -498, 750, 150, 47, 1138, -955, 1204, -697, 762, -123, 346, 414, -231, 859, -576, 1021, -867, 1225, 38, -36, 421, -557, 1098, -937, 779, -621, 728, -33, -87, 231, -739, 1021, -795, 554, -634, -93, -125, -286, -127, -748, 527, -1105, 780, -921, 2, -7, -669, 479, -765, 781, -818, 369, -712, 30]
1606C0M9p47J251j768K006j796J241l24j48R86j229Q85j180J738j460P43l00j5
1624c8Q08j487J553j441J332q43L54M5l50P37j136J588k045J812r94K52M18j066
1642e01J528j701J324j253J137p89M73J85r68J422j879J839j247M48p3l42O07
1659B10j024J156j135J470j190M50k6p73J486j659J455j173Q96p22O15r4o90J326
1677E78j617J694j432J130q39L98M10j023J353j305J107j014J039p40J52N96j401
1694i14J662j377J205j062N70M4m20J118j400J504j256J117q28K38J41o51J263
1711I54j598J619j596J262n46o3L99r41J498j591J308r25M01k29q3N53j028J291
1729F85j173R98j140Q53j33l53O78j230J501j641J273n88M12j19o18R46j253J331
$$ y = [30, 79, -668, 583, -1185, 821, -975, 266, -58, -206, 780, -449, 436, -744, 994, -466, 277, -23, -38, 770, -717, 836, -605, 727, -116, 238, 283, -67, 670, -466, 1122, -923, 889, -105, 147, 565, -501, 1027, -674, 650, -603, 534, -255, 218, 403, -565, 857, -1022, 817, -430, 18, -55, -397, 210, -814, 342, -793, 677, -513, -63, -89, -862, 624, -1035, 420, -753, 143, -579, 36, -58, -748, 578, -1039, 655, -777, 353, -486, -88, 322, -701, 652, -653, 454, -560, 479, -261, -109, 487, -914, 748, -629, 576, -486, 84, 128, -292, 826, -574, 930, -326, 791, -37, 201, 342, -309, 954, -644, 975, -621, 641, 95, 32, 431, -510, 988, -603, 705, -220, 181, -48, -131, 422, -606, 685, -488, 510, -630, 223, 90, -263, 415, -815, 686, -955, 318, -270, 142, 23, -595, 351, -902, 429]
1747D29j344J345p53J25K62p75J105j338J400r60P04l84j93P36j052J286j316
1764g23J193r85O04l3k15O91j045J157j091J109q03K89j4l74J019j437J641j580
1782e97J274q45K36L61p85J281j409J117j304J180n34m4O22r26J219j414R90q12
1800c90M49q9k35O78j103J152j079Q34o97O47M7o43J048j646J727j379J036p64
1818d07M37L5n24R26j202J178j074Q89m21j58N73r27J345j332J112o74K86Q8l74
1837b24P72r46J158j449J155q79N79L45r60J193j264J293j193R82p20K30M17q22
1855c33J170j273J522j277N82k77p9P24j125J199j302J066r30O02m2l48P60j272
1873f33J345j143J044j022K52J7j89Q38j321J517j157Q04n57k54O87q26Q14j025
$$ y = [429, -915, 430, -323, -198, 64, -711, 394, -944, 456, -504, 200, -184, -377, 359, -693, 593, -723, 470, -515, 89, 56, -159, 532, -513, 644, -447, 662, -141, 148, 134, -240, 779, -658, 983, -597, 677, -168, 68, 429, -356, 925, -484, 633, -671, 509, -25, -69, 553, -373, 846, -568, 422, -390, 59, -30, -265, 413, -690, 462, -617, 217, -480, 167, 214, -429, 619, -1027, 700, -679, 357, -407, 30, 65, -459, 467, -735, 443, -631, 258, -163, -321, 252, -675, 670, -662, 450, -224, 62, 150, -224, 548, -398, 760, -689, 466, -413, 166, 511, -449, 744, -520, 773, -420, 562, -158, 72, 489, -333, 837, -436, 1086, -191, 391, 114, 35, 759, -366, 833, -469, 597, -333, 269, 227, -121, 639, -633, 712, -431, 613, -409, -157, -140, -329, 509, -812, 705, -452, 352, -205, -459, 228, -598, 216, -809]
1891h09J178j015Q40n93o9P49j228J348j405R81n08N00J59o01N31q67J196j167
1909g80J220p35J90K92r49J242r15J111j059P68l38J63p8m08J015j335J346q88
1927a38K92L0j68O63j096J116j193J163j096P81%o22J329j542J298j039P90q17
1945b49N45j65j87O88j355J658j505R26n99l2M13m80O17r11J010r53J000q51K07
1964b23R24j292J276j403R67o90K08J1k30N40l63O44j224J166n96K62P4o05J250
1983F96j066N81q77P64k02Q1r0n08J492j345J089j212O42M8q7Q9k68P17j086J209
2003F67j184P30P9n60P67j243J414q99N61n98N81k3k84L28r84J488j313P61m29
2022a41m4R49j752J889j850J146n64N99n30N09K06o80R85j661J329p28N03l53
$$ y = [-809, 369, -646, 194, -399, -468, 281, -947, 401, -1004, -23, -531, -31, 128, -473, 58, -809, 387, -780, 440, -295, -105, 187, -762, 480, -435, 676, -383, 385, 47, 210, 132, -276, 739, -596, 750, -138, 154, 184, 16, 679, -417, 699, -494, 669, -427, 354, 354, -268, 1061, -481, 817, -222, 568, -249, 296, 131, -56, 632, -723, 935, -570, 356, -243, -275, 138, -342, 275, -636, 374, -579, 421, -430, -223, 701, -591, 685, -718, 249, -441, -233, -222, -452, 88, -275, 369, -855, 311, -285, -23, 51, -554, 696, -370, 211, -666, 98, -104, -23, -113, -621, 871, -474, 615, -597, 45, 93, 6, 95, -173, 544, -542, 667, -517, 213, 292, -268, 499, -744, 670, -229, 332, -266, 315, 292, 8, 336, -648, 840, -473, 288, -141, -185, 764, -988, 901, -949, 197, -367, 232, -298, 211, 417, -263, 722, -939, 390, -338, 165, -188]
2040a88r0M71p31J190j282J021m23o8K31p53J237j303P23q61J141o25L41j87l16
2059d72J368j617J428j083O23j70q4J54n12R23j006R87j035R33l96j52P41j001
2077c71J179j210O75m47O02m88P6O44j090J263r48O71n71l9N26q37P62r96J189
2096E90p89M39m64K23K98p37J068j225J147p50J02J01m80O91o81J026j108Q48
2114B99o47K12J20k67N66p58Q08r32Q69o71K52K75n54Q94j129J076r67O78j97
2133g3j72K96m18O78p85R24r88P03m22QM73n46Q95j036Q31o10M27R6o56Q63q38
2154c50R21r78R38n93L91m8n68R29j031J164p77M30o94N56J45o99Q82j120J250
2173G48j248M64J62k11L18o11O70q18Q81o27K72n2j18L80n70P46q19Q40o35J88
$$ y = [-188, -278, 193, -538, 652, -630, 391, -32, -100, 131, -622, 615, -688, 35, -826, 315, -310, 31, -156, -472, 896, -721, 707, -376, 247, 77, -7, 147, -365, 558, -448, 539, -496, 437, 41, -111, 630, -371, 808, -402, 273, -174, 428, -60, 16, 660, -430, 833, -115, 556, -15, -54, 472, -365, 397, -599, 590, -199, 240, -224, -1, 297, -440, 628, -597, 550, -200, -98, 3, -477, 214, -467, 559, -549, 299, -348, -136, -16, -283, 283, -475, 333, -599, 270, -401, -149, 126, -428, 466, -663, 413, -554, 124, -73, -245, 51, -367, 311, -474, 450, -538, 165, -257, -249, 224, -322, 573, -463, 368, -242, 185, 281, -375, 488, -350, 571, -407, 531, -62, 329, 281, -287, 642, -389, 775, -2, 428, -266, 290, 435, -264, 618, -502, 748, -500, -36, 126, -85, 233, -378, 292, -526, 355, -272, 0, -52, -170, 210, -360, 386, -433, 407, -228, -40]
2193d0m6n78R51r17J184j195O51l22j07Q41o96M85r72J125j043Q48k81m1N59o45
2213b39R65j302J242j078N89j50k74P80p16N68o28P03l10l14J39m9N99j078J134
2232E81j118P98j28j50J73m67J138j278P89r52P12k11k36N82j206J364q46Q30
2250C75n40L26k98OM89p99M70j026P03n05J238o05j74J15j59O25o99L79n91L93
2270b77L11n35J279j647J202k46J14o46K98N70q37J365j957J089j71j227J345
2287C0L12n25k0L16J64O96o89j060J384j169Qr55J675r55J270o02K36N91k01n73
2307f7M21j73q35Q38n92k10N25k54J082p12L2K31N5k98k8L79j16J095j402M99
2327D70p4q41Q91n99Q14j593J147l29P02j076J021n57q66J053o89J247j865J67
$$ y = [-40, -86, -664, 287, -630, 554, -641, 10, -312, -419, 422, -274, 211, -761, 364, -679, 169, -112, -153, 406, -239, 726, -576, 666, -412, 177, 27, -247, 533, -183, 385, -243, 460, 150, -164, -25, -74, 525, -553, 581, -537, 261, 133, -17, 156, -311, 827, -451, 338, -614, 98, -113, -349, 233, -973, 391, -455, 375, -165, 161, -137, -131, 358, -441, 29, -997, -294, -799, 439, -166, -340, -225, -384, 241, -458, -79, -670, -277, 34, -501, 778, -869, 333, 87, 201, -445, -147, 423, -414, 951, -1006, 83, -88, -1315, 30, 342, -183, -203, 113, 277, 973, 284, -776, 608, -561, -553, -1508, 167, -788, 482, -120, 116, 707, 506, -67, 354, 181, -654, 184, -408, -618, -93, -347, 735, 23, 55, 286, 341, 43, 15, 394, 278, 1373, -29, 470, 396, -445, 446, -153, 661, -932, 215, -114, 588, -488, 533, -24, -890, 163, -526, 721, -1144, -977]
2345i77J269l24N77n9r13J74R4P6M22p18K03l4n2Q56o70r2J48j20J086j689Q31
2366H8o83O85l77M73j11O08n58j73j62J92J070r36n33R47j26O23q36R95j353P02
2386E35q47k45N45p30J573r85O91q60J082q12k9M75n00K56m99O07k8R6l27J20
2406A18R6o72J246j173N02r36J459k50O9m62o98P31q4K88o14O59l06L25n2r27
2426f81J066j105R54k79j17L68j17m40MJ58n41J271q81N45L79j142J342p66M12
2445D30j292J201l90K3L83l10M82j047P42p46N44J35r2k42L71M6n92P17m65J59
2465E7l01l02J068j002P91q83J001n84n0L54n65O91m35N42l76K92r3k27K45o20
2485c97P32n09L65k15j22J64j76M26r96O08l77Q71p51O36j14k26N78m62K26p78
$$ y = [-977, 292, -32, 545, 486, -427, -253, -159, -83, 339, -379, -176, -210, -262, 594, -76, -168, -20, -140, 946, -743, 88, -595, 90, -287, 186, 75, 683, 125, -48, -210, -18, 1052, 116, -417, 530, 404, 1027, 191, 1186, -167, 535, -312, -557, -12, -742, 831, -154, 537, -323, 759, -53, -82, 393, -107, 149, -350, 257, 229, 325, -2, 118, 214, -458, 788, -385, 117, -819, 640, 390, 459, -3, -701, 30, -54, 234, -380, 279, -27, 298, 246, -681, 385, -720, 234, -45, -162, 206, 89, -351, -347, -189, -730, 541, -340, 205, 584, -558, 784, 18, 430, -862, 339, -51, -28, 355, 45, 527, -520, 222, -524, 20, 155, 63, -179, 192, 238, -354, 363, -102, 57, -244, -546, 522, -480, 311, -572, 429, -155, -205, 149, -416, 275, -160, 382, 6, 298, 205, -22, 223, -397, 335, -174, 191, -24, -146, 18, -158, 268, -728, -120, -497, 374, -377, 259, 145, -81, 497, 35, 261, -517]
2505e17R64n52L62k76o13J105q81P24n01L88n14M61J61l24M10r68J101k68j35
2524A27l42k2Q20n94M71m66M73n00L75n02J75N23o79M11p55R46m70q0L45n2J83
2545C87q83N23m57P37n05J8O80q26Q58p28K93j79K51j96p1N4k98L97n09P74n10
2566a90Q5K42m65P08o68O49n39M6K4K9K44m51N33o24O81m36K13m85L68L14n07
2587b29Q06r60P33m98K18k0l32Q08p40O67o50O58m50O9Q9k52M84o68N00m75M26
2608A84l47j70M31j21M96p31O07n17K07k69R3N71m62L20l07K07l23K36j43p5K51
2629A38j37J48o45R15o54J35J08j1K9m37L92k08M53k42j34K8j71P07o89N10l11
2650g6P2j17L9L53o63P50n94L26l69K84J23j90L85n36L47n16O65m51J98m1p8L47
$$ y = [-517, 447, -105, 257, -19, -632, 473, -408, 316, -185, 203, -311, 150, 311, -13, 397, -571, 530, 262, 127, -215, -237, 583, -11, 460, -6, 467, -33, 342, -160, 15, 538, -141, 270, -485, 461, -9, -89, 256, 204, 387, -496, 27, -430, 307, -198, -180, 500, -326, 532, -196, 97, -82, 169, -27, -98, -44, -342, 55, -454, 320, -190, -105, 137, -328, 380, -288, 361, -178, -132, -108, -79, 165, -286, 247, -377, 304, -132, 81, -404, -36, 278, -229, 577, -383, 350, -148, 70, 50, -282, 526, -214, 453, -197, 461, 11, 80, 169, -83, 401, -267, 233, -242, 184, -163, -333, 98, -23, 473, -258, 349, -168, 39, -230, -137, 434, -28, 292, -15, 192, -131, 105, -38, -113, 138, 1, 149, -496, 419, -235, -100, 8, -3, 26, -411, -19, -227, 226, -16, -150, -122, -293, 414, -275, 235, -76, -4, -121, -82, 271, -392, 358, -236, 90, -279, 5, 128, -62, 323, -213, 134, -382, 283, -168, 30, -11, -89, 258]
2672B58n01P42q27L98m66L04L36m79N65n56N96k58m09K81L02j44N7L19m83J31
2692A66j95L31k97K18j81k20M35n78L70m58M06j52k30P45n93K00m16M36L28p68
2712d53N82j54P64r48K54n62M41k45j34L32r1L79k47M11J88o55L06l05O0j26Q01
2733E98j067J035p33K8P64j055O99j11O49j340J330j133M84R4M3L65p45j50N2
2752a93P68j77j19J0l12M16l97O68l95J04o44l76O41o52J340o11p8m72K53L64
2772A38o26P32m49M00n18M95j37Qm65P59J51j206P67m94M35m50K23J14q0K26k25
2793b02J02Q4Mj34j26M03j89M4k12N57m93J70J89n85N85l00K28k67M16m55J26
2814e5l0n0L33l60L36k54K11J63k28J13l80N96m27K28l95M27j40p7Q2l08N45m22
$$ y = [258, -243, 499, -328, 70, -396, -92, 244, -235, 330, -226, 370, 112, -297, -16, 286, 142, 199, 518, 35, 166, -29, 302, 5, 223, 42, -178, 257, -321, 49, -409, -3, -155, -385, 360, -233, -33, -449, -13, 315, -453, 129, -25, 739, -209, 45, -517, -76, -321, -455, -123, -214, 165, -82, 329, 517, -138, 168, -137, -77, -203, 598, -469, 566, -167, -139, 625, -430, 269, 158, 807, -533, 797, -336, 148, 242, 285, 650, -95, -245, -193, 575, 398, 279, 289, -23, 393, -4, 664, 269, 373, -271, -647, -6, -658, 682, 71, -7, -479, -226, 138, -488, 244, -205, 195, -323, 172, 35, 43, -422, 337, 488, -718, 49, -445, -10, -460, -237, -123, -203, 23, -202, -100, -16, -12, -146, -272, 131, -58, -14, -226, 331, -162, 8, 197, -388, 197, -103, 125, -142, 274, -181, -55, -85, -135, 198, -162, 174, -80, 131, 294, 66, 179, -201, 395, -32, 196, -199, 228, 88, 11, 93, -215, 330, -92]
2836i2K58m40L81J9k77L36l83N32l89L76l25J10k13k20M02m09N68l48K59m08J48
2857a15K46n49M21l73N00j22K23k75p4J47l06L32m11N06o23O63l36j76M83l42
2877a81L09k83J31q0J12P6k83L56l57L42n85N16M9j3M2o64R09p13O16l96K16k20
2899a01K14Q4l16J91j09J25l93L18L7p3L40m61O4o7K13m8N8j00K44o6l74K98J3
2922I1K09l33mm0j60M29m13N59l39M2J72n04M29j09K5k61N0j21L16j68J60Lm01
2945c68M66n55N71l76L91j71l04N73n97L60l73P36m80L53j99j7K44n88L71j17
2965h0l9J15k8Rp4K22n47N01o6P5Q9m80O50m04J83k66L84m97K17J54l50O06m25
2988e1J99l26K75l79J14K17o7M01n97N98m21K55j35j14Jq6K98m24L19l35M84l21
$$ y = [-92, 166, -274, 107, 126, -151, 185, -198, 334, -55, 321, -4, 106, -107, -327, 75, -334, 234, -114, 145, -263, -115, 131, -418, 3, -370, 130, 8, 231, -44, -118, 29, -277, 55, -356, 150, -473, 190, -146, -322, 161, -181, 128, -155, -24, -104, 8, 84, -199, 157, -200, 142, -443, 73, 122, 109, 151, -513, 396, -317, 299, -97, 119, -101, 113, 197, -119, 72, -37, 88, -305, 13, 50, -23, 317, -144, -80, -147, 66, 18, 76, -24, 220, 154, -220, 78, 91, 300, -33, -37, -77, -237, 192, -221, 338, -1, 41, 213, -291, 138, 29, 54, -207, -157, -278, 38, -130, 30, 33, -368, 98, -457, 114, -262, 129, -42, -346, 227, -370, -10, -383, 353, -127, 226, 27, 10, 254, -334, 37, -80, -119, -4, -32, -23, -97, 125, -422, 79, 13, 88, 177, -303, 347, -57, 126, -140, 244, -253, -36, 118, -232, 374, -51, 148, -178, 97, -282, -168, 49, -18, 383, -214, 384, -37, 218, 83, -31, -30, -116, 182, -242, 77, -258, 226, -95]
$$ [...]
8191A3
##END NTUPLES=NMR FID
##END=
