##TITLE=1H_Ser S-2
 CDCl3,8 sc, 
 3.02.2021
##JCAMPDX= 6.0         $$ Bruker NMR JCAMP-DX V2.0
##DATA TYPE= NMR FID
##DATA CLASS= NTUPLES
##ORIGIN= UXNMR, Bruker Analytische Messtechnik GmbH
##OWNER= root
$$ XWIN-NMR		Version 3.5
$$ Wed Feb  3 10:58:17 2021 Russian Standard Time (UT+4h)  she@DPX200
##.OBSERVE FREQUENCY= 200.1315066352
##.OBSERVE NUCLEUS= ^1H
##.DELAY= (6, 6)
##.ACQUISITION MODE= SIMULTANEOUS
##.ACQUISITION SCHEME= undefined
##.AVERAGES= 8
##.DIGITISER RES= 18
##SPECTROMETER/DATA SYSTEM= spect
##.PULSE SEQUENCE= zg30
##.SOLVENT NAME= CDCl3
##.SHIFT REFERENCE= (INTERNAL, CDCl3, 0, 15.7039)
##AUDIT TRAIL= $$ (NUMBER, WHEN, WHO, WHERE, WHAT)
$$ ##TITLE= Audit trail, XWIN-NMR		Version 3.5
$$ ##JCAMPDX= 5.01
$$ ##ORIGIN= Bruker BioSpin GmbH
$$ ##OWNER= she
$$ F:/spectra/data/she/nmr/H-F/1/audita.txt
$$ ##AUDIT TRAIL=  $$ (NUMBER, WHEN, WHO, WHERE, WHAT)
(   1,<2021-02-03 10:57:09.03 +0400>,<she>,<DPX200>,
      <created by zg, POWCHK disabled, PULCHK disabled
       configuration hash MD5:
       00 E9 B6 7A A2 85 ED C7 34 08 36 98 17 FE 4E 26
       data hash MD5: 16K
       F4 DB 03 EF 87 5F 69 50 34 E6 32 12 EC 12 24 00>)
$$ ##END=
$$ 
$$ hash MD5
$$ BB 23 9D E2 86 1B D6 AD F1 0C 08 0A 83 43 36 42
##$RELAX= 
##$RELAX= 
##$RELAX= 
##$RELAX= 
##$RELAX= 
##$RELAX= 
$$ Bruker specific parameters
$$ --------------------------
##$DU= <F:/spectra>
##$EXPNO= 1
##$NAME= <H-F>
##$PROCNO= 1
##$TYPE= <nmr>
##$USER= <she>
##$AMP= (0..31)
100 100 100 100 100 100 100 100 100 100 100 100 100 100 100 100 100 100 
100 100 100 100 100 100 100 100 100 100 100 100 100 100 
##$AQSEQ= 0
##$AQ_mod= 1
##$AUNM= <au_zg>
##$AUTOPOS= <>
##$BF1= 200.13
##$BF2= 200.13
##$BF3= 200.13
##$BF4= 200.13
##$BF5= 200.13
##$BF6= 200.13
##$BF7= 200.13
##$BF8= 200.13
##$BYTORDA= 1
##$CFDGTYP= 0
##$CFRGTYP= 5
##$CHEMSTR= <none>
##$CNST= (0..31)
1 1 145 1 1 1 1 1 1 1 1 1 1 1 1 1 1 1 1 1 1 1 1 1 1 1 1 1 1 1 1 1 
##$CPDPRG= <>
##$CPDPRG1= <>
##$CPDPRG2= <>
##$CPDPRG3= <>
##$CPDPRG4= <mlev>
##$CPDPRG5= <mlev>
##$CPDPRG6= <mlev>
##$CPDPRG7= <mlev>
##$CPDPRG8= <mlev>
##$CPDPRGB= <>
##$CPDPRGT= <>
##$D= (0..31)
0 1.2 0 0 0 0 0 0 0 0.06 0 0.03 0 0 0 0 0.0002 0 0 0 0 0 0 0 0 0 0 0 0 
0 0 0 
##$DATE= 1612335428
##$DBL= (0..7)
120 120 120 120 120 120 120 120 
##$DBP= (0..7)
150 150 150 150 150 150 150 150 
##$DBP07= 0
##$DBPNAM0= <>
##$DBPNAM1= <>
##$DBPNAM2= <>
##$DBPNAM3= <>
##$DBPNAM4= <>
##$DBPNAM5= <>
##$DBPNAM6= <>
##$DBPNAM7= <>
##$DBPOAL= (0..7)
0.5 0.5 0.5 0.5 0.5 0.5 0.5 0.5 
##$DBPOFFS= (0..7)
0 0 0 0 0 0 0 0 
##$DE= 6
##$DECBNUC= <off>
##$DECIM= 32
##$DECNUC= <off>
##$DECSTAT= 4
##$DIGMOD= 1
##$DIGTYP= 9
##$DL= (0..7)
0 120 120 120 120 120 120 120 
##$DP= (0..7)
150 150 150 150 150 150 150 150 
##$DP07= 0
##$DPNAME0= <>
##$DPNAME1= <>
##$DPNAME2= <>
##$DPNAME3= <>
##$DPNAME4= <>
##$DPNAME5= <>
##$DPNAME6= <>
##$DPNAME7= <>
##$DPOAL= (0..7)
0.5 0.5 0.5 0.5 0.5 0.5 0.5 0.5 
##$DPOFFS= (0..7)
0 0 0 0 0 0 0 0 
##$DQDMODE= 0
##$DR= 18
##$DS= 0
##$DSLIST= <SSSSSSSSSSSSSSS>
$$ [...]
##$SUBNAM2= <"">
##$SUBNAM3= <"">
##$SUBNAM4= <"">
##$SUBNAM5= <"">
##$SUBNAM6= <"">
##$SUBNAM7= <"">
##$SUBNAM8= <"">
##$SUBNAM9= <"">
##$SW= 16.9725356469052
##$SWIBOX= (0..15)
0 0 2 0 0 0 0 0 0 0 0 0 0 0 0 0 
##$SW_h= 3396.73913043478
##$TD= 16384
##$TD0= 1
##$TE= 0
##$TE2= 300
##$TE3= 300
##$TEG= 300
##$TL= (0..7)
0 120 120 120 120 120 120 120 
##$TP= (0..7)
150 150 150 150 150 150 150 150 
##$TP07= 0
##$TPNAME0= <>
##$TPNAME1= <>
##$TPNAME2= <>
##$TPNAME3= <>
##$TPNAME4= <>
##$TPNAME5= <>
##$TPNAME6= <>
##$TPNAME7= <>
##$TPOAL= (0..7)
0.5 0.5 0.5 0.5 0.5 0.5 0.5 0.5 
##$TPOFFS= (0..7)
0 0 0 0 0 0 0 0 
##$TUNHIN= 0
##$TUNHOUT= 0
##$TUNXOUT= 0
##$USERA1= <user>
##$USERA2= <user>
##$USERA3= <user>
##$USERA4= <user>
##$USERA5= <user>
##$V9= 5
##$VALIST= <valist>
##$VCLIST= <CCCCCCCCCCCCCCC>
##$VD= 0
##$VDLIST= <DDDDDDDDDDDDDDD>
##$VPLIST= <PPPPPPPPPPPPPPP>
##$VTLIST= <TTTTTTTTTTTTTTT>
##$WBST= 1024
##$WBSW= 4
##$XGAIN= (0..3)
0 0 0 0 
##$XL= 0
##$YL= 0
##$YMAX_a= 41512
##$YMIN_a= -20983
##$ZGOPTNS= <>
##$ZL1= 120
##$ZL2= 120
##$ZL3= 120
##$ZL4= 120
##$ABSF1= 10
##$ABSF2= 0
##$ABSG= 5
##$ABSL= 3
##$ALPHA= 0
##$AQORDER= 0
##$ASSFAC= 0
##$ASSFACI= 0
##$ASSFACX= 0
##$ASSWID= 0
##$AUNMP= <proc_1d>
##$AZFE= 0.1
##$AZFW= 0.1
##$BCFW= 1
##$BC_mod= 2
##$BYTORDP= 1
##$COROFFS= 0
##$CY= 11.3945322036743
##$DATMOD= 1
##$DC= 2
##$DFILT= <>
##$DTYPP= 0
##$F1P= 15.9154993809931
##$F2P= -4.1035820241983
##$FCOR= 0.5
##$FTSIZE= 0
##$FT_mod= 4
##$GAMMA= 1
##$GB= 0.15
##$INTBC= 1
##$INTSCL= 1
##$ISEN= 128
##$LB= 0.24
##$LEV0= 0
##$LPBIN= 0
##$MAXI= 10000
##$MC2= 0
##$MEAN= 0
##$ME_mod= 0
##$MI= 1.114404
##$NCOEF= 0
##$NC_proc= 0
##$NLEV= 6
##$NOISF1= 3.799351
##$NOISF2= 2.8
##$NSP= 1
##$NTH_PI= 0
##$NZP= 0
##$OFFSET= 15.70392
##$PC= 1
##$PHC0= -10762.31
##$PHC1= 15.20095
##$PH_mod= 1
##$PKNL= yes
##$PPARMOD= 0
##$PSCAL= 0
##$PSIGN= 0
##$REVERSE= no
##$SF= 200.130013532006
##$SI= 16384
##$SIGF1= 3
##$SIGF2= 2
##$SINO= 400
##$SIOLD= 16384
##$SREGLST= <1H.CDCl3>
##$SSB= 0
##$STSI= 0
##$STSR= 0
##$SW_p= 3612.71676300578
##$SYMM= 0
##$S_DEV= 0
##$TDeff= 0
##$TDoff= 0
##$TI= <>
##$TILT= no
##$TM1= 0
##$TM2= 0
##$TOPLEV= 0
##$USERP1= <user>
##$USERP2= <user>
##$USERP3= <user>
##$USERP4= <user>
##$USERP5= <user>
##$WDW= 1
##$XDIM= 8192
##$YMAX_p= 0
##$YMIN_p= 0
$$ End of Bruker specific parameters
$$ ---------------------------------
##NTUPLES= NMR FID
##VAR_NAME=  TIME,          FID/REAL,        FID/IMAG
##SYMBOL=    X,             R,               I
##VAR_TYPE=  INDEPENDENT,   DEPENDENT,       DEPENDENT
##VAR_FORM=  AFFN,          ASDF,            ASDF
##VAR_DIM=   8192,          8192,            8192
##UNITS=     SECONDS,       ARBITRARY UNITS, ARBITRARY UNITS
##FACTOR=    0.0002944,     1,               1
##FIRST=     0,             0,               0
##LAST=      2.4114304,     0,               0
##MIN=       0,             -20983,          0
##MAX=       2.4114304,     41512,           0
$$ Real data points
##PAGE= N=1
##DATA TABLE= (X++(R..R)), XYDATA
0 0 0 0 0 0 0 0 0 0 0 0 0 0 0 0 0 0 -8 8 -8 8 -8 8 -16 16 -16 24 -24 32 -32 40 -43 48 -56 64 -72 80 -88 99
38 99 -110 123 -138 152 -168 186 -205 225 -249 273 -303 333 -366 402 -444 489 -542 601 -666 742
58 742 -833 939 -1067 1222 -1425 1687 -2047 2572 -3404 4935 -8645 34797 41512 -20815 26891
73 26891 23639 17638 -1250 30660 4247 19578 12649 12306 12452 -8459 30404 -7061 17 5815
87 5815 11186 -3839 -7846 13419 -11765 7977 -11680 4809 -9095 -2398 -726 -16192 9340
100 9340 -14285 4006 -7642 -2057 -7553 -909 -2981 -13809 13737 -15267 7297 -7037 -4430
113 -4430 -2054 -7124 -603 -13815 9767 -10838 -678 -9812 4052 -2717 -14694 10131 -8157
126 -8157 6148 -10475 6956 -1051 -2114 5725 -5212 7084 -3957 12280 -12165 8065 7850
139 7850 -1772 8055 -2984 14926 -2182 6574 -2100 13221 5131 -1272 13628 -2592 12924
152 12924 -6237 7853 885 2118 6170 -1597 5990 -5905 11243 -8582 4667 -660 639
165 639 6047 -8094 7574 -5005 6734 -7654 4170 842 -4459 3101 -6458 5926 -10831
178 -10831 7866 -4706 -3452 4 -4456 -259 -12908 6655 -9267 -481 -6268 -1163 -2395 -10746
192 -10746 2301 -11469 3637 -9081 -702 -2767 -4033 -2547 -6918 5956 -10042 5660 -3235
205 -3235 685 -1314 -2189 4527 -7916 8155 -3004 2751 -4377 5510 1108 -4687 8026 -4504
219 -4504 7801 -5165 6185 -1441 1320 3905 -3429 8687 -3141 6599 -3123 6476 -1411 -24
233 -24 7896 -4297 7219 -2357 7170 -4780 3820 3176 -1410 4595 -3860 7967 -7015 4416
247 4416 -2624 1063 1775 -4571 5182 -5712 3969 -7977 4407 -3789 -2740 2643 -5136 1859 -8050
262 -8050 5674 -8218 -774 790 -2843 -1633 -6166 5995 -9680 2368 -3719 1061 -661 -3969
276 -3969 2875 -6586 5085 -6383 4189 -2325 322 961 -2713 4428 -6893 8139 -4007 2293
290 2293 87 2442 1344 -5042 8455 -3427 5106 -2586 5734 221 -990 4969 -3402 7347
304 7347 -3706 5987 -1955 2865 993 -1309 5463 -4937 7167 -2822 3444 -2967 2640 2609 -5786
319 -5786 5632 -2403 3779 -6069 4038 -1626 -2390 2402 -4105 4047 -5753 4157 -5443 670 -930
334 -930 -2747 2251 -5597 3651 -5820 2788 -5982 741 1759 -4712 2022 -3739 4574 -7580 2588
349 2588 -1124 -1103 504 -2929 3819 -6709 4123 -4590 1114 -912 -1134 1559 -4893 3161 -5255
364 -5255 4157 -4831 1372 1417 -1596 1700 -3641 6963 -4430 2895 1019 2632 981 -569 5178
379 5178 -4440 6047 -1747 4402 -280 2591 3476 -2582 5296 -1913 6294 -2563 3548 540 410
394 410 2242 -3889 6086 -3521 2351 -1632 2239 -994 -1817 4566 -3691 3478 -3112 4372 -3393 1185
410 1185 2208 -3630 3101 -3616 4144 -4696 956 -2625 -937 107 -5788 2528 -3893 1721 -6302
425 -6302 1442 -1504 -4126 2325 -3298 1376 -4593 4013 -3951 -178 1485 -1052 2675 -2782 5685
440 5685 -2783 3411 341 2224 3685 -210 4721 -544 6573 -3170 4946 2467 961 3292 -568
455 -568 5171 -3908 5032 -1482 789 -213 1579 1183 -5310 5716 -4307 899 -2609 1318 104
470 104 -2781 1654 -4888 3350 -4291 1964 -1814 889 -124 -3532 3981 -4887 2908 -1712 774
485 774 -2624 481 1946 -5239 1519 -3597 3152 -5605 -439 -833 -3649 699 -4612 1574 -4464 2428
501 2428 -4394 -81 -575 -2400 3196 -4356 3632 -1725 3104 -2590 32 3445 -1500 2817 -1561
516 -1561 5781 -3112 3397 1691 309 2445 -1052 5141 -3192 3470 -1079 1921 -174 -432 2807
531 2807 -2613 4156 -3634 3471 -1629 401 1745 -1360 2106 -2653 3879 -3840 1666 -619 498
546 498 511 -2764 3262 -4670 2321 -2619 128 -972 -941 630 -3285 1807 -5218 2565 -3313 -839
562 -839 -1042 -1616 1158 -5770 1723 -2733 724 -3824 980 -207 -3170 2596 -4009 2733 -2670 2267
578 2267 -940 -639 1246 -1189 2879 -3180 3866 -1325 2351 -524 468 3092 -3253 4319 -1305 2583
594 2583 -1449 3203 1234 -1698 3144 -302 3943 -3523 4473 263 433 2066 -588 3567 -1231
609 -1231 3945 -1527 3109 -461 1107 2545 -2183 4076 -1979 3176 -2887 1481 704 -1219 743
624 743 -1742 2876 -4614 2753 -2865 -780 -110 -1596 1329 -4157 2483 -3444 456 -2674 -262 -230
640 -230 -2851 1384 -4561 2914 -3896 134 -796 -505 -131 -2964 3102 -3834 1924 -2169 1335 -835
656 -835 -981 2214 -3306 2767 -2439 2088 -1504 1634 602 -874 2412 -2422 3845 -2317 2153 -126
672 -126 1814 1467 -2248 3995 -1307 2218 -1712 3380 -321 -502 2404 -1503 2949 -1905 3719 -1926
688 -1926 1271 934 -304 1571 -2008 3687 -2008 2401 -1809 1523 794 -2270 2047 -1558 2623 -2958
704 -2958 2340 -1315 -945 980 -1667 1318 -3325 3373 -2705 -373 -738 -381 170 -3303 2207 -3254
720 -3254 1525 -3116 231 -386 -1775 858 -3030 2239 -3792 1384 -1825 -756 -269 -1523 1339 -3892
736 -3892 2842 -2245 514 -1434 666 930 -2224 2550 -2051 2622 -2089 1964 334 326 2166 -1643
752 -1643 3544 -1549 3241 -615 2169 976 631 3460 -2235 3601 -641 3454 -971 1417 2251 -1297
768 -1297 2472 -1462 3380 -1786 2222 -213 218 1292 -1690 2471 -2209 2413 -1854 1147 -850
783 -850 -1207 1564 -2826 1533 -2702 2189 -3005 -762 25 -1979 -38 -3152 1725 -3937 420 -1986
799 -1986 -851 -873 -2494 1130 -3669 1411 -2842 831 -1817 -1310 892 -1929 1703 -2577 3114 -1905
815 -1905 335 244 216 1548 -1951 3663 -1968 1945 -597 1409 718 -391 2902 -1778 2961 -1499
831 -1499 2154 -446 464 1086 -710 2228 -2405 2903 -1146 1169 -281 647 1659 -2006 3106 -1583
847 -1583 1914 -1132 1970 50 -433 2253 -1958 2193 -1988 2605 -1354 278 287 -1056 1629 -2968
863 -2968 1881 -2285 748 -2168 -242 428 -2968 969 -2662 1241 -3414 690 -755 -1669 382 -2275
879 -2275 1231 -3009 2009 -1744 285 -305 -435 1414 -2369 2641 -1555 2213 -1353 404 1007 -987
895 -987 1396 -1889 2967 -2160 1751 -115 -1 773 -1114 2900 -2396 2362 -846 1121 -252 490
911 490 1888 -1475 2768 -1648 2723 -1070 1073 903 -3 2036 -1209 2741 -1793 1690 -460 1343
927 1343 138 -1047 2812 -2263 1951 -1687 1400 -945 -57 1042 -1989 1257 -2273 1803 -2732
942 -2732 460 -453 -938 946 -2742 1768 -2193 857 -1887 911 -475 -1344 1140 -2329 1918 -2196
958 -2196 1643 -1541 -510 1161 -1205 743 -2187 2461 -1536 1277 -647 121 1482 -1832 2564
973 2564 -1719 2329 -1117 1207 264 -707 1701 -828 2381 -2176 2929 -598 396 911 -207 2035
989 2035 -1620 2356 -1364 1738 -617 476 426 -1568 2183 -1808 2006 -2262 780 88 -798 330
1005 330 -1389 1574 -2700 1556 -1655 271 -502 -576 1142 -2915 2017 -1678 652 -1791 577 400
1021 400 -1546 997 -2154 2115 -2138 1163 -926 58 635 -1404 1417 -1998 1342 -1413 1311 -1449
1037 -1449 -165 1781 -2133 1771 -1407 2101 -1310 934 574 -716 983 -1308 1860 -2124 1993
1052 1993 -343 413 636 -899 2005 -1658 1653 -968 1969 -824 262 1118 -801 1422 -1799 2517
1068 2517 -1468 776 223 -490 513 -1131 1978 -1741 1569 -1369 884 79 -1034 1514 -1985 1790
1084 1790 -2005 1343 -1273 -26 48 -797 995 -2445 2391 -2101 654 -779 -112 402 -2039 1304
1100 1304 -2197 1500 -1650 1221 -987 -377 1175 -1728 1818 -1991 1680 -1220 124 -194 -2 1351
1116 1351 -2094 2475 -1160 1485 -1035 587 982 -1284 1869 -910 1850 -1083 1896 180 4
1131 4 1201 -956 2004 -1942 2443 -734 811 183 -167 1256 -1530 1528 -1774 1543 -1324 505
1147 505 209 -1508 1475 -1508 1400 -1878 1351 -430 -312 40 -844 1252 -2388 1804 -1646 351
1163 351 -918 -474 316 -1950 955 -2162 1195 -2033 213 -555 -982 405 -1901 1552 -2453 945
1179 945 -948 202 -456 -842 1517 -1870 2157 -1196 1633 -421 337 1121 -555 1901 -1355 2275
1195 2275 -818 1051 77 321 923 -776 2555 -1112 1368 -457 1269 75 -635 1849 -814 1710
1211 1710 -1054 1875 -920 445 559 -530 1399 -1428 2134 -1255 1023 -517 525 731 -971
1226 -971 1835 -1377 1298 -1154 1135 -551 -879 515 -1442 704 -2169 1241 -1789 -453 -593 -1034
1242 -1034 140 -2108 1028 -2129 516 -1452 11 -302 -1543 951 -1607 1484 -1526 1007 -183
1257 -183 -214 660 -357 1564 -1399 1977 -507 1229 122 492 1295 -1143 1818 -962 1383 -905
1273 -905 827 65 -700 1377 -1129 1879 -1292 1394 -232 299 254 -451 1791 -1485 1960 -781 1130
1290 1130 -469 508 1198 -1094 1701 -1230 1380 -1180 1017 -75 -530 620 -1324 1244 -1873 742
1306 742 -1071 -26 -512 -1197 802 -1964 814 -1722 753 -1490 -282 425 -1551 651 -1636 1288
1322 1288 -1877 441 -108 -464 189 -1089 1377 -1730 1073 -920 637 -236 -601 1074 -1325 1352
1338 1352 -1197 1329 -845 140 389 -458 853 -1120 1873 -1215 991 -157 534 619 -646 1577
1354 1577 -1080 1580 -773 1152 -170 -82 1018 -749 1349 -1262 1889 -686 476 252 -270 890
1370 890 -1459 1611 -1197 874 -907 360 -43 -1003 1100 -1621 1001 -1409 1050 -764 -418 218
1386 218 -925 680 -1631 1131 -1198 696 -710 -402 645 -1493 1327 -1475 860 -1120 384
1401 384 -124 -815 1042 -893 1186 -1600 1395 -670 -162 570 -664 1002 -958 1200 -690 1173
1417 1173 -579 222 810 -969 1270 -941 1754 -1206 777 471 -161 719 -599 1525 -1543 1435
1433 1435 -667 597 103 -137 1303 -919 1441 -880 933 -687 65 267 -458 938 -1233 1448
1449 1448 -1195 750 -211 -412 226 -801 1101 -1508 1108 -818 850 -698 -580 844 -1512 1059
1465 1059 -1328 721 -1059 88 -139 -863 713 -1526 1440 -1526 333 -731 -128 90 -815 1382
1481 1382 -1170 595 -1163 1148 -548 -137 886 -917 896 -1190 1457 -789 353 142 -176 643
1497 643 -824 1642 -851 1173 -697 350 334 -481 1293 -1096 1128 -1017 1353 -423 265 623
1513 623 -248 806 -1395 1687 -825 455 -66 -327 847 -844 1136 -1000 705 -956 606 -114
1529 -114 -509 1016 -1019 1154 -1476 530 -213 -184 -415 -317 754 -1373 1171 -1462 500 -509 -27
1546 -27 147 -1215 670 -1135 729 -1533 646 -156 -428 249 -983 1359 -1271 1072 -354 201 -12
1563 -12 -49 1097 -899 1083 -665 1169 -725 617 544 -512 815 -706 1394 -775 889 -613
1579 -613 3 135 -801 1201 -1057 1149 -719 543 -239 -128 915 -920 831 -874 1272 -504
1595 -504 524 340 -230 812 -1023 1429 -1223 641 -229 -119 -228 -602 777 -1475 449 -1494 606
1612 606 -769 -465 191 -1103 606 -1496 822 -1185 165 -421 -538 617 -1019 1355 -1279 678
1628 678 -582 532 320 -286 955 -785 1079 -739 1096 -321 23 392 -362 1072 -1045 1487
1644 1487 -507 666 -280 207 364 -684 1321 -979 890 -536 752 223 -22 911 -718 1308
1660 1308 -796 1568 -374 489 301 -142 933 -994 1319 -530 974 -649 227 215 -870 791
1676 791 -817 830 -1157 695 -474 -605 254 -1101 311 -1466 522 -1156 -12 -520 -451 523 -1399
1693 -1399 727 -1262 698 -684 -267 226 -778 668 -1019 956 -1005 738 -297 196 227 -487
1709 -487 1058 -1231 993 -514 519 -142 125 850 -713 872 -999 1253 -663 552 201 -6
1725 -6 816 -680 1677 -707 1070 -207 640 283 -251 1350 -666 992 -482 1162 -461 169 482
1742 482 -775 927 -1033 977 -846 356 -361 -295 658 -1028 925 -1177 577 -674 152 -365 -769
1759 -769 831 -1220 483 -1000 682 -865 -248 4 -626 381 -1365 932 -1203 371 -432 -71
1775 -71 203 -792 1024 -1035 777 -893 566 -241 -301 474 -715 962 -1189 1070 -588 439 265
1792 265 -33 985 -895 1266 -616 932 -217 460 306 -475 1049 -1014 1145 -624 977 227
1808 227 -86 614 -468 1125 -1018 1130 -439 620 -67 -32 738 -988 1147 -562 744 -758 313
1825 313 15 -558 465 -704 999 -1000 608 -576 0 107 -896 499 -1294 707 -1178 215
1841 215 -685 -328 286 -1071 681 -1195 681 -991 285 134 -341 319 -595 826 -1149 692 -534
1858 -534 162 70 -621 823 -742 938 -681 1130 -432 320 355 -380 1092 -723 1318 -682 810
1875 810 202 126 285 -439 1356 -807 1117 -330 686 -71 -173 1002 -712 1180 -612 1046 -617
1892 -617 350 351 -242 820 -1064 1243 -803 650 -533 225 300 -1075 723 -1114 733 -1023 298
1909 298 -732 -246 545 -1200 559 -1158 708 -856 -134 -341 -496 300 -1156 790 -1359 452 -881
1926 -881 332 56 -979 719 -711 656 -961 686 -352 -50 99 -418 1033 -698 1039 -552
1942 -552 577 90 -161 485 -668 865 -333 912 -780 903 126 -31 856 -522 1179 -742 946
1959 946 -148 280 405 -36 686 -778 1454 -788 665 -397 110 593 -692 443 -836 966 -900
1976 -900 319 -201 -380 368 -1077 822 -1223 433 -651 -200 -557 -434 39 -1264 329 -1173 617
1993 617 -1049 -335 148 -811 693 -1004 628 -859 554 -148 -30 -244 -571 1307 -1204 929 -422
2010 -422 376 -162 -373 950 -587 946 -802 835 -423 512 35 -336 773 -926 1074 -725 823
2027 823 -128 430 346 -401 1036 -426 1104 -732 902 64 93 827 -365 996 -707 1081 -609
2044 -609 439 -226 86 603 -1033 949 -810 888 -430 -67 43 -522 401 -822 507 -1329 655
2061 655 -516 -224 -17 -746 536 -1144 654 -647 292 -385 90 361 -905 725 -972 627 -684
2078 -684 282 -15 -596 479 -675 686 -1178 567 -475 236 -8 -434 824 -962 1042 -537 687
2095 687 -292 333 632 -493 921 -727 1183 -564 1072 425 355 795 -291 981 -544 929 -264
2112 -264 646 219 100 655 -561 1025 -519 781 -427 -9 94 -793 348 -860 879 -1075 353
2129 353 -470 -244 61 -799 510 -919 725 -877 199 -409 -300 293 -707 561 -920 854 -914
2146 -914 138 -186 -434 278 -1022 521 -1154 466 -534 71 -57 -421 617 -732 745 -569 559
2163 559 -191 59 453 -370 969 -677 1082 -631 455 -36 112 468 -725 927 -558 985 -217
2180 -217 643 166 -61 907 -695 889 -537 757 -518 185 431 -523 847 -658 893 -638 333
2197 333 -396 53 179 -739 815 -982 563 -673 313 -247 -409 108 -892 346 -1069 424 -673
2214 -673 -131 -193 -445 270 -1006 495 -816 314 -565 -115 282 -811 524 -881 664 -857 471
2231 471 -151 -9 527 -549 880 -1095 720 -567 397 59 -66 618 -561 1042 -671 931 -437
2248 -437 263 361 -309 718 -449 874 -465 712 -233 513 362 -240 766 -653 1035 -263 540
2265 540 -423 58 722 -589 744 -689 470 -702 399 178 -282 476 -812 649 -993 277 -532
2282 -532 -57 -304 -490 568 -1175 710 -946 330 -774 -83 -52 -661 389 -1073 656 -857 93
2299 93 -306 -192 34 -708 747 -994 611 -548 448 -177 -379 719 -784 611 -804 765 -380
2316 -380 212 188 -187 643 -656 921 -304 539 73 266 163 -444 813 -578 893 -457 698 144
2334 144 159 639 -481 890 -866 986 -412 126 277 -298 486 -442 1076 -584 512 -392 285 46
2352 46 -679 491 -782 521 -693 496 -588 -213 -119 -716 471 -705 753 -609 -69 -99 -142 182
2370 182 -750 275 -824 665 -805 221 95 -318 555 -489 754 -804 485 -292 -97 95 -136
2387 -136 705 -483 597 -434 459 -349 -112 619 -359 551 -527 669 -387 765 101 -105 577 -379
2405 -379 724 -372 708 -240 551 148 -51 413 -613 674 -549 667 -311 166 173 -411 418 -637
2423 -637 734 -637 103 3 3 -189 -622 564 -770 608 -545 163 -38 -274 100 -622 510 -886
2441 -886 288 -707 208 73 -576 388 -893 879 -527 248 -450 0 110 -554 609 -750 461 -649
2459 -649 420 -220 -215 368 -613 506 -376 656 -530 390 -55 -21 504 -480 937 -551 648 -8 347
2478 347 318 -215 592 -400 512 -738 808 -137 102 231 -339 859 -382 791 -368 224 -267 -33
2496 -33 326 -627 783 -366 616 -457 -86 -54 -303 267 -484 464 -833 672 -490 -45 -119 -495 624
2515 624 -978 421 -430 227 -572 103 202 -657 247 -745 579 -815 345 -121 -335 339 -687 461
2533 461 -765 511 -426 302 -76 -368 569 -667 610 -623 622 -104 169 275 -203 653 -350 708
2551 708 -482 717 -255 -27 231 -279 764 -547 659 -174 390 125 -159 446 -537 716 -566 770
2569 770 -342 12 100 -197 375 -462 742 -303 298 -713 53 128 -619 505 -857 536 -453 82
2587 82 -278 -323 310 -538 522 -669 654 -565 76 44 -138 454 -483 690 -480 469 -461 18 27 -528
2607 -528 220 -566 401 -539 637 -325 74 207 -188 560 -483 478 -255 499 -66 403 457 -491 568
2626 568 -387 523 -321 478 91 -176 375 -598 716 -434 627 -98 315 25 -90 432 -383 609 -494
2645 -494 200 -284 -141 265 -515 320 -440 555 -372 246 -155 -12 106 -552 182 -682 227 -673 166 -180
2665 -180 -231 178 -741 368 -647 455 -433 138 6 -608 535 -692 518 -355 520 -19 -18 384 -422
2684 -422 608 -713 876 -550 713 1 -68 371 -499 437 -208 615 -639 425 222 -288 507 -554
2702 -554 799 -393 523 67 145 168 -109 765 -504 856 -596 582 -125 -92 269 -223 390 -414 651
2721 651 -300 143 -259 -280 239 -315 739 -692 273 -441 -11 18 -518 -61 -706 -88 -762 384 -281 73
2741 73 36 -587 332 -633 494 -413 655 -473 -496 365 -412 531 -599 669 -222 748 309 -103 361
2760 361 -382 182 -721 589 -482 225 436 -527 26 -700 460 -369 244 324 -26 530 -209 360 -813
2779 -813 678 -1104 60 5 301 355 4 691 -126 -446 -1309 487 113 -109 426 -665 796 -537
2797 -537 887 243 128 160 -247 593 -461 792 -524 160 -293 51 160 -453 373 -670 368 -574
2815 -574 10 121 -140 256 -536 300 -304 675 -476 10 -76 -282 399 -507 295 -347 398 -377 226 17
2835 17 -289 266 -596 480 -441 481 -20 236 376 -266 304 -389 578 -354 461 161 144 523 -154 645
2855 645 -606 765 -332 89 226 -172 417 -613 395 -547 543 -193 180 -3 -352 532 -447 666
2873 666 -357 243 -205 -5 17 -555 454 -471 284 -636 407 -233 -206 172 -718 273 -573 355 -564 166
2893 166 -184 -241 275 -604 474 -487 199 -332 167 57 -557 239 -400 493 -747 387 -214 -71 324
2912 324 -109 507 -336 618 -434 240 -44 -58 398 -210 658 -284 660 -404 163 322 234 208 -174 522
2932 522 -249 703 -115 75 169 -156 471 -526 423 -511 535 -308 32 481 -82 339 -507 645 -465
2951 -465 -11 -42 -154 200 -465 427 -626 312 -244 414 -445 -162 475 -519 221 -442 225 -450 -68 -62 -349
2972 -349 253 -488 661 -361 432 -99 -44 469 -530 605 -372 331 -370 494 -219 -45 508 -377 582
2991 582 -465 659 -195 183 154 -52 470 -343 757 -150 523 38 73 431 -147 679 -474 801 -302
3010 -302 330 -276 -71 524 -275 489 -552 574 -2 311 -4 -367 349 -444 231 -601 243 -351 105
3029 105 -199 -392 352 -607 188 -661 319 -229 -138 373 -327 412 -821 309 -483 234 -50 -195 348 -459
3049 -459 398 -505 517 -328 -4 24 -469 247 -358 568 -696 245 -88 -21 100 -71 67 -691 585 -410
3069 -410 500 18 -63 68 -187 546 -590 498 -273 379 41 -128 350 -256 646 -407 674 -327 173
3088 173 82 -206 325 -404 428 -445 452 -264 96 94 -357 193 -246 424 -554 305 -174 -111 -5 -370 381
3109 381 -589 413 -345 184 -167 -313 212 -491 399 -488 281 -19 124 -254 -269 170 -643 384 -436 209
3129 209 -280 4 -42 -338 396 -363 531 -494 354 -62 107 186 -482 738 -819 670 -322 -11 237
3148 237 -76 347 -206 358 -185 568 -123 203 435 -132 421 -263 428 -257 268 -343 49 156 -418 454
3168 454 -418 540 -292 276 -228 98 160 -360 529 -363 201 -380 155 -334 -150 190 -238 537 -600 375
3188 375 -386 217 273 -299 252 -570 450 -331 371 -305 -36 -181 -474 264 -202 377 -384 385 -193 39
3208 39 98 -383 489 -450 455 -118 338 101 -22 202 -348 538 -252 527 -291 431 335 68 631 -413 770
3229 770 -49 275 60 66 141 -345 389 -396 427 -312 200 -271 -230 286 -129 307 -372 369 -141 -8 -194
3250 -194 -237 56 -400 467 -673 149 -76 63 -55 -278 209 -365 331 -598 94 -14 -213 -28 -243 228
3270 228 -440 50 -418 160 -249 23 82 -330 551 -649 264 -279 149 54 -325 338 -214 310 -335 110
3290 110 -322 188 304 -16 471 -327 497 -51 350 155 -5 154 -245 572 -300 500 -325 445 117 -57
3310 -57 399 -252 471 -183 618 -246 58 112 -103 185 -389 411 -342 302 -300 -87 -8 -219 273 -490 355
3331 355 -487 208 -86 -46 163 -329 294 -420 293 -472 337 -209 -136 211 -582 360 -594 293 -323 217 -22
3352 -22 -328 112 -347 289 -336 210 -192 291 267 -282 577 -271 374 -220 120 -8 80 200 -336 441 -584
3373 -584 340 -413 90 119 62 329 -273 643 -249 294 -207 252 138 17 299 -513 87 -614 359 -287 235
3394 235 101 -93 51 -297 311 -425 139 -134 -461 -4 -362 229 -410 158 -404 155 -73 -253 83 -421
3414 -421 105 -488 366 -226 5 59 -227 85 -362 350 -665 198 -271 241 160 -444 282 -332 448 -274
3434 -274 102 -53 -86 21 -78 360 -644 281 30 400 47 -129 162 -257 241 -225 501 -81 208 239 -200
3455 -200 415 -337 229 -263 253 -66 -6 268 -33 354 -462 565 -260 389 -466 -202 441 -375 309 -184
3475 -184 9 -334 370 57 -217 292 -349 282 -244 378 -111 -146 -204 -120 77 -597 78 -308 358 -169 -63
3496 -63 361 -374 271 -278 74 -332 12 -425 15 116 -367 358 -459 274 -223 -20 97 -124 206 -318
3516 -318 379 -365 206 -45 125 241 -108 327 -205 128 -292 341 181 231 204 -129 364 -238 235 -381 282
3537 282 -35 -274 302 -385 308 -460 369 -208 53 -127 -205 271 -370 502 -412 -14 -284 -58 -2 -83 293
3558 293 -338 165 -393 177 -134 -129 45 -484 358 -165 414 -165 -10 -202 -81 137 -324 186 -282 321 -283
3579 -283 108 -28 -201 212 -225 503 -338 500 11 62 239 54 377 -236 479 -74 239 99 167 213 -283
3600 -283 515 -385 524 -322 278 353 -211 338 -243 359 -71 406 -303 -138 7 -176 74 -399 365 -335
3620 -335 232 -42 -75 19 -256 43 -362 442 -418 111 59 -38 -28 -564 22 -300 243 -294 21 -399 -10 17
3642 17 -176 220 -351 326 -353 -17 71 -113 278 -135 187 -387 60 244 206 134 -306 337 -198 387 -313
3663 -313 183 18 -175 74 -252 306 -86 259 -189 173 -79 101 174 -130 323 -331 457 5 -37 171 -258
3684 -258 217 -142 453 -375 421 45 -82 133 -154 232 -357 418 -208 305 102 -167 216 -543 341 -564
3704 -564 323 -93 -102 -31 -356 72 -246 193 -481 209 -284 -95 152 -291 149 -257 264 -167 247 -53 -114
3725 -114 155 -220 242 -180 348 -359 184 23 92 15 -248 -47 -313 582 -175 125 -97 165 217 -454 205
3746 205 -299 326 -37 -51 181 -24 217 -62 114 -118 52 -93 92 254 -236 315 -295 125 -295 -92
3766 -92 58 85 37 -294 401 -276 -49 -340 64 -134 -237 90 -183 442 -256 48 -100 41 52 -314 174
3787 174 -249 327 -428 18 -206 -253 238 -309 289 -155 326 -164 56 187 -126 12 -416 286 -372 200
3807 200 -334 86 220 -63 246 -68 444 -217 319 -88 84 -132 -105 173 -203 318 -25 59 82 -241 92
3828 92 -154 414 -138 246 -7 118 -41 -54 433 -487 263 -277 11 -196 41 -47 -278 147 -438 272 -186
3849 -186 -20 -42 33 176 -350 297 -166 220 -255 -24 -112 -121 149 -375 297 -636 174 -146 -18 186 -168 173
3871 173 -472 164 -394 185 -223 -276 -34 -105 215 -268 224 -148 156 -26 113 114 6 239 -84 341 -44
3892 -44 38 111 -255 299 -88 321 -127 226 -322 195 5 -1 341 -186 336 -377 515 -26 14 134 -92 227
3914 227 -60 268 -249 69 69 54 265 -183 132 -287 154 -360 111 127 76 170 -349 97 -246 35 -158 119
3936 119 219 -244 21 -116 188 -253 -36 -271 4 97 -218 -46 -223 94 60 29 8 13 30 -143 268 -232
3958 -232 373 -220 192 -115 -99 258 -234 114 -303 361 -52 207 30 216 131 -44 245 -190 117 39 216
3979 216 499 -65 144 -114 342 -406 -1 -85 100 20 -85 75 -172 435 -236 0 -59 -186 433 -151 371
4000 371 -42 231 -231 129 -44 -350 -71 -367 326 -453 240 -343 47 -61 -275 -3 -383 117 -24 1
4020 1 -271 -267 40 -161 17 -358 60 -139 -51 -159 21 394 -316 407 -168 138 -481 -146 235 -56 413 -313
4042 -313 239 -155 46 0 137 264 -152 148 -99 164 24 39 -140 -4 160 -123 387 -169 25 -234 -32
4063 -32 -16 -88 5 -171 245 -352 108 -163 126 -55 -284 197 -104 -20 -472 115 -157 -59 -32 -214 84 -447
4085 -447 -105 -197 -61 50 -37 170 -120 -29 -229 110 -300 -125 280 -204 36 -226 -4 -86 202 -67 184
4106 184 159 -270 -9 -286 270 -167 -20 17 53 93 -111 173 -389 342 -141 245 -3 182 153 -214 230 -189
4128 -189 461 -196 28 173 -125 325 -355 374 -158 117 -34 79 66 -130 36 -174 -12 -259 163 -26
4148 -26 -89 209 -154 295 -106 -16 -93 311 -59 -149 56 -165 291 -260 349 -162 5 73 -100 161 -342 176
4170 176 -87 58 -21 226 315 -326 154 -86 525 -198 -177 -30 -171 231 -252 42 -233 157 -209 256 -239
4191 -239 -1 71 -5 315 -264 354 -198 -152 80 -419 327 -125 375 -383 321 -121 -246 47 -407 203 90
4212 90 112 -336 117 -111 150 -38 -35 249 -47 134 -186 180 -24 -214 204 -402 115 -181 -80 -164 40 122
4234 122 -487 37 -293 256 -353 86 -210 73 196 -142 202 -281 6 -168 76 77 -192 96 -172 232 48
4255 48 265 -200 2 199 -214 292 -98 346 -84 230 -106 106 121 61 122 -141 242 -131 222 49 192
4276 192 -226 66 154 -271 200 -398 123 50 95 330 -362 273 -8 326 -147 -38 138 -215 105 -257 79
4297 79 -86 253 -217 -216 -61 -125 38 -314 111 -39 -4 59 -26 115 -201 -47 -269 -40 -154 204 -129 10
4319 10 -39 -229 309 -398 168 -33 106 3 -220 89 -352 291 -228 356 -167 249 229 -170 203 -152 326
4340 326 62 57 -113 -56 206 -195 470 -56 314 -223 140 164 168 213 -338 198 -192 102 -289 116 79 -32 12
4363 12 -179 431 -466 438 64 -248 142 -178 -77 -471 8 -366 -45 -174 -276 -43 -34 230 -334 -74 -97
4384 -97 -38 -101 -217 304 -389 276 -5 -94 57 -36 68 -113 187 -250 87 -244 32 -143 -206 163 -274 291
4406 291 15 73 -200 168 -28 -238 -102 -156 23 -63 8 -74 -125 170 16 285 -147 313 -173 55 62 140 81
4429 81 -116 213 -149 298 106 93 -57 -99 31 -73 242 -254 104 -84 138 158 32 35 -403 125 -403 286
4451 286 -172 -30 178 -113 77 -134 129 -286 40 -222 -12 65 -472 222 -82 208 -244 -272 -34 -351 -48
4472 -48 -69 187 -311 11 -362 108 -49 128 133 -336 13 -106 205 -271 162 -203 -217 215 -198 270 -425 343
4494 343 88 28 214 28 360 -228 212 -91 -64 -43 137 92 -65 294 -317 74 -279 145 53 -149 152 -172
4516 -172 160 -19 107 -12 -89 150 -8 67 -169 159 -368 -31 -231 60 -20 -277 82 -166 167 -209 -198
4537 -198 232 -162 -219 -269 219 -339 -39 114 19 103 192 -85 -711 -5 -109 -127 -142 -220 512 31 527 212 347
4560 347 -11 -35 209 380 581 210 97 -206 -49 -256 77 -318 424 -486 -355 109 120 744 492 279 -159
4581 -159 269 155 10 -190 -76 503 -453 -235 182 -148 -54 -285 520 -312 148 257 -168 -52 254 391
4601 391 92 352 -101 -205 585 27 -252 -285 104 136 294 -481 73 328 -38 101 401 440 440 344 -489 154
4623 154 206 215 310 -241 -418 -25 -575 97 387 155 94 812 -249 122 171 227 169 398 -84 260 -165 173
4645 173 186 -134 303 57 -469 -173 -389 447 -337 187 -91 52 -137 -246 385 31 -169 -220 -3 89 385
4666 385 94 -414 117 -161 490 104 -213 69 85 295 -210 -123 -47 275 -53 101 -324 -175 129 -79 53
4687 53 -370 156 -350 -185 207 -231 -17 -308 -37 -463 238 -293 218 218 -454 -25 28 391 -560 -146 226
4708 226 -363 282 -141 216 147 -20 -412 -99 -247 -343 -287 -186 425 69 222 10 150 517 137 278 -58
4729 -58 -186 177 192 -20 51 85 -374 -51 89 284 -95 37 -16 -102 -35 -240 138 -363 323 -40 -50 178 -290
4752 -290 220 -104 342 -356 327 -137 112 -159 -358 82 37 199 -218 64 -191 19 327 124 324 -62
4772 -62 149 -88 -106 -90 -356 -132 -97 93 -172 143 -106 70 155 88 97 -150 280 24 169 138 -100 -382 186
4795 186 183 -335 250 -183 169 42 -102 -178 -82 372 -135 -82 88 -145 -231 -237 317 -24 130 -256 -14 531 -33
4818 -33 33 -147 11 -38 168 -105 -181 -42 -104 205 337 41 -214 -409 -292 105 -184 -104 87 -474 -181 196
4840 196 -164 -276 78 -35 -55 798 -476 383 83 28 286 539 3 245 -67 -8 513 -218 669 561 60
4861 60 168 -529 -154 1 110 -1 105 -265 -121 -247 50 18 -235 388 127 70 134 -131 66 -76 117
4882 117 4 128 -35 18 55 -247 292 -116 744 122 336 247 -555 224 -256 -87 5 -186 556 -51 -98 99
4904 99 171 -167 -69 -224 136 -102 88 -14 200 -53 -97 420 -140 324 -427 90 -79 -188 143 -285 187
4925 187 156 -21 58 -18 168 -48 409 -203 -88 21 212 -156 -129 337 -297 270 -136 181 114 -28 412 319
4947 319 -73 38 260 71 175 477 575 -25 -53 441 -514 60 19 518 -4 173 159 -379 224 132 689 5
4969 5 383 744 459 254 129 -427 -320 658 478 -36 504 -618 44 184 -487 -15 -226 173 456 -302
4989 -302 -307 -218 56 -225 -37 21 -259 207 -79 -53 128 376 79 -29 240 359 380 22 -359 192 30 -79
5011 -79 211 -22 455 -344 542 -43 330 228 150 -91 -800 29 138 348 345 -102 276 -46 113 -102 214
5032 214 78 9 -294 495 -376 355 -49 -172 139 40 -34 -643 263 -205 -408 112 -15 373 -59 346 208
5053 208 79 105 -89 -270 56 81 75 282 -48 87 360 -35 113 67 -186 -410 3 152 134 -39 13 71 -254
5076 -254 80 -65 337 -126 -39 -44 484 -22 -123 463 485 39 -101 46 -79 7 501 80 171 -212 685 -203
5098 -203 74 -41 -132 -341 519 92 753 -61 397 67 285 -42 660 -454 -352 -91 -48 144 -302 -126
5118 -126 -325 -164 -148 34 9 -208 181 270 337 -418 -258 -48 349 -452 171 -214 115 746 -506 446 407
5139 407 507 135 -325 -519 438 -57 52 55 285 -210 40 420 380 14 -279 733 28 255 -226 278 -309
5160 -309 332 -317 -271 179 521 37 -30 546 -296 34 -71 -103 -84 187 25 162 110 389 364 -89 613 -311
5182 -311 -260 112 -179 -344 91 -44 18 427 -421 104 383 65 -165 -103 -67 -415 -190 45 -170 2 180
5203 180 -149 -575 -505 -318 -262 52 -243 608 67 326 225 -127 -843 -340 53 -113 -321 -34 197 33 353
5224 353 295 76 18 268 80 -236 -66 145 -119 445 405 -70 44 -102 74 334 -158 679 416 -11 371
5245 371 -612 81 -60 -154 304 219 -50 125 114 -174 -8 -115 198 244 379 -42 -77 212 -120 175 -176 -48
5267 -48 -367 126 178 249 380 -357 93 324 266 145 -82 125 43 35 -122 32 48 -68 -160 -302 -229 -364 134
5290 134 -195 85 -131 348 3 -328 96 54 145 -105 88 -121 83 81 -127 -7 -10 -416 -33 -77 176 -96
5312 -96 96 -139 99 -53 -16 343 -406 166 -46 104 248 0 -68 -148 154 -305 43 -21 -14 -106 9 -258 -60
5335 -60 133 180 -492 -181 -74 -193 216 267 -78 301 140 29 -141 149 -83 217 16 148 -109 -307 239
5356 239 -307 -64 -232 102 -222 159 14 -19 -206 -31 -21 162 -124 321 62 -41 -117 214 -48 70 -117
5377 -117 -183 60 -7 -79 -112 233 60 139 -106 -1 -56 24 -133 -196 -113 56 21 34 40 12 -158 137 144 16 -107
5402 -107 58 -238 209 -300 -4 81 127 40 -82 43 269 -158 166 68 -84 111 96 130 -216 53 -29 -60 -161
5425 -161 -60 120 -59 53 -41 270 -227 153 65 -62 -175 -104 -156 -312 -62 -199 -133 -247 -8 -6 -74 23 -207
5448 -207 -83 -109 43 11 -237 50 -281 257 -82 179 -232 -9 -80 127 29 -168 110 -49 30 -5 61 61 218
5471 218 58 23 -12 -33 107 8 -109 68 -114 204 68 206 -38 -65 -8 150 -73 -147 34 -183 145 -185
5493 -185 121 82 -169 14 44 237 -47 44 -117 -26 51 -260 -156 -188 -206 -8 31 198 98 55 36 6 -20 172
5517 172 1 64 154 -157 -218 -87 -42 42 -28 1 -81 22 8 80 -73 -18 -54 74 -49 137 123 -1 -183 -128 109
5542 109 -119 25 -138 65 77 37 6 155 -7 156 51 -18 222 -67 -145 343 -307 202 187 101 -36 269
5564 269 -44 -180 -9 -46 88 -107 64 106 -220 130 -67 49 -270 -195 60 318 -94 11 129 66 83 -102
5586 -102 127 56 -35 -66 -102 147 101 226 167 58 -139 -41 -87 100 -20 147 146 -189 26 -107 30 15 156 352
5610 352 80 -83 -3 96 83 37 -120 -195 -57 40 -28 -212 7 -20 -272 99 -31 -20 25 287 -28 -175 57
5633 57 225 -36 -312 51 73 128 -79 27 51 -167 -58 -27 133 -38 -176 -53 -125 239 94 83 -73 -84 131
5656 131 97 -23 -25 89 -97 -200 -172 -52 -196 4 166 -13 20 9 -55 -182 -33 -36 -139 176 -156 79 62
5679 62 -11 6 77 73 -137 39 57 336 151 42 72 129 -82 -51 72 -284 6 -72 192 136 -62 85 6 39 -53
5704 -53 120 -59 170 -62 -52 40 -28 -68 -154 -121 -140 115 -23 -112 134 94 53 90 65 -149 -76 -44 47 306 -395
5729 -395 256 -218 -45 -74 -122 87 -184 -6 -190 -162 11 40 257 92 -46 -204 -250 -235 -26 134 115 -13
5751 -13 160 69 -62 149 -297 -339 139 34 204 -75 -198 143 -503 -135 -487 -280 -432 935 -561 -311
5771 -311 464 -90 -653 205 238 -139 25 103 -71 -241 134 448 127 185 -98 -327 -13 -211 474 276 -24
5792 -24 2 -75 199 3 -280 -56 4 45 -162 122 92 -72 74 108 197 -159 -95 -29 2 -72 39 11 56 -121 63
5817 63 -15 156 29 128 118 -25 43 145 98 -34 205 197 -64 4 -95 -240 -183 168 202 -106 -12 -813 32 -444
5841 -444 -438 -144 -214 -829 -751 71 141 -624 -628 275 -647 213 -332 -266 -220 -351 279 419 -184 527 191 -322 -29
5864 -29 155 -580 280 -451 -122 -64 9 -832 886 293 -194 23 216 -185 -40 355 -103 870 536 -995
5884 -995 63 480 257 109 105 126 475 -274 -404 404 -518 -182 230 37 81 -47 -357 191 -66 279 -531
5905 -531 3 -151 57 166 -270 517 198 -258 -106 -215 8 153 -741 924 -179 20 66 -88 -351 -31
5925 -31 -170 102 -226 -356 -305 128 -413 -349 -310 -763 -143 587 64 137 -255 906 537 134 381 -406 -293
5946 -293 -474 -338 -255 -249 -83 -416 -325 -160 -154 -83 -264 -177 128 66 321 -66 -214 250 -252 55 -321 34 -41
5969 -41 -428 126 -171 -181 -24 36 67 59 -141 155 216 -1 87 39 -7 -411 296 31 -256 221 61 -123 -262
5992 -262 -60 -45 -48 144 -308 -86 -51 82 -180 -165 45 5 -78 111 -201 -90 87 -64 470 168 287 -45
6014 -45 199 331 -145 -643 -111 -377 -144 -140 19 230 397 338 85 -377 512 -151 -16 22 277 541 779 130
6036 130 202 87 -662 322 -460 -363 -570 -190 13 -413 -743 446 -78 -137 -708 279 -685 -471 -536 -56 126
6057 126 -269 -149 -119 245 -326 90 -291 -149 -508 -336 -1071 255 -71 253 439 -845 -158 128 -631 77
6077 77 -52 175 -256 -360 29 -420 1238 -939 28 1004 -373 -220 112 98 -70 -250 204 -177 21 200
6097 200 -22 -258 -41 175 -91 -292 84 13 12 -17 318 -83 -416 -87 -218 191 -345 69 109 -81 151 -296
6119 -296 14 -312 -41 -155 -110 345 -133 -223 -362 -140 9 7 159 -59 -292 -174 59 -389 545 90 -333
6140 -333 2 -382 54 443 -155 146 -247 -22 118 -191 -569 8 321 304 -14 149 278 -87 45 192
6160 192 -229 -283 -283 -730 -204 -245 345 -236 -286 40 -210 -91 153 -111 -83 -215 192 -26 -198 251 -15 -144
6182 -144 345 -251 497 222 -315 201 -469 -222 362 -376 3 -534 189 -119 -254 -326 -52 -107 -71 210 160
6203 160 182 2 -127 289 -362 -205 -165 97 -528 168 -579 83 227 -463 -330 -271 -291 -456 26 -258 187
6224 187 349 -495 44 454 -249 216 -244 -7 -637 27 26 530 189 -402 -584 285 -204 285 14 -192 219
6245 219 -63 129 188 405 -252 -2 -244 -128 130 -577 570 -73 -196 -686 -267 -392 82 -656 -504 -407
6265 -407 803 -621 129 220 348 326 -614 112 -390 -113 -107 -4 27 -79 -505 -270 -43 28 -142 244 144
6286 144 -122 -28 -438 408 948 -405 517 585 -228 105 1 -13 -6 -486 -145 -160 -256 188 -25 127 126 72 97
6309 97 196 -46 -123 7 -58 -20 -236 196 50 -108 -173 -100 225 -272 66 -28 94 236 68 -9 -175 195 174
6332 174 -77 -155 -11 -33 -135 21 81 122 125 229 145 -76 -8 -231 156 40 144 106 -168 -113 25 -104 276
6355 276 97 -81 80 19 -7 59 -72 72 152 114 72 -120 -64 -334 291 -25 -13 -181 -263 44 -132 -74 7 25
6379 25 25 127 80 41 -11 125 -72 -52 16 283 228 -109 56 -195 -130 -43 -88 112 21 183 -251 27 -23 62 210
6404 210 -73 71 -78 -96 9 33 266 142 -67 -184 48 -272 -113 -49 -189 -42 23 -199 34 -61 3 61
6426 61 86 55 -30 41 50 2 123 -134 6 84 99 224 -31 51 -91 56 53 93 39 74 -44 -79 256 9 222 27
6452 27 55 -233 46 -179 -17 -44 23 179 -213 210 174 -231 -32 -154 -111 1 218 198 7 339 1 143
6474 143 126 317 298 15 23 446 -20 -327 551 -1086 360 23 -128 -123 212 109 -32 141 -115 0 110
6495 110 -1 56 140 -198 -17 80 9 -155 11 10 90 -69 159 -60 -95 -117 243 -101 -33 -37 60 -98 -39 -18 -39
6520 -39 1 -190 126 -20 32 -37 -88 146 68 -203 -155 -28 -40 109 -69 -92 256 133 -31 229 285 9 -227
6543 -227 73 -35 362 -35 -76 -99 68 -13 -183 -78 -217 -255 9 49 12 -210 83 60 -22 222 22 93 -212
6566 -212 121 196 -155 1 155 -233 -108 25 -100 219 63 -107 205 156 -304 -224 -40 102 -108 -48 -179
6587 -179 -55 -102 147 -211 193 -238 240 45 -140 408 -19 -84 43 -56 -88 8 -205 24 -80 175 96 -70
6609 -70 -18 44 44 -165 -69 119 -59 -6 85 124 -159 -184 136 -172 167 -25 145 95 174 83 100 67 -189 36 -182
6634 -182 63 -153 197 -68 59 195 368 -174 -162 -55 129 -76 127 -40 16 -160 -106 -216 -32 -75 -36 42
6656 42 -148 -33 -176 -139 252 17 -83 -162 -22 137 -53 45 48 -144 104 62 184 102 -50 -72 -81 92 25 18 -192
6681 -192 -169 114 -73 -223 153 248 -227 -120 225 248 250 -313 -134 69 -26 -32 155 144 18 68 -151 -73 -147 32
6705 32 96 -44 -86 -49 75 35 -109 92 -62 -159 155 142 58 -31 -72 123 92 -6 46 -253 -102 -51 159 -176 100
6730 100 16 9 -145 99 -24 -78 159 95 -3 29 -138 -159 -160 -30 73 121 -54 -26 -150 -7 -52 214 84 50 -108
6755 -108 -80 53 -198 242 175 -6 -192 -90 -57 27 -72 210 -24 53 -181 89 -200 300 139 -40 -209 -215 178
6778 178 -287 345 129 -12 -57 -254 -220 -50 209 -355 161 -195 -174 50 -107 -32 -109 -72 -156 -91 116 30 86
6801 86 -47 -10 -108 -111 -151 -42 -8 -91 216 -66 -26 -255 -235 -68 -30 57 -91 11 -86 135 17 109 36 76 174 91
6827 91 -67 -5 108 -57 155 -152 -148 35 -216 204 -47 39 104 212 -137 -116 74 57 -53 148 -16 -55 87
6850 87 -115 48 70 -165 -182 -119 -141 151 186 209 -140 35 -158 56 -140 105 189 -51 91 152 -16 4 48 -50
6874 -50 -62 185 -146 148 -231 50 -33 -20 257 -73 107 152 19 -20 14 -10 226 -20 29 -182 117 -80 -157
6897 -157 -116 203 -47 -51 -200 -83 53 -110 -61 100 84 -36 343 201 5 -122 -81 44 90 105 163 133 -41
6920 -41 -100 247 185 209 45 -22 112 144 -104 154 19 -99 343 -30 23 -134 -136 -18 30 304 129 -11 13 69
6944 69 -116 -199 -30 -20 43 9 55 87 35 2 -34 26 103 164 44 108 -53 34 -46 107 -82 -134 -29 21 69 80 8
6971 8 -96 -229 -134 -259 41 268 -109 -158 2 62 337 -248 -62 -140 -7 -17 -161 145 -74 7 36 -53 -52 2
6995 2 188 81 25 -218 -141 15 -116 -174 53 -52 165 223 214 62 -26 -129 23 -46 85 -21 -260 -22 119
7018 119 -64 -173 84 -55 32 -245 -87 -285 127 150 -197 -100 -3 -18 -66 -66 18 37 33 -11 33 96 -35 214 -109
7043 -109 -80 96 202 -43 20 -286 45 88 -91 126 8 189 -62 -205 -150 -80 27 75 24 -132 -14 -3 190
7066 190 146 -63 18 -49 56 -119 53 243 -45 -58 134 -237 147 -68 117 2 225 50 43 -140 47 -31
7088 -31 167 20 50 117 112 41 -77 22 -12 37 -121 107 -95 64 -111 -56 -90 -99 176 -202 -90 -25 59 -17 53 -99
7114 -99 222 -188 -180 114 -99 -33 -73 -119 -211 1 165 -135 -88 -171 -79 -195 -78 39 356 21 -79 17 -36 13
7138 13 -50 20 91 45 -1 63 39 148 -124 -77 -39 96 217 6 -141 57 111 188 166 22 -65 130 153 92 -24
7163 -24 -131 -274 -139 -54 -27 -116 -4 -131 63 -28 1 81 -180 34 45 57 81 -16 158 180 54 234 -125 -85
7187 -85 -14 -58 223 161 197 -11 -99 129 115 167 121 22 -4 -233 40 -78 -188 -92 6 63 -21 -13 -175 10 -103 139
7213 139 111 -156 -77 -73 -45 113 -184 235 205 37 133 202 131 -9 -62 -192 75 190 -22 85 -6 -238 171 -4
7237 -4 -90 -84 -117 107 183 140 -104 13 16 -77 67 124 77 115 -159 -112 140 -301 128 271 52 42 109 -199 -60 -78
7263 -78 49 55 120 -42 75 -152 -9 -119 240 8 184 45 9 -97 47 220 72 -100 -172 35 -84 10
7285 10 -146 178 -118 213 -53 -13 22 -137 96 153 -7 -18 31 149 -9 59 237 -22 -132 100 -247 179
7307 179 -269 18 -135 50 -68 -375 58 56 179 26 -80 -232 25 114 -93 -57 -94 31 -100 -115 -24 -140
7329 -140 46 -23 131 135 -19 7 107 120 -22 -167 -24 58 -10 56 -50 -76 -300 -110 127 -5 -26 92 213
7352 213 -151 96 77 -28 38 -27 46 17 92 39 -64 -131 35 57 -191 -33 -77 -217 231 154 70 -29 12 43 65
7377 65 -107 7 201 130 -105 19 -176 35 -72 -158 -128 -28 -29 -15 -85 9 -337 198 -35 -134 56 -58 96
7400 96 -223 -15 -54 -156 33 -87 -117 214 -241 73 107 -41 -157 57 -243 -247 27 -79 -75 31 80 -169 175
7423 175 2 86 -89 -186 75 -115 233 146 43 130 71 66 170 155 -199 -69 138 178 -39 -237 -85 -21 138
7446 138 112 73 -86 62 4 56 -67 100 -143 -157 -129 -239 -115 93 -350 14 65 -125 179 58 137 -43 125
7469 125 -41 -130 -20 4 -17 -83 75 -38 -136 59 -357 182 -24 115 41 183 -76 -13 -66 37 -43 -260 241
7492 241 -45 86 -98 -123 177 116 91 71 -115 12 -176 111 68 -209 44 -108 -74 166 -39 61 -84 21
7514 21 -51 -98 -77 77 83 -164 3 -76 68 -139 -37 -44 13 163 -95 122 86 123 -76 -33 70 18 -18 84 -85
7539 -85 94 65 -97 -40 58 180 -134 164 -158 142 148 -283 46 120 71 -277 -120 2 4 23 -48 46 56 41 -36
7564 -36 154 -46 22 29 -17 -69 -18 90 -115 105 -252 26 -220 69 -33 -125 -67 -69 64 114 -100 -113 -139 60 195
7589 195 -212 59 -16 -18 -140 27 -85 77 -207 55 -7 -49 -58 136 -142 49 49 162 42 -176 -91 19 -14 125
7613 125 -44 38 -37 -42 284 -146 45 32 -181 -83 164 -109 -179 -68 182 115 401 357 -273 122 -138 -202 -67
7636 -67 19 -109 142 103 -233 -75 57 -3 27 107 -168 61 17 170 131 -27 162 -142 -23 99 -174 -90 -250
7659 -250 156 -46 15 141 60 16 -117 17 11 -201 185 98 -21 -225 -260 -258 -169 214 246 73 -16 -194 212 179
7683 179 185 103 52 -241 -88 90 -5 120 -218 -72 -71 -163 269 46 35 -44 57 61 -56 -19 -53 49 -187 -78 104
7708 104 -209 125 -14 -85 74 -76 136 -146 -259 -64 115 -429 82 46 -57 86 -27 57 5 -229 65
7729 65 -21 122 -294 -122 -100 -119 141 36 92 -77 -181 41 250 -59 178 73 119 -12 -185 -181 -65 -235 70
7752 70 -111 -42 32 -156 -28 19 -124 91 148 -174 -122 -88 34 -111 -239 -285 28 -137 52 41 208 -18 -78
7775 -78 54 158 169 -34 -39 -62 108 11 -91 -50 -36 21 -60 -6 66 53 19 -15 75 -6 -84 245 108 37 -19 -159 67
7802 67 -164 18 -162 -201 -47 357 -47 0 -23 48 -121 -84 37 66 118 221 -20 41 43 48 -198 -5 -93 -127 32
7827 32 -154 126 -45 -63 -82 -165 -64 11 -27 -41 204 -57 -92 45 -146 -125 -199 -3 35 -65 -28 -157 103 -15
7851 -15 -243 -54 41 -71 6 -125 -37 -63 -29 -137 107 102 158 91 32 78 -270 113 -172 -246 30 20 -84 177 -66
7876 -66 -130 -162 129 -62 -122 18 -78 -215 54 -196 -64 89 -15 -23 -305 63 -122 -16 133 10 -292 -56
7898 -56 -267 4 88 -157 -74 -170 -43 -105 -38 31 164 -138 225 19 70 27 86 -68 103 -122 -89 26 97 -98
7922 -98 -343 72 10 -94 -343 22 95 -133 -152 -62 -258 -88 12 -81 -84 47 -17 99 -66 -128 89 -122 15
7945 15 -139 -130 -34 10 -225 140 -153 53 -133 188 51 12 272 35 100 -160 -7 -192 11 -48 30 124 30 71
7969 71 -42 -109 -219 1 -54 62 217 110 -166 -69 80 152 38 -93 -44 78 26 -185 -147 42 -92 -30 226
7992 226 86 70 -65 69 -124 -225 -235 69 -45 178 183 -48 37 -21 71 44 -19 -93 186 -61 107 -15 -243
8015 -243 -31 -56 127 -37 -65 -191 -70 -39 34 -65 -42 -68 -20 -12 -206 -44 -157 37 63 188 145 231 74 175
8039 175 -96 -128 -48 -31 -44 -139 76 -171 -171 -145 -21 -32 -169 10 -113 326 209 24 71 -143 -103 -44 -40 111 -31
8064 -31 84 -7 -93 -64 -250 -221 3 -85 99 -67 188 47 -426 -108 -85 56 -91 -123 -65 134 -50 -124 190
8087 190 -84 -100 119 -168 80 -69 -61 -214 -9 17 57 -15 156 85 -94 130 -37 85 -49 235 18 -81 186
8110 186 -10 -239 16 -114 -380 -227 20 122 17 32 125 -107 -39 -103 69 104 41 163 -150 75 -151 30
8132 30 -32 -14 36 -202 -198 -80 83 6 -3 -41 2 -66 35 -107 -71 218 63 -210 -206 -82 -69 47 -26 -102 65 122
8158 122 -199 -127 -116 215 -139 176 47 -114 -60 -105 -17 198 58 -32 113 -35 -224 -105 -77 -39 -119 161 -31
8181 -31 -194 101 -23 -123 163 -11 -315 320 -171 -122
8191a22
$$ Imaginary data points
##PAGE= N=2
##DATA TABLE= (X++(I..I)), XYDATA
0 0 0 0 0 0 0 0 0 0 0 0 0 0 0 0 0 0 -2 8 -8 8 -8 8 -16 16 -16 24 -24 32 -32 40 -48 51 -58 66 -75 88 -97 108
38 108 -122 138 -154 170 -188 210 -233 257 -284 313 -345 381 -420 461 -508 560 -618 683 -756
57 -756 838 -932 1042 -1169 1323 -1511 1747 -2054 2478 -3101 4149 -6428 26373 -17908 8435
72 8435 31855 3158 -3626 11145 11171 -8210 14723 -12071 8537 -19249 11392 -2582 -20983
85 -20983 7813 -3498 -2918 -19855 10333 -10374 -5210 -3489 -9703 2197 -15089 7717 -17584
98 -17584 6837 -4891 -6528 2274 -11051 1170 -8885 4850 -16181 9251 -6735 -8996 3601
111 3601 -17113 3478 -12366 1450 -11866 3805 -2373 -10252 1249 -5715 7797 -17323 11231
124 11231 -641 -1251 272 -2734 10063 -9309 10331 -5791 5849 -594 4911 -366 -4014 18475
138 18475 -8456 8494 -2354 7933 2054 -3006 4637 1396 11038 -11645 10869 -4061 1762
151 1762 -1204 -4866 7683 -7306 8301 -6094 3640 -5204 3692 -309 -6128 8767 -7052 8709
165 8709 -9194 3197 -143 -1650 151 -5730 7767 -10741 4203 -6388 2312 -4632 -2051 4020
179 4020 -12383 4602 -8696 779 -9891 1708 -437 -8481 2258 -7332 4289 -11668 4848
192 4848 -3051 -588 1856 -5366 7532 -5847 5001 -4034 7896 -2337 -99 6077 -3875 4857
206 4857 -4963 9209 -6348 4413 3399 -2540 2979 -1471 7771 -8098 8413 -1425 2582 627
220 627 -2095 6462 -4643 7115 -4472 6635 336 34 1252 -1255 6028 -6100 10028 -5281
234 -5281 2785 -32 -152 775 -5574 7850 -6869 4190 -3920 2952 -2736 -3407 3980 -6216 5820
249 5820 -7619 3961 -3737 -735 -954 -2787 4403 -7991 6064 -5994 1569 -3699 1694 1206
263 1206 -5927 7775 -4783 2522 -5553 6230 -2549 -2031 5464 -3216 5567 -6177 5852 -3518
277 -3518 2743 331 -1117 5331 -4594 5566 -4704 5510 -3550 3163 2626 -4714 5089 -3065 4394
292 4394 -6804 6395 -381 -1648 1847 -2251 4572 -7301 5727 -4376 2464 -1084 -1921 2140
306 2140 -4895 4351 -5884 4910 -4507 1846 523 -3758 1824 -4034 5781 -7781 3856 -339
320 -339 -818 -1552 -2100 4368 -6759 5220 -3965 2860 -1951 -376 1478 -3962 5574 -4715 5144
335 5144 -3483 2869 -61 -839 2163 -3594 8047 -5240 3207 -929 2780 -1097 -1791 6097 -4169
350 -4169 4557 -3643 4303 -3118 924 1800 -3492 4630 -3931 4552 -4412 2844 -501 664 2149
365 2149 -2907 7001 -3721 3820 -2477 5278 71 -1952 5492 -2015 3303 -4187 4519 -3592 1777
380 1777 1604 -2443 2272 -4858 3685 -5196 2545 -1287 -187 624 -4009 2817 -4705 2504 -6249 3551
396 3551 -1093 -2414 1699 -3017 2748 -5709 4819 -2324 897 17 -1140 799 -4861 4976 -5764
411 -5764 2540 -2033 252 -588 -3659 1801 -3681 3799 -5085 3242 -410 -138 660 -1320 5834 -4656
427 -4656 5226 -765 2258 -863 2630 2772 -3094 7004 -994 4328 -1230 3952 1716 -676 4732
442 4732 -1702 5460 -2746 2949 -1341 1694 -709 -2513 4308 -5494 1750 -4247 1385 -3917 -2028
457 -2028 753 -4667 1067 -3993 1733 -6680 1466 -1495 -3441 1413 -3256 2490 -5316 2434 -2881
472 -2881 958 -406 -2241 2354 -2886 3188 -4901 3251 -2278 -783 1689 -3523 365 -4072 3294
487 3294 -5997 543 -1538 -398 -901 -4440 4211 -4735 2659 -2511 886 211 633 2351 -1871 4771
503 4771 -3066 5546 -1211 1792 2503 175 2366 -2414 5935 -1911 2293 -49 2744 320 -1999
518 -1999 4871 -3604 3240 -2105 3119 -1284 -1062 1947 -2425 2416 -3531 3517 -3034 1974 -1158
533 -1158 -888 2652 -3350 3988 -2554 2120 -1892 1522 -504 -1983 3121 -2734 2535 -4038 2668
548 2668 -2611 -775 1389 -2786 2297 -2776 2030 -3596 1808 -1990 -165 1461 -3712 2931 -2781
563 -2781 3064 -3557 1252 1556 -933 865 -1268 3875 -4069 3658 -1409 1138 1304 -924 3069 -3220
579 -3220 3550 -1674 2502 -1536 1092 1924 -1928 2552 -3000 4221 -3230 2001 938 -976 1054
594 1054 -1244 3289 -4355 3079 -555 1435 -1531 -316 3461 -3719 3137 -2223 2572 -1268 684
609 684 279 -1510 2075 -3025 3311 -3760 1965 -782 -778 -385 -2521 3041 -3826 1552 -2089 1732 -2529
626 -2529 -750 1589 -3639 2974 -2963 2315 -2680 914 291 -1955 1398 -1992 3329 -3048 2445
641 2445 -1998 1279 1030 -2568 3340 -1903 2448 -2479 3097 -732 -466 1911 -1080 2621 -2982 3850
657 3850 -2512 1236 373 -586 1661 -1636 2805 -3206 2194 -1989 1637 369 -1617 2313 -1991 2569
673 2569 -4112 2448 -420 -545 -133 -603 2216 -3680 3059 -2885 1158 -726 89 710 -2694 2882
689 2882 -2666 1645 -2247 2064 -507 -1189 903 -2245 3308 -3607 1924 -930 721 -632 -1028 2016
705 2016 -3530 2783 -2010 1441 -1854 1414 534 -3123 2941 -1840 1939 -2779 2058 -392 -628 801
721 801 -1844 2909 -2941 2171 -1707 1436 -490 -783 2236 -2181 2832 -1683 2417 -2201 1594 1301
737 1301 -1836 2349 -1131 3324 -2837 2649 -57 356 1024 -1123 2776 -2378 3004 -2168 2018 -485
753 -485 -286 1744 -1663 2118 -2731 2562 -2931 284 347 -912 468 -2532 2993 -3703 910 -1529
769 -1529 276 -585 -1843 1610 -3096 1843 -3026 1181 -1342 -327 404 -2244 1624 -3159 2217 -2296
785 -2296 560 -636 51 487 -3038 2987 -2415 1027 -1535 1700 -98 -1339 2090 -1787 2717 -1749
801 -1749 2794 -811 1153 1272 -445 2495 -1596 3825 -1096 2228 -341 1533 1758 -1923 3152 -1143
817 -1143 2683 -1961 2255 -135 -981 1553 -1442 1735 -2876 2230 -2168 265 -540 -1492 1087 -2771
833 -2771 2140 -2628 1067 -2220 91 409 -2131 1213 -2049 2099 -2992 1490 -603 -986 648 -1203
849 -1203 1903 -3168 2139 -1937 248 -707 -543 928 -2763 2090 -2837 1543 -2091 335 458 -1229
865 -1229 1105 -1912 2761 -2675 1629 117 958 498 -495 3338 -1837 2931 -675 2379 133 1192
881 1192 2405 -988 2858 -1218 3155 -1202 2109 347 208 1542 -1807 3088 -1752 1615 -1047
896 -1047 1305 -33 -1256 2362 -2077 1924 -1691 1881 -1506 -86 1244 -1767 1210 -1808 2444
911 2444 -2195 1199 -741 -548 395 -2234 1852 -2660 1187 -2029 556 -728 -1710 835 -2363 1163
927 1163 -3160 1682 -2096 -767 -195 -1632 761 -2512 1907 -2367 1032 -1012 223 256 -1462 2208
943 2208 -1709 2342 -1572 1454 700 -215 1220 -745 2674 -1609 2562 -850 1265 849 290 1871
959 1871 -1722 3153 -1022 1645 -742 1494 729 -880 1972 -1290 2553 -1878 1872 -200 -22 1103
975 1103 -1056 1996 -1790 2117 -1345 891 -967 31 1481 -2892 1654 -1979 1343 -1910 205
990 205 -497 -1704 537 -2370 1112 -2742 1370 -1714 -450 -263 -2015 1487 -2641 892 -1924 1108
1006 1108 -1337 -421 645 -1794 1662 -1996 2403 -2120 842 505 -787 604 -962 2261 -1723
1021 -1723 1795 -1132 1387 353 -912 2090 -1399 2444 -1414 1788 -258 721 1101 -608 1661
1036 1661 -1423 3546 -1771 1289 616 506 888 -1268 2299 -1307 1905 -1160 1613 -405 128 1570
1052 1570 -1647 1876 -2092 1777 -1361 115 444 -444 811 -2247 1963 -2163 855 -1457 -102
1067 -102 175 -1995 1578 -1980 911 -2012 969 -1167 -547 191 -1581 1674 -2236 1630 -1864 143
1083 143 -263 -737 914 -1867 1780 -1713 1210 -1484 1164 611 -1708 1500 -1145 2015 -1996 1555
1099 1555 68 -9 677 -783 1768 -1495 2657 -1228 1135 163 583 1716 -1163 1751 -806 2226
1115 2226 -1172 1474 375 -199 1382 -927 2564 -1799 1635 -144 215 345 -478 1402 -2353 1999
1131 1999 -1421 927 -1411 -150 1128 -1719 1195 -2154 1581 -1935 -56 -716 -528 203 -1800 1672
1147 1672 -2670 1013 -1501 129 -688 -1291 1028 -2342 1098 -1585 834 -2060 37 116 -1671 1177
1163 1177 -1854 1568 -1616 567 -569 -111 489 -1087 1764 -1503 1697 -1010 1651 75 -206 1767
1179 1767 -932 1899 -987 2513 -560 1537 974 162 1889 -1084 2339 -1170 1504 -473 839
1194 839 871 -591 1462 -1250 1773 -1738 1657 -567 -650 690 -715 943 -1877 1580 -1184 236
1210 236 -246 -455 259 -1929 1573 -1913 982 -1542 172 217 -1130 782 -1873 1111 -2454 705
1226 705 -1500 -701 -294 -1252 577 -2452 1419 -1931 42 -1000 -221 468 -1770 1542 -1717 1066
1242 1066 -1307 859 -117 -204 1324 -552 1797 -1205 1939 106 911 380 -1 2319 -1071 2238
1258 2238 -660 1784 -148 575 1130 -988 1771 -1266 1615 -1412 1199 57 -246 501 -885 1502
1274 1502 -1567 1305 -1241 532 -147 -457 985 -1576 1199 -1653 1298 -1075 182 326 -1134 498
1290 498 -1707 1307 -2118 521 -1058 -744 -328 -1451 856 -2215 604 -1660 -11 -1013 -850 234
1306 234 -1498 970 -1997 1463 -1177 135 -85 -483 804 -1312 2010 -1129 990 -374 752 375
1322 375 -672 1710 -1201 1718 -768 1640 -234 355 1131 -596 1612 -1033 1744 -713 895 289
1338 289 81 1247 -892 1900 -1046 1259 -660 1014 458 -664 1563 -1057 1337 -1488 1379 -734
1354 -734 140 393 -700 791 -1580 1276 -1435 667 -786 -202 165 -1820 1072 -1680 828 -1777
1370 -1777 332 -418 -1037 364 -1306 816 -1929 940 -1344 -110 -150 -850 895 -1612 1176 -1273
1386 -1273 819 -834 81 292 -976 953 -1314 1705 -1381 1014 171 115 826 -669 1302 -1122
1402 -1122 1422 -239 919 149 260 1357 -898 1754 -622 1355 -404 668 453 -286 973 -945
1418 -945 2147 -1183 994 -212 394 516 -878 1483 -1308 1082 -961 829 -523 35 778 -1385
1434 -1385 1081 -1203 1177 -1219 -79 -4 -697 242 -1443 1218 -1436 574 -1469 174 -51 -1274
1450 -1274 877 -1652 828 -1276 498 -1212 -425 539 -1045 533 -1840 1475 -1102 524 -153 -553
1466 -553 464 -1114 1104 -1153 699 -689 1018 -96 -641 1062 -721 1481 -1275 1200 -191
1481 -191 250 477 -112 1179 -901 1954 -683 1061 -117 494 526 -1070 1668 -749 1148 -561 1071
1498 1071 18 170 876 -944 1504 -1497 1529 -715 -130 163 -382 584 -1215 1116 -1095 722
1514 722 -1179 408 312 -1027 903 -1293 803 -1167 285 -565 -366 105 -791 725 -1689 1124 -1176
1531 -1176 67 -605 -518 755 -1543 501 -1043 633 -1306 70 -147 -1030 767 -1328 1065 -1265
1547 -1265 781 -84 -193 408 -280 1202 -1008 1376 -613 1431 -149 15 1216 -410 1101 -819
1563 -819 1378 -708 820 558 165 421 -918 1427 -1188 1160 -372 324 161 -407 717 -1116 1148
1580 1148 -992 1022 -574 71 417 -815 1077 -1221 1176 -530 533 -287 293 174 -1015 1128
1596 1128 -1270 826 -918 217 -715 -739 306 -1333 533 -1366 440 -1117 -58 -356 -662 858
1612 858 -1347 949 -1248 545 -227 24 148 -502 1191 -627 1265 -1107 956 -122 -351 1075
1628 1075 -620 971 -843 1231 -445 304 113 168 924 -723 1199 -879 1017 -434 526 477 -857
1645 -857 577 -631 1214 -1205 928 -86 -120 600 -381 1319 -1284 1245 -573 545 -324 256 537
1662 537 -1081 975 -990 833 -1100 395 -89 -619 245 -1131 877 -1619 364 -740 -95 -282
1678 -282 -639 789 -1833 875 -1198 325 -543 -26 361 -770 921 -889 1016 -930 558 148
1694 148 -226 663 -405 1203 -874 944 -485 568 79 -329 930 -913 1257 -822 1153 -272
1710 -272 381 541 -524 891 -732 1495 -804 833 116 419 707 -392 1252 -1104 1205 -778
1726 -778 794 -94 -458 802 -965 767 -888 972 -665 -160 -38 -675 261 -1288 1110 -1051 285
1743 285 -764 -162 -40 -853 826 -1232 944 -1497 473 -492 -368 408 -700 431 -1253 920 -757
1760 -757 155 -34 -141 356 -887 1060 -940 473 -527 356 178 -364 1118 -770 1038 -911 785
1777 785 -206 197 504 -288 1021 -994 1115 -427 654 -136 192 754 -646 1015 -673 973 -480
1794 -480 690 62 -124 991 -819 836 -896 1154 -485 330 -140 -576 971 -1164 774 -810
1810 -810 672 -972 33 319 -973 305 -1065 847 -1164 223 -180 -589 385 -889 828 -1431
1826 -1431 742 -662 157 -83 -529 587 -1296 648 -1099 864 -552 131 174 -523 497 -914 1199
1843 1199 -884 647 -208 3 522 -549 1472 -920 1260 -608 725 -58 95 981 -418 1081
1859 1081 -750 1317 -437 568 607 126 965 -735 1541 -773 882 -313 242 278 -683 1030 -1008
1876 -1008 816 -792 912 -330 101 431 -560 726 -1147 1052 -714 340 -296 -354 499 -1119 800
1893 800 -1288 766 -1071 312 -387 -822 423 -1347 797 -1130 625 -738 -174 19 -571 438
1909 438 -1184 833 -1158 451 -405 79 447 -766 701 -809 826 -975 632 78 -107 633 -710
1926 -710 934 -822 1233 -228 417 208 99 801 -817 1184 -505 1209 -407 268 639 -550 1023
1943 1023 -774 1023 -573 712 -112 55 481 -613 1228 -830 753 -590 590 -79 -408 835
1959 835 -879 935 -838 937 -856 195 210 -679 677 -1009 1099 -1028 219 -448 -181 -160 -654
1976 -654 501 -1368 583 -937 441 -479 -203 543 -1141 502 -810 840 -758 349 -276 -63
1992 -63 514 -720 1257 -928 1062 -267 227 485 -298 688 -771 993 -723 1316 -528 18 594
2009 594 -479 968 -964 1103 -279 509 -88 321 327 -444 1254 -599 1187 -564 633 170 -442
2026 -442 776 -193 888 -630 1107 -471 322 233 -514 805 -1025 1093 -1004 418 -249 44 44 -901
2044 -901 522 -790 587 -1204 262 -424 -421 81 -1000 629 -1114 747 -794 -14 -208 -268 885
2061 885 -1223 822 -605 888 -432 -103 383 -432 762 -681 1064 -860 735 -108 236 510 -519
2078 -519 1091 -729 757 -412 744 -208 60 894 -436 1047 -778 1018 -438 205 349 -149 653
2095 653 -407 1041 -630 908 -362 308 -21 -600 943 -635 983 -773 735 -195 -237 296 -933
2112 -933 332 -1132 819 -964 321 -388 -572 458 -960 721 -900 290 -633 176 -328 -580 527
2129 527 -978 545 -950 454 -400 -56 312 -356 654 -968 795 -783 690 -148 -65 290 -560
2146 -560 861 -854 728 -674 539 -75 -55 731 -630 1016 -552 1003 -425 354 374 -558 800
2163 800 -494 1019 -451 801 -290 279 108 -490 851 -711 876 -752 834 60 -171 361 -774
2180 -774 603 -760 745 -685 194 -130 -364 419 -1009 727 -987 461 -700 77 -126 -758 536
2197 536 -987 686 -1079 586 -488 -169 158 -586 637 -985 591 -718 546 -312 -251 335 -701
2214 -701 563 -685 759 -704 398 55 -183 747 -611 975 -604 737 -134 431 464 -207 947
2231 947 -683 1040 -184 550 52 171 346 -281 749 -642 983 -327 586 102 87 532 -300 765
2249 765 -882 870 -532 190 196 -268 754 -652 446 -650 481 -583 119 -78 -446 335 -884
2266 -884 685 -1057 196 -356 -111 -156 -727 457 -968 373 -887 276 -169 -471 308 -822 585
2283 585 -947 522 -582 201 121 -444 440 -723 1072 -566 527 -352 256 153 -305 765 -664
2300 -664 690 -539 544 118 8 328 -178 527 -592 999 -400 319 205 43 625 -589 849
2317 849 -503 615 -628 585 255 -181 475 -370 762 -795 681 -183 27 269 -521 595 -896
2334 -896 632 -768 435 -373 -101 432 -659 479 -746 517 -712 229 -132 -373 321 -935 561
2351 561 -1050 308 -425 5 -179 -139 370 -823 504 -1062 414 -459 319 141 -289 635 -796 750
2369 750 -673 560 -46 226 351 -557 1000 -822 577 -414 515 42 -189 523 -439 841 -491 676
2387 676 -473 82 223 79 612 -466 896 -486 577 -73 108 149 -315 749 -769 625 -623
2404 -623 657 -18 -217 510 -666 520 -785 677 -552 61 -108 -703 289 -967 558 -873 -41
2421 -41 -600 -184 -204 -605 395 -932 546 -771 478 -175 -344 539 -536 538 -687 890 -531
2438 -531 301 114 42 425 -634 860 -540 812 -658 138 23 -103 632 -325 862 -601 762 -342
2456 -342 -78 298 -159 756 -734 997 -227 495 -152 131 342 -310 585 -386 819 -563 152 -91
2474 -91 -313 360 -491 578 -685 448 -330 237 -397 -299 436 -865 645 -511 606 -543 -265 46
2492 46 -479 272 -866 477 -686 123 -386 -475 191 -766 726 -774 137 -418 365 -237 -390 314 -470
2511 -470 636 -494 510 -745 268 374 -434 394 -538 660 -435 435 -272 269 184 -291 830 -540
2529 -540 622 -261 493 -47 177 401 -363 817 -460 773 -319 319 63 -116 486 -591 573 -487
2547 -487 562 -464 315 144 -274 423 -559 459 -759 402 -418 -16 122 -597 156 -969 425 -606
2565 -606 247 -322 -237 62 -603 637 -740 392 -601 158 -168 -254 132 -426 716 -734 440 -366 -53
2584 -53 143 -289 357 -423 716 -441 507 -306 0 399 -486 650 -391 597 -435 587 362 -35
2602 -35 200 -491 586 -327 678 -471 294 69 -3 533 -570 640 -472 582 -507 211 192 -166
2620 -166 410 -501 545 -435 326 -131 94 214 -375 702 -677 589 -480 196 -320 -187 217 -861
2638 -861 472 -621 373 -627 -151 92 -389 163 -588 521 -650 464 -232 -139 -89 -532 425 -566 384
2657 384 -502 67 -127 -327 397 -328 467 -622 592 -542 83 -111 146 380 -655 904 -485 386
2675 386 -218 221 109 46 635 -104 579 -354 661 -405 205 206 -24 553 -529 614 -229 258 -12 168
2695 168 291 -442 240 -224 968 -306 357 -170 -228 348 -553 509 -613 238 -576 118 -239 -174 138
2714 138 -583 411 -453 163 -618 -162 -162 -556 179 -728 490 -702 318 -188 -295 -86 -502 316 -875
2733 -875 449 -522 382 -190 26 570 -446 669 -469 360 -233 -61 184 -211 730 -638 271 -266
2751 -266 635 294 -346 487 -578 421 -855 378 -105 810 -195 561 789 -330 628 -553 638 -493
2769 -493 445 53 -561 112 -461 604 -156 -72 -129 515 -319 -276 708 -276 626 -439 375 -393 -168 -657
2789 -657 -1161 -157 -625 646 -97 -531 -683 -55 -210 -830 648 -684 378 -460 364 -76 -180 324
2807 324 -620 592 -568 615 -247 131 180 -429 342 -635 500 -616 461 -21 206 275 -387 650
2825 650 -271 617 -343 199 55 -38 342 -204 365 -282 591 -150 178 402 30 724 -450 712 -286 316
2845 316 -157 227 160 -403 453 -404 552 -500 461 -235 -175 175 -599 134 -542 482 -408 103 -129 -416
2865 -416 90 -762 385 -704 240 -411 -113 213 -268 245 -570 198 -858 341 -479 190 65 -399 289
2884 289 -692 616 -369 103 -191 -225 211 -275 450 -189 560 -434 412 11 -268 177 -411 392 -361 443
2904 443 -155 127 152 -162 752 -274 784 -279 242 -294 178 188 -253 300 -384 665 -519 290 -120
2923 -120 -64 129 -373 525 -541 250 -308 253 -111 -237 93 -401 416 -630 152 -372 54 -6 -599 480
2943 480 -613 161 -602 37 -501 -154 53 -290 294 -825 264 -444 334 -445 79 185 -259 192 -436
2962 -436 547 -149 128 -280 67 276 -320 473 -780 235 -459 399 123 -60 556 -232 649 -127 420
2981 420 198 96 216 -14 573 -302 605 -410 240 116 -93 348 -527 378 -492 588 -221 264 -45
3000 -45 -310 266 -592 308 -626 707 -143 -64 137 -443 274 -509 260 -461 372 -520 -317 51 -567 147
3020 147 -644 101 -487 117 -127 -238 161 -325 483 -554 437 -216 -13 19 -292 490 -585 222 -227 317
3040 317 -272 140 188 -291 636 -687 702 -338 242 -143 -22 230 -70 433 -517 309 -288 388 156
3059 156 -14 327 -369 474 -147 528 -155 157 152 -27 360 -350 758 -420 535 -313 49 332 -636 451
3079 451 -486 389 -445 117 -128 -298 133 -589 516 -455 443 -465 -18 -98 -201 113 -493 269 -599 37
3099 37 -288 132 44 -268 473 -479 163 -411 282 30 -202 37 -284 405 -637 494 -243 522 -198 -259
3119 -259 6 -493 581 -357 331 -175 365 145 49 400 -376 677 -455 327 88 129 253 89 141 -450
3139 -450 547 -303 400 -121 168 61 -275 375 -421 488 -449 212 -91 -126 49 -431 551 -534 366 -255
3159 -255 -34 -133 -273 349 -321 328 -469 149 -478 -53 74 -409 150 -335 493 -347 219 -138 -163 159 -367
3180 -367 226 -611 215 -469 20 59 -193 115 -353 415 -600 496 -322 275 -231 -13 265 -394 623
3199 623 -330 536 167 278 290 -265 566 -402 406 -31 537 -4 50 268 -231 588 -525 496 -404 523
3219 523 191 -74 257 -391 404 -463 526 -81 105 -26 -353 401 -623 333 -526 378 -394 -27 201 -499
3239 -499 374 -618 329 -523 178 -288 -21 20 -327 489 -594 232 -257 251 86 21 99 -361 283 -333 365
3260 365 -387 148 -87 -118 266 -370 597 -347 288 -174 92 125 -258 485 -418 499 -295 138 119 -153 408
3281 408 -214 471 -239 425 -311 209 77 -184 449 -362 777 -358 102 -52 263 268 -418 405 -432 345
3301 345 -318 200 -376 146 -14 -125 307 -241 284 -517 396 110 -380 378 -281 283 -484 196 -496 -12
3321 -12 -45 -215 250 -410 371 -484 240 -234 165 -241 -83 326 -562 388 -306 473 -202 -81 58 -284 182
3342 182 -485 599 -179 164 -94 -70 486 -318 591 -404 426 -59 214 52 -20 543 -117 509 -415 257
3362 257 -423 214 213 -151 410 -547 409 -278 120 -39 313 73 -259 419 -183 317 -489 140 -103 -167 93
3383 93 -203 245 -496 407 -239 -43 -59 -165 161 -501 161 -312 253 -190 375 -35 -310 211 -382 485 -304
3404 -304 233 -95 -16 92 -270 186 -818 494 -184 58 -20 32 399 -251 572 -267 263 -24 245 18
3424 18 57 290 -519 407 -260 467 39 -10 345 62 358 -188 645 -128 281 146 5 294 -232 612 -439
3445 -439 160 -158 158 -263 -167 133 -227 157 -586 30 -98 -11 42 -315 366 -207 -19 -293 300 -227 43
3466 43 149 -335 -81 -346 182 -389 -142 -163 -179 122 -414 239 -526 433 -196 293 204 -299 284 -505 -44
3487 -44 -195 546 -216 97 140 -57 290 -337 516 -320 360 -57 -141 48 -115 339 -388 126 -397 327 26
3508 26 74 564 -347 395 -68 358 -15 244 -44 -162 155 -178 360 10 160 -84 -134 243 -37 100 -325
3529 -325 92 -356 219 -106 -193 108 -281 334 -585 337 -477 183 -89 104 -118 -327 239 -435 92 -151
3549 -151 236 -130 -162 -52 -250 176 -412 108 -79 -255 52 -195 74 -506 401 -192 183 -159 17 274
3569 274 -168 152 -193 491 -219 138 17 260 234 -218 415 -262 274 -132 306 5 -257 43 -310 315
3589 315 -280 594 -40 -89 -36 -135 327 -628 324 -224 257 -119 -102 77 -200 355 -410 371 -328 -29 -187
3610 -187 -71 199 129 78 -305 59 -4 129 0 -257 305 -331 413 -173 145 -60 -106 119 -371 112 -304
3631 -304 211 -53 295 -24 -156 73 -442 44 -198 466 -274 340 -94 -365 54 -191 287 -294 496 -147
3651 -147 79 250 34 369 -249 352 -260 429 -269 202 69 -179 120 -350 559 -205 247 -134 47 275
3671 275 6 254 -528 171 -15 103 -98 69 458 -311 342 -412 290 -231 6 36 -9 332 -232 204 -479
3692 -479 115 126 123 5 -417 142 -269 190 -285 -41 -199 149 106 -396 219 -328 279 -383 256 -74 -45 254
3714 254 -417 292 -211 282 -456 129 -26 -124 131 -87 409 -397 132 214 198 221 -79 362 -138 29 -80
3735 -80 155 108 -149 252 -150 436 -274 261 -324 112 38 11 45 -157 373 -231 56 -201 129 13 -139 304
3757 304 -248 67 -313 -41 -153 -139 96 -226 250 -443 102 -172 1 -201 -23 185 -429 403 -274 230
3777 230 -168 -255 -92 -292 10 -91 295 -289 -22 -100 -65 57 -315 293 -506 308 -442 332 51 -10 150
3798 150 -187 374 -210 260 -43 163 64 -117 266 -71 270 -107 260 -154 161 52 -68 182 -308 161
3818 161 -182 239 -164 78 199 -131 112 -340 53 -356 182 139 152 173 -129 113 -381 104 -455 24 -53
3839 -53 -166 299 -334 53 -310 156 -246 60 315 -114 249 -317 246 -328 -93 -136 -109 -29 -293 241 -196
3860 -196 361 -421 -58 -103 24 291 -283 346 -245 367 -224 161 -9 115 158 -208 569 56 263 -61 33
3881 33 63 -269 315 -331 338 -84 82 -117 40 125 -242 422 -276 276 -261 387 -132 42 272 -276 7
3902 7 -358 409 -473 90 69 -168 73 -253 237 -312 -68 -233 -48 104 -234 239 -381 515 -352 34 -107
3923 -107 19 69 -430 4 -284 344 -228 144 26 -100 7 -216 322 -400 173 -10 -32 216 -42 100 -247
3944 -247 512 -201 211 -113 -236 287 124 445 -144 227 52 390 41 65 248 -212 283 -215 226 -215
3964 -215 234 -177 -14 206 -134 280 -316 255 -221 172 42 -304 410 -190 283 -84 79 -278 154 96
3984 96 -175 211 -239 76 -183 -56 -166 -37 342 -190 239 -189 78 -399 247 -6 -67 102 -290 373 -186
4005 -186 90 -94 -131 107 -104 9 -499 257 -139 371 -342 -252 -57 -350 54 -81 186 -183 286 -22 -112
4026 -112 405 54 195 -80 210 -125 69 180 13 12 -43 408 -263 246 90 -40 314 -144 327 -118 74
4047 74 -278 170 124 10 80 -252 431 -209 214 -80 -40 -107 -112 247 -253 128 -384 -39 -375 -115 -78 -206 240
4070 240 -345 124 -414 14 -134 66 -53 -177 223 -70 303 -372 92 -293 -131 93 -243 266 -226 273
4090 273 -212 121 163 -227 220 -98 309 -228 266 36 115 283 49 76 57 351 -362 342 125 -13 47 -57
4112 -57 232 -245 184 -133 243 7 -217 178 -171 223 -366 125 -60 -80 -169 -74 76 -265 224 -264 103
4133 103 -260 218 -125 -169 265 -241 271 -428 268 -385 -113 -57 -349 84 -274 223 -147 231 -257 2 -3
4154 -3 -77 212 -401 -47 32 117 -115 -3 165 -177 154 -74 123 47 22 68 -138 306 -376 433 -96 238 -91
4177 -91 -26 -3 -115 122 -295 352 -288 107 -7 -156 168 -141 269 -191 77 -179 9 81 -227 203 -313
4198 -313 106 -273 257 -268 -130 168 4 345 -282 222 -220 105 -285 -36 -91 -220 -9 -419 58 -424
4218 -424 81 -356 -96 -54 -105 -107 -259 100 -290 152 -209 -45 159 -193 60 -498 215 -159 -96 -121 -211 406
4240 406 -120 -8 -317 176 -56 259 216 -178 222 -175 301 -168 361 -50 78 154 -67 478 -174 435 83
4261 83 257 11 -62 144 -226 175 -21 358 -344 123 160 97 285 -325 1 -193 -99 -200 -133 186 -98 -24
4283 -24 -313 187 -332 108 -85 78 190 -339 119 -389 257 -33 111 106 -232 152 -200 306 -67 248 -109
4304 -109 -204 137 -369 255 -15 365 34 225 -18 74 94 -100 78 -129 393 -174 294 -12 -161 41 2
4325 2 288 -112 192 21 -167 -122 -101 207 -240 131 -241 345 -70 73 309 -110 164 -80 343 -82 236
4346 236 35 12 114 -247 -79 -220 7 -25 21 156 -170 65 -185 136 -405 94 -249 74 23 -65 68 -248
4368 -248 33 -410 86 -99 -120 43 -173 38 -108 90 -403 146 72 -15 69 -246 368 -48 6 -179 120 67
4390 67 -109 26 -106 171 2 187 -147 -28 9 -58 254 -159 206 -102 78 -122 20 198 -13 96 38
4411 38 154 -474 348 -212 -263 39 -177 186 -29 165 -188 -106 43 -51 129 -187 393 -219 136 -119 -252
4432 -252 80 -33 208 -249 117 -125 -32 -104 -217 8 27 92 -139 129 -372 20 -333 -194 -44 -2 211 -241
4454 -241 121 -41 -81 -114 -161 104 -85 -13 -189 194 -95 89 97 84 90 -43 73 -184 188 -195 77 -54 -7
4477 -7 176 -19 63 -78 146 -96 -83 179 -60 212 -208 165 -133 97 25 98 284 -3 217 2 337 -21
4499 -21 171 45 -121 56 -283 125 -285 -53 -265 -69 -9 69 33 -155 94 -189 -130 64 -108 126 -204 56
4521 56 -356 -49 -184 -3 168 -40 180 -95 157 -316 206 -49 67 68 62 363 -247 278 -208 238 -1 139
4543 139 -104 21 97 -426 -54 14 -113 -313 -115 283 -4 -79 111 -371 -132 665 -110 -20 258 37 353
4564 353 -610 32 -286 -358 244 -296 444 324 190 55 -121 176 -522 398 -241 -169 -153 46 -24 -280 -371 -362
4586 -362 576 94 239 -403 334 -118 143 435 -254 80 -57 -173 325 626 3 601 -189 -161 509 -108
4606 -108 526 -112 317 185 -176 149 -352 48 -88 116 -157 734 -230 168 35 -122 254 -182 135 -13
4626 -13 -183 630 -357 -28 34 218 -78 259 -380 -192 276 -246 776 -28 210 -26 598 102 -402 291
4646 291 88 269 306 246 243 196 181 169 55 -88 -277 -94 -105 168 -13 124 304 274 -169 -514 185 328 -283
4669 -283 -359 -264 239 364 -267 -476 -195 331 -83 146 -202 91 88 -393 435 -134 95 -131 -268 -364 -78 43
4691 43 -201 368 338 -66 -88 160 -161 127 349 -400 -198 -28 -170 -256 -70 511 294 98 -243 94 12 96
4713 96 274 9 492 -317 -169 339 117 30 -444 32 -94 75 -243 158 -195 168 38 -267 35 -167 300
4734 300 -203 174 93 -57 45 -295 27 -204 68 59 -198 1 13 -53 -517 293 130 237 -10 -55 -204 -285
4756 -285 161 -105 50 -229 123 -317 -304 55 -43 -44 -138 115 -260 124 248 77 385 -283 128 -213 5 136
4778 136 -2 159 17 152 175 128 -154 189 -38 -368 -343 71 266 126 217 28 -461 157 -339 -42 442
4799 442 183 -196 3 199 350 48 -117 3 -256 224 -306 95 -62 75 -39 8 -66 -110 -239 -360 62
4820 62 -420 77 -239 -64 -183 -282 -146 49 178 -451 506 -535 -43 315 -74 -179 -189 217 185 62 149
4841 149 286 307 -152 277 226 103 339 -190 23 -102 -72 224 207 29 -73 -62 2 -51 -258 94 62 15 -89
4864 -89 246 276 -146 94 -250 206 -243 291 54 -47 -35 -102 -109 -249 -137 -407 -128 -260 -63 -17 -318 -63
4886 -63 232 -433 -412 38 402 -458 210 -379 17 -425 -180 481 -228 931 -183 130 -388 -32 -515 -116
4906 -116 -14 -367 323 -60 119 -180 228 -51 303 51 -53 36 -55 -49 -167 187 -152 191 -60 -716 -146
4927 -146 -256 537 129 -237 -290 141 44 -52 -154 -297 246 -89 178 9 -152 21 -315 68 -124 239 -298
4948 -298 -173 30 -74 30 -292 823 110 216 -212 -58 -3 -435 33 -301 282 -202 346 80 522 -345
4968 -345 -840 -112 -325 -211 -245 163 231 -248 282 -498 11 -557 -518 -82 -552 103 -122 247 -743 -154 141
4989 141 -34 117 -187 -175 327 641 239 -144 194 -320 556 -151 269 197 -117 -47 59 177 -198 -282 66
5010 66 185 20 263 296 -115 -230 -246 329 102 3 -231 267 -49 8 -73 -12 112 -413 385 -14 -103 -111 -236
5033 -236 193 -59 499 430 -237 -233 -392 -339 -159 -613 -113 540 153 169 -499 212 -53 136 -87 491 317 -10
5055 -10 185 349 -182 -293 205 90 -246 -10 35 -101 -91 84 -155 188 431 287 59 -488 646 -472
5075 -472 -337 182 -132 101 257 528 127 35 214 2 -379 475 108 63 214 -312 681 -218 216 556 238
5096 238 103 -541 218 -15 20 -367 -182 460 103 87 -33 -20 -28 323 178 -198 -378 -311 85 -118 307 282
5118 282 -98 -77 -286 55 99 334 142 124 -15 66 396 468 349 -306 404 52 -88 107 51 -179 -431 100
5140 100 -41 -205 -106 90 251 71 -108 44 -172 97 -291 -7 46 -73 133 132 -110 -206 39 48 -233 -340
5162 -340 233 -221 -77 579 476 -155 2 -23 473 -21 -222 -123 -160 172 -663 -35 -178 -591 168 294 -167
5183 -167 -120 31 -182 153 115 486 221 160 86 -334 102 300 -56 179 -318 -77 -135 -67 -463 42 -432 175
5205 175 403 162 203 -270 304 377 -365 171 119 42 -174 -342 148 110 -332 253 -54 -187 297 175 -422 49
5227 49 224 -790 -368 -17 51 6 288 34 -435 349 32 -100 45 -144 166 320 151 -278 348 138 67
5248 67 315 22 146 -273 -105 -86 524 154 -84 -165 278 -207 -109 -186 -208 113 77 299 79 185 269 22 -70
5271 -70 113 -327 379 -369 261 -382 -100 -290 -149 61 -96 109 89 314 -197 107 35 -74 51 -236 223
5292 223 141 388 283 -321 222 192 89 -71 200 -399 -113 -55 -300 -155 -340 -200 -447 34 -149 88 18
5313 18 -40 281 -396 345 292 -202 -432 79 -237 39 51 -121 -74 -305 87 -427 -217 -117 -166 -163 -229 440 -68
5336 -68 -20 -141 -116 -122 287 -396 -165 136 15 116 -70 34 67 -370 139 -240 -55 -307 -223 -157 57 -78 205
5359 205 30 -209 362 -106 -211 -4 -21 161 64 145 -117 -101 148 -163 13 -53 179 19 131 -183 151 -20
5381 -20 -100 403 -42 49 -41 430 -22 -181 97 -82 66 -173 41 -270 -44 148 245 -62 -77 182 -151 170
5403 170 -150 132 -112 20 -41 -169 66 -297 30 -124 -118 8 -116 -174 40 -98 -185 -45 94 168 60 80
5425 80 83 -17 97 -60 -42 -170 3 206 247 189 -204 63 -121 83 39 111 -115 -55 190 -199 -168 -159 120 -82
5449 -82 22 96 -3 275 29 158 -179 109 -7 34 47 -98 -32 -9 79 -87 180 -234 -165 106 118 27 -119 92
5473 92 63 -126 -157 -129 -42 -80 34 145 -175 59 -66 -144 -16 87 -53 146 42 -114 -20 34 -42 -306 123
5496 123 -98 60 53 60 45 182 0 -266 -66 16 -104 -161 -39 -193 -99 38 100 275 160 73 -122 132 344
5519 344 -9 93 221 -188 -170 -92 119 -223 191 -61 39 -167 -73 -69 39 -238 -45 -9 -111 12 41 222
5541 222 -172 51 175 -166 235 -149 -62 152 8 90 61 -154 -69 63 -137 40 -141 12 65 37 194 -71
5563 -71 -51 78 293 105 97 -78 -164 -47 -119 268 106 51 -209 86 123 -191 160 -71 75 0 70 -36 -90 -34
5587 -34 -145 118 -28 51 111 62 -169 171 70 222 -134 71 -31 189 94 -208 -130 132 -67 252 -68 248
5609 248 -91 194 80 -195 235 -91 88 -236 37 56 -262 254 -37 110 -26 -78 83 42 172 162 13
5630 13 -155 79 -253 105 -101 -3 121 135 -84 -59 -144 -258 -79 -107 -31 247 26 -2 -11 -26 -115 193 50 -220
5654 -220 37 -181 118 77 -97 62 163 -28 139 126 -48 41 -52 59 17 -102 108 -184 -39 67 14 142
5676 142 -77 48 -5 -125 93 -143 -120 22 -202 -20 57 49 257 -128 146 173 -115 99 -61 -132 42 164
5698 164 -48 122 -192 73 119 -44 79 -6 -195 95 28 -57 -22 68 -27 154 86 -176 -75 104 60 261 -84
5721 -84 -159 127 -78 76 42 -14 -235 66 -31 -148 211 -39 81 -82 119 -25 -263 -161 196 -152 -241 22
5743 22 -317 -84 -56 76 111 86 131 -284 -74 3 -6 307 -417 498 -71 73 -315 63 -400 -354 -139 179 2
5766 2 -307 361 -296 -757 41 -239 -395 -266 450 -416 75 -39 -224 -957 -629 -303 -143 -643 -194 -110 -202
5787 -202 653 344 -28 211 -83 -69 12 -16 69 -163 63 -4 97 55 80 -198 255 -240 31 60 -9 145 -64
5810 -64 70 -105 7 62 -207 10 15 93 9 139 52 144 33 -56 -38 -173 6 60 -143 -179 -26 162 -184 238
5834 238 -851 340 -92 -333 71 357 -7 -327 30 -496 392 -214 233 -30 148 210 -477 -129 -250 22
5854 22 -168 -577 108 642 219 -529 220 -129 -120 -424 665 112 -996 -844 742 -409 64 -217 651 262
5874 262 -252 441 -50 27 -211 -116 51 -506 131 -90 436 -332 -439 135 -313 242 -67 -171 88 32 -84
5895 -84 334 211 -98 -169 90 48 70 -121 -47 -96 257 592 211 320 27 188 24 349 95 76 42 -309 -179
5918 -179 -577 -123 -563 105 -19 -184 -220 216 -8 69 364 -78 -93 125 -345 -218 -1070 -251 -588 192 82
5939 82 243 -125 -216 489 429 -613 -509 593 632 -111 449 335 -29 72 -25 735 98 -13 -321 212 20
5960 20 62 -642 288 -264 158 126 -46 159 -290 -368 55 240 -63 -109 37 -77 -149 -167 75 218 424 42
5982 42 7 70 -103 -295 -54 -109 -245 137 -31 57 -150 -31 248 -163 -24 -358 122 90 -17 -138 -32 208
6004 208 -150 -37 -299 -29 7 -85 63 177 40 -282 -77 324 -62 -85 -48 -325 123 216 -242 -148 -535 -615
6026 -615 -17 -149 -128 -175 -222 -148 -448 584 764 -517 68 -314 -242 -351 -92 -154 -389 390 140 -3 -161
6047 -161 5 -161 -181 455 -457 -297 -404 -492 39 -443 108 -132 -346 -750 231 43 -275 -517 -753 -679 -347
6068 -347 47 -572 245 333 76 -173 -200 934 330 587 479 48 -226 -271 297 32 -294 -166 218 212 -325
6089 -325 379 -32 397 396 -2 -156 -79 -77 103 -228 166 258 -245 122 -488 -314 44 -18 527 69 200 -54
6111 -54 -400 77 561 432 -27 -393 -276 -161 370 -228 -142 -338 223 0 -273 72 146 -182 64 -176 409
6132 409 144 -171 -62 -383 -27 -193 -121 -39 -87 -191 234 156 -222 84 -126 -135 365 -1 -247 301 -244 -127
6154 -127 334 176 -100 7 128 -194 -384 -274 98 308 -503 -54 160 120 -144 423 46 -65 -326 -134
6174 -134 -194 -38 -404 230 -243 205 434 -384 286 542 -57 -242 372 128 -2 -61 -146 -302 235 317 -110
6195 -110 -493 -45 130 309 257 80 207 -604 -237 -2 204 -105 115 -122 209 265 325 -77 -224 -251 -62
6216 -62 183 229 -94 352 -127 143 -61 144 -134 -198 317 171 -308 -460 -313 171 355 -376 -148 -458 -18
6237 -18 -126 -479 -156 1 164 -193 -430 -17 -413 -326 -112 637 -295 -34 -208 -469 -276 -39 603 84 0
6258 0 -403 474 -161 -573 -382 -626 371 -129 -111 -251 -249 376 202 -78 -274 -621 -189 1129 -462 -805 -143
6279 -143 129 126 64 -195 -172 286 312 -17 -533 -157 -115 -497 174 -39 181 53 98 -161 189 -18 79 365 -330
6302 -330 -287 -3 -170 174 -108 286 -163 -31 -231 -50 -130 56 48 141 285 -116 -91 -159 272 26 -222 160
6324 160 -174 -61 -118 141 31 214 163 160 202 -14 310 -294 227 -150 88 -128 71 142 -114 -38 -46 226 -64
6347 -64 0 98 76 -42 -52 19 66 -100 -197 -28 61 -118 285 52 151 -106 -38 -66 -67 112 -274 175 47 102 -68
6372 -68 125 145 16 105 4 -60 -32 -59 52 274 -180 117 59 -113 208 -94 83 1 63 -91 63 -59 125
6395 125 42 -21 129 -305 -1 0 23 -91 -41 -220 -184 234 6 144 -124 -143 -5 -89 64 -184 -8 -36 -106 64
6419 64 153 -132 -53 -90 213 255 -85 -96 23 -3 145 -42 48 14 50 78 -178 -68 -91 125 43 25 5 -97 72
6444 72 45 264 31 -271 -69 -137 98 92 -21 -24 254 -76 88 52 166 21 -149 -90 7 -23 -57 -27 -71 -78 -235
6469 -235 -84 -6 -96 110 -169 50 -67 -155 -220 -783 239 -347 495 715 -828 -89 554 139 126 -356 -161
6490 -161 88 -22 -156 190 53 82 -102 46 76 -4 7 25 74 17 -182 -181 -183 -61 89 -146 73 -161 -9 -176
6514 -176 36 314 48 132 76 79 -83 -151 -166 147 -135 -172 123 16 80 255 -21 155 7 7 19 44 309 117
6538 117 10 201 145 78 52 -13 -71 -5 22 -25 194 -198 74 -109 -43 -112 229 -139 152 60 231 16 -150 29
6562 29 -103 30 134 86 20 -51 88 -5 -251 74 87 -179 -81 -1 56 19 -86 -91 -132 80 117 -67 -89 -143 -285
6587 -285 64 -83 146 -12 -17 -49 -108 -81 -44 -89 73 36 -97 47 116 50 -99 -53 112 -33 142 20 7 40
6611 40 -137 10 -249 129 28 38 -13 -149 -101 128 -38 164 4 -92 -290 -51 -91 -73 -101 -37 10 183 -166
6634 -166 16 -34 53 -44 -80 -39 -51 19 -12 -50 -30 -96 -97 127 -91 156 192 -68 -223 -101 72 -103 38 17 72
6659 72 -3 -201 -2 -70 -16 59 -24 -70 -76 -192 -52 -33 193 -154 -124 12 126 11 151 15 138 -21 -117 -98
6683 -98 -53 114 -206 70 -142 67 103 -250 119 -89 119 -167 -88 -34 79 88 -17 80 -23 132 39 -124 -120 -123
6707 -123 166 116 90 90 -116 -267 -114 -63 -123 201 27 -149 83 46 -20 29 44 -189 -114 -32 -157 122 -42 71
6731 71 7 -53 81 -32 139 164 -92 -191 -92 257 -17 -80 75 46 -235 92 -24 -152 2 79 -6 -59 91 63
6755 63 -7 43 -97 -6 -14 40 -155 84 98 128 -2 114 113 194 30 -84 55 158 158 -213 78 194 -86 -107 -10
6780 -10 177 183 171 -31 -22 182 70 180 158 95 -111 -87 -17 -68 4 171 -6 -41 3 171 -62 262 -371 44 263
6805 263 -65 258 -114 216 3 -31 86 168 -124 2 193 -25 24 -77 -91 13 47 -144 -70 172 -81 -109
6827 -109 -205 89 -65 -44 -345 127 24 37 28 176 272 44 -186 -6 105 -10 -137 42 -104 -42 179 -213
6849 -213 28 -219 11 9 -11 -141 -155 198 156 54 111 -69 -156 197 31 -84 32 20 133 316 92 -191 157
6872 157 -15 -12 190 -213 256 -212 -163 -161 -26 108 -150 170 9 -20 62 -78 58 -56 15 -91 160 -309 152
6895 152 -56 3 18 -66 89 118 -107 -77 68 -52 17 -298 -28 26 -13 79 -130 -6 -38 -72 -136 -39 150 -9
6919 -9 73 -243 23 -390 150 83 53 27 11 34 -119 -56 8 114 51 23 256 -133 -15 90 -114 139 124 46 80
6944 80 -220 -17 -98 -94 26 67 83 275 -120 -55 74 81 230 -144 -124 -292 164 -47 119 97 170 238 -141 210
6968 210 169 -115 244 76 222 -213 160 -80 8 -143 584 626 -473 249 225 380 445 116 186 -28 -268 34
6990 34 172 106 -63 -126 -95 -98 40 137 218 47 -187 15 73 94 -160 -1 184 27 124 -25 143 -67 28 78
7014 78 117 41 -231 -107 143 59 29 -117 -86 -192 -87 83 132 59 23 -55 -6 -166 -59 -43 -71 45 45 -97 -53
7039 -53 429 -64 -104 -136 -32 60 48 -153 -6 -154 -12 -149 124 -136 102 75 90 -60 -182 373 -54 69
7061 69 -96 101 -307 21 -148 -146 153 52 -165 -45 -47 150 7 -217 -147 -61 -139 4 65 12 167 -112 70
7084 70 -40 -23 -125 -86 63 187 -54 49 -205 -30 59 -220 279 -70 135 25 124 -89 194 -26 -104 -203
7106 -203 -189 255 -287 -26 230 46 86 89 168 -45 -224 82 -73 51 -195 92 140 28 -67 4 -120 -133 -159
7129 -159 -29 194 -71 -225 -184 39 61 -161 -84 -12 115 86 -48 26 130 89 122 68 -48 -96 -33 -21 124 35
7153 35 -318 124 -51 -40 117 -20 -216 -11 -40 18 -232 -89 67 -141 -135 -15 -27 71 66 -151 35 134 14 12
7177 12 -69 162 -127 -92 -39 -94 19 -144 -173 -53 -235 -199 59 -17 -125 -97 109 -72 161 -47 -229 -143 86
7200 86 51 -22 41 119 61 41 -180 40 -149 -109 188 -132 167 177 208 -122 -191 289 -186 -164 -141 -51 95 68 -77
7225 -77 24 190 4 -40 2 266 15 9 -62 -101 -24 -85 -27 63 -14 -10 -107 126 -115 9 257 220 -38 24 10 -29
7251 -29 -19 1 28 -24 124 138 -14 123 -51 79 63 -1 -34 -75 279 54 134 174 -227 41 235 30 -7 125
7275 125 27 -8 53 52 -48 -73 -24 -143 21 -87 98 86 -69 90 -82 -104 127 -41 -99 42 -333 -129 130
7298 130 -130 61 -143 -69 -52 -53 84 -50 -68 46 242 82 -44 -46 -31 -54 124 5 178 151 -188 -105 28 20
7322 20 -115 76 -392 -108 62 -132 82 -143 194 -146 212 48 165 89 -70 263 175 -33 -12 -64 -83 -126
7344 -126 28 200 107 8 185 26 11 106 -89 123 2 180 -294 73 -111 35 224 99 10 309 36 -92
7366 -92 4 110 216 -35 -54 177 222 -9 -82 -118 58 -25 -66 93 15 20 -74 281 261 67 123 24 43 113 -12 228
7392 228 22 67 -57 -42 -39 122 -2 -35 156 -131 34 -50 13 -191 -39 66 -4 21 -58 -46 -141 -184 43 -174
7416 -174 97 -65 76 72 -43 -130 -42 -63 -125 115 149 199 -169 -82 193 110 -133 -318 130 92 160 -45 174 -305
7440 -305 -60 -82 -80 2 101 -114 85 75 124 -14 -55 21 261 6 90 -108 -152 159 -56 -109 -164 66 101 275 -69
7465 -69 -25 -22 62 -180 -84 -75 72 52 -136 -193 -50 122 24 149 2 -54 199 112 -272 -158 119 11 -20 145 -26
7490 -26 61 171 12 104 -70 52 85 78 75 -119 20 -45 69 44 -183 -16 -35 -128 -69 -92 -15 -86 -22 141 -33 33
7516 33 18 -13 46 247 -34 29 -38 19 -354 101 -37 13 94 -110 -18 -10 -48 202 18 -190 -4 -160 112 -108
7540 -108 19 -228 264 -34 66 3 -68 -11 -5 -36 116 100 -45 -69 -45 -50 -156 -137 113 -11 -76 70 61 181 150
7565 150 32 56 68 17 82 -109 3 -47 31 45 -51 4 100 -127 83 104 166 -98 -195 6 -55 56 1 -125 100
7590 100 -158 14 -33 140 181 -212 -169 -28 -50 -103 -89 -66 -18 131 96 -46 97 0 133 -58 193 49 -98
7613 -98 -83 80 -193 -157 -101 -18 -18 -182 -91 -35 -48 204 -20 -286 6 -43 -28 -139 2 65 206 151 74 307 39
7638 39 37 -46 -173 3 276 -28 -242 -81 -56 -100 164 11 138 -231 -31 -78 -174 79 -29 125 47 212 -150
7661 -150 72 -216 3 76 22 102 -54 -16 40 77 -44 8 -244 -41 -7 36 413 147 79 205 -92 -105 -235 -134
7685 -134 40 8 87 -41 165 -137 184 48 -31 -40 78 -11 -28 28 -154 90 23 -5 -57 12 -281 -167 85 -26
7709 -26 -17 -16 -76 62 -126 -1 91 -122 114 -70 54 88 165 12 -20 91 42 -52 -52 32 -106 37 179 -187 44
7734 44 -2 63 12 -116 -35 129 332 33 85 128 28 83 142 -68 -61 -80 3 -169 -96 -100 -29 -137 25 109 -41 -1
7760 -1 154 75 277 121 -153 65 147 -139 -5 -307 -261 -135 111 -218 6 63 227 26 37 -229 21 -94
7782 -94 98 -117 -132 -247 -134 3 -203 31 -99 -251 101 129 -59 -22 -150 108 51 -86 62 29 -72 122
7804 122 205 -147 47 129 -28 -76 -144 26 82 24 -40 9 2 -84 -116 54 56 45 166 -178 -87 -181 -19 -69 9 54 -120
7831 -120 83 77 -1 -75 53 82 -4 -141 21 129 164 85 67 207 -75 -213 -26 -68 35 299 -50 -46 185 -106
7855 -106 -28 -241 -47 -10 -136 -96 -176 -98 150 99 82 228 -214 -240 -57 134 37 -105 -173 74 -121 102 -96
7878 -96 -74 -130 -198 -28 87 137 48 -159 23 -68 120 -58 -74 -18 -185 -110 -35 -83 63 -78 -106 105 50 47 19 -11
7904 -11 51 -70 -221 4 37 -23 -59 -55 -155 17 -28 -212 -33 -28 16 113 25 151 0 122 7 54 -72 -28 40
7929 40 -41 89 -147 23 -22 -60 -68 -65 -175 -34 -123 -106 60 -95 186 112 -29 -360 -2 243 -33 90 17 -27
7953 -27 -141 118 -162 23 175 -164 -101 -209 150 127 -254 -88 61 -64 148 120 85 -73 -83 54 69 -104
7975 -104 -150 38 117 23 -61 124 48 -109 -59 44 29 -39 -83 89 -93 11 200 -287 -18 -153 -48 -195 31
7998 31 9 -252 17 76 -99 -53 43 -125 37 -45 6 -11 -144 137 -71 -59 -164 -158 -26 46 4 -132 -80 -112 80
8023 80 172 2 266 -291 -127 85 -112 -68 -38 -296 -30 -61 -41 -251 151 192 -94 -12 -272 -179 161 -264 25
8046 25 126 228 -25 -72 45 184 80 26 161 -116 81 74 102 204 -12 111 -31 -2 -191 308 115 291
8068 291 -212 -107 250 72 131 37 19 -135 -206 -216 82 -60 -37 -153 149 80 15 -128 159 17 199 128 -180
8091 -180 83 330 174 -51 -104 80 119 174 -237 -93 196 -145 61 -44 -166 -107 -235 93 -53 69 -136
8112 -136 -81 -28 -160 228 -36 -84 -16 115 73 118 156 75 135 44 86 -11 209 26 317 203 -180 4 -168 84
8136 84 -257 -70 36 -64 203 168 -238 -38 97 1 -108 3 140 89 7 189 -81 116 -138 -42 34 -68
8158 -68 15 64 -189 -256 32 1 79 -67 156 37 214 27 158 -175 128 106 108 62 51 -46 -103 114 134 215 29
8183 29 -69 -129 8 -123 -80 57 24 -84
8191h4
##END NTUPLES=NMR FID
##END=
