##TITLE=1H_Ser S-1
 CDCl3,8 sc, 
 3.02.2021
##JCAMPDX= 6.0         $$ Bruker NMR JCAMP-DX V2.0
##DATA TYPE= NMR FID
##DATA CLASS= NTUPLES
##ORIGIN= UXNMR, Bruker Analytische Messtechnik GmbH
##OWNER= root
$$ XWIN-NMR		Version 3.5
$$ Wed Feb  3 10:50:42 2021 Russian Standard Time (UT+4h)  she@DPX200
##.OBSERVE FREQUENCY= 200.1315066352
##.OBSERVE NUCLEUS= ^1H
##.DELAY= (6, 6)
##.ACQUISITION MODE= SIMULTANEOUS
##.ACQUISITION SCHEME= undefined
##.AVERAGES= 8
##.DIGITISER RES= 18
##SPECTROMETER/DATA SYSTEM= spect
##.PULSE SEQUENCE= zg30
##.SOLVENT NAME= CDCl3
##.SHIFT REFERENCE= (INTERNAL, CDCl3, 0, 15.7039)
##AUDIT TRAIL= $$ (NUMBER, WHEN, WHO, WHERE, WHAT)
$$ ##TITLE= Audit trail, XWIN-NMR		Version 3.5
$$ ##JCAMPDX= 5.01
$$ ##ORIGIN= Bruker BioSpin GmbH
$$ ##OWNER= she
$$ F:/spectra/data/she/nmr/H-F/1/audita.txt
$$ ##AUDIT TRAIL=  $$ (NUMBER, WHEN, WHO, WHERE, WHAT)
(   1,<2021-02-03 10:49:36.90 +0400>,<she>,<DPX200>,
      <created by zg, POWCHK disabled, PULCHK disabled
       configuration hash MD5:
       00 E9 B6 7A A2 85 ED C7 34 08 36 98 17 FE 4E 26
       data hash MD5: 16K
       09 47 71 55 31 2C 10 C1 DE 77 93 2A 63 A5 15 87>)
$$ ##END=
$$ 
$$ hash MD5
$$ 94 A3 9E 7D 11 AD B4 FC D8 50 C3 1F 59 C7 9D 4D
##$RELAX= 
##$RELAX= 
##$RELAX= 
##$RELAX= 
##$RELAX= 
##$RELAX= 
$$ Bruker specific parameters
$$ --------------------------
##$DU= <F:/spectra>
##$EXPNO= 1
##$NAME= <H-F>
##$PROCNO= 1
##$TYPE= <nmr>
##$USER= <she>
##$AMP= (0..31)
100 100 100 100 100 100 100 100 100 100 100 100 100 100 100 100 100 100 
100 100 100 100 100 100 100 100 100 100 100 100 100 100 
##$AQSEQ= 0
##$AQ_mod= 1
##$AUNM= <au_zg>
##$AUTOPOS= <>
##$BF1= 200.13
##$BF2= 200.13
##$BF3= 200.13
##$BF4= 200.13
##$BF5= 200.13
##$BF6= 200.13
##$BF7= 200.13
##$BF8= 200.13
##$BYTORDA= 1
##$CFDGTYP= 0
##$CFRGTYP= 5
##$CHEMSTR= <none>
##$CNST= (0..31)
1 1 145 1 1 1 1 1 1 1 1 1 1 1 1 1 1 1 1 1 1 1 1 1 1 1 1 1 1 1 1 1 
##$CPDPRG= <>
##$CPDPRG1= <>
##$CPDPRG2= <>
##$CPDPRG3= <>
##$CPDPRG4= <mlev>
##$CPDPRG5= <mlev>
##$CPDPRG6= <mlev>
##$CPDPRG7= <mlev>
##$CPDPRG8= <mlev>
##$CPDPRGB= <>
##$CPDPRGT= <>
##$D= (0..31)
0 1.2 0 0 0 0 0 0 0 0.06 0 0.03 0 0 0 0 0.0002 0 0 0 0 0 0 0 0 0 0 0 0 
0 0 0 
##$DATE= 1612334976
##$DBL= (0..7)
120 120 120 120 120 120 120 120 
##$DBP= (0..7)
150 150 150 150 150 150 150 150 
##$DBP07= 0
##$DBPNAM0= <>
##$DBPNAM1= <>
##$DBPNAM2= <>
##$DBPNAM3= <>
##$DBPNAM4= <>
##$DBPNAM5= <>
##$DBPNAM6= <>
##$DBPNAM7= <>
##$DBPOAL= (0..7)
0.5 0.5 0.5 0.5 0.5 0.5 0.5 0.5 
##$DBPOFFS= (0..7)
0 0 0 0 0 0 0 0 
##$DE= 6
##$DECBNUC= <off>
##$DECIM= 32
##$DECNUC= <off>
##$DECSTAT= 4
##$DIGMOD= 1
##$DIGTYP= 9
##$DL= (0..7)
0 120 120 120 120 120 120 120 
##$DP= (0..7)
150 150 150 150 150 150 150 150 
##$DP07= 0
##$DPNAME0= <>
##$DPNAME1= <>
##$DPNAME2= <>
##$DPNAME3= <>
##$DPNAME4= <>
##$DPNAME5= <>
##$DPNAME6= <>
##$DPNAME7= <>
##$DPOAL= (0..7)
0.5 0.5 0.5 0.5 0.5 0.5 0.5 0.5 
##$DPOFFS= (0..7)
0 0 0 0 0 0 0 0 
##$DQDMODE= 0
##$DR= 18
##$DS= 0
##$DSLIST= <SSSSSSSSSSSSSSS>
$$ [...]
##$SUBNAM2= <"">
##$SUBNAM3= <"">
##$SUBNAM4= <"">
##$SUBNAM5= <"">
##$SUBNAM6= <"">
##$SUBNAM7= <"">
##$SUBNAM8= <"">
##$SUBNAM9= <"">
##$SW= 16.9725356469052
##$SWIBOX= (0..15)
0 0 2 0 0 0 0 0 0 0 0 0 0 0 0 0 
##$SW_h= 3396.73913043478
##$TD= 16384
##$TD0= 1
##$TE= 0
##$TE2= 300
##$TE3= 300
##$TEG= 300
##$TL= (0..7)
0 120 120 120 120 120 120 120 
##$TP= (0..7)
150 150 150 150 150 150 150 150 
##$TP07= 0
##$TPNAME0= <>
##$TPNAME1= <>
##$TPNAME2= <>
##$TPNAME3= <>
##$TPNAME4= <>
##$TPNAME5= <>
##$TPNAME6= <>
##$TPNAME7= <>
##$TPOAL= (0..7)
0.5 0.5 0.5 0.5 0.5 0.5 0.5 0.5 
##$TPOFFS= (0..7)
0 0 0 0 0 0 0 0 
##$TUNHIN= 0
##$TUNHOUT= 0
##$TUNXOUT= 0
##$USERA1= <user>
##$USERA2= <user>
##$USERA3= <user>
##$USERA4= <user>
##$USERA5= <user>
##$V9= 5
##$VALIST= <valist>
##$VCLIST= <CCCCCCCCCCCCCCC>
##$VD= 0
##$VDLIST= <DDDDDDDDDDDDDDD>
##$VPLIST= <PPPPPPPPPPPPPPP>
##$VTLIST= <TTTTTTTTTTTTTTT>
##$WBST= 1024
##$WBSW= 4
##$XGAIN= (0..3)
0 0 0 0 
##$XL= 0
##$YL= 0
##$YMAX_a= 88054
##$YMIN_a= -92510
##$ZGOPTNS= <>
##$ZL1= 120
##$ZL2= 120
##$ZL3= 120
##$ZL4= 120
##$ABSF1= 10
##$ABSF2= 0
##$ABSG= 5
##$ABSL= 3
##$ALPHA= 0
##$AQORDER= 0
##$ASSFAC= 0
##$ASSFACI= 0
##$ASSFACX= 0
##$ASSWID= 0
##$AUNMP= <proc_1d>
##$AZFE= 0.1
##$AZFW= 0.1
##$BCFW= 1
##$BC_mod= 2
##$BYTORDP= 1
##$COROFFS= 0
##$CY= 11.3945322036743
##$DATMOD= 1
##$DC= 2
##$DFILT= <>
##$DTYPP= 0
##$F1P= 15.9154993809931
##$F2P= -4.1035820241983
##$FCOR= 0.5
##$FTSIZE= 0
##$FT_mod= 4
##$GAMMA= 1
##$GB= 0.15
##$INTBC= 1
##$INTSCL= 1
##$ISEN= 128
##$LB= 0.24
##$LEV0= 0
##$LPBIN= 0
##$MAXI= 10000
##$MC2= 0
##$MEAN= 0
##$ME_mod= 0
##$MI= 1.114404
##$NCOEF= 0
##$NC_proc= 0
##$NLEV= 6
##$NOISF1= 3.799351
##$NOISF2= 2.8
##$NSP= 1
##$NTH_PI= 0
##$NZP= 0
##$OFFSET= 15.70392
##$PC= 1
##$PHC0= -10757.43
##$PHC1= 11.00095
##$PH_mod= 1
##$PKNL= yes
##$PPARMOD= 0
##$PSCAL= 0
##$PSIGN= 0
##$REVERSE= no
##$SF= 200.130013532006
##$SI= 16384
##$SIGF1= 3
##$SIGF2= 2
##$SINO= 400
##$SIOLD= 16384
##$SREGLST= <1H.CDCl3>
##$SSB= 0
##$STSI= 0
##$STSR= 0
##$SW_p= 3612.71676300578
##$SYMM= 0
##$S_DEV= 0
##$TDeff= 0
##$TDoff= 0
##$TI= <>
##$TILT= no
##$TM1= 0
##$TM2= 0
##$TOPLEV= 0
##$USERP1= <user>
##$USERP2= <user>
##$USERP3= <user>
##$USERP4= <user>
##$USERP5= <user>
##$WDW= 1
##$XDIM= 8192
##$YMAX_p= 0
##$YMIN_p= 0
$$ End of Bruker specific parameters
$$ ---------------------------------
##NTUPLES= NMR FID
##VAR_NAME=  TIME,          FID/REAL,        FID/IMAG
##SYMBOL=    X,             R,               I
##VAR_TYPE=  INDEPENDENT,   DEPENDENT,       DEPENDENT
##VAR_FORM=  AFFN,          ASDF,            ASDF
##VAR_DIM=   8192,          8192,            8192
##UNITS=     SECONDS,       ARBITRARY UNITS, ARBITRARY UNITS
##FACTOR=    0.0002944,     1,               1
##FIRST=     0,             0,               0
##LAST=      2.4114304,     0,               0
##MIN=       0,             -92510,          0
##MAX=       2.4114304,     88054,           0
$$ Real data points
##PAGE= N=1
##DATA TABLE= (X++(R..R)), XYDATA
$$ [...]
2445a800J394J446j672J43J857l425K128J331m002M855l056j54K529k195l59K266
2461A286j732m83L492m687L266k10k571L334j881o21J785o33j828L807l178M52
2477d02K716m094L089q24j677J973j6j981K544p93k153M652m711J853J115k703
2493a412J828J74j539J097J388l760M111k402o26L381l993J756R13j638K99J816
2509A393l198K139P96l522M508l113K41J496j757K43J949k232K69K720m518L712
2525A126j101j940L212j852r6J740j210j617L823l808J656J787m182L989j531
2540dr15J533j70j932L005j470j543M122m671K758O86k719K104K1j835J628O53
2557A251l292M286k873O4K680l663J915L97j214O52J201l179K799m05k607M423
$$ y = [-1800, -406, 1040, -632, -489, 1368, -2057, 71, 1402, -2600, 2255, -801, -955, 1574, -621, -980, 1286, -446, -929, 2563, -2124, 1142, 932, -1639, 1695, -186, -807, 978, 345, -1483, 2324, -854, -402, 2314, -1780, 1309, 485, -1192, 781, 765, -1216, 1328, 535, -1618, 3034, -1677, 176, 1291, -1412, 416, 590, -949, 148, 1536, -2224, 1887, -515, -1141, 2240, -1753, 3, 916, -722, -423, 1393, -1805, 334, 1130, -2392, 2116, -997, -756, 740, -1017, -774, 1175, -1057, -788, 1932, -2586, 1126, 25, -1915, 1297, -555, -651, 1089, -121, -1738, 2085, -1723, -67, 1720, -2462, 1527, -4, -919, 614, 444, -1488, 1517, 47, -1496, 2626, -2045, 713, 1399, -1320, 784, 805, -1030, 598, 1251, -2041, 2245, -628, -564, 2116, -1547, 368, 765, -449, 203, 1404, -1775, 1024, 619, -1988, 2435]
2573B435l416P17J166j531j5J866k438P70K086m148M227j848j349K704k011K4
2589g61J485j066j000L055l680J965J229l344L668k160n35J540k35j587K719j782
2605d89q77L180m064K859J26j704J959o06j768K060jk483L878l029M57K162l466
2622a806K582j88j199Q52J207l041K851r39j858L704l346J792N45j652M82J300
2638A286k177J048J279l245L674k133o12K299k177O29J179j318o54K655l784K343
2654B92N32k742L468j896l68J240n57j478K935k205k02K767m315L485q25j363
2670a232K082p63j298J707l45k076L616l226J577J208k790K119n27r24Q97J259
2686A284l035L093j272j410L347l163J631O59j628O29J083k428J831P92l217L971
$$ y = [2435, -981, -264, 902, -629, -644, 1222, -1216, -446, 1640, -2508, 1719, -129, -1478, 1226, -785, -761, 724, -342, -1342, 1713, -1967, -2, 1227, -2117, 1551, -609, -1144, 396, 161, -1426, 1293, -489, -1366, 1814, -2250, 609, 735, -969, 990, 384, -1384, 676, 675, -1808, 2070, -959, -502, 1660, -1806, 776, 588, -611, 241, 1448, -1593, 1258, 319, -1539, 2165, -1181, 611, 1156, -496, -14, 1286, -891, 157, 1436, -1809, 1865, -268, -880, 1419, -758, -129, 1050, -268, -922, 1733, -2051, 292, 824, -1918, 1550, -346, -714, 526, -31, -1509, 1426, -779, -981, 1786, -2529, 956, 131, -1232, 850, 87, -1211, 496, 151, -1925, 1691, -1535, 42, 1250, -1540, 579, 52, -872, 25, 1284, -1751, 1342, 70, -1340, 2007, -1156, 475, 1134, -494, 135, 1218, -1210, 621, 1413, -1804, 2167]
2702B167k536j62J777j738M08J275j468r3K246l883L096n88k093L374k278N8J129
2719F91n76r49K497k543N92K089l785L170j290p01J513p02p22J809j016j512L399
2736A964l665K104N94k549K323o82j010R87P11k569L251k075l99K393l256K203
2752C25P9j229Q47R10k458J907L78k520L565k752N96J247j849J181O05j174j2
2769c54J649l082L158j203j328K886k326O21P82p66o84K278k704J325J227l066
2785a587L443j886k62J399o87r86J672j022j004K645l242K509k17k001J953p12
2801A5p81J279O8j948L095k656K54J998k944K488m70r43N12O42j934K055n39j869
2819a678L370l065J217O39j593J322L69j527P81J289l014L185j749o64K399k067
$$ y = [2167, -369, -531, 1246, -492, -84, 1191, -277, -370, 1876, -2007, 1089, 501, -1592, 1782, -496, -438, 691, 115, -834, 1663, -880, -288, 1801, -1984, 1186, -104, -805, 708, 6, -716, 1093, 77, -1435, 1964, -1701, 403, 997, -1552, 771, 89, -921, 66, 777, -1792, 1459, -616, -1015, 1378, -1878, 325, 404, -825, 22, 932, -1526, 381, 759, -1761, 1804, -948, -352, 895, -954, 227, 832, -342, -354, 1295, -1787, 1371, 168, -1160, 1726, -600, 21, 803, 37, -647, 1631, -1073, 252, 1479, -1587, 1856, -30, -292, 1107, 420, -566, 1106, 84, -920, 1725, -1517, 992, 775, -1226, 727, 15, -766, 513, 581, -1367, 1728, -928, -674, 1324, -1620, 868, 398, -545, -33, 609, -1325, 730, 191, -1678, 1692, -1373, -156, 483, -1110, 212, 581, -946, -165, 1124, -1890, 1295, -454, -1118, 1281, -786]
2835g86O05O97r30j96J973k875J820Q15k678L203k134K87R76n47o27J530j547
2852d14j05K227l290K709p82j086J817r89l91R30j6j694K779k680Q20J428k637
2869a374K240o01p70P96J73j868K497j205j060K868l022J693L0j327Q69M57j306
2886i10R09R26k969L544k266J1J964k248J144J51p84k47J912k674K225j03k272
2903a687L282k432O60P11q74m32J876j709K83J853l075K653j113q06J949j277
2919a38k62R88m34j325L196l105J332O95k427K764j090m28O27N90j915K457j692
2936a67o39K658l070J875j89j184J008J85j119J052J74k169L305k485K22J367
2952H24j726Q40M89n84k37J595k526K205q49j489K883k399P48L74p24J59J338
$$ y = [-786, -181, 516, -414, -610, 1363, -1512, 308, 1123, -1555, 1648, -486, -199, 777, 230, -397, 1133, -414, -519, 1708, -1582, 1127, 345, -741, 1076, 87, -304, 626, 610, -1084, 1695, -985, -165, 1263, -1374, 866, 265, -505, 291, 464, -1404, 1093, -112, -1172, 1696, -1326, 367, 397, -930, -61, 396, -910, -1, 925, -2044, 1500, -766, -755, 1209, -1039, 105, 256, -528, -775, 1137, -1537, 688, 585, -1687, 1595, -837, -177, 534, -340, -772, 1104, -605, -322, 1531, -1544, 1109, -4, -810, 1139, -138, -400, 588, 154, -1171, 2025, -1080, 252, 947, -1480, 1284, 194, -234, 393, 983, -932, 1525, -167, -806, 1852, -1218, 657, 468, -716, 292, 477, -642, 410, 584, -1585, 1720, -765, -543, 824, -902, -62, 427, -157, -394, 1201, -1325, 880, 31, -1458, 1425, -974, -226, 148, -576, -417, 921]
2969I21j857P53J294k995L025j471n78J521j051o9J200q66q05K676l227K065L75
2986I11k366K453j295k29R98J29j531K511k220J1K279k918K106o96o19Q08J76
3003E08j491J660Lj869L157k814O88J189j629J033J82q57K69R64k395K468j248
3020a82r09K383k273J015M63q00k15J552k042J148O99k406K583j513q8J134j084
3037e35k41J333p90n95K107k817J929oj778K177j208m0R24l58j176K504k246L15
3055e01J567k666K493o33q29J135j86j283J557l91j561K924k864J896J6j459J344
3072E59j22r56N13J137k397K579j334k89K177k824J425J5q92L05J093j667J218
3089E40K49k135K895k121Q40M20p82j50J151j129J01J572l381K940p61j152J665
$$ y = [921, -936, -183, 1111, -1884, 1141, -330, -908, 613, -438, -507, 693, -173, -978, 1698, -1529, 536, 911, -1455, 998, -297, -526, 472, 601, -930, 1581, -639, -628, 1651, -1267, 839, 143, -476, 332, 508, -983, 677, 680, -1189, 1968, -846, -158, 1031, -598, 435, 617, -240, 29, 993, -1402, 1066, -182, -1091, 1292, -981, 34, 497, -303, -518, 1034, -1008, 140, 839, -1567, 1016, -497, -585, 549, -535, -776, 557, -233, -828, 1279, -1538, 391, 385, -1393, 784, -424, -464, 460, 102, -1074, 1430, -816, -501, 1066, -1600, 893, 260, -569, 566, 380, -903, 654, 263, -1298, 1626, -1238, 658, 674, -785, 559, 437, -519, -6, 1131, -1266, 1313, -21, -310, 1867, -957, 468, 483, -409, -104, 989, -678, 540, 789, -1346, 1549, -572, 268, 688, -94, -244, 907, -222, -121, 1451, -1930, 1010, 249, -903, 762]
3106G62j308M07N10o1j244K441k702J253J138k559K699j772M26J20j64q54J568
3123F60p08q35K059k844J893J88r07O45N00j314J449O91k831L018k391k22K122
3140A173k213J684n45m92L54J087k099J811m67j356K334k080Q96M17n48PR01j362
3158d98L05J629k687K339j437j09J582j614O67L08n25p27K098k543J554L16k092
3175a434K598j466l7O45j20j083J692r20o85K045k627J968n60o88Q37m7q18Q43
3193A43Lj487K409k109P51J137j987J591m38o90K08J263k045K007p46j036K344
3210A318k206J118J96p80L22P36j324Q40Q26k413K720j749K49J144j302M91K04
3227C90l23m21J686k395J589K62j946K512k542J088J471r77q60J339j507j04K124
$$ y = [762, -546, -139, 371, 310, -934, 1507, -1195, 58, 1196, -1363, 1336, -436, -10, 110, -54, -908, 660, -48, -883, 1176, -1668, 225, 413, -494, 151, 651, -663, 786, 1477, -1354, 1664, -727, -949, 1173, -1040, 644, 99, -393, -39, 1048, -1051, 760, 293, -1063, 1271, -809, 87, 504, -44, -37, 864, -498, -193, 1436, -1251, 1088, -349, -458, 1124, -490, 177, 485, -40, -767, 1331, -1212, 342, 658, -1434, 1164, -302, -339, 306, 186, -897, 795, -125, -810, 1235, -1392, 576, 16, -672, 165, 118, -700, 143, 146, -1341, 1068, -1041, -290, 847, -1140, 451, 13, -677, -469, 794, -1251, 756, 10, -1026, 1318, -888, 230, 426, -354, -32, 704, -620, 220, 1046, -1367, 1353, -396, -147, 997, -305, 186, 390, 67, -354, 1332, -1063, 526, 788, -1158, 1354, -1188, -100, 1371, 394, -466, 873, -634, -738, 1386]
3244A386k731K108q61n60J206n96o25J103k18j406K410k364J286L12j409J426
3260D67n50j79J11P05j716J897r53n85K025k523J349Jn35L13O06j282Q99M69k070
3279a551K531j794L55J049j309O86L33n42j54J439k282K218n97j341J909j412
3295d62L94O12o74l72J476j232L62J031k195K208j549nR57o04j41Q01l68q93J911
3314A257k491J688J02j183J250o53k52L76L31j244J766j349j83J746k215J309
3330B55k5p57N94K79j308J196j43j303K145j603L60Q54j378R05j28j61P0P25k077
3349a500K094o81n74J627j620M46O29q1n14J346j930N69N58j372J632m88p45R77
3367C73J44o85J036j019r78K395k386J857l8j667J801p99j5K02J13j199J954j540
$$ y = [1386, -1345, 763, -98, -658, 548, -48, -673, 430, 212, -1194, 1216, -1148, 138, 450, -959, 467, -83, -262, -151, 554, -1162, 735, -218, -803, 1222, -1301, 48, 49, -486, -173, 433, -849, 50, 519, -1551, 980, -814, -459, 590, -719, -33, 300, -242, -396, 1043, -1239, 979, 382, -959, 950, -462, -68, 544, -130, -502, 974, -258, 104, 1135, -1060, 1148, -401, -406, 551, -53, -194, 607, 239, -654, 1257, -1234, 454, 556, -627, 623, -30, -282, 94, 425, -819, 947, -402, -585, 1161, -1054, 255, 230, -527, 67, 346, -962, 234, 91, -1212, 933, -670, -310, 544, -834, 71, -57, -218, -148, 577, -1500, 594, -87, -661, 966, -654, -208, 421, 340, -174, 1172, -758, -189, 369, -1003, 629, 141, -604, 373, 517, -168, 868, -151, -1129, 1266, -1120, 737, 699, -968, 833, 34, 19, 221, 334, -865, 1089, -451]
3385d51L10J305j975J559n14l95J57M15j061J266l68j316K337j891O98K75q96
3402e45O37j9m55J29R08j945J856r19k33J605j658L63M93m09m58J178j616J277
3420A89J68j638K192j634N47L21l63l24R54q62l63J930k622K125n89p88J325m91
3438G7l28N92o0j066J978j879O57Q98j849J871q32j51L96K70j183J264m24r35
3456g04K069k217J369P3q37O86K41j064N51N51j530J719j242J36J086j367N31
3473E1M13k76m18R30j549J265j74j390J911j453O45K04k67m68R04o94k5J262j929
3492a058J822q82l49R48p39K99J09l74q19K179k142J158L61j455J338m98j58k32
3510d92J555r65Q11r41r68K178j668M80J00q99O23P55j139M09M2o91J903j906
$$ y = [-451, -141, 1164, -811, 748, 234, -161, -4, 411, -650, 616, 248, -1068, 1269, -622, 76, 351, -545, 92, 73, -382, -253, 655, -1290, 566, -353, -586, 1019, -639, -276, 217, -192, -650, 528, -1088, 189, 357, -1281, 911, -723, -176, 145, -218, -542, 412, -450, -813, 1117, -1505, 620, 31, -757, 568, 77, -251, 341, 281, -785, 1193, -686, -29, 869, -980, 891, 59, -92, 304, 574, -609, 655, 231, -704, 1365, -852, 517, 590, -247, 439, 680, -384, 167, 718, -812, 907, -335, -199, 887, -480, 51, 464, 188, -230, 700, -849, 416, 242, -1148, 763, -690, -45, 159, -108, -576, 328, -366, -391, 871, -1058, 764, -118, -467, 481, -258, 41, 150, -224, -1043, 1136, -1006, 152, 513, -942, 396, -102, -260, -492, 1063, 98, 909, -32, -1000, 1178, -490, -10, 90, -809, -186, 569, -570, -161, -119, -810, 1093, -813]
3528h13M47J474j090J91j7m83J44J268k110J984p82j170K323j711J080l57m86
3545a08n57J443j072Q73O57k555K257j111m52R01r36Q8J049k66r64J386j526J207
3563C14K35j523J376q87R3L95K28j166J340j099M88J053j926J622o42l01J69J94
3581c7o25J241m14r99K108k008Q64K14j347J324j39k02M7P84j863J809q44o28
3599g15J736j538R17k76j90j88J062j236N35P17j384J522j217L90N33n21m93N27
3617A81k95j83J421j923J238k47r23J289p88K38l83P03n49Q85j185M95O58j733
3635a101J620j007r8P68j43k79P98p73n97J718j617P38J20r16L95M39n22J72N50
3654B65r65J447j032l97J498j340J236o54j26l3R03j783J691j90j767K510j529
$$ y = [-813, -366, 1108, 18, 209, 192, -291, -147, 1121, -989, 995, 213, -957, 1366, -345, 735, 378, -108, -665, 778, -294, 579, 1236, -1319, 938, -173, -625, 276, -660, -572, 477, 211, -753, 633, -893, 314, 549, -974, 402, -485, -392, 3, 231, -935, 405, -694, -206, 847, -1079, 543, -99, -400, -231, -37, -662, 579, 165, -834, 1274, -734, 130, 344, -1003, 321, 182, -20, 27, 811, -1052, 757, -87, -715, 1021, -517, 400, 124, -66, -254, 808, -428, 107, 824, -560, 962, -255, 135, 668, 147, -346, 181, -114, -297, 1124, -799, 439, 192, -731, 558, -230, 8, -375, 328, -221, 664, -521, -26, 632, -1101, 519, -488, -586, 182, 39, -240, 558, -215, -812, 906, -711, 27, 147, -769, -374, 65, -457, -285, 265, -700, 747, -285, -682, 816, -524, 712, 58, -68, -101, 802, -981, 710, 520, -1247, 1263, -266]
3671b66M07P03j060L0P73o99K57J28j349J335m41m74J666j288J6O48j32q94J288
3690F48j338O91M86j233J408r64K13O37m00o53Q43l93o33J327j391R65k16n71
3708e74P13l35lK44J58r08J407j271M83Q04j452J059l90k72J40L95j178J170K33
3727D23j574K272j764P35J77q42N14N76p52J68P33j457J426p02l02J065r18J26
3745i6K58j34l50J164j191P12L8j316J697r13J00K15n9m69Q16l10l82J274j944
3764h90J364r1q40R49m31l08O19k05j152J939j430J50R44j309J296p66p6K42K14
3783B19p73J257p38n56J465j608P87k26l61L43L62o42L24O23j691J861j094M2
3801d06P04o49M34M5k06m52J251j273R97j25j248J582r52M40L8l54m4O64q25r6
$$ y = [-266, 141, 844, -216, -186, 587, -112, 145, 273, -1076, 259, -182, -656, 1010, -278, -262, 386, 254, -640, 648, -690, 1, 487, -746, 662, -302, -89, 548, 148, -505, 338, -55, -688, 639, -752, 213, -3, -574, 139, -196, -199, 45, 203, -705, 702, -569, -86, 718, -734, 325, -65, -337, -197, 198, -980, 190, 423, -1151, 1121, -643, 92, 269, -573, -59, 517, -235, -67, 666, -791, 635, -67, -369, 696, -222, -96, 162, 28, -322, 842, -349, 363, 401, -915, 782, -131, -31, 184, 125, -344, 472, 162, -220, 1054, -890, 474, 383, -457, 492, 61, -247, 372, 167, -985, 954, -476, -326, 618, -691, 605, -161, -237, 5, 219, -554, 703, -35, -591, 874, -734, 53, -173, -534, -191, 171, -471, -147, 476, -1215, 646, -448, -406, 298, -351, 83, 128, -78, -530, 721, -552, 445, 320, -928, 654, -298, 142, 180, -174, -218, 446, -379, -475]
3821d75J191j607J491n21k92Q82p71j45O42k82o30J186j071N53K59q83R10n13
3839g6p3J47M99q91J036n85p24J539j521R97j61l54L36K35o98K08N07j223J569
3858G67j234J45Q07j167P81M3j80j44Q79j525J195m40p15J529j147L92M7j28l06
3877d01R12j023K96Q04j421J604r45k00O67m62J04M94k81j014J884j240N56P7
3895D11r50J131p31K70l4K62r53J370q97l27J088j363J239o12j9J87L88o70N33
3914C23J98j260J750j377M69L83q60O74j87k84P7M33j253J170m07m10J144j246
3932f63P58Q1l11m35R75r27N54L03j501J719r20p8O86j82k93M61l54m36J334j629
3952h58J185k08p23Q49l31j70M69J00p46J228j242jR74j412J394l82l68L38L56
$$ y = [-475, 716, -891, 600, 79, -213, 669, -102, -247, 395, 113, -517, 669, -402, 151, 410, -473, 437, -76, -149, -2, 497, -394, 642, 57, -667, 872, -649, 348, 187, -167, 169, 404, -294, -86, 421, -802, 767, -467, -322, 485, -682, 99, 142, -38, -182, 697, -828, 367, -73, -788, 741, -406, -14, 33, -95, -401, 511, -512, -216, 588, -833, 771, -174, -374, 293, -169, -65, 429, 148, -866, 1018, -222, 334, 411, -539, 592, -139, 131, 97, 359, -594, 776, -121, -448, 640, -723, 516, -96, -115, 72, 460, -210, 323, 521, -739, 1011, -366, 103, 486, -374, 300, 113, -171, -94, 339, -914, 256, -151, -561, 583, -663, 95, 176, -135, -570, 405, -522, 32, 335, -1166, 553, -367, -445, 241, 59, -234, 227, -127, -563, 771, -858, 327, 119, -604, 245, -86, -256, 213, 313, -433, 795, -447, -448, 526, -886, 508, 126, -242, 96, 452]
3971D52q57R87m91o47J392j261P79m06m41Q46k93l3J32M61j461J150M44j014J411
3990A150j065L91j117Q76p30O94p30Q08L61j228J672q11m23K66n29K56L94m28
4008a93j28R58j506J078k95k79N86m59J03K65J79r07P85r04N62N08j025R08m22
4027a86L3L55K38r64O65k57l57J688j770O72L87o99M2J06j22K64N93r80R38r35
4047b89O41M92j140L17j26P9K66l39o24J111l18j28J122j626M64R33o33m67O14
4066C49q88J86J038j269J327j328N34O03j93r20R20j80j169K557j925N89n40n11
4084h20J805j270J81jM76j255J482o22l79Q17j114R94m18k29M15J00m87K43M47
4103C65j021J482j386O63L16q06O68j67j03k47R60j320J056l43o00J274j352M89
$$ y = [452, -405, 582, 91, -556, 836, -425, 354, -52, -493, 353, 60, 27, 159, 620, -841, 309, 753, -261, 1150, 85, 476, -641, 235, -495, 199, -531, 277, 638, -590, 1082, 271, -152, 114, -415, -159, 235, -193, -321, 637, -869, 209, -86, -365, 221, -238, -135, 130, 309, -598, 187, -717, -155, 353, -672, 236, -186, -153, 202, 440, -524, 141, -116, -473, 1215, -555, 117, 504, -195, -153, -47, -169, 95, 688, -292, 646, -289, 352, 844, -296, 21, -105, -26, 240, -99, -723, 388, 70, -58, 1064, -562, -98, 835, 202, -265, 349, -539, -353, 685, -584, 743, -585, -51, 552, 359, -561, 359, 179, -990, 1567, -358, 231, -309, -820, 985, -285, -104, -105, 371, -884, 598, -24, -403, 414, -700, 294, -124, -353, 62, 162, -325, -82, 365, -656, 826, -560, 103, 419, -387, 281, 114, 11, -236, 724, -596, 460, 117, -483, 791, -561, -72]
4121g2L61l03P3M27o54J54N57j325J430o64J75L50p39M29K58k60p34J484j487
4140e40J025Jq00J032j187M98J45m4n58P45q10K43P95j010R05m85j65L91l30k39
4160c88P06j24p12J008j208P74K07p46O58l15om2L85p59J056q16j32J181j252
4179e25Q05k59j76j3M30n07M10L90j111J336j074J96J56m60N57J96j22n69R73
4198F33j122P51j56n66J046q61L99mom00P47r40L67Q97j354R96p31L62L46l25
4218G9j34M19j37n36J237j681J016q8m39N77j87k33J38L92j101J185p24j6O41
4237D08j109Q85l24J8J90J81q67Q59p0p74J397j391N23J20k17J43K09j39m22R36
4257E56j124J103l90n13Q73p71L23L79n27l50J114j110L69O92j311J297r09M90
$$ y = [-72, 289, -14, 59, 486, -168, -14, 543, -782, 648, -16, 159, 509, -230, 199, 457, 197, -537, 947, -540, 485, 486, -314, 718, -469, 29, 174, 130, -428, 317, -493, -250, 545, -465, 440, -45, -210, 181, -149, -388, 318, 194, -518, 490, -718, 56, 263, -483, 175, -140, -146, -188, 197, -562, 494, -322, -454, 727, -525, 280, 21, -155, -168, 262, -245, 165, 555, -556, 780, -294, -98, 58, -402, 155, 351, 229, -340, 633, -489, 262, 106, -460, 586, -275, 124, 120, 114, -286, 461, -479, -112, 785, -569, 427, -304, 58, 404, 79, -55, 364, 227, -309, 928, -753, 263, 175, -264, 313, 126, -107, 31, 423, -678, 507, -217, -233, 408, -701, 184, -140, -122, 68, 249, -618, 241, 171, -603, 794, -597, -74, 46, -171, -28, 181, 42, -380, 556, -568, 535, 145, -368, 505, -266, 57, 436, -91, -441, 673, -437, -68, 624, -687, 610, -299, 191]
4275A91O5j45j82K69j54m79J343j190P47l05k12N11n65r2J11N78r87J102p69K37
4295G4L08r90Q45l19n2m1M52p25Q31k91n19P52r83P24j52j09K0R9r3JN68j192
4317g92J155q24K3R87o08KJ53P8n04P08q76L98K55o59J078o56J34N1j15k37P12
4338D63n92M4N92j294J115l31k2J56J58k96J68L27q49J064q24K13K84n37O74m57
4358E6k25K36K67p15P22l30l70J042j173Q99l80j03j88J92Q7j14N87j227J388
4377F51r45L92M0n14M18p4K4m22R69j131P23n4n97Q02n80L39k68K86l86N47o51
4398d31J45P28j306J004l57K39K92m71r2K89J09p51J338j029K19M00p50P55k19
4417A12r0k22N51o22P05n64m4R10j190Q66k67k69J83K08n57M32L05q60J202j029
$$ y = [191, 256, 111, -71, 198, 44, -435, 908, -282, 465, 160, -52, 459, -106, -198, -87, 491, -496, 606, -163, 74, 382, -608, 237, -82, -134, -175, 277, -448, 383, 92, -427, 325, -658, 66, -86, -195, -175, -76, -169, -168, 400, -792, 363, -461, -438, 549, -59, -57, 96, 174, -330, 378, -498, -100, 155, -504, 574, -82, 52, 103, -12, -249, 463, -129, -85, 507, -787, 328, -3, -25, 131, 289, -7, 161, 488, -361, 703, -121, 92, 376, -161, 513, 56, -169, 67, 334, -381, 341, 11, -359, 683, -490, 409, 29, -74, -262, -70, 17, -97, 490, -737, 651, -294, 98, 138, -376, 42, -32, -8, -430, 539, -592, 131, 77, -520, 282, -298, 41, -227, 59, -327, 220, -431, -286, 442, -864, 140, -217, 22, 314, -157, -249, 40, 149, -602, 736, -293, -74, 326, -424, 331, 112, 22, -200, 351, -271, 434, -130, -174, 736, -454, 412, 145, -124, 59, 267, -290, 142, 447, -413, 789, -240]
4437b40K62K40m77L09J85j17n08P37q80Q52m50k64O56n23N91l92kp5L51m27j43
4458c15O02r30J028o21J58K43l61m12O45j07l92P62r38O98J9l56L73j98m7J05
4478d4L53p37P46o19N3N78j079J079l56k63M83J1j80m2L27o56R02r19M79J47l38
4499g5M98j57k10o0M57q58P18m11k19O12o59O34j54j8j23M05o89L19K84r33J332
4520F93q47J91o5j22MM12k14l16Q29j281R82j63j86M97p74L27p1J10m24R31j028
4541e15L14P73j181Q93l65m4L74j20l64L18L7l08O43r25P13j38j19K1J4J31l67
4562b15O67p00P15q68N97J98q17P07k52J08l58P13m11j52L93n18M50m58M30j13
4582A16O8j84J6k51lR49j224O67j39j14L52n82K75K9K04n62Q94p18K09J23o33
$$ y = [-240, 22, 262, -215, 94, 279, 162, -346, 391, -489, 363, -87, -351, 305, -218, 373, -19, -21, -96, 255, -172, -315, 287, -643, 385, -236, -78, 165, -196, -608, 37, -70, -462, 300, -638, 60, 79, -277, 96, -102, -149, -44, 309, -428, 318, -301, -248, 330, -749, 330, -26, -289, 194, 205, 25, -17, 310, -346, 556, -363, 116, 263, -75, 423, 266, 56, -4, 453, -405, 313, -98, -317, 295, -364, 270, 116, 98, -25, 380, -309, 10, 294, -639, 693, -154, 37, -28, -150, -146, 266, 52, -264, 565, -716, 266, 103, -83, 414, -360, -33, -104, 6, -418, 513, -515, -201, 572, -609, 284, -81, -125, 249, 129, -235, 83, 120, -188, 455, -470, 243, 105, -14, 7, 21, 152, -215, 452, -248, 467, -401, 196, 394, -423, 284, 32, 140, -218, 495, 84, -68, 325, -193, 257, -201, 229, 116, 184, 0, 16, -235, -238, 711, -513, 154, 15, -99, 253, -329, -54, -25, 179, -383, 511, -207, 2, 125, -508]
4603e08P63o45K25K83j01m67O61m75k17P59p48N63k53J33r0M0l16J90M52o70Q95
4624D74o12O33j00p70M99J2o20J087l61k95J83K92j017J120j193J168p42M21K18
4643C97p41k55j65R10r89J442n95M4R0j57J03J62l5k55O42r77L41j7n11Q63m93
4664a96L37q4J27k07M16m89j63O24q99Q00k88k15J60M21p07K66Q0m75Q03q06O16
4685A21q4o83R70m72J8K0M40r93R46l75m08Q63r97R37o04K00p3L40j69k24O71
4706D44r58J200o57l8L43k56j36J46o2j78O73q97M28K3k90P05m67k44K98K5m54
4727c52P61m53n2M59p79Q17l28k18L14j51m26K49J21m34J190j093K11L88m33M83
4747B74n55K01L9J15n08O63m3l34N21m96J17p4K45J72o60K90o34N24q05Q49m1
$$ y = [-508, 255, -390, -165, 118, 17, -450, 211, -264, -481, 278, -470, 93, -160, -27, -117, -77, -393, -203, 249, -421, 474, -138, 495, 395, -375, 124, 136, -484, 603, 242, -53, 130, 422, -595, 525, -668, 500, -242, 179, 397, -344, -599, -764, 146, -843, 599, 4, 48, 138, -19, 84, 246, 211, -44, 598, -379, -38, -55, -566, 297, -196, 141, 57, 184, -23, 393, -96, -259, 365, -534, 266, -22, -237, -77, 344, -363, -97, -17, -492, 311, -495, 121, 37, -646, 324, -148, -130, -110, 330, -663, 283, -92, -500, 363, -634, 303, -301, -101, -174, 166, -3, -227, 444, -514, 686, 29, -9, 334, 78, -58, 88, 26, -152, 521, -376, 52, 75, -215, 490, 23, -221, 77, 102, -352, 409, -44, -96, 363, -416, 401, 73, -145, 169, 18, -408, -159, -38, -472, 718, -375, -164, 224, -209, 274, -281, -80, -41, 74, -434, 229, 186, -148, 373, -123, -6, -80, 165, 337, -323, -33, -667, -143, -948, -99, -140]
4768a40k6M85k00k35k1n9j02L31q32R86k75K50M14j717J170K72j88J24j82j708
4788a653J011J290j188J257m33l39j93M61L05l92J05k74N05r08O89P1l09L2M6
4807H3Q9k96M34n70N18n31K86L11j000Q62k10q5M03j02m33P93l46q83O48r8J90
4828F3J99o50O38k62Lj34L10l99R52r05J10L93q00P83n84L77M5M30j055P36n68
4849c18l64J136j304R58N63o00n02L2L06k45O41r12J345r28R4K34N32l89r75J285
4869E89N96l99j174k49J265j577J995q54j70O69m49P22O60k290Q72M87j615J269
4887C47j142Q35q73O55K09J62O6k69K32l10j869K693m77l63j030P40r61J718m67
4906a04L24K20j018L90N9o37r2J444n44N64r21L80O27p81J08m32l07O94J91j56
$$ y = [-140, -166, 319, 119, -116, -137, -196, -298, 33, -799, 187, -88, 162, 576, -1141, 29, 301, 113, 237, 55, -1653, -642, 648, -540, 717, 284, -55, -248, 213, 518, 126, 231, -43, 462, -446, 243, 314, 5, 37, 83, 172, -124, 310, -260, 258, -273, 13, 324, -676, 186, -24, -109, 294, 192, -241, 552, 206, -677, -29, -127, 63, 262, -388, 250, -12, -9, -143, 167, -232, 720, -185, -75, 318, -482, 301, -283, 94, 139, 569, -486, 250, -318, -682, 454, -850, 108, 671, 71, -431, -399, -93, -338, 303, -609, 736, -192, -98, 136, 668, 279, -696, 589, 1185, 786, -388, -637, 628, -949, 1046, 192, 22, 691, 242, 964, 1624, -666, 206, 693, -922, 347, -795, 40, -833, -178, 31, 193, 259, -10, 222, -88, -1957, 736, 259, -104, -1134, -394, -1355, 363, -104, 220, 440, -578, -188, -129, -766, -858, 586, 42, 606, -315, 65, 692, -89, 19, -413, -720, -26, 165, 9]
4926Im59k98L48N74l74R0R5R5J66j117J080o5N18n39k9K85n05L70k90O43p56M46
4948B87O1k17K37l62N22p31O65m50K39P2o55M35K0k20Q7M18p46N07j07m01Q07
4969D68p01M80j96J41j89J29k20nM79q75P29l42l50M47j69Q1n8J89k95M67q05
4990e95O67J39o22N19l24J99K61k82k30N4m6P4N32p68Q33o89K31k33O0j07N84
5011B57o0o23J019p74N04j28l99K64o9n4P8L77p21O60q5l73O05n41L69j19j48
5032C9j63O41n60n7L70n26O66o45N2K46j67J5K00j96j37N10o41O37j72l63L78
5053A27p7k18k29M92m60O27o46K03L75q11P40k01J09q2O9m22M79K07q12J038r05
5074c97N69k66l1J04M0k25P4K67o47Q13l92j79N55m98K39J84j77j52J75k93K94
$$ y = [9, -450, -748, -400, 174, -200, -110, -15, 80, 246, -871, 209, 144, 662, 123, 94, 379, -126, 244, -46, 597, -159, 287, 348, 131, 368, 6, 528, -203, 462, 12, 251, 323, -332, 103, 123, -97, -10, 408, -338, 169, 62, -339, 468, -233, 247, 51, 192, 3, 132, -88, -93, 386, -489, 240, -102, -452, -5, -174, -93, -151, 38, -257, 210, -595, 72, 211, -411, 108, -216, -17, 244, -38, -268, -214, -260, -186, 346, -422, 411, -278, -47, -280, -220, -327, 257, 197, -426, 593, -181, 323, 195, -204, 60, -9, -63, 15, 392, -329, 331, 246, -127, 478, -63, 306, 187, 39, -124, 517, -43, -100, 270, -256, 410, -235, -183, 63, -104, -89, 111, -85, -222, 288, -353, 284, 112, -251, 127, 50, -168, -397, 95, -365, 262, -384, -181, 194, -617, 123, -78, 31, -51, 18, -404, 75, 282, -530, 508, -397, 172, -94, -125, -21, 19, -206, -132, 135, -512, 301, -91, -270, 285, -213, 26, 210, 33, -119, 56, -237, 57]
5095E7J87p21J021o94K15J6j43J34J16k61P5O80r84N76j72k25O21o55K72K1J24
5116B60n52O38n25j73O17p93Q98l58Q0j53L2k51N31j0l48N77q40L86M4j53O4K48
5138B19j68j99L34o79P85m49J45J68l71N44l71J29m57O62n22J49K03n30N94n75
5158c89N60k91J17j64J21Q1m3J56p51R51m03q2M07m42R3k5K11j96K88k55L90p
5180C27p51N08k67L14k32L49l26K49m8n17P90o29N97k66j07k6J43j57m8K64n45
5201c78O98n21K78K11m93N24n36J05j13K89k16J61K14o03M29m83P75m91J57o6
5221e9m6J3K1M65q81Q30m72m0M02l24j6q0L44l27M08n81M31P0j69L54o60K54j05
5244a68J21j42N01k58j84M46n69N67m62P5J43Q2l87J89M67o25Q90r29K30K63m71
$$ y = [57, 244, -477, 544, -150, 65, 81, -62, 72, 188, -73, 2, 682, -302, 274, 102, -123, 498, -157, 115, 136, 260, -292, 346, -179, -352, 265, -528, 370, 12, 92, -61, -29, -280, 251, 241, -107, 470, -370, 16, 60, -93, -29, 219, 51, -148, 186, -493, 292, -157, -12, 156, -215, 329, -42, 87, -370, 292, -230, -81, 122, -408, 186, -389, 171, -120, -3, -167, -46, 35, -8, 148, -603, 348, -55, -137, 270, -172, -79, -104, 107, -89, 199, -56, 334, 327, -424, 84, -183, 131, -101, 248, -78, 171, 123, -394, 396, -233, 364, 98, -9, -35, 108, -49, -97, 167, -378, 320, -201, 77, 288, -205, 319, -217, -112, -225, 64, -152, 9, 223, -380, 49, -434, 341, -150, 7, -59, -105, -92, -71, 394, -487, 343, -129, -169, 233, -91, -107, -187, 157, -170, 238, -343, 88, 158, -11, 343, -317, -63, -168, -47, -189, 312, 54, -130, 316, -253, 314, -148, -73, 70, 152, -235, -46, 421, -204, 686, -243, -13, 250, -221]
5265b21L88j97m1k67N24p71O85Q3l76O66p97O84j58m78K79K64n28K32K7m32Q00
5286C66o89J60K69l18M28k72q9j01L73l74J87J3j87M33k77L22k62M1k06N74n53
5307a62n6N63p74J159r47p5K72P8j28J75j6l00O66n56J41j71m8L59k02n4J87M5
5329A56j18J47j88j77N75o50N71j49K5j56j03N7L8j3n37J148q54K61K37l83K46
5350A33O2j03k66L51m19O59m46j90M94m29K16l03K72k41L62n10L67K29p24Q67
5370C81n82J80PK26j22r4j0k30N90n36J39j33r6L29j25J49j29K20l31L21l35K91
5392A10K67p51N66L3k07O0K30o1J0J8o57O75m03L11j63J4j55k3J10n8L29p73R00
5415C82m27j00N58m96J59J66j79k58O74p22L59J47o74N50m40L25R0l2j32K81l29
$$ y = [-221, 167, -30, -71, -338, 186, -585, 100, 183, -193, 473, -324, 360, 202, -276, 3, 267, -261, -29, -2, -434, 366, -323, -163, 106, -212, 216, -56, -145, -246, 127, -247, -60, -47, -234, 199, -78, 244, -18, 23, -183, 391, -162, -218, 345, -429, 730, -217, -292, -20, 58, -70, 105, 89, -211, 455, -101, 40, -131, -179, 180, -22, -76, 111, 156, 38, 185, -3, -180, 395, -255, 316, 167, 192, 36, -67, -10, 28, 15, -522, 626, -228, 33, 270, -113, 133, 195, 92, -174, 177, -242, 417, -29, -219, 275, -154, 62, -241, 31, -210, 152, -358, 9, 238, -486, 381, -201, -21, -14, 212, 90, -4, -14, -244, 346, -190, -51, -184, -280, 49, -76, 73, -56, 164, -167, 154, -181, 110, 377, -374, 192, 225, 18, 78, 308, 247, 257, 275, -382, 293, -110, 201, 38, 52, -103, -126, -16, -74, 255, -518, 382, -45, -145, 413, -83, 76, 242, 63, -195, 479, -243, 116, 263, -411, 139, -301, 24, 114, 82, -50, 231, -98]
5436i8k98N63p63P56q7k72L39j48j81j6K4Q9M99n03J41n1k06K96m11N25k41J17
5458G4k81K01J95n92O15n24O30n45j3J35J40n5J18J60n44N40m61O6L47m86L92
5479A12j48K99m44L90k74K78r7k93M45k35K17l06J1L8J88m16J10L96n97M59k52
5500a19J42j8K1j31K65j43o06Q93q02O28L1k52L64m99M18k52K61o26N99k76r1
5521a93M61n82M01J50l06q2J86j04J33n7o14J071o83K80N1j86J61q3l2k26L76
5542A22m66N24j35r8K37k37K24j99R5l1R2r0j51N46m50M43m27R6M8j34P7j50L48
5565B84l84M43n72R2L9k4N77m93J03P0j36J7J01j48k73O60o42L84m30N0J09J09
5587f4l7L37k06k61O31o78L04M3k32L62m25M9m2M47m90L33j71J05K36m08K20j30
$$ y = [-98, -396, 167, -596, 160, 73, -199, 140, -8, -189, -205, -181, -92, 407, -96, 45, -6, -212, 84, -327, 198, -43, 74, -207, -6, 189, -403, 212, -312, 318, -227, -240, -105, 35, -20, 98, 258, -286, 254, -207, -141, 206, -280, 112, -36, 263, -181, 209, -65, 213, 116, -177, 268, 33, 250, -56, -45, -7, 181, -235, -125, 271, -326, 133, -119, 23, 5, 26, -105, 160, 17, -589, 304, -498, 130, 161, -91, 273, -226, 192, -60, 201, -425, 174, -102, -193, 268, -314, 87, 237, -69, -151, 35, -69, 64, 7, -607, 464, -219, 61, 112, -74, 87, 4, -28, -254, 122, -344, 180, 45, -53, 184, -53, 171, -28, 67, 36, 128, 38, -113, 433, -17, 426, -1, 95, 143, 9, 86, -64, 284, -100, 343, -229, -137, -98, -122, 455, -38, 65, 135, -1, 16, 117, -31, -304, 356, -286, 98, -332, -282, -173, -64, -101, 236, 30, -231, 400, -278, 26, 69, -163, 199, -226, -177, -219, 228, -262, 71, -100, 5, 241, -167, 53, -77]
5609g7O3Q0J09l07K34K82n77N87m62j26L70p3n1m4K31l03M02o02N42k12l09L71
5631A28k62L47k04J07k89N01l74R8J46m24M15r9l9r5K9J2j9J22l30N13l04J33
5653A12j49l83N74l73L11n4J70l84J83kJ5K53o23M64j83J59OK4k93K97j10j23
5675a09J47k90K46K29k42KQ7J1k62M36o07O82j23j75L74o72P08j16M20r72n2J30
5697a48k85J078p36L10k36K89K61m59m17L00Pk46J77k27N43k40L32n96K49J22
5717G8o78k50J7J472q97P51K25j245L08k74k77M43M37l88R75k44p27Q6p8K8m4
5738b82jK18N8n48M96R3j074J892j911O26j31J079p81K13l72O35m43j87P31j099
5758g88J372j370p80Q62J093j12j63L95m08Q3n0j13L30k59L6J3j34k89M64n3m67
$$ y = [-77, -14, 66, 175, -132, 102, 384, -193, 394, -68, -194, 176, 103, 52, 8, 239, -64, 338, -264, 278, 66, -243, 128, -134, 213, 9, 116, -173, 328, -46, 52, 198, -226, 189, 90, 51, -44, -15, -3, -22, 100, -230, 283, -21, 112, -37, -420, 154, -219, 92, 38, 208, -176, 7, 5, 20, 273, -350, 114, -69, 90, 96, 120, -173, 124, 14, -109, 38, -252, -6, 223, -19, -17, 70, 81, -181, 255, -352, 330, 207, 32, 406, -266, 442, 326, 746, -226, -278, -148, -433, 645, -91, 219, -17, 272, 533, 74, -343, -43, -36, -282, -105, -332, 211, -29, 303, -293, -44, 78, -600, -850, -833, 639, -258, 493, 718, -527, -219, -493, -770, -327, 110, -278, 697, 453, -274, -188, -266, -238, -282, -283, -65, -7, -555, -59, 34, -1040, 852, -1059, -433, -564, 515, -266, -53, -425, 210, -233, -420, 311, -788, 584, -786, -1566, -704, 389, 277, 114, 509, 101, 184, 134, 21, 351, 92, 128, 141, 7, -282, 182, 129, -338]
5779c38O70m22P9M31o07L16J11r9k41J42K4P9kn42N08l19M28p1N5k83R8J31j33
5802A5K70n14N34k79n5j13j31L59q8Q0l58L58k37L68j57j98M34n28L85l32L00
5823A13k63J52n2j97N86o19L59k44J73J57l92J13j5J83j93L70n38M85n3k73L02
5844A54j55OO7ql17M97l67P7M3k30N87k27n6o5K53j91N2P8m42N65m60J10K20k78
5868h7J07J70k30N1K37l56M10k92j93O00p90K96Q8J70m47K18l9J5L44o25K49M4
5890f0M3m8K09k33q3J47k39M63l03J71J01m19M94k89N9k63K57k95M54J4l74N14
5912C20p05N93k05J33j38j18J77j28J61k40N46o92M83l14N7kj16L26j99K01n14
5933c74N59k16j93O24n90R5J67k9j60J76j59O5K87l50M20m51J9j23J91m3K59k19
$$ y = [-338, 332, -90, -11, 420, -187, 129, 240, 141, -100, 42, 66, 145, 143, -399, 109, -210, 218, 147, 202, -81, 17, 148, 15, 285, -229, 305, 26, -29, -142, -273, 86, -2, 78, -280, 78, -159, 209, 52, -146, 288, -240, 145, -187, 113, -150, 2, -50, -247, 339, -280, 79, -165, 8, 165, -227, -114, -129, 54, -139, 231, -307, 178, 125, -148, 154, -1, 5, 72, 64, -253, 244, -123, -46, -3, -233, 354, 127, 71, 6, 259, 68, 120, 198, -244, 321, -139, -29, 191, -87, 20, 190, -40, 11, 248, -108, 302, 10, -183, 417, -373, -77, 11, 181, -266, -48, -87, -72, 272, -353, -104, -60, -17, -65, 144, -89, -172, -25, -264, 199, -104, 67, 168, -251, 243, -46, 13, -250, 7, -288, 166, 180, -194, 320, -385, 208, 3, 136, -2, -120, 57, -71, 90, -150, 396, -296, 187, -127, -70, -72, -188, 138, -61, 140, -374, 185, -31, -224, 400, -190, -95, 72, 43, -117, 59, -100, -35, 252, -98, 322, -129, -110, -233, -42, -85, 174, -45]
5955d5P8K26o96P52k92j91K07%J83j99R2j89K12k29J00Q1l98M01k80J40j56K26
5977B3j51L11q7m51M52l80L79L3l87K40J86k00q9L36l96M37j80R3J97m86M52l74
5999d2J63k85M28l14lP6k45M12m10L64k21L97k24p9K06l22M28n54K89j95Q4J86
6021A39l48J72Q2O3l74N58m18lK32k43L94l23k5R8k2l67N53m84k2O06n10K64j75
6044a53k66M58J7q9l12N01n35N05j94J30L86m04l8J15l84K95K90l28r5J12l52
6065c41N18l65J96L18l15K84k20J32k24M78r27N92l82N64l23qJ2M8K26n20N88
6086C31o77L00L18p16N77j90j75J73J93m58L06Qm88P71o72L40j19j62L40j5k47
6107b62l3J68k51M41%jj01j39M41m69K05k2L5l15J31M52m23J58m84O01k20o8p0
$$ y = [-45, 33, 259, -437, 315, 23, -168, 39, 39, 222, 23, 115, -74, 138, -91, 9, 90, -308, 93, -187, -47, -203, 23, -128, 183, 96, -355, 97, -283, 96, 129, -258, -18, 168, -32, -121, 215, -181, 256, 76, 169, 366, -120, 332, -42, 121, -164, 264, -50, -53, 23, -222, 190, -220, 144, -77, 320, 96, 17, 223, -99, 329, -225, 64, -131, -47, 139, -209, -37, 45, 108, -266, 292, -126, -129, 103, -140, 254, -69, -94, 4, -18, -385, 168, -316, -338, 268, -242, 22, -153, -419, 39, 56, -33, -345, 156, -379, 126, -68, 62, 448, 44, 6, 121, -263, 32, 322, -6, -101, 11, -341, 177, -188, 8, 326, 11, 295, 75, 207, -17, 461, -466, 126, -256, 308, -15, -23, -11, 37, 263, -257, 331, -346, -46, 272, -444, 133, -57, -232, -59, 134, -324, -18, -10, -498, 273, -399, -59, -178, -340, 0, -15, -262, -295, -127, -378, 63, 63, 62, -39, -178, 263, -206, -1, -23, 12, -303, -172, 280, -143, 15, -469, 132, -88, -156, -226]
6130b26M38p73N88O6l52N95k60J63k63k08N37J05n74l14P29J72n39K42n26q2N08
6151B6k91O28q8m81J520j035m08L55m79K71J1p7j19K91J01q56O80m73P46n92K60
6172a0k33O0P50j138K12O62l03l08K90k74L84N20o96J13J23l26J17K67M1m14K98
6193A35o42N67j91L18l90j42M84j49n5j88N62n64L50j94k02M54k98l8RL01k84
6214a57M02k60J9K12l12J99l12J13J08J64o4J66M4o12O41m80k1K33P8m1j01o6
6236d7J39J97o05N34j91p8L21o50M03l7J16k83J88n8o0K57j57K64n27J87k63J67
6258a83M14k66J90m35M81l32L18l69J62P2j19J73o6N00p39N90l92j23M10n15K80
6279E1K6J86m25K53J72k47j69o1M14m99K75K9n2K56o44O6O05Q02j383P48r09O09
$$ y = [-226, 212, -561, 27, 93, -259, 336, 76, 239, -24, -232, 305, 410, -164, -478, 251, 423, -116, 126, -400, -482, 26, -265, 363, 275, -206, 1314, 279, -129, 226, -253, 18, 29, -48, -167, 124, 225, -631, 49, -424, 322, -270, -10, -243, -183, 567, -571, -359, 303, 0, -308, -18, -292, 92, 612, -84, 29, 152, -174, -57, 210, 251, -163, 135, -507, 60, -131, 187, -203, -345, 139, -10, -65, -253, 309, -255, 95, -99, -301, 153, -145, -183, -174, 127, -157, 245, -15, 4, 216, -96, 103, -209, -96, 12, 176, 112, 278, 322, -290, 351, -129, -150, 83, 161, 120, 19, -47, 92, 289, -316, 218, 27, -51, 270, -380, 23, -14, 102, -181, 7, -51, -111, 146, -11, 253, -274, -87, -350, -183, 231, -35, 155, -280, 201, -131, 187, -182, -20, 52, -67, 106, 40, 540, -199, 391, -1, -124, 286, -229, 51, 77, 263, -162, 91, 263, 16, -153, -214, 200, -299, -24, 5, -47, 209, -435, -369, 236, 1038, -345, 403, -506, 103]
6301A03N82j484J412j375O60O13o82J9L0M39m30K86j63J71l82L27KK11k83j38
6321h2K71l53L13m03K60N8q2K20l55J34j87M16n25J81Q2j11J63j98J34q7K09J8
6343G6k8j22P1L13q36N18n5l49M19J93k41J65L5j28O7k25K15J12m21L12q3Q9P5
6366A72J69n78M44ll72N11q07Q52m03j6N1j9k04K53J73m08N05m97K45o8L3K73
6388C06l64P1k7l2j36J57K96k42R8l77M35m74j32J02M62Rk75N36l41q2J18M93
6410F01m27j18m50Q6O10q74Q52q10Q41j027J184M5r32L80j51R31j028O63l32J06
6430A50P1p92Q99q71N23M3K48L07j142J232j019k37K61O1n78R06j63K6l49L30
6450i4N8m33L73Q5m4k98j11P01r68P32L28m39j39L76Q7l17N28j035J314n02j29
$$ y = [103, 685, -799, 613, -762, -102, 511, -171, -152, -122, 317, -113, 173, 10, 181, -201, 126, 128, 339, 56, -82, 189, -164, 149, -254, 6, 64, -18, 202, -153, -19, -206, 210, -315, -134, -52, -163, 0, -198, -64, -151, 58, 76, 48, -74, -3, 310, -526, -8, -63, -412, 7, 200, -41, 124, 159, 31, 98, -127, 88, 200, -221, 91, 8, 97, 172, 341, -237, 207, 204, -168, 343, -464, 388, -15, -31, 20, 1, -203, 50, 223, -185, 320, -177, 68, 0, 33, 306, -58, 13, -14, -46, -182, -25, 271, 29, 127, -250, 185, -289, -421, -319, 143, 152, -123, 413, 72, -10, 108, 601, 174, 56, -394, -308, 302, -572, 280, -530, 311, -716, 468, 513, -419, -39, -190, 741, -287, 376, 44, 150, 221, -571, 328, -543, -20, 23, 271, 578, -564, 668, -351, -588, -327, -266, -844, 62, -101, -75, -424, -94, -36, -469, -96, -11, -55, -353, -464, 237, -731, 1, 329, -110, -249, 127, 214, -103, 425, -610, 704, 202, 73]
6471G3n51K14k42L52L39q94J090J83m22m2j49o8j5K82r18O81N2m84R42o85O40
6492C78q4j51m68K05m79J076j50m48N47o17m14L01L01L28m20j65O72k96k60K24
6512H0o1k07M53l26J16k57J81j48L26j87K09j20k75K39j49K84q4j18K63k24j2
6533a7q8L28l51L22k30K9K26l29J91n1k4m2M13j54J37j83l06K14k51J79n6J54
6555A11j51R0R4m39N75n34M99j87k98L42o7Oj42N27m97K76l30J18K33k81J98m23
6577b80K42k80M82j15j81L17k19J57m73M42j05Jj60J32n4J77r1j65J44R0j09K88
6599B40l34N5J59q2l05N09k42J30J29n95N29l45L18p7M6l8j36M8k14K05m7K28
6621A81l40K3J88P5j48l9N10n47Q5m2J48Pj82M28k65k20o1K41j0m7M1j19L53l57
$$ y = [73, -478, -264, -506, -154, 185, -709, 381, 564, 142, 100, -49, -117, -132, 150, -768, -87, -35, -519, 423, -262, 378, 294, 143, -325, -120, -599, 477, 327, -121, 426, -191, -605, -304, -3, 325, -95, -260, 412, 116, -144, 80, 19, -188, 265, -61, 55, -202, -21, -169, 157, -30, 179, 59, -216, 23, -126, 158, 74, -44, 219, -5, -17, -105, 223, -128, 194, -36, -7, 219, -110, 81, 30, 6, -36, 377, 223, 360, 177, -129, 85, -166, 13, -43, 111, -40, 50, 144, -295, 280, -254, 245, 58, -240, 102, 35, 41, -101, 426, -71, 205, -125, -7, 226, -55, 143, -280, -38, -318, 164, 49, -132, 185, -34, 123, -350, 92, -13, -12, -172, -40, -94, 83, -8, -173, -29, 61, -48, 240, -94, -39, 120, 38, -267, 242, 0, 130, 259, -336, 193, -152, 166, 89, 135, 97, -39, 9, -205, 0, -47, 181, -159, -136, 52, 127, -21, -60, 450, -97, -12, -54, 94, 101, -81, 347, 82, -138, -199, 42, 32, -15, 26, -93, 260, -97]
6645i7K69k77K62k23m3L1N2O1k48P76o14Ok7j38O88n07m45M95K73m28P6Q57j03
6668F96P1j141L19n96L58O20J57p23r79J311m11n80O64J08L06n09Q18j02o64l82
6688f59O60n16M26r9Q0J78m77j020R07j28K21k14L52J77N58n95K01M5L59p49L78
6709H5l63j45R68n87K57k62k24K38J14k66Q3l5j80N99l35k46J68l96P60k65L35
6730C03o68L71j07J38J14k78L26l12L44j94J00J03K59l64k02O1l30N30m6m69J48
6751a73J40kn19P15m3q8l10K55J71j25P6k64m2j63J43j61j41L84K98l27k80Q32
6773C76p60Q59k08n62L62l9M33n76L1k20L81J3k38M56l32J69k74j06l8J28O7q1
6795a59O0j43N44j06p1j02j7l8K23k12K8M65o80K0K50J56k34K13k54K54Q7r62
$$ y = [-97, 172, -105, 157, -66, -109, -78, -26, 35, -213, 563, -51, -45, -72, -210, 478, -29, -474, 21, 294, -134, -58, 799, 696, 767, -374, -55, -651, -293, 327, 484, -239, -1218, 93, -318, -898, -234, -126, 180, -329, 489, 387, -277, -659, 1, -515, -89, -188, -108, 70, -407, -1427, -520, -648, -427, -641, -289, -112, 446, -149, 52, 97, 456, -293, 85, -278, -423, 545, -42, 215, -47, -271, -33, 81, -185, -102, -137, -317, 282, -53, -299, -131, -527, 233, -32, 303, -365, 6, -101, 37, 151, -127, 199, -113, 231, 37, 137, 240, 499, 135, -67, -6, -336, 194, 148, -321, -173, -33, -35, -554, 161, 118, 30, -280, -25, 146, 21, 97, -167, -209, -372, -229, -390, -531, -147, 151, -176, -456, 376, -384, 475, 267, -295, 67, 28, 461, -115, -84, -304, 77, 90, -148, 308, -24, 145, -129, -235, -273, -145, -78, -159, -99, -242, 302, 196, 125, 23, 6, -32, 191, -21, 7, 472, -208, -188, 62, 218, -16, 197, -57, 197, 284, -678]
6817f78Q18n00O52K50o84J10j14Mk24J65Q30j41n37o3J24k14O76l41l4j05p5m11
6839d92N66o4k47P74j16l89ml14J92L33K1L51o35r2Rj84k52k18M47K41j17l66
6861e56R12m1j29n29J55k1J71O67L1n25m21M08m04q2N81K50r29J55J05n07j89
6882h98J928j196P2j23r8K27O4L5j02O40J3n18o5n2M12k52k54L73l95L89q5m87
6904c72O07n54Q13j120R26n38j22M58m04O75n12J53J39N34o92O65l95l05J59q14
6924f99L27M50J81j22L9Jn34L77K89k25k89O35p67L09J29l75M73o09K84o9J80
6945a5k49J26J34j67L78k85K89j26K55l86j37K75O5j43j35L67n04J50l3K08m0
6966B7nk29M2L85k63J46j23k0j3J87m8l7K53k50j9k8O8J69k37K49l52N1K42k56
$$ y = [-678, 140, -360, 292, 542, -142, -32, -146, -142, -366, -201, 629, 488, -49, -112, 12, -202, 474, 133, 99, -6, -81, -492, 74, 10, -237, 537, 421, 32, 28, -286, -94, 239, 260, 611, -24, -116, -107, -291, -543, -761, -314, -73, -190, -556, 356, 315, 186, -343, -188, -209, -38, 629, 660, 135, -286, 122, -282, -364, 217, 467, -462, -307, -202, -709, -898, 1030, -166, -94, -217, -315, -88, -24, 11, -91, 549, 562, 44, -21, -73, 339, 87, -167, 206, -189, 200, 115, -372, 235, -319, 494, -626, 300, -238, -360, 98, -306, 369, -143, 10, 149, 683, -9, 656, 261, -44, 115, -699, -372, 78, 259, 137, 176, 177, -357, 20, 309, 84, -205, 430, -337, -28, 101, -274, 199, -410, -126, -195, -15, -264, -138, -4, -171, 207, -78, 211, 85, 340, -46, -183, 92, 157, 14, -121, 246, -258, -108, -141, 67, 27, 22, -207, -165, 220, -43, 103, -20, -40, -53, 134, 86, 49, 302, 52, 33, 5, 73, 242, 5, 254, -98, -47, 195, -61]
6990f1J6k6K86l69L94m20K49j3n1Qq5K3n4L4L3J49l5n9Q6j45J7j55L20Pk63Rl5
7017a40M49l65J14j61L07k27j88M53m04L6QJ59j28J07lk60M03j40K34k09J48l73
7039a80K06p2J25j4j36J57j61PJ29K9j62K5J3L02j84l14K73k3L7%l63J58K62r
7063A05m5q9M1O0O8k65Q3L36k62j66j15J47K82j41k76N78m64M6j43J24R3j11j7
7086a31K2K76m21K40o1mL41k31Q5j10O3Nj45K3O1J52k88K77pl36Q4KK56k44J22
7111C1j24L62m29O8J90l90M26k98K3R6J41k57J92Nm6J42n39L67o6L80j29k7j61
7134d3J72o2l53K57l38L83j5L3j48M9K8m3K79m33M78k98k38P91p44M32j48oK5
7157E8j10k03L52j26J45lo48O91m14K29P2j27J45k36J55j52J95k50J41J34k6r
$$ y = [-61, -45, -71, 215, -154, 240, -180, 69, 56, 5, 13, -72, -49, -103, -69, -36, 113, 78, 19, 105, -40, -23, -178, 142, 149, -114, -105, -140, 309, -56, 58, -103, 204, -23, -211, 242, -162, -126, -118, 41, -87, 20, 17, -243, 160, 20, 254, 45, 193, -180, 26, -46, 79, 65, -71, 86, -75, -68, 61, 90, -72, -47, -34, 268, 84, -230, 43, 20, 57, 57, -306, -148, 114, 105, 60, -29, 12, 72, 140, -125, -42, 294, 32, -134, -249, -102, 180, 39, -237, 341, -123, -77, -220, -96, -3, -114, -131, -109, 167, -254, -14, -75, -79, 262, 31, 116, 6, 69, 74, -71, -48, 13, 165, -123, 154, 147, -189, -105, -103, 153, -91, 31, -93, 269, -160, -92, 98, -292, 134, -164, -141, -45, 96, -161, 31, 36, -10, 132, -407, -40, -106, 274, 145, 118, -43, 129, 67, -286, -29, -367, 16, 1, 34, -114, -65, -37, -80, 199, -234, 244, -54, -292, 499, -245, 187, 39, 33, 58, -52, -255, 97, -29, 116, 113, -535, 156, -258, -29, 43, -84, 61, -175, -20, -172, 23, -227, -86, 48, 22, 13]
7179A3o2L74m72n2R7J66j42j04K80o3r3q6J73m6J19pk17K58k75M51m53J73K81
7202C13k79j71K26J85l36o4MK18l3j18Q2k2J81l04K80n8ok43k0J84k83J1L09Q7
7226A43j7j00Pk76L64l23L92q5M3j0j51l0J71J07k14p0j12R2L2j2O4p1M3L7J09
7251A33L0k37k8p2K65l82M85l03K52k08r2j0J82J34k70J91j20R3K0NK85k56P4
7274A71j22qj2K75k97j6K96l93K49k36J36J0m5J41l45N31n27L92m30J4K16j20
7296a20L04k97L2K33j29k29K48l03K46q8j86M46j72J64k25K41j27j52K38k68J89
7317D5o2J77m50K37o4J47L8l92N40l21K32n7j82K38j48p3l7mL55k7l93J10J48
7340E7k33K40k8j82P7j6J13p2k0J05k7k06K95j0j13qJ39k78lK46j78O0n05R30
$$ y = [13, -49, 325, -147, -199, -102, 64, -78, -182, 98, 35, -58, -144, 29, -17, 102, 95, -122, 136, -139, 312, -141, 32, 313, 34, -137, 89, 274, -62, -126, -122, 96, 63, -55, 27, 5, 186, -118, 162, 104, 98, -145, -165, 19, -264, -253, 56, 143, 126, 26, 33, -243, 121, -202, 190, 105, 148, 138, -13, -43, 128, 235, 21, -49, -161, -69, -37, -49, 15, -56, -13, 24, 133, 163, -74, -102, -174, 91, -291, 194, -109, 143, -65, -157, -167, 15, 149, -121, 70, -50, 43, 63, 68, 353, 97, 171, 49, 41, 29, 304, 7, -9, 287, -106, 143, -93, 43, 53, 8, 149, -196, 335, -192, 200, -230, -216, 0, -120, 184, -113, -81, 152, 23, -206, 42, -261, -15, -103, -289, 157, -15, 149, -76, 165, 38, -114, 124, -144, 45, -17, 160, -290, -53, -117, 30, 68, -324, 216, -105, 127, 70, -112, 126, -22, -95, -132, -136, 219, 192, -201, -91, 57, -176, 64, 36, -146, -69, -85, 28, -44, -64, 41, 14, -192, 103, 93, -20, -28, 111, -167, -170, 76, -102, -42, -547, 383]
7364C83p0m33L9j145J107R5o59O60m41O61k45P92o42l28M02j02j69J31K4J1J09
7385A80l90L95n96N74l17L01j7k92nk5K65p5J33j67j40K7M7M8P6j30M9L02k19
7408B4j74K59l77L43j94R4R5o9K25nk07j24j28K4L00J22j02j98j30K92p8J82k85
7431a11K39o5j84L15j61J30k02J04r6k8J18j37J93l84L30j20J05o8O9j4j19K24
7453A38k21j2J47m3l7j92L68j61J29j48n4j1M9K01m27M35m49J27Q3J82P4r7M6
7476A27l67L73l50K03l11K00K01j32K99l50L54l38M8k06L70k16j93K93N2L5j25
7497c3J77k92J33N2J55m7j57J92j77P1K08m12J80p7P2Q2R8l06r5j4K65m2j01L1
7521c7j54M48k36r2J80r1Q4k64J56j62K86n8l55O7j03M67k73L71m16L8J00m4J54
$$ y = [383, 313, -120, -81, -1226, -119, -24, -683, -23, -464, 197, -48, 744, 102, -226, 176, 74, -95, 36, 60, 71, 180, -210, 185, -411, 163, -154, 147, 130, -162, -167, -192, 73, -2, 131, -36, -176, -149, -102, -54, 22, -108, -59, 243, 24, -150, 109, -268, 75, -119, -25, 70, 1, 226, 221, 14, -110, -238, -214, 86, 208, 106, -92, -222, 70, -8, 174, -111, 128, 63, -121, 194, 33, 163, -39, 65, -31, -59, 59, -78, 115, -269, 61, -59, 46, -22, 47, 33, -86, 138, -83, -95, 52, 9, -28, -220, 148, -13, 116, -32, -86, -97, -48, 153, -274, 161, -288, -161, -78, 104, 178, 81, 127, -240, 133, -217, -14, -325, -125, 76, -56, 243, -107, 247, -91, -43, -249, 121, -95, -288, 5, 57, 92, -33, 144, -148, -15, 37, 192, 145, -12, 180, 3, 74, 282, -130, 50, -27, 45, 127, 225, -81, -176, -190, 75, 33, -68, -37, -191, 257, 21, -71, 109, 18, 102, -162, -6, -168, 118, 60, -295, -228, -331, 136, -137, 234, -182, -144, -44, -88, 66]
7544F6j98P3R0r2J1K42m4k88J28m9J65k15n6M23m09O4j7L10m16N30l34p2j69j73
7568d30M39r3L45k58M0k48K95q6N0j7L0N8l26J52N6m6q6K60O5k00m0k11M38l97
7592b10J19J52k74L75j91J32k24J17k4k56K56m7J25l97N01l69J60j8k28M63l79
7613b17M24l55J93J29j47j71O5L93l48J92l96J28Nj18K99k77L30k09J05m28N84
7634A81j73j67K06k00J43n5p8K22n8r1J34P5j95jj02J74Q4q3l10O28m41k8R8M
7658c3j86P4J72l9K85j42j84j36J40j1K65k25J36m48R7j8J96k69L01j77L85N84
7680G67p10l19K63J88l02m80J226q66N40lJ28r5l0J31q22k74O65r4l19P22l00
7701A6J43lJ67k02j23K8r3L36m41J75M2j87M95l95M6n43O49j57n01N66%M43n73
$$ y = [66, -132, -59, 31, -61, -50, 192, 148, -140, -12, -61, 104, -111, -167, 256, -153, -89, -106, 204, -212, 318, -16, -88, -257, -430, 9, -84, 261, 3, 43, -205, 90, 4, 54, 37, 67, 125, -201, -49, 7, -39, -125, 135, 200, 0, -40, -251, 187, -210, -91, 61, -213, 162, -29, 103, -121, -4, -28, -284, -28, -75, 50, -347, 154, -215, -55, -73, -301, 162, -217, 207, -148, 45, 174, 27, -144, -79, 314, -34, 158, -238, -110, -105, -223, 76, -201, 129, -80, 25, -403, 181, 8, -159, 47, -153, -10, -65, -143, 79, 21, -70, 64, 139, -56, -57, -159, 15, 99, 16, -294, 334, -107, -135, -37, -33, -219, -145, 27, -12, 273, 131, -53, -189, -49, -60, 205, -20, 116, -332, -235, -253, -57, -326, -25, -202, 183, 767, 57, -262, 1, 189, -113, -593, 633, -233, 307, 304, 432, 337, 307, 438, -384, -658, 7, -87, -406, 316, 16, 159, 156, 323, 121, -2, 26, -67, 269, -172, 3, 45, -142, 353, -42, 4, -539, 110, -47, -548, 18, 18, 461, -112]
7724a12K3k82N45M14j636J216j42k2o1j4k89P10n23J38j53J37K04Kn6k42J12K8
7746cP1J66k80K24k75K87k62J49m9j78n5K25J7l70M64k48J16j57J40L80l98k42
7768b78k48L72N57l20k29m75Q21j68P3J09n65O23n42M31j41j74k73L97o0K90m08
7789b08J16kJ50J61n03K59n2Q7K64l28J7j74L61k11R4k28o6O05n36K53J0J06j55
7812B0J4J45k50J16P3J42n06N92m07K40k28M5K8k11L74k01J65l01P0o5K03q2m9
7835g3N2j22J71k6j01J08j90K15Q1n1k62N1K01Q8m0k95P9o7K78l41L47n2j90L54
7859B15n14M57m7mk5r3r6k8K24o6K00j45o6J15l07M33m54K65ok10M08j10%j59
7883a3L8L5j5j38L06k12Pm2r5M9J4K16J48j60l00J17Mj9n8q9M82l84J15o4O6N5
$$ y = [-112, -89, -371, 174, 588, -1048, 168, 26, 4, -57, -71, -360, 350, -173, -35, -188, -51, 153, 155, 99, -143, -31, -3, 68, 234, -46, 178, -97, 190, -72, 77, 28, -150, -205, 20, 37, -333, 131, -117, -1, -158, -18, 362, -36, -278, -526, -154, 403, 83, -146, -621, 200, 32, 105, 214, -351, 272, -270, 161, 20, -154, -427, -30, -90, 200, -208, -92, -94, 56, 217, -286, -27, -79, 8, 272, -56, -39, -213, 148, -63, 31, -197, -263, 342, -194, 59, 69, 175, 20, 34, 179, -71, 45, 118, 260, -246, 346, -61, 179, -49, -4, 24, -187, 187, -14, 151, -150, -80, -145, 58, -24, -73, -21, -143, 28, 2, -99, 9, -181, 34, 115, 64, -198, -147, 54, 142, 102, -193, -114, -181, 97, -244, 103, 51, -139, 215, -299, 158, 111, 107, 82, -11, -107, -135, 89, 23, 223, 78, 12, 127, -180, 253, -201, 64, 58, -152, 256, 146, 146, -13, 25, 60, 45, -93, 213, 1, 8, -34, -129, -80, -66, 150, 298, 138, -162, -45, -41, -60, -118, -207, 275, -109, 6, -58, 8, 63]
7909F3L5l7r9k73K66R1P3l86L50O1j39j56J65k23j59O29Mk66K4M5ok5K0m6J03
7934A14kl13J85j81LL09J2n7j66k19L18l22M63j97r3J57K77M0l67O2k85K14K82
7957B34m08L36k00L8k22l8K62p0p9R5K15l74M12m75M57n38L41K17O9k52j06l6
7979a22K10J04l92L64l72L07Q5j05J03l18l7J64j61J45K39l08J31Q3j44R7k07
8000a34o3L07j64K75l07L20O9l43j29K13J32k07J86m05J61K18j56r0l3o1M52k07
8022C4j64J87N7L75m45k24L01j55m7l0K22k00L65n50j15K17J93j35M67j33k37
8043a7kk26pl3q4L54L52k73m76Q45j68l54M27j16k54Jo4K55l77Q8N28k84J86m85
8067a84j69J278r50Q2K04j44l49L22j40O91p26o0M00k36k26L23J11n90P86m68
$$ y = [63, 98, 61, -38, -311, -45, 46, 119, -267, 83, 144, 5, -151, 14, -209, -368, 261, 265, -1, 23, 68, 62, 37, 57, 11, 114, 112, -201, -16, -197, -194, 115, 127, 70, -96, -315, 3, -319, 144, -53, -146, 11, 288, 328, -39, 23, -262, -48, 234, -174, 162, -38, 0, -222, -260, 2, -68, -147, -52, 163, -211, 201, -274, 183, -355, -14, 203, 272, 20, -86, -122, 88, 192, -200, 164, -208, 99, 184, 79, 182, -136, -173, -9, -170, -25, 214, -94, 37, 120, -24, 73, -134, -197, 110, -54, 221, -86, 234, 303, -40, -169, 44, 176, -31, 155, -250, -89, 129, -27, -117, -150, -211, 241, 34, -130, 57, 114, 489, 44, -180, 121, -34, -81, -111, 111, -89, 276, -274, -389, -172, 21, -114, 353, 220, -17, -19, -245, -252, -285, -369, -15, 337, 64, -412, 433, 265, -89, 338, 222, -32, -31, -95, 160, -217, -129, 399, 115, 301, -184, -353, 925, -25, 57, 261, 117, -232, 90, -50, 641, -85, -145, 255, 19, -207, 116, 227, -363, 423, -45]
8087d5n8O02l85n42M97m78J310n96N59j9j101N84m38K56p76L57R68q20K25O86
8107G86k16j053Q96M15j351K86R4R4o24J078q24Q94p29R3P72n03L64o14M60n13
8127a95M78j81K6m80L09k4l90L16K06J10l47K88L61k78l31J30k28J46j03L21j13
8148B1M85q45J14J60K29J09k83K62q0q8l4j6j26K49j03j03Q9k5J82j74p9q4M4
8171i6K12p2O5q5O5O0k26K49j24qJ00j16N3K45k45P7k21P1J40j86
$$ y = [-45, -103, 499, 114, -428, 69, -409, 901, 305, 864, 845, -256, 328, -110, 146, -630, -273, 695, -125, 100, 786, 570, -483, 413, 828, -523, -237, -143, -49, -673, 405, -419, 475, -254, -161, 611, 108, 472, -142, 318, -195, 283, 102, 128, -352, -43, -67, -457, -141, 65, 175, -172, 116, 477, 199, -132, -2, -230, -84, -187, 134, 21, 506, -339, -225, -65, 164, 273, -10, 252, 172, 84, 50, 34, -92, 157, 54, -49, 40, 15, 197, 23, -56, -140, -96, 116, 44, 109, 24, 89, 149, -77, 172, 48, 40, 140, 24, 77, 322, 77, 154, -67, 4, 144, -42]
8191d2
$$ Imaginary data points
##PAGE= N=2
##DATA TABLE= (X++(I..I)), XYDATA
0@%%%%%%%%%%%%%%qJ6j6J6j8K6l2M0m8N6o7P5q8J04j21J42j65J89k15K44k77L14
36A67l54L98m49N03n59O22o94P72q55R46j044J153j273J403j548J704j876K067
54A083k278K513k778L079l421L815m274M818n476O290p328Q710j0659J3664j9226
69a1468N0766j20378R8325L7497j14770J08269m4582m5306R8132o9269m5626J44122
81H5712j65039O6123Q7715j41646O1762K3126o2276N9984j4768o8915J33675q5751
93b0298m1013J28025j24103M1137O1004p6299K3723L3638o8043P4143k0607q0911
105f9604J45189p9749l1144Q2190o6833R176M9557n7308J9836M0221r3499R6377
117D4409l0097p8828J18369m7169l3988N1094l3697j0211O0428q2852M3192M3125
$$ y = [0, 0, 0, 0, 0, 0, 0, 0, 0, 0, 0, 0, 0, 0, 0, -8, 8, -8, 8, -10, 16, -16, 24, -24, 32, -35, 40, -48, 56, -65, 77, -88, 101, -114, 130, -147, 167, -187, 211, -238, 265, -294, 328, -366, 406, -449, 497, -547, 606, -667, 736, -812, 892, -984, 1083, -1195, 1318, -1460, 1619, -1802, 2013, -2261, 2557, -2919, 3371, -3957, 4753, -5906, 7758, -11468, 39298, -81080, 17245, 54742, -60028, 48241, 3659, -41647, 56485, -12784, -58410, 85712, -79327, -13204, 74511, -67135, -5373, 17753, -44523, 15461, 693, -68222, 65453, -20298, -61311, 66714, -57389, -16252, 44752, -31547, -7824, 25814, -42229, 31914, 11307, -69604, 75585, -4164, -35308, 46882, -19951, -10775, 38782, -18526, 1310, 41531, -51968, 44409, 14312, -64516, 53853, 6684, -27304, 23790, -9907, -20118, 40310, -42542, 650, 43775]
129D3775j06161R7803k5764o2471P5450r504l9873N0336l8638m189P3255j09078
141e5059O0528L7600q3822O4115l366n2658M9585K272m5631P3099o8096J1150
153a0283P3432j09378M7102L7156n8326L0360J4517n9780O0065j8828m4624R1309
165E2722q5794J7300O2720q2126J4282M4554m7893K4572J7217p0916Q6777m1930
177h515l9084Q7857o6657K660N7107n1629j0149N4897n8817M5515O621p2878R6802
190D3730m0675l8815O4521k7872k1074N8966m4740p810N3060p5523O3617k722
202B4663o4966P5216j2739n0292M5352o803l4152O6440o0939J0993M5002p8491
214d0716N5273O657n7597M5363J9152o2044M6254j5078k5831P0251p4269K3668
$$ y = [43775, -62386, 35417, 9653, -52818, 22632, 13128, -26745, 23591, -15047, -19236, 54019, -55059, 5469, 43069, -40753, 23362, 19996, -32662, 16923, 19195, -26436, 46663, -21433, -10283, 63149, -46229, 873, 38029, -20297, 10063, 24580, -35200, 24865, 6037, -38587, 52722, -33072, -15772, 46948, -35178, -20896, 23658, -24235, 337, 17554, -53362, 33415, -8515, -47599, 40258, -26399, -23739, 33368, -18261, -28410, 26487, -32330, 13185, 19806, -53072, 43730, 3055, -35760, 28761, 889, -20185, 38781, -5959, -13769, 39291, -36232, 27385, 24663, -40303, 34913, 22174, -28118, 17234, 10431, -23721, 42719, -18220, -7227, 37775, -40716, 14557, 21214, -36383, 8980, 28132, -33912, 12342, -2736, -28567, 41684, -32585, -8917]
226h917M1884o3430K5991K8433n5965L2783K8244o1965N8804l7348j0575O4996
238D2935o6082J0276M7052m4310k133M2904o0840M0606J0461n0255O3784m6920
250a2522p880N3265m2119j7671N7157l8195m170L5851o3436N6051r908l8287N5639
263B3775k8714k3370M9936k4724l2088O2669m5280J7954J8491n8898N8757q422
275A0086l8651M3484n13m1756N5124k7160k3886N6310n2782L4981Q950n1741M2079
288A4525J2754n1841L5969J1644m6296N8622m2425n240M2143n1014K7760J9217
300B5818m9020K0449L4450o3796L8080J839l2860N6032m9557J229L7947l9370
312a8759K868M2394n1900J4511L8304o1953M4278j4487j7799N0651l7531j4194
$$ y = [-8917, 32967, -30463, -4472, 23961, -32004, 779, 29023, -32942, 25862, -11486, -22061, 42935, -23147, -12871, 34181, -10129, -12262, 30642, -30198, 10408, 20869, -29386, 34398, -12522, -20402, 32863, -9256, -26927, 30230, -7965, -12135, 23716, -39720, 16331, 6423, -31864, 23775, -4939, -28309, 21627, -3097, -35185, 27484, -17796, 158, 18649, -40249, 18508, 10086, -28565, 14919, 14406, -27350, 27774, 614, -23272, 33038, -19744, 15237, 24187, -27554, 14525, 27279, -24562, 11407, 23051, -23245, 35377, -7048, -12288, 29855, -21159, 6601, 25818, -23202, -2753, 31697, -32099, 5981, 7820, -25040, 30992, -18565, -17336, 20611, -18759, -15891, 26503, -25397, -10886, 27418, -34535, 9743, -4744, -22543, 28108, -9423, -23617]
324b3617M7754l0768j7118N6014n5580K4545K3620n0393M3360j7873k0284M6659
336B6319j7946l8262O0587l1131j7963M7540n3651L3801R506m0211L2779k258
348I110l7874M6995n348m8025O3038l5278l198K8150m3971L0663J4629m0056K2375
361A210J9353n3684M9634p492l5098N1179l3091P259J7924l5658J5379L4058n0180
374a9207K0500K5447n2469M6695j8086j7535L6336k5098m32K7258l7963J107M7980
387C4533n7111K3867J4244l6100L7105k2174j3613L3099j6539j7782M5466m3615
399a8620n59M3822n0314K6067K705k0484K8952j2442k7031M2662j3033k7351N3859
412B8233m3678O970K7457l5467K0745L564k1486K9020K93m5956N3477j6785k3182
$$ y = [-23617, 24137, -6631, -23749, 32265, -23315, 1230, 24850, -25543, 17817, -56, -20340, 26319, 8373, -29889, 30698, -433, -18396, 29144, -24507, 9294, 18800, -21411, 11368, 9110, -28764, 18231, 12883, -35142, 27896, -7382, -10580, 17570, -26401, 4262, 18891, -21165, 1210, 20563, -33121, 16513, 9021, -26077, 25102, -7989, -730, 17194, -18464, -3085, 30973, -19207, 1293, 26740, -25729, 20966, 2880, -14655, 21681, -3417, -3849, 23409, -14554, -13447, 34533, -22578, 1289, 15533, -20567, 16538, -5636, -19249, 13850, -2689, -20471, 24995, -18620, -19179, 24643, -25671, 396, 3101, -17383, 11569, -873, -27904, 14758, 1725, -25626, 28233, -15445, -8475, 18982, -16485, 4260, 7824, -13662, 15358, 15651, -30305, 23172, 6387, -16795]
425a6795M3548l6283J1851J6431k9807J2495J7011l9308L6263N129n1588N2136
437B1083k0213j2996K8209k6529O694K4373l6987Q199L0309n2351M1410K402l9391
450b5788L9089j5681r011K2908k1418k848M1981m7687R822L1556m8001L5355j185
463I092k4029K5888o404j8575L1844k4641j0677N1877m9683J0430K1373l2171
475a5676K1342J526k2230K4151j4l2162M4345l0924j0314M5083l7890O765J4369
488H371k0744J1457J0065l4618L5469m9l6010M6660k9290o736L1351k1538l96
501f008J8633k3426J3099J6193m6373M3514k893k8551L4122j8560p169K2462j5168
514a25o249K9051l5899J9698J4540m6220L7746k211j9499J9054p963j3326K7418
$$ y = [-16795, 26753, -9530, 2321, 18752, -11055, 1440, 18451, -20857, 15406, 20535, -31053, 21083, 870, -12126, 16083, -10446, -3752, 20621, -16366, -8167, 22142, -30209, 11201, 13603, -25788, 13301, -2380, -11391, 11517, -9901, -12749, 29232, -18455, -8633, 22923, -25078, 10277, 9092, -14937, 10951, 4547, -14028, 17816, -6825, -17502, 34375, -15308, -4878, 16495, -15676, 5666, 7192, -15038, 9113, 9099, -23063, 21282, -9642, -19956, 25127, -12763, -5998, 8371, -12373, -916, 9149, -25469, 10000, 9951, -26059, 20601, -8689, -15425, 15926, -5612, -6008, 12625, -10801, 2298, 18491, -27882, 15632, 12739, -15812, 18310, -250, -7419, 15043, -125, -6374, 22677, -13222, 6476, 21016, -25204, 12542, 10331, -9168, 9886, 1923, -11403, 16015]
527A6015k2932n617L5796m3516K4245R485l4925K2717L994j7832J7707n296j8370
540a8529L8966l4670j4L2115l5228J8003R645k4587J2138J1363k5710K8726j2377
553a59j8390M5058l6479k28K4292k1329O250J5578k5381J3285J0985l3556L7808
566A7734j7575j5787L7487k4134q757K0301j3593j039K1620l3806K2543P175l4406
579b2237L5364j3545j3823K6318r370j6105K3298j7281J990K4527m0905K9170
591G401N456k8639K3218k682j6586K2562l611j9726L1529k9128Q617K1499l7438
604a7528K2114J0680k3859J0690O959k4383K8822j1608j5766L4151l2854Q854
616c728J7544k7923Q745J8476k3913R557O606k6659L5444j9712r848K9551k3249
$$ y = [16015, -6917, -12534, 23262, -20254, 3991, 13476, -21449, 1268, 5262, -12570, 5137, -159, -18529, 20437, -14233, -14247, 17868, -17360, 643, 10288, -14299, -2161, 9202, -16508, 12218, -159, -18549, 26509, -9970, -10198, 14094, -7235, -985, 14593, -10788, 2497, 13482, -20074, 17734, 159, -15628, 21859, -2275, -11032, 9269, -4324, -5363, 16257, -17549, 4994, 12169, -22237, 13127, -418, -14241, 12077, 2707, -13398, 9900, -7381, -5391, 19136, -21769, 7401, 12857, -15782, 7436, 4754, -11832, 10730, 7119, -12607, 18922, -10206, -1589, 19910, -17528, 4586, 15266, -8593, 2097, 9056, -15327, 13495, 1887, -13879, 20272, -12582, -3728, 13816, -14107, -5362, 13114, -10799, -1242, 5364, -21295, 14149, -5563, -15411, 14140, -9109]
629i109O15J7718j9121q09K4438k7513J8674n09k3099L4507j8603r134K3044r195
643A904r907K2653k1843K813K0884l0236K6699o582j8499K6048q484j7187K1644
656I907m881j2505K5622k9631J1698J3148k7643K2672j979j7745J7509J920k4788
669a6696K5207j0272n967K4269l2204J5190J0488k2424J1520R824k1498J7255
681D692M106k5654K8612j8834K915K0024k6473P490J5809j9941K677J7195k6473
694a3855K3984m344j9269K7022k0174J295J7973j7595l950K4778k4411M312J3699
707I465k6727K8841j0611j4080K2353j2004r247K2098j4147q643K8683k7743J1751
720a1M919k1089K6044o353j5552J9022j832j8750K6920j7378l084K3686k5832
$$ y = [-9109, -8494, 9224, -9897, -10706, 13732, -13781, 4893, 4384, -18715, 15792, -2811, -11945, 11099, 1904, -8003, 14650, -7193, -4380, 16504, -13732, 12967, 6385, -12114, 13934, 5450, -11737, 9907, 5026, -7479, 18143, -11488, 210, 13358, -14285, 8387, 6408, -11337, 6172, 8092, -16696, 8511, -1761, -7728, 16541, -15663, -473, 10015, -12409, -889, 8935, -12563, 4692, 8798, -16856, 11756, -7078, -4163, 15861, -10612, -3122, 12687, -7254, -4577, 12618, -13855, 10129, 5785, -13484, 13538, -6636, -5341, 12632, -4963, -8913, 15865, -8546, -4234, 9465, -17262, 11579, 968, -13112, 9241, -2763, -12010, 10088, -4059, -12702, 15981, -11762, -11, 4908, -16181, 9863, 3510, -12042, 6980, 5148, -13602, 13318, -4060, -7144, 16542, -9290]
733i290J5081J662j7940J7252N227k3348J8867J871k0085K6490k1845M238J5968
746A4148k0414Q790P282j9673J0182J3148k9768K3707l949j2966K1288k1760M069
759e916J5065j5733q6J8558k5008J1206J1055k6648K4500r076n016J6117j5157
772f139m022K1231j5417m506K3295k6921J6270K709j8745J9464o846o348J6206
785A0231r175j3677K8038j9587j670J8183k2485J7016j745j4855J3805Q84j5543
798a0580K0978q260j6033K8471k2201M642R806j6191J3737K883j8588J2344P311
811H319k3594K6664j1470r559K2315j8745M808P752j3225P620J3492k6599J5542
824C320O846k2727K4487j3358k760J5199j3053j706J3768j7243M812J9128l0401
$$ y = [-9290, 5791, 7453, -10487, 6765, 11992, -11356, 7511, 9382, -10703, 15787, -6058, -1820, 14148, -6266, 2524, 9806, -9867, 315, 13463, -16305, 7402, 3453, -9513, 11775, -9985, -5916, 9149, -6584, -6670, 11888, -13120, -1914, 9141, -17507, 6993, -2083, -7099, 9018, -6139, -10161, 11070, -4347, -8853, 14442, -12479, 3791, 6500, -12245, 7219, 373, -5975, 10231, 1056, -12621, 15417, -4170, -5840, 12343, -10142, 6874, 5129, -9726, 4079, 4963, -10580, 10398, 2138, -13895, 14576, -7625, -2983, 6823, -9368, 4369, 7252, -11336, 1008, 8319, -15275, 11389, -81, -9640, 12675, -6070, -1262, 6490, -6735, 885, 14377, -12222, 3320, 10166, -12561, 11926, -1432, -4192, 11007, -2046, -3752, 10016, -7227, -2415, 16713, -13688]
837a3688J7992J067j4880J6795j0161m405J5816r194j0481K2664k3076O671J6091
850A1211k4897J6100j120r734J1294l693j2565K3371j0449j1466K4873k3753Q800
863b028R592j6224J0715L444j2396J2203J1k0262K9081j3613p028J8568j7780
876e717O640O729j2994N447J1389k1013J7427j728k0343K6568j2904l298J1319
889G522j0392L94J1735j7796N497J4800k4864K0333m274j4024J7621p607m603
902e658J1089p580l687J8746k4631R390J2277k0677J6820l894q909J1061k156
915B191j0393J7326j2002k730K0806k6052J0293O966j2688R606J97j0916J2485
928E089j756j5787K3829j7553J128J6500j9961O228N799r514N375N891j7652J9653
$$ y = [-13688, 4304, 5371, -9509, 7286, -2875, -7280, 8536, -658, -11139, 11525, -11551, -4880, 11211, -13686, 2414, 1294, -8440, 2854, -839, -13404, 9967, -482, -11948, 12925, -10828, -2028, 7564, -8660, 2055, 5499, -6897, 5306, 5317, -14945, 14136, 523, -6505, 12063, -5717, 923, 7652, -5342, 105, 11494, -9519, 7908, 6180, -14163, 12405, -499, -3797, 7522, -2870, -2476, 9259, -8537, -3040, 11760, -13104, 7229, 2955, -11069, 6552, -1055, -5658, 5431, -2149, -5836, 12910, -11721, -2331, 9946, -10731, 6089, 2195, -6714, 4347, 2191, -8202, 9124, -2878, -5608, 15198, -10854, -561, 6405, -6283, 3323, 3520, -7396, 5089, 3333, -12454, 11375, -6178, -5050, 11450, -8511, -2283, 3516, -5998, -623, 5268, -12384, 7269]
942G269n087j5247K2666j5650K042J1595j1368k9J0937j4005P548P320k1231K3978
956A0738p373j0883J5395q781j800J1352r321k759J6084k0898J2355M143j9207
969a0955K0592n061r351R443k814q226J6292j3887p45J7481k3351J3276J579j3762
983i489J1971K011j2034J0444k529j0915K1657k0096L885J4008j7308Q185L658
996C448j1280P099P035j6255J6626o795q777K0327j8560L176J1346r857N93Q780
1010F906j4625Q917O332j8273K0299j0241m971J4543j1655k745J1802p174k087
1023b972J2271j9749J4389J094j5439J7237p026m411R542m560q883J6339j1388
1036c556J591J0824j9932J6048j540j0913R812J017q716J1749m566r764J8690
$$ y = [7269, 2182, -13065, 9601, -6049, -4007, 7588, -3780, -3809, 7128, -6877, 671, 7991, -13240, 10738, 3365, -7518, 7877, -904, -2704, 8648, -673, -3432, 12652, -8246, 4109, 8252, -10955, 9637, 4576, -4775, 4668, 1854, -6372, 9920, -3967, -4712, 12769, -10582, 2694, 4273, -9489, 2482, 4493, -7541, 2903, 374, -10541, 11116, -8980, -5095, 8913, -8395, -210, 3448, -7832, -733, 6302, -9953, 6673, -122, -8899, 11428, -7132, -3956, 7390, -2467, -1874, 6906, -7719, 1198, 7530, -10743, 9556, -685, -5656, 8887, -2768, -5513, 6289, -885, -2972, 9299, -10450, 3939, 5033, -10406, 6831, -195, -4606, 4936, 376, -8507, 7832, -3556, -1965, 8859, -11073, 4975, 3435, -7478, 2334, 3351, -5365, 6384, 1818, -7946, 10744]
1049A0744j6930P273P133j5617J1368J975j1171N692N149j2888J6322r625n679
1062f254J6359j7074O681N603j0662M099Q323j5045P646L116j3365J9512j3675
1075d736j370J2332j1044K57Q589r772K083J1869j8482J3393k791r145J7059j1199
1089b957j923J0727n622o392J3919j3761N811R896j8253J5133n139o710J1776
1102F505m279p962J3449n802o999J5166j7843J0357M403j3546J0749q98q731Q725
1116C294O34j3238J7758r662k605J1685j6412R350M221j0463N077O215j3343J0808
1130C319j003j1974J8140j2317K424P540j1806L884Q432j1706L385R458j6105
1143h329J4556n953p566J4297r784Q33P638q338k113J3153j5340N832O520j3459
$$ y = [10744, -6186, 1087, 8220, -7397, 3971, 5946, -5225, 467, 5616, -7272, 9050, -575, -6254, 10105, -6969, -288, 5315, -5347, -1248, 7075, -7970, -324, 2792, -10573, 8939, -4736, -6106, 6226, -4818, -4561, 4028, -5744, -3661, 8208, -10274, 3119, 328, -8817, 8242, -2957, -4880, 5847, 225, -6167, 7752, -6009, -198, 9698, -8555, 6578, 1439, -5271, 6505, 2226, -5736, 7713, 1911, -5088, 10078, -7765, 2592, 6995, -6551, 4198, 3300, -5431, 3294, 3928, -9310, 8448, -1214, -3819, 7866, -8546, 804, 5025, -5438, -361, 5854, -7489, 3319, 2316, -9658, 8482, -3835, -1411, 6129, -5677, -1793, 6639, -5067, -1682, 7776, -8329, 6227, 274, -7292, 7005, -2779, -1946, 5692, -2646, -4759, 8394, -6946, -1114, 5406, -8053]
1157h053J4645q088m776J0120m322n480J1867q570l014J4340j7289R395J483q432
1171f174J1067m026p245R610r14r931J5830j1780J890R849j4424Q644N42o669
1185c731P509K006j2546J2744k896r247J5130j2935N222N873j0802M241M520j0093
1199e005P038M378j5102J5704p045m629J0478j0806L904O367q695k08J0218j5120
1213h523R643K504j2795J5198p931k088P096o488j613J1960j0895j86J1728j6173
1227h563J1699j520p831J0758l757m919Q412m622o602J6378j4060L149P974j2494
1241e998R573k169o524Q186Q23j0390J2679p006n617J5338j4398N277M504q157
1255c879N129K188j0355Q951K938j3116J5886j0035j819J0757j0617L204N268
$$ y = [-8053, 6592, -1496, -6272, 3848, -474, -5954, 5913, -2657, -5671, 8669, -8620, 775, 2258, -6174, 4893, 867, -6378, 3232, 2318, -7613, 8217, -3563, -1673, 8176, -6248, 2396, 2938, -3731, 3778, 5784, -6762, 5982, 3086, -6161, 8969, -3966, 1256, 7129, -3673, 568, 5088, -5005, 2033, 6411, -8691, 7013, -32, -4661, 5817, -4989, -1085, 5282, -3413, -3621, 6597, -8523, 1120, 3624, -9171, 6027, -1904, -3992, 3104, -3384, -4997, 6963, -3932, -4118, 7610, -8563, 3136, 1616, -6215, 4543, 786, -4133, 4279, -343, -6945, 9433, -4627, -1478, 6496, -5998, 3575, 1406, -5118, 3068, 3891, -6499, 6180, -826, -6443, 8895, -5503, -226, 4278, -3879, 1250, 3438, -6917, 2034, 4972, -8144, 7742, -2293, -4112, 6645, -3972, -768, 4500]
1268D500o940K240P101j5274J1883O90j0590J3301q281m50O867o325j983R960
1282F699j0148L110Q266j6673J2580k217o313Q608m523k813Q173o425m811J3728
1296G241j3861O639M548j2352R615j636n183O118r24o827J3225r483l325J2699
1310F494j3033P479K178p823N606K080q316Q060o19r083J6119j1287p28Q408r117
1325c582M374L385o832L649N410j3027J1547l395o904J3867r769l52N697n562
1339a494k35P136j0161N316N434j3879J2730n447l852R224n443k570P511o099
1353a829j718J0432j4612R189L275j0675R539l652l873P110k345o130J1632r328
1367b985N84R423j4379Q809J740o720N037P83p515Q901l084p409J4275j1676K772
$$ y = [4500, -2440, -200, 6901, -8373, 3510, 4200, -6390, 6911, -1370, -1820, 5047, -1278, -3261, 6699, -3449, -339, 7927, -8746, 3834, 1617, -4696, 3912, -611, -3424, 4749, -1676, -6487, 7241, -6620, 19, 4567, -7785, 1830, 194, -4989, 1129, 205, -6622, 6603, -2880, -6205, 6494, -6539, 940, 3118, -4705, 901, 2981, -5335, 2725, 2106, -6977, 9142, -2145, -2873, 5535, -3582, 792, 4177, -2655, 994, 6404, -6623, 4924, 1529, -5375, 8492, -1277, -1629, 4068, -1494, -1729, 5407, -4754, 562, 5996, -7883, 4847, -600, -4452, 4772, -671, -3241, 4270, -1829, -3547, 6885, -7727, 1462, 4737, -5938, 3601, -51, -3924, 3186, 841, -5289, 6343, -2985, -2401, 7022, -7357, 1452, 3192, -3528, 1509, 2292, -5223, 3678, 594, -6815, 7460, -4216, -1444]
1382a444N957r995M667L657o627M012L137j1067J2640n994n224J2042q993K101
1396a131M815o585P39P077r880O697K117j0354J3104p163l113Q038m478j103O351
1411E131o826J2Q945j3077R527m66p641J0061m768l867O242j967m629R960j0427
1426c790L145O442j2356Q867q07n264O119n06p528Q538l555m103J1358j2418N297
1441e61M439q892M692J905n875N421J828r440J1248o908j911R640j0042M089L995
1456C628o267J312M963q779Q224l82q798J2458q755J65O318o130J76O970p395
1471b292J255N745j1238J0840l072n891R393n346j895N683m280k506J0011j0464
1485d057M238L887r970J0101k997m629O288j087n268Q062n847k160J0222j0904
$$ y = [-1444, 4513, -5482, -815, 2842, -3785, 227, 3364, -7703, 4937, -1057, -6281, 5761, -3232, -1131, 3684, -2901, -2162, 4915, -4965, 1732, 3849, -6505, 6599, -564, -3677, 4361, -117, -1220, 5131, -1695, -1683, 7262, -5815, 3712, 3246, -4395, 5666, 898, -2969, 3273, 1306, -3323, 6637, -3790, -645, 5797, -6559, 2308, 1501, -3763, 2356, 1850, -5678, 2860, -695, -4798, 6560, -5858, -561, 3878, -5014, -322, 1583, -4292, 1129, 2957, -6483, 4765, -2143, -4054, 5586, -4456, -367, 3628, -2639, -1327, 3636, -5143, 3081, 2699, -6099, 6359, -2396, -2231, 4087, -2043, -1867, 5103, -2292, -1037, 4708, -6530, 4310, 1238, -4653, 4740, -606, -2501, 3182, -1098, -3604, 6407, -4057, 181, 4068, -5902, 4199, 1202, -3427, 2861, 1774, -3494, 4568, -1279, -3439, 6783, -4121]
1499d121O474J092p641O841j38o279O046Q09p452J0457q744L85P626r190M582
1514G47K094n766K969L584j0025Q409r07o387J0068q392J620N341o171N85N187
1529B956p242L626M771j1707J0835l794k978Q086o793M9N355m678j707Q552r886
1544d555O395J633q929R314l750k240N830k929m137Q655o676r77Q052j0263Q142
1559C565q21o451O337j071m639O244j854n587J0684r396J944M647q244O730J88
1574B276n523M001K263q104Q728m174l456R760r229L138K581n466K977L908p814
1589d134N236K158r197J0557o390q68O805o240P43M407n870J048O531j0419P698
1604B065n6o543Q006n623l63N234l664k506P725p562J603N882j0079Q527j657
$$ y = [-4121, 2353, 3445, -4196, 2645, 2507, -3772, 2274, 3083, -4369, 6088, -2656, -2271, 5355, -3835, 747, 2841, -2925, 44, 3628, -6397, 2012, 1105, -5282, 4786, -3606, -1986, 3355, -2816, -2231, 2956, -4286, -660, 4111, -7596, 3239, -555, -3533, 4553, -2240, -2191, 3164, -1514, -3221, 5331, -4555, 1840, 3473, -5456, 3858, 108, -2132, 3698, 769, -3368, 5287, -1389, -2366, 5686, -4577, 3565, 2744, -3707, 2630, 1559, -3080, 3164, 1310, -4277, 6407, -2989, -1045, 3602, -4642, 2088, 2276, -3247, 754, 3017, -5087, 3641, -533, -3989, 5771, -3458, -320, 2261, -3205, -228, 3680, -4134, 1102, 3260, -5937, 4620, -1770, -2638, 4167, -2073, -1330, 3077, -2793, -1745, 4786, -5633, 2065, 2009, -4534, 3472, -2151, -2514, 2720, -944, -3450, 4275, -3287, -1684, 4198, -5881, 2646, 989]
1619I89l964N669l021l458P275l379l926R809r731M227L036p834O591j63m119
1634a999M512j85o904R604n307k297Q692r098M666J270n925L309L343o969O148
1649B860l67q079J0531o656j30N223n632K036L163o368J860N452r613Q585j937
1664I28n721Q552n909p7M139l447q96O925r076L325M735r005Q597k866l608O604
1680C200l253k966N512l589j279Q342j0267M782K272o606O066j366l170M785r92
1695A471o069R052o426J59P021q923N088N19m486L064J575n806O834j206o368
1710d501R510p759J921M373n816K438K950n310K452L194q790R606l324m091P275
1725D128n838Q84L624l893l71O191q292M542J495p963R389l920k019M329k914
$$ y = [989, -2975, 2694, -327, -3785, 3490, 111, -3815, 5994, -3737, 490, 3526, -4308, 2283, 2120, -1999, 2513, 2328, -4576, 5028, -279, -2576, 6116, -2982, 1684, 2954, -2971, 338, 3681, -3288, 2860, 2493, -5586, 4945, -1711, -1841, 3382, -2250, -214, 2949, -3419, -1559, 3893, -5720, 2865, 928, -4793, 3759, -2150, -2227, 1912, -1535, -2431, 4494, -4582, -1257, 3478, -5527, 3070, 204, -3404, 3200, -53, -3019, 2493, -1096, -2375, 5967, -4300, 482, 2754, -3852, 2214, 848, -2322, 2463, 1471, -4598, 4454, -1972, -1813, 5208, -3715, 1373, 1892, -2594, 470, 2045, -3761, 3073, 1867, -4501, 5009, -2750, -829, 3544, -2272, 166, 3116, -2194, 258, 3452, -5338, 4268, 944, -3147, 4128, -1710, -826, 2798, -1095, -1466, 4725, -3567, 975, 2470, -5493, 3896, -24, -2043, 2286, -628]
1740f28j951N551n411j12P316r463O093k20n627O519k089k891M605j515m395Q635
1756D417q079J697N813p958N453j53m193L698R44n594O883k523m027Q992q743
1771c373K875L535m813K555K046n326L689J896p668R161m778j891O840o753J299
1786g06L287l714L49M928q226O360J49p071Q240m297n85M271k609k429M880n033
1802b206J341M704q616P097j759m084N316j939j197L880k089l306P444q250L798
1817A34K308o566O163j067l388L090K88m564O867l923k408P774q484L909J327
1832A460m448L444J525n037L759O27n845Q564o086k09N727n955K052J934l608
1847b096J475M113p208N959j059n025P874n813P94L906l222q77M320n461K433
$$ y = [-628, -2579, 2972, -2439, -2551, 4765, -4698, 1395, 1175, -4452, 2067, -22, -2913, 1692, 177, -4218, 4417, -3662, -1965, 3848, -4110, 1343, 1190, -3003, 695, 1639, -3955, 2928, 405, -3622, 5370, -3373, -498, 3037, -1776, 779, 2825, -2501, 1188, 3084, -4584, 4577, -201, -2092, 4748, -2005, -706, 2581, -1133, -784, 4144, -4082, 2278, 2427, -4644, 3596, -701, -1286, 2985, 376, -2053, 2827, -2206, -865, 3839, -4777, 2320, 561, -3523, 1793, -146, -1343, 2537, 448, -2858, 4586, -3664, 134, 2442, -4124, 2039, 972, -2416, 674, 962, -3602, 3265, -658, -3066, 4708, -3776, 133, 1460, -2988, 456, 1981, -3056, 703, 1330, -4515, 4049, -2037, -2246, 3481, -2474, -422, 1512, -2096, -621, 3492, -3716, 2243, 1184, -3841, 4033, -1780, -986, 2920, -302, -1179, 3141, -2320, 113]
1862A13L849p693P213k719k720M883k953j487M332k293k512O549q070M136K001
1877B629o478O254j841k347L065p09m370O992m470p99N910q062N060L67m210L356
1893C47J101m410M024m96n179Q472o232J270L740n516K765J558l439J208L504
1908B717o569O717k272m134P188n816J772K634l399Q2M247n841K506K756o684
1923d096P653l845j824M554l076q83L978l050r48N785p757M911K37m683N911k704
1939A63j453L035r76l652O425n176Q14M992p344M900p08k853L176nl529M292j125
1956I76m356P308o586K505K795m995K921O69l240K175J808o034O911l355k198
1971b696N461n932K883J638k877L83L451n554L618R38n522P435m524j24L172l422
$$ y = [113, 3962, -3731, 3482, 763, -1957, 2926, -27, -1514, 2818, 525, -1987, 4562, -3508, 628, 2629, -3849, 2405, 564, -1783, 1282, 573, -3797, 3195, -1275, -2074, 3836, -4226, 834, 1201, -3009, 347, 1448, -2962, 1062, 566, -4613, 3859, -2373, -1103, 2637, -2879, -114, 1444, -1995, -787, 2717, -3852, 2865, 593, -3541, 3647, -2169, -397, 2237, -1162, -1080, 3167, -2674, -168, 2588, -4096, 3557, -288, -2112, 2442, -634, -1517, 2461, -589, -1537, 4248, -3509, 1402, 1639, -3044, 2867, 163, -1290, 1745, 769, -2883, 3542, -1634, -820, 4172, -3172, 1728, 1020, -1833, 1343, 1338, -2191, 2101, 976, -3380, 3928, -2658, -153, 2642, -2353, 568, 1237, -2003, 172, 1980, -4054, 2857, -498, -2696, 2765, -3167, -284, 1354, -1523, -1140, 2311, -3243, 375, 1313, -4209, 3226, -1298, -1422, 1750, -1672]
1987a672L06L369l176j48N106p539N695j144l831N680l195k58K685j554k391N833
2003C766n739J791L614o564N771k232k185L218k48l185M660k444k630O504p013
2018b916L471J412m121L464l48l083K946R87n266O727m505l98M902n973K918J190
2034A407k777J229K474n754M767j77m724P109n113P80K742l447K71L157l809J352
2050e13L379o772N991j968k715M640l281J09K617k094j572M996n763L267J895
2065B216n681N514k207j385K605r35k210M732l401j190N605p040M792j33l176
2080a894L482m65k650K769k01l828O817n239Q63L685n492L366l9k326J689K141
2096B678n272M763j680l304O412n397J786J588k677P00K031l755K272K169n960
$$ y = [-1672, -1366, 2003, -1173, -1321, 3785, -3754, 1941, 797, -3034, 2646, -549, -807, 1878, 324, -2067, 3766, -1973, -182, 3432, -3132, 2639, 407, -1778, 1440, 1192, -1993, 2667, 223, -2407, 4097, -2916, 555, 1967, -2154, 1310, 962, -2121, 825, 1812, -3454, 3273, -1232, -1630, 3272, -2701, 217, 1407, -1370, -141, 2333, -3421, 1346, 1169, -3555, 3554, -1559, -779, 1963, -1484, -1213, 1944, -1865, -513, 2866, -3906, 2085, 117, -2598, 2042, -1239, -1130, 1487, -607, -2179, 2817, -2946, 321, 2216, -3465, 2049, -158, -1543, 1062, 127, -2083, 2649, -752, -1942, 3663, -3377, 1415, 1282, -1894, 1588, 1123, -1527, 1242, 1041, -2787, 4030, -1209, -346, 3339, -2153, 1213, 1174, -1152, 537, 2678, -2594, 2169, 489, -2815, 3597, -1800, -14, 1574, -1103, -403, 1628, -2127, 145, 2314, -3646]
2111c646O253l463j291M237l736Q04K162k310o25M249o302M514O81m830N655l309
2127i57m50K271j197j854M605l668J24M095o683N014o69k464L304r21k249L233
2143A534j109l157O463n682J965K322m945L647m27j953J849J384m534N236k639
2158d6k115N380n316K647J051k870J153K259m112K674J326m905O233m268m43L446
2174B094l447J190K045k712l9L801o065M556m78l454N311l848k09K307j269j580
2190a797M284m370J170L316o344N475k001j914L295j073k207L404j521k274N399
2205B842n793L057J313l926L445q66j700J940Q31l805N005l080j041M473n194
2220b499L373L83k271J141J435l606L180N42m362O256m745Q02K537l725J571J866
$$ y = [-3646, 2607, -856, -2147, 2090, -1646, -842, 1320, -990, -1615, 2634, -3668, 846, 1527, -3303, 2352, -957, -1407, 864, -333, -2187, 2418, -1250, -1126, 2969, -3714, 1300, 631, -1833, 1471, 550, -1699, 1534, 425, -2732, 3731, -1951, 14, 2336, -2609, 1038, 611, -1342, 507, 1891, -2643, 2593, -46, -2161, 3219, -2097, 550, 1601, -1269, -116, 2143, -1969, 705, 2031, -2874, 3359, -909, -1352, 2094, -1353, -163, 1882, -830, -869, 2932, -3133, 1423, 945, -2509, 2802, -1046, -1255, 1052, -217, -1797, 2487, -1883, -713, 2603, -3741, 1734, -267, -2181, 1114, 41, -2166, 1238, -283, -2557, 2842, -2951, 106, 1419, -2507, 938, 72, -1628, 312, 1143, -2662, 2343, -737, -1778, 2695, -2499, 874, 1257, -1014, 127, 1562, -2044, 1136, 1678, -2684, 3572, -1173, -371, 2166, -1559, 12, 1878]
2236A878k527K51L085n587M981j799k278M934l807N37J470j758p32L820m417J904
2252d5K177m981M772k283j170K674j053j500L098k406r84M657o018L964M15l438
2268b121L360j026j884J970N51l600N591m180j00L847n395L878m11j984J849Q35
2284A180l727L601q71k707N426m684J519J609k955J440J266k366J351K017n218
2299c119N114k250j257M152l854J273J423j896l81L061m076K770J026m267N056
2314B775l000m25K353j730q78K936k442o92L873n415M101o65k772L584j680q89
2330i66J707l81k606N034m475J297K088m214L565o99j378J201O17l073L482j420
2346b21j956M698m719K518O10k333J320J286k760J452J648m616N503l677j80L188
$$ y = [1878, -649, -398, 2687, -2900, 2081, 282, -1996, 2938, -869, -332, 1138, -620, -1352, 2468, -1949, -45, 2132, -2849, 1923, -360, -1530, 1144, 91, -1409, 1689, -717, -1701, 2956, -3062, 902, 1317, -2121, 1239, 213, -1671, 299, 850, -2750, 2841, -1339, -1439, 2408, -2987, 891, 480, -1504, 345, 1180, -2547, 1054, 183, -2524, 2902, -1782, -263, 1346, -1609, -169, 1097, -1269, 82, 2099, -3119, 1995, -255, -1512, 2640, -1214, 59, 1482, -414, -795, 2266, -1810, 960, 1986, -2281, 2775, -225, -650, 1703, -27, -905, 2031, -411, -1103, 2770, -2645, 1456, 791, -1981, 1603, -77, -966, 741, 360, -2246, 2788, -1687, -390, 1698, -2516, 1049, 350, -1028, 173, 790, -2283, 1199, -221, -2177, 2521, -2198, 320, 930, -1403, -83, 1203, -1557, -105, 1543, -3073, 2430, -1247, -1427, 1761]
2362A761l324J679R26j806q4K770m834L977J84l548M550l223K97K183j382j100
2378i74L365l439O99K690n211M864j376j658K825j836o41K098j003j919M284m265
2394a497J933J264l884L829j506o27J366O4k649L496j991j685M597m883L013J35
2410I75k331J745K73k000K016M66l693N308m138N09K326l127J610N59j590L32
2426g60K162m168L717p31k605M465l630Q93J332j367j8K331l044J236K039m730
2442b878M724j890j226L030k187l34J947j586q75L998m463K617N77l396L918j986
2458a0n04J421k38k200L606k693l45L624m817L260k91j707J756j09k225K470k85
2475G13k782M628l802Q03J829k994K037O05k103P70J696l642L798j676j533L972
$$ y = [1761, -1563, 116, 1042, -764, -848, 1922, -2912, 1065, 1249, -2299, 2251, -972, -675, 1508, 126, -974, 2391, -1048, -349, 2341, -2870, 1994, 618, -1040, 1785, -51, -692, 1406, 403, -1516, 2768, -1497, 436, 1700, -2184, 1645, 139, -488, 878, 942, -1707, 1789, -202, -1887, 2710, -2173, 840, 975, -1356, 389, 662, -1338, 678, 1144, -2549, 2759, -1379, -870, 1456, -1671, -61, 498, -1092, -760, 1402, -2766, 951, 220, -2385, 2080, -1550, -657, 675, -692, -710, 1621, -1423, -187, 1852, -2878, 1846, -44, -1270, 1760, -427, -761, 1186, -400, -1275, 2723, -1740, 877, 1454, -1942, 1976, -10, -514, 907, 669, -1531, 2075, -618, -963, 2661, -2156, 1104, 813, -894, 862, 753, -1472, 998, 713, -2069, 2559, -1243, -440, 1389, -1605, 432, 1037, -1066, -296, 1400, -2242, 1556, -120, -1653, 2319]
2491B319l875J451O67j456J60K172l032J622J233l883M427k672k5J846j577j2
2507f35J534j711l36L219m230L187Q7l230L856k119m78J582l82j730L395l249
2523a240M25K901m384L770q49j324J472j16j952K500p42j849L975m171J625J194
2539A235k553K150M7j622J256R79l636M032j808j383L576l494J665M76j755N89
2555b46J608l027K225L89l283M339l104K43J831j816L31J257j707k11L017m281
2571b435L559q36k209L115k178L17J640j071j333L292l273R81J899l641L565j309
2587H3j076J623m40j582K482j530r49M001m426K315K29k177K245k13j375J200
2603D10P27k966M089k909J15K555l454K145k9j460Q48J454l035K589j62k614L873
$$ y = [2319, -1556, -105, 562, -894, -734, 1438, -1594, 28, 1261, -2622, 1805, -867, -892, 954, -623, -635, 899, -812, -1148, 2071, -2159, 1028, 1115, -2115, 1741, -378, -856, 726, 344, -1386, 2009, -1240, -815, 2086, -2298, 1472, 623, -701, 771, 655, -1297, 1203, 461, -1388, 2587, -1584, 41, 1235, -1318, 832, 879, -743, 513, 1492, -2144, 1888, 80, -1303, 2273, -1221, 444, 920, -835, -246, 1362, -1665, 560, 949, -2334, 2005, -1099, -856, 975, -841, -510, 747, -960, -1171, 1846, -2435, 1124, 288, -1921, 1194, -984, -667, 973, -98, -1431, 1861, -1412, -431, 1468, -2173, 1392, 83, -993, 630, 190, -1392, 1090, -440, -1389, 2612, -1814, 501, 730, -1447, 798, 585, -790, 410, 1137, -1829, 2260, -649, -534, 2021, -1433, 712, 683, -777, 71, 1525, -1510, 1079, 917, -1697, 2176]
2620B176l218O07J931k178O97J513k348O16J931l994L550r76j598K780k221J11
2636f21J365j074n82K739l506J661J255l488L430j767l12J565q23j270K390j486
2652e24j002L379l997K636j20j762K260m58j531J777K27k956M048l077N36J882
2668A318k774K203l45j075N26J231k801L054p84k034L485l219J264J183j842N07
2684a03J400k002J012J341l277L530j768r17K294k114L79J194j035r03K999l468
2700a438J983L48k780L460j972N2J199p02j344K556k201k8K760l649K925r03j412
2717a146J600m11p73J153m7k105L614l341R97J520k812K358m84j054P98P09k290
2734a714K821j186j470L312l400J942M38j662Q86J013k013J486N47l093L749k270
$$ y = [2176, -1042, -435, 1496, -682, 15, 1528, -820, -204, 1727, -2267, 1283, 307, -1291, 1489, -732, -621, 744, -330, -912, 1827, -1679, -18, 1237, -2251, 1179, -588, -900, 665, -158, -1428, 962, -524, -1526, 1853, -2144, 492, 372, -1390, 870, 412, -1119, 658, 885, -2071, 1977, -1100, -564, 1318, -1456, 747, 402, -673, -147, 1084, -1717, 1337, 553, -1481, 2004, -1215, 49, 1232, -610, -103, 1297, -705, 307, 1648, -1629, 1901, 133, -784, 1510, -604, -225, 969, -66, -969, 2030, -1438, 545, 893, -1887, 1573, -399, -347, 852, 150, -1194, 1362, -839, -867, 1893, -1756, 1169, 266, -1146, 454, 43, -730, 423, 376, -1729, 1885, -1456, -459, 1061, -1751, 607, 123, -931, -133, 576, -1714, 1107, -79, -1549, 1763, -1637, 305, 743, -919, -33, 980, -1033, 453, 1000, -2093, 1656, -614]
2750f14J17J902k265Q14J063j285k8K076l259K453j72k271L039k011L74Q90o76
2767A47r72K344k359N53K150l406L057j595o44J671r60o85J745r56j154L049l476
2784a491J677O14k171K192q42o64N52L69j952K826j823n50K661l109J942o7q57
2801f93O39O80k011J738L64k696L536k672O37J501j870P58M24j020M74J665k891
2818a437K515r45j414K785k310N31R47n75p68K216k388Q80J403l227L323j535
2834An11J206m30p60J578j036p87K990l844K122L86k125K217o94q79R86K15k036
2852a401L079k315L3K487l343K059l70j027Q50O32j766J598k15k081L391l071
2868a460J290J195j934J074L95j266M44J440l112K928j312r66K454k187Q49O30
$$ y = [-614, -497, 1405, -860, -46, 1017, -268, -296, 1780, -1479, 974, 802, -1469, 1570, -441, -67, 823, 147, -825, 1519, -840, -287, 1863, -1543, 1514, -81, -725, 946, -14, -699, 1046, 90, -1064, 1985, -1491, 186, 800, -1371, 821, -21, -685, -133, 236, -1716, 1110, -713, -1263, 1398, -1711, 231, 164, -693, -54, 626, -1385, 353, 717, -1979, 1557, -1115, -478, 1023, -847, -89, 335, -685, -211, 1454, -1437, 1078, 133, -1281, 1504, -806, -275, 672, 97, -671, 1545, -843, 37, 1440, -1787, 1536, 1, -510, 696, 266, -494, 1084, 48, -739, 2251, -1593, 529, 915, -1210, 1007, 313, -566, 420, 635, -1401, 1678, -637, -604, 1883, -1460, 599, 229, -798, 52, 684, -1082, 516, 301, -1780, 1611, -1460, -170, 1025, -909, 165, 560, -706, -262, 1178, -1934, 994, -318, -1284, 1170, -1017, -168, 462]
2884D62q15k89J777k622J651N23k653L410k013J86J063p36o42J675j179l63K325
2901A760l107K446p52j323K003q66m66J028m49j277K448k204P68J412k788K418
2917A051j036l21O45J98j345J980j245j262L341l551J953L05j358Q63L44j478
2933i16R27P85k681L378k204Q1J758k359J274L38r17M9J556k598J798J99k202
2950a734L082k143M64Q53p73j76J060j441J11J829l114L129j376o81J672j089
2966c27n0J125o81j219K762k590J193P65k259K520j067n87P55K96j363J974j035
2983B12j040K673l372K160k93j078J386n8j350J186N95k355L046k081j11J970
2999A490k300J215j60o11l4J561k434J892n16j370K923k528J032M01q52k16J486
$$ y = [462, -353, -642, 1135, -1487, 164, 687, -1966, 1444, -569, -383, 680, -56, -698, 977, -202, -565, 1760, -1347, 1099, 347, -976, 1027, 161, -305, 723, 274, -1003, 1445, -759, 9, 1421, -1367, 1051, 15, -306, 339, 537, -808, 1172, -73, -1335, 2006, -1545, 408, 713, -645, 218, 562, -916, 11, 796, -1885, 1493, -711, -630, 1128, -1231, 43, 381, -536, -487, 1069, -1529, 269, 468, -1734, 1348, -795, -331, 522, -251, -427, 633, -808, -697, 1132, -1982, 1147, -229, -910, 762, -327, -377, 748, 67, -1152, 1610, -980, 213, 978, -1281, 1239, 172, -415, 340, 636, -727, 1247, 212, -828, 1845, -1527, 633, 340, -738, 648, 590, -760, 426, 1021, -1334, 1712, -369, -480, 1490, -810, 405, 245, -366, -400, 1161, -1273, 619, 103, -1267, 1656, -872, 160, 561, -291, -507, 979]
3016I79j901M74J679l193L044j680k54J432r68Q0O18n60r42K761l261J985K75
3033E68k094K582j193m84Q81J08j574K424j755k72K184k979K232p31m32J147j79
3050D33j351J180L56j793L093k927R32J250j938J381l56m60J20J434k557K314
3066A111j134r52K523k423J236N37r18Q6J038j944Q19J113k472K863k134L54J250
3083I53j293J5R94p58r38K310k846K151k35j455K087j654L95N47m1j363K310k012
3101h33L17J474k673K474q70l37R26k64j027J435j080o82K789k674J024M96j552
3118a057J733r42n83J109L90k031K559j112o93J863k469J883j13q02Q25m85q73
3135g98R99J006k045K694j974o37K014j877O39K31r17M23J957k776J596p53n51
$$ y = [979, -922, -448, 1231, -1962, 1082, -598, -852, 580, -388, -308, 310, -250, -1192, 1569, -1692, 293, 568, -1526, 1056, -137, -621, 260, 368, -1206, 1218, -537, -809, 1375, -1604, 628, -103, -535, 612, 433, -918, 262, 618, -1175, 1918, -1009, -77, 1173, -765, 616, 260, -200, -80, 1354, -1203, 1111, -23, -975, 1548, -875, 361, 898, -20, 66, 1104, -840, -21, 1092, -1380, 1483, -651, -297, 953, -340, -325, 669, -89, -1027, 1283, -1563, 588, 353, -1102, 985, -669, -274, 273, 232, -1131, 1179, -833, -516, 958, -1715, 759, -111, -448, 478, 214, -813, 622, -458, -1140, 1649, -1025, -1, 495, -1057, 676, -266, -849, 260, 650, -1381, 1178, 66, -627, 1236, -1233, 650, 537, -265, 560, 75, -798, 201, 1207, -838, 1856, -118, -755, 1259, -618, 21, 252, -665, -242, 1715, -1061, 535, -218, -769]
3152g69J848j251l8O17m28j093K195j928O21J362k450K204j363j18Q39j98q51
3169h01J182n24j132K670k866J843q4j233J230m04n14M93O51j646K476j777j19
3186e55J691k290J568q5q41N08O55j545J633l49j656K725k247P94L71o72L04N12
3204E21q33M66J167k662K380j057l82J429j163L51N3p1q80J942k239J371M57k076
3222a226K483j344L1K75j18o95J438r47n65J908k849K446n90j167J008J73j271
3239a010M71Q18j657K751k248N38J272k235J656m35k16P4Q43j708J650p85j062
3256a283K587k451J307J74n25M1M74p93L44J070k451K724j698n3J171j237O63
3273F4J24j82m30J604k064J354%j437K230j660J37M37K9o62J375j307j32J931
$$ y = [-769, 1079, -172, -210, 407, -21, -1114, 1081, -847, -226, 1136, -1314, 890, -473, -591, 248, 50, -801, 381, -143, -1275, 1395, -1471, 372, 288, -945, 285, -119, -633, -140, 511, -1135, 1341, -436, -555, 1136, -1154, 414, 329, -512, -4, 651, -894, 739, 390, -1266, 1459, -788, 6, 377, -295, 9, 521, -312, 154, 1321, -1341, 1039, -18, -400, 1029, -134, 217, 270, 199, -681, 1261, -978, 393, 850, -1226, 1257, -87, -56, 219, 101, -594, 844, -103, -668, 1240, -1609, 837, 247, -920, 88, 261, -1010, -539, 279, -1378, 1373, -875, -337, 935, -1300, 356, -79, -295, -221, 622, -1086, 564, -221, -1283, 1304, -1147, 160, 334, -191, -150, 324, -469, -125, 945, -1506, 1218, -480, -533, 638, -599, 64, 188, 6, -424, 1180, -884, 470, 470, -967, 1263, -397, -260, 177, 206, -456, 919, -388, -520, 1411]
3291A411k703K295q90m30R89l95o29Q29r9j304K303k201P13P79j800J695m71l78
3309b86L06M29j314J547q49o71J979k415J446l18j30N3N61j092Q91M83k178K713
3327A155j825K65R59j303O49K57n58j4J307k009J707k65j155J734j822P95J84
3344F1q1l58J194j121oJ246k283K187j243k25J729o04n97N01k77q91K125j810
3362d53J250L46k745K638j016J20o7P87j817J772j657J99K200k660J473l2p10
3379c72L93M69j176R73K33j750K589k179Q18O50j305P13K41p71K27J025k208J965
3397E35l95j124J971j845P02K19m87J16R21j126M02P97k040K289j383J15Q66p64
3415b31r5Q37m76m62J451k071J698j80j200J394o34k64N60J18j266J879j363J15
$$ y = [1411, -1292, 1003, 113, -317, 672, 277, -352, 477, 378, -926, 1377, -824, -111, 668, -1132, 563, 92, -286, 20, 449, -865, 682, -167, -838, 1141, -1274, 172, -146, -276, -223, 338, -754, 137, 620, -1558, 1155, -670, -405, 554, -749, -100, 157, -401, -415, 892, -1117, 590, 325, -830, 904, -918, -123, 61, -20, -378, 816, -305, -311, 935, -1348, 839, -404, -629, 1100, 496, -101, 400, 123, -768, 1357, -453, 797, 1143, -1602, 1036, 20, 140, 73, 860, -957, 815, -842, -643, 1557, -1103, 370, 338, -372, 21, 490, -686, 287, 520, -1230, 1359, -820, -2, 648, -657, 56, 297, -474, -247, 778, -1430, 535, 140, -984, 987, -858, -156, 63, -424, -308, 613, -513, -111, 686, -1354, 935, -448, -333, 533, -231, -326, 511, 35, -427, 1024, -1047, 651, 471, -729, 665, 31, -233, 327, 445, -821, 1058, -305, -190]
3433a90J272k154J862n48o63O88L83r78Q53lj376K294k169J044J93r54M69L16
3451C39l34l60J135j913K050j141l38J515j769R26J36n33j56R75j302R01N59j757
3469a067J919j337J72O62o77O6N65m64n09J558j960J546l01q57J309r93j43O34
3487A23M09j589K020j541N58P98k015K112r55m32L70J70p02J540n14j226K458
3504A584k287J281j40j333J392J06j469R0J829k196J557q53l26J383j154J083
3520E47l72j24k81J166j297J030q68j248K355q60L59j07k43j42J37m64O8P49j467
3539a062J444n62k86J157j130M32P8K58j236J572j248L55P33j777K193j316L9
3556c56M15l13o01J374p21q06J866j747J474k96r21J129l09r88J059l9j284J923
$$ y = [-190, 1082, -1072, 790, 242, -421, 267, 650, -328, 525, 522, -854, 1440, -729, 315, 508, -446, 23, 339, 5, -355, 780, -1133, 917, -224, -562, 953, -816, 110, 246, -287, -443, 532, -770, 131, 690, -1067, 852, -485, -313, 349, -328, -262, 303, -161, -670, 888, -1072, 474, 173, -684, 625, -368, -511, 123, 532, -1057, 963, -578, -20, 778, -1237, 875, -80, -512, -142, 28, -674, 866, 352, -874, 1584, -703, 578, 438, -895, 497, 603, -866, -776, 1053, -1143, 414, -439, -765, 618, -536, 547, 175, 51, -230, 936, -361, 669, -199, -1447, 908, 48, 407, 300, 57, -85, 52, -412, -344, 405, -1062, 382, -180, -466, 691, -439, -7, 71, 329, -907, 665, -583, -228, 505, -1272, 921, -395, -356, 59, -254, -855, 519, -202, -1008, 858, -889, 585, 289, -632, 497, 188, -800, 259, 220, -1064, 859]
3574H59j544N30P61p11K14L83o57L16O39j731J649m58r13J562j276N24J36j90
3592I3j3M28r03M22Q22j786J948r56k04K04k24p3O37m88n46J884k123J028J20
3611B70j115J313q01Q9K22K66o18J012q05q13K139k020J231j7q61P60m80n8O07
3630C21O6j713K277j863O79O31j193R15L3l21nP35j432J519n99p21J595j834R43
3649C3K75l75j10M30n44N63L00j402K076j120n63Q15o85M98R8q1p93J155j218
3668f48R42L63j190J110j009J33M77J25k02R45j172p3J225j694R46n26m9O51l08
3687D6m33L66L72j057J635j844J250K26j097Q34k99k85J02M58j188J390o49n9
3705b32J072j662R77j45m7m14R19j066Q05K9j178J987j667O08M17q67L87L42m09
$$ y = [859, -685, -155, 606, -105, 109, 492, -165, 151, 790, -941, 708, 250, -663, 899, -377, 147, 283, 93, 80, 508, -395, 27, 849, -937, 1011, 55, -149, 55, -169, -242, 395, -93, -639, 1245, -878, 150, 270, -845, 468, -333, -244, -22, 244, -374, 638, -167, -980, 1159, -861, 370, 353, -508, 252, -228, -286, 321, 387, -1326, 951, -912, -233, 398, -795, 120, 153, -168, -173, 562, -870, 649, 50, -671, 924, -910, 33, 308, -67, -177, 253, -291, 272, 572, -830, 1246, 126, -437, 378, -307, 191, 289, 208, -585, 570, -648, 294, 657, -533, 577, -432, -299, 178, 303, 101, 1046, -126, -199, 1026, -668, 278, -248, -297, 354, 46, -387, -21, 351, -706, 929, -915, 335, 561, -536, 298, -1, -286, -184, 274, -914, 476, -173, -232, 840, -822, 155, 10, -37, -451, 468, -598, 207, 236, -942, 1045, -622, -14, 403, -464, -77, 265, -144]
3724a44L2P24j344J282m52p01J381j175M80J08r3m52J280j290K59O83j289J475
3742G64q08j63M28m0o02J198j012k98J480j485R13k50o35R50n62J0L09q3j010
3761h96J756j097J58O72j461J021N2m15l44R38r66J101l74j308J962j407M61L85
3779B38n28L52L13p67M32O12j548J514r52k29J049r43M21m4P6l22J107j488N70
3798a37N90j406J620p42J9L65l18k49P81k17o36J331j367P04j81m81O35l10j89
3817a88M92J30j139J636j423O73L65j239J265o18LN5L21j103J275m35q11J533
3835G92j623J113m6o05L21j2j96K1Q43j611J518q38q5J032j067M09J95l55j75
3854c69Q11j053Q71k47r51J638j014L43L81m83l97R66q15q4J133j664J561n16
$$ y = [-144, -112, 612, -732, 550, 98, -603, 778, -397, 83, 191, 98, -354, 926, -364, -105, 578, -711, 764, -44, -207, 221, 181, -421, 777, -235, -533, 947, -538, 375, 125, -510, 440, -122, -112, 197, 114, -896, 860, -237, -79, 593, -868, 153, 205, -210, -554, 384, -582, 519, 145, -1163, 799, -608, -147, 238, -290, 62, 375, -392, 40, 652, -896, 618, -334, -563, 486, -457, -36, -80, -4, -326, 781, -707, -137, 453, -953, 667, -75, -56, 309, -9, -258, 523, 306, -330, 1001, -366, 338, 157, -324, 311, 1, -188, 304, 434, -705, 931, -492, 181, 546, -693, 572, -46, -43, 12, 333, -770, 505, 70, -741, 792, -831, 282, 236, -369, -48, -60, -256, -235, 608, -1003, 515, -323, -408, 624, -443, -34, 161, -194, -369, 442, -611, 260, 13, -938, 700, -314, 29, 410, -73, -470, 496, -319, -403, 730, -934, 627, 111]
3872A11n46O89m27J01K37J32r32J722j462L35P69j276J050l94j11K12L02j078
3890e66J225l65o18J273j612J360n58m01K01N89j092N72M78j453J922j131L9O20
3908D83j017O45M7m27j42R82j652J458j61j019J261p49L59R0n61j76Q92p55J85
3927b57Q24j379J369n90j80K81q4k40N26r2n17J039j404Q88J08j086J235n07J0
3946e6J08L64q96J095j049M6P80r93Q53K06n55O4K39n99P65O4q63J377j528O67
3966H9K73p20O02J62k49k28P20j295Q19p2o10J005j209O73L12o79N81l95j20J59
3986a82J227k454K339j631P87J070j410j96L83K39q74J647j703J217r41j37P31
4003A12m26K81N3q5o56J248r89Q8Q75j089J114k97k11J98Q9n93O15j32r70J758
$$ y = [111, -435, 254, -173, -72, 165, 297, -635, 1087, -375, -40, 729, -547, 503, 109, -2, 210, 512, -566, 659, 294, -324, 949, -663, 697, 139, -262, -61, 528, -564, 8, 486, -967, 955, -176, -137, 483, -534, 111, 158, -269, -411, 571, -1081, 377, 216, -803, 458, -291, 68, 158, -403, -579, 313, -442, -257, 567, -812, 557, -33, -213, 68, -16, -256, 270, 178, -339, 700, -704, 184, 292, -794, 441, -66, -56, 52, 416, -480, 615, -434, -388, 392, -601, 252, 458, -97, -33, 206, -393, 372, 436, -427, 950, -578, 89, 362, -358, 244, 406, 157, -71, 649, -646, 173, 101, -509, 496, -713, -40, 272, -407, 174, -221, -341, -182, 1045, -1409, 930, -701, 86, 1156, -254, -450, -67, 172, -702, 945, -758, 459, -482, -619, 112, -314, -33, 20, -65, -721, 527, -462, -374, 501, -588, 526, 229, 18, 216, 305, -288, 327, 195, -775, 983]
4023I83j721J058L03j461J315j61j49l36P30j024J064p26N2R36j012L25L37q26
4041c13K53P37j188N71J19k56J135j810R50K12l26j93R7l9k24J441j923J840j097
4060a4n62J184j796P71N46L64q25O66j127J130l54j105J109L27p53J71N06o53
4078d15M43j40p34J756k004J268k91J1K72m90K28p3N43r32J201j052K31N27j040
4097f91J059m25Q7J24N84j092O08K32r56J245r56N04j23j39k56N60n65P5Q46j475
4117g54J190n55j30N18n74N31j87K5l16J279j447M29K89r66J208p46J21L32k90
4136d3m31J024o58m52J351j591J151m67l48O72r7k01J18K11q04J192j365M18M83
4155A63o21Q98o42j08J47N62j055Q27j64n94J087j189R85r6k31j13K81l27K9N99
$$ y = [983, -738, 320, 623, -838, 477, 316, 167, -169, 561, -463, 601, -125, -73, 863, -149, 176, 513, -313, -60, 677, -511, 60, 179, -77, 1058, -752, 198, 410, 84, -109, -12, -51, -275, 1166, -757, 1083, -14, -576, 608, -1188, -417, 129, 493, -332, 334, -793, 337, -17, -1122, -13, 314, -439, -268, 238, -415, 28, -112, -846, 910, -1094, 174, -117, -106, 166, -324, -96, -169, 374, -558, 643, -409, -178, 349, -691, 368, -57, 30, 154, 738, -354, 254, 486, -470, 775, -181, 323, 200, 61, -195, 365, -200, -125, 721, -754, 436, -119, -249, 269, -305, 226, 39, 64, -252, 1027, -420, 9, 298, -668, 540, -206, -85, 247, -43, -474, 550, -108, -560, 791, -800, 351, -116, -464, 208, 111, -90, 28, 239, -565, 627, -738, -320, 163, -458, 440, -202, -310, -163, 399, -656, 171, 7, -587, 500, -689, 296, 200, -31, -144, 137, -190, -161, 438]
4175D38j254J662j025R4N02n87K46L15j62m79P61j031J055j10j050J205p53L71
4193A98n9K12n04O44n72n2O27j004J104n69k54L05p0k11K97N0p21J333j380P64
4213A38N0p05O56l50j03L33J98p64O20j73l71J065j189R77l40l86J71L81m63J12
4233a43O43j268J381j114L90K89m36K96j62k6j14Q16j112J095m51k07P77q84K60
4252C0K6K92p66Q63n73K22O32j282J042m08j68K40l09k64P74J12q30J055j367
4271f79P36J31m31N85k01P7n37O73q26J190q11j11O96j166P85j5k71K47M73p94
4291b49K72R8p17J103j202N37L80o04M52J4l84K4P35j054R27k21n83P15o53M66
4311E6j12j68l5O24r54N02N40j107J234n73k50N07k71k02O39j62o30R63j059Q73
$$ y = [438, -816, 846, -179, -85, 417, -170, 76, 391, 229, -250, 511, -520, 535, 425, -625, 580, -173, 198, 139, 351, -153, 491, -81, -133, 494, -510, 594, 25, -229, 76, 6, -205, 92, 142, -579, 754, -626, 138, 188, -517, 139, -211, -314, 19, 217, -547, 73, -100, -471, 594, -595, 382, 42, -344, -173, 208, -255, -143, 500, -768, 613, -501, -111, 178, -258, 38, -124, -150, -264, 552, -560, 535, 84, -123, 654, -230, 30, 56, 348, -418, 445, -128, 94, 726, -556, 486, 78, -90, 150, -159, -423, 351, 463, -367, 688, -679, 57, 188, -243, 342, 141, 218, -319, 354, -472, 718, -93, -204, 492, -674, 111, 96, -175, 72, 545, -249, 23, 121, -596, 507, -695, -158, 222, -382, 70, 84, -300, -276, 459, -595, 332, 111, -472, 243, -410, 56, -56, -224, -259, 365, -589, -87, 453, -654, 580, 7, -243, 264, -7, -209, 430, 268, -362, 601, -458, 415]
4331D15j93m43N91m24J8N7K29m49R06j026K03P87j026O16j66o0j72N02o84L78
4351E9L27q47R84r89M82J51m54J88O4j61L08J35p21Q96o68k07P75n26K92J3M4
4372A45n08P50p55K76N64r89J083q54K59J38j23m84P04k88j92O69j068J184n42
4391c1m94Q18l60j68L75O7n29Q89q09K15L41p75Q29m24K40j48M91n55M02l76k25
4412b27R18r99L53K46l71K32J31k86R5K16q06Q55o22M0P75p05N70m65N2l38Q26
4433D90r16Q98m29m29Q49o49J25J38l45J42M48o84l5Q47r47Q19n17j9K53n2l4
4454d7j12K29m36J077j203O12O4n83P33l60j38L2L32o27Q41l54m85J159j414J197
4474E17n96K21n3K12l33lL53o71J034r93M39K92n78L54q5n9r2O19r78P15k94j97
$$ y = [415, 222, -221, 370, -54, -36, 21, 250, -199, 707, -319, -116, 671, -355, 261, 95, 35, -137, 365, -319, 59, 386, -461, 523, -466, 16, 167, -287, -99, -35, -196, 112, 247, -474, 422, -246, -453, 322, -204, 88, 101, 145, -363, 387, -368, -92, 472, -517, 566, -288, -29, 109, -14, -498, 206, -82, -274, 395, -673, 511, -31, -525, 293, -67, -235, 140, 207, -322, 567, -242, -27, 314, -461, 368, -56, 184, 36, 527, -28, 374, -2, -227, 691, -308, 45, 291, -80, 152, 283, -3, 92, 308, -498, 357, -265, -225, 550, -155, 415, -50, 2, -336, 490, -426, 472, 43, -386, 463, -186, -61, 77, -268, -126, 322, -362, -397, 450, -497, 322, -195, -214, 39, -13, -47, -159, 70, -366, 711, -492, 120, 184, -399, 334, -26, -164, -132, 200, -427, 414, 60, -425, 734, -680, 517, -79, 142, 89, 301, -32, -35, 318, -353, 681, -312, 127, 419, -159, 195, 110, 51, -41, 578, -400, 315, 21, -176]
4496a76P08q61N62j97j10J3M34p21L33M97j002R52m21L8J01n57K73K74l04k10
4516c74Q04r05N79j00n20P16m44J41n0K24o01Q33o49n2P30q99Q72m58K40m18M54
4537A23j42J44J14o54Q35o98N56j85m23O30k26q1j86P47j123Q93k40m90R69q86
4557c23P30j91P9j94L07m21r1K96m96P29p14M67N7k67QPN3k81P33q14N15l36m8
4580a95J77k11K19J72J77o99N87n96N6M33o40J032o97qK67j49k94M04j35MO61
4601E65j397R67n7k38K90j78j02j7M06p31Q92o96K96L26p87P24o0k21l8K63l06
4622i9J08K80p70J412j197L66M7k27k6J21P1o19P87m37O47o76M23r0j09j76L57
4643A93k18m81R29m70k59O64r95P96l05j71M30J03n07L59J96n93Q14q96N80J2
$$ y = [-176, 532, -329, 233, 36, -74, -61, 373, -348, -15, 482, -520, 432, 11, 49, 150, -407, -134, 140, -164, -374, 430, -475, 104, 4, -516, 200, -244, -103, -153, 71, -530, 303, -346, -398, 332, -567, 305, -153, 87, -331, 123, -19, 125, 239, -415, 420, -278, 278, 93, -330, 300, 74, -7, -193, 554, -569, 324, 84, -406, 563, -323, 407, 216, 295, 101, 408, -13, -104, 192, -304, 425, -289, 178, 235, -32, -24, -17, 36, -245, 488, -326, 189, -147, -195, -18, -229, -10, 162, 339, -360, 227, -369, -313, 120, -520, 512, -185, -193, 74, -75, -369, 35, -100, -96, 565, -832, 135, 78, -160, 130, -48, -150, -167, 239, -492, 400, -296, 0, 326, -461, 263, 203, -18, -56, 207, -99, 9, 289, -481, 931, -266, 100, 147, -80, -106, 15, 86, -533, 254, -183, 464, -212, 211, 121, 12, -164, 193, -25, -506, 423, -47, -306, 358, -637, 159, -146, -317, 113, 216, -291, 68, 264, -329, 485, -411, 169, 181]
4663A81l22M72n50J05j46L93q79J038m66n8O22q90N53j54J25k81O01q01M72J17
4683A32p59R80r52O33j16J14j18M8j03J18M03p79P13k46k77N41n01N3J18J00k35
4704a33N99p69M09J29n32O07l47j06K09J1j34L52l30q1O09q28P10k78j24Q9m8
$$ y = [181, -141, 331, -219, -114, -260, 133, -746, 292, -174, -232, 390, -500, 53, -101, 24, -257, 344, -457, 15, 132, -627, 353, -599, 34, -82, 32, -86, -38, -141, -23, 380, -399, 314, 68, -209, 332, -169, -116, 2, 102, -133, 466, -303, 106, 235, -297, 310, -37, -143, 66, 77, -57, 295, -35, -116, 493, -335, 375, 97, -27, 62, 14]
$$ [...]
8191A57
##END NTUPLES=NMR FID
##END=
