##TITLE=1H_Ser Ril-V
 CDCl3
 8 sc, 
 18.5.2023
##JCAMPDX= 6.0         $$ Bruker NMR JCAMP-DX V2.0
##DATA TYPE= NMR FID
##DATA CLASS= NTUPLES
##ORIGIN= UXNMR, Bruker Analytische Messtechnik GmbH
##OWNER= root
$$ XWIN-NMR		Version 3.5
$$ Thu May 18 15:34:32 2023 Russian Standard Time (UT+4h)  she@DPX200
##.OBSERVE FREQUENCY= 200.13135
##.OBSERVE NUCLEUS= ^1H
##.DELAY= (6, 6)
##.ACQUISITION MODE= SIMULTANEOUS
##.ACQUISITION SCHEME= undefined
##.AVERAGES= 8
##.DIGITISER RES= 18
##SPECTROMETER/DATA SYSTEM= spect
##.PULSE SEQUENCE= zg30
##.SOLVENT NAME= CDCl3
##.SHIFT REFERENCE= (INTERNAL, CDCl3, 0, 15.7039)
##AUDIT TRAIL= $$ (NUMBER, WHEN, WHO, WHERE, WHAT)
$$ ##TITLE= Audit trail, XWIN-NMR		Version 3.5
$$ ##JCAMPDX= 5.01
$$ ##ORIGIN= Bruker BioSpin GmbH
$$ ##OWNER= she
$$ F:/spectra/data/she/nmr/H-F/1/audita.txt
$$ ##AUDIT TRAIL=  $$ (NUMBER, WHEN, WHO, WHERE, WHAT)
(   1,<2023-05-18 15:33:25.46 +0400>,<she>,<DPX200>,
      <created by zg, POWCHK disabled, PULCHK disabled
       configuration hash MD5:
       00 E9 B6 7A A2 85 ED C7 34 08 36 98 17 FE 4E 26
       data hash MD5: 16K
       D3 BE AD DA 7E A8 4D B8 F5 73 FB 85 E2 69 DC 23>)
$$ ##END=
$$ 
$$ hash MD5
$$ 1B 14 13 51 54 9B 3F B5 73 C7 AC FC 89 7B 74 EC
##$RELAX= 
##$RELAX= 
##$RELAX= 
##$RELAX= 
##$RELAX= 
##$RELAX= 
$$ Bruker specific parameters
$$ --------------------------
##$DU= <F:/spectra>
##$EXPNO= 1
##$NAME= <H-F>
##$PROCNO= 1
##$TYPE= <nmr>
##$USER= <she>
##$AMP= (0..31)
100 100 100 100 100 100 100 100 100 100 100 100 100 100 100 100 100 100 
100 100 100 100 100 100 100 100 100 100 100 100 100 100 
##$AQSEQ= 0
##$AQ_mod= 1
##$AUNM= <au_zg>
##$AUTOPOS= <>
##$BF1= 200.13
##$BF2= 200.13
##$BF3= 200.13
##$BF4= 200.13
##$BF5= 200.13
##$BF6= 200.13
##$BF7= 200.13
##$BF8= 200.13
##$BYTORDA= 1
##$CFDGTYP= 0
##$CFRGTYP= 5
##$CHEMSTR= <none>
##$CNST= (0..31)
1 1 145 1 1 1 1 1 1 1 1 1 1 1 1 1 1 1 1 1 1 1 1 1 1 1 1 1 1 1 1 1 
##$CPDPRG= <>
##$CPDPRG1= <>
##$CPDPRG2= <>
##$CPDPRG3= <>
##$CPDPRG4= <mlev>
##$CPDPRG5= <mlev>
##$CPDPRG6= <mlev>
##$CPDPRG7= <mlev>
##$CPDPRG8= <mlev>
##$CPDPRGB= <>
##$CPDPRGT= <>
##$D= (0..31)
0 1.2 0 0 0 0 0 0 0 0.06 0 0.03 0 0 0 0 0.0002 0 0 0 0 0 0 0 0 0 0 0 0 
0 0 0 
##$DATE= 1684409604
##$DBL= (0..7)
120 120 120 120 120 120 120 120 
##$DBP= (0..7)
150 150 150 150 150 150 150 150 
##$DBP07= 0
##$DBPNAM0= <>
##$DBPNAM1= <>
##$DBPNAM2= <>
##$DBPNAM3= <>
##$DBPNAM4= <>
##$DBPNAM5= <>
##$DBPNAM6= <>
##$DBPNAM7= <>
##$DBPOAL= (0..7)
0.5 0.5 0.5 0.5 0.5 0.5 0.5 0.5 
##$DBPOFFS= (0..7)
0 0 0 0 0 0 0 0 
##$DE= 6
##$DECBNUC= <off>
##$DECIM= 32
##$DECNUC= <off>
##$DECSTAT= 4
##$DIGMOD= 1
##$DIGTYP= 9
##$DL= (0..7)
0 120 120 120 120 120 120 120 
##$DP= (0..7)
150 150 150 150 150 150 150 150 
##$DP07= 0
##$DPNAME0= <>
##$DPNAME1= <>
##$DPNAME2= <>
##$DPNAME3= <>
##$DPNAME4= <>
##$DPNAME5= <>
##$DPNAME6= <>
##$DPNAME7= <>
##$DPOAL= (0..7)
0.5 0.5 0.5 0.5 0.5 0.5 0.5 0.5 
##$DPOFFS= (0..7)
0 0 0 0 0 0 0 0 
##$DQDMODE= 0
##$DR= 18
##$DS= 0
##$DSLIST= <SSSSSSSSSSSSSSS>
$$ [...]
##$SUBNAM2= <"">
##$SUBNAM3= <"">
##$SUBNAM4= <"">
##$SUBNAM5= <"">
##$SUBNAM6= <"">
##$SUBNAM7= <"">
##$SUBNAM8= <"">
##$SUBNAM9= <"">
##$SW= 16.0151230935494
##$SWIBOX= (0..15)
0 0 2 0 0 0 0 0 0 0 0 0 0 0 0 0 
##$SW_h= 3205.12820512821
##$TD= 16384
##$TD0= 1
##$TE= 0
##$TE2= 300
##$TE3= 300
##$TEG= 300
##$TL= (0..7)
0 120 120 120 120 120 120 120 
##$TP= (0..7)
150 150 150 150 150 150 150 150 
##$TP07= 0
##$TPNAME0= <>
##$TPNAME1= <>
##$TPNAME2= <>
##$TPNAME3= <>
##$TPNAME4= <>
##$TPNAME5= <>
##$TPNAME6= <>
##$TPNAME7= <>
##$TPOAL= (0..7)
0.5 0.5 0.5 0.5 0.5 0.5 0.5 0.5 
##$TPOFFS= (0..7)
0 0 0 0 0 0 0 0 
##$TUNHIN= 0
##$TUNHOUT= 0
##$TUNXOUT= 0
##$USERA1= <user>
##$USERA2= <user>
##$USERA3= <user>
##$USERA4= <user>
##$USERA5= <user>
##$V9= 5
##$VALIST= <valist>
##$VCLIST= <CCCCCCCCCCCCCCC>
##$VD= 0
##$VDLIST= <DDDDDDDDDDDDDDD>
##$VPLIST= <PPPPPPPPPPPPPPP>
##$VTLIST= <TTTTTTTTTTTTTTT>
##$WBST= 1024
##$WBSW= 4
##$XGAIN= (0..3)
0 0 0 0 
##$XL= 0
##$YL= 0
##$YMAX_a= 68464
##$YMIN_a= -122222
##$ZGOPTNS= <>
##$ZL1= 120
##$ZL2= 120
##$ZL3= 120
##$ZL4= 120
##$ABSF1= 10
##$ABSF2= 0
##$ABSG= 5
##$ABSL= 3
##$ALPHA= 0
##$AQORDER= 0
##$ASSFAC= 0
##$ASSFACI= 0
##$ASSFACX= 0
##$ASSWID= 0
##$AUNMP= <proc_1d>
##$AZFE= 0.1
##$AZFW= 0.1
##$BCFW= 1
##$BC_mod= 2
##$BYTORDP= 1
##$COROFFS= 0
##$CY= 11.3945322036743
##$DATMOD= 1
##$DC= 2
##$DFILT= <>
##$DTYPP= 0
##$F1P= 15.7292609196834
##$F2P= 12.9074282941183
##$FCOR= 0.5
##$FTSIZE= 0
##$FT_mod= 4
##$GAMMA= 1
##$GB= 0.15
##$INTBC= 1
##$INTSCL= 1
##$ISEN= 128
##$LB= 0.24
##$LEV0= 0
##$LPBIN= 0
##$MAXI= 10000
##$MC2= 0
##$MEAN= 0
##$ME_mod= 0
##$MI= 1.114404
##$NCOEF= 0
##$NC_proc= 0
##$NLEV= 6
##$NOISF1= 3.799351
##$NOISF2= 2.8
##$NSP= 1
##$NTH_PI= 0
##$NZP= 0
##$OFFSET= 15.70392
##$PC= 1
##$PHC0= -19896.91
##$PHC1= 5.852719
##$PH_mod= 1
##$PKNL= yes
##$PPARMOD= 0
##$PSCAL= 0
##$PSIGN= 0
##$REVERSE= no
##$SF= 200.130013532006
##$SI= 16384
##$SIGF1= 3
##$SIGF2= 2
##$SINO= 400
##$SIOLD= 16384
##$SREGLST= <1H.CDCl3>
##$SSB= 0
##$STSI= 0
##$STSR= 0
##$SW_p= 3612.71676300578
##$SYMM= 0
##$S_DEV= 0
##$TDeff= 0
##$TDoff= 0
##$TI= <>
##$TILT= no
##$TM1= 0
##$TM2= 0
##$TOPLEV= 0
##$USERP1= <user>
##$USERP2= <user>
##$USERP3= <user>
##$USERP4= <user>
##$USERP5= <user>
##$WDW= 1
##$XDIM= 8192
##$YMAX_p= 0
##$YMIN_p= 0
$$ End of Bruker specific parameters
$$ ---------------------------------
##NTUPLES= NMR FID
##VAR_NAME=  TIME,          FID/REAL,        FID/IMAG
##SYMBOL=    X,             R,               I
##VAR_TYPE=  INDEPENDENT,   DEPENDENT,       DEPENDENT
##VAR_FORM=  AFFN,          ASDF,            ASDF
##VAR_DIM=   8192,          8192,            8192
##UNITS=     SECONDS,       ARBITRARY UNITS, ARBITRARY UNITS
##FACTOR=    0.000312,      1,               1
##FIRST=     0,             0,               0
##LAST=      2.555592,      0,               0
##MIN=       0,             -122222,         0
##MAX=       2.555592,      68464,           0
$$ Real data points
##PAGE= N=1
##DATA TABLE= (X++(R..R)), XYDATA
0 0 0 0 0 0 0 0 0 0 0 0 0 0 0 0 0 0 0 0 0 0 0 0 0 0 0 0 0 0 2 -2 6 -7 7 -7 7 -7 7 -7 9 -9 9 -11 13 -15 17 -17 19 -21
48 -21 23 -26 28 -31 34 -37 41 -48 55 -62 71 -81 96 -117 144 -183 242 -338 507 -859 1835 -7347 -33591
71 -33591 4497 19623 59830 63995 45388 28727 25266 56327 51578 52400 1460 -32670 -19294
84 -19294 -20826 12137 -9401 -40934 -51202 -37296 6554 13579 18762 -15774 -16169 16689 25744
97 25744 46595 8058 -14290 -11759 -2601 16001 -4570 -19430 -49575 -35282 -10813 -12129 4064
110 4064 -23075 -21742 -8880 4804 30716 24860 23477 2040 11128 22928 27298 39544 -1564
123 -1564 -12324 -16389 -7319 13067 -8499 -24857 -45740 -23086 4614 14329 11799 -23666 -6340
136 -6340 15054 38716 46555 10093 -2121 -6773 19053 24900 8508 -9107 -34832 -13311 -8187
149 -8187 -758 -4194 -27603 -18916 -16508 2114 4677 880 -2307 -14850 6392 8920 20682 16034
163 16034 -7240 -3641 -7497 13846 15465 1781 -14777 -28912 -4915 1905 12792 -2067 -23063
176 -23063 -9848 -584 24752 16822 1728 -3425 -1224 24646 20898 18080 -2425 -11323 5990
189 5990 5822 14848 -4408 -15919 -16915 -14034 5235 -1905 -1717 -15581 -17293 -2898 -1483 13526
203 13526 -1017 -8383 -10524 -6940 11789 5311 4381 -12946 -12078 4532 9137 17035 -6252 -10469
217 -10469 -5074 7734 23584 6837 -1430 -14452 -704 17326 13731 10674 -12238 -6842 1034
230 1034 8516 12218 -8134 -7978 -12138 -292 5062 -3497 -1877 -14285 -3285 255 4705 7805
244 7805 -4373 500 -6223 5075 11695 7668 5773 -11782 -3551 684 9645 10602 -8146 -10000
258 -10000 -14112 5151 9977 18 -6515 -18284 -353 6445 10468 366 -15079 -3457 2044
271 2044 16320 7648 -5180 -6115 -7200 12061 8509 4031 -5185 -10859 2196 351 9020 0
285 0 -5149 -2938 -6267 5594 -1113 1084 -4421 -10166 -2603 -4136 6153 -2767 -6399 -5453 -4672 12269
301 12269 8039 7076 -3095 -4169 10844 12635 17691 965 -3909 -1518 3288 14237 -476 -5800
315 -5800 -12885 -7856 2178 -3581 -3203 -15365 -9942 -2480 455 5178 -6894 -2027 -3704 3068 9665
330 9665 3667 5623 -5011 519 2511 5143 10043 -2159 -2212 -8502 -464 7002 1947 1475 -10521
345 -10521 -2383 4135 9988 10413 -5116 -974 467 11191 10530 -2995 -8107 -15023 -27 2293
359 2293 -1242 -8597 -18014 -4413 -590 7725 4034 -3919 937 1517 12780 7112 4629 2294 -2572
374 -2572 5304 -751 2467 -3215 -8394 -5731 -9969 -1503 -4601 -2346 -6584 -10717 693 2257 12456
389 12456 6574 -623 1405 3040 16868 11550 5347 -4502 -5520 6668 3798 5159 -9033 -12693
403 -12693 -3741 -79 6105 -5967 -8228 -7798 1422 11832 4597 5164 -4324 1032 9299 6334 7752
418 7752 -3882 -5522 -8600 -5058 -1070 -7390 -4577 -13527 -8215 -1388 432 6986 -3017 -1768 -403
433 -403 7380 11533 3829 973 -9283 1203 7975 6062 4158 -10685 -5510 141 7891 7955 -2430
448 -2430 -3132 -5550 8912 10015 5429 4047 -5388 3573 4963 5815 1033 -8114 -6949 -8854 268
463 268 -4336 -7092 -8469 -15605 -3835 -1938 2564 985 -4980 -2779 -1427 11164 10000 8473 2565
478 2565 -4258 8153 7892 10423 2513 -8922 -6193 -2046 6983 -652 -6562 -11594 -8412 8641 6061
493 6061 4830 -5518 -8420 4033 8370 10649 -1381 -5537 -6709 -76 9517 -131 400 -6060 -4352
508 -4352 4081 1868 4173 -2610 -2405 -3504 322 5438 -597 2154 -7442 -6390 1852 2647 5977 -5412
524 -5412 -9229 -8310 1179 9293 1614 -2529 -12395 -1622 10754 8761 6917 -6172 -3792 3990 11775
539 11775 9503 -2954 -3673 -6056 6116 7517 -923 -2950 -11144 -3235 1455 3006 379 -6195 -4659
554 -4659 -6812 4412 5474 2470 1358 -8677 -1051 2439 6526 4961 -5259 -6345 -5422 7417
568 7417 6153 428 -4386 -10371 3338 7014 6838 -1322 -10389 -4178 1408 9981 1952 -4369 -7263
583 -7263 -6600 7700 4997 3121 -2530 -6310 797 3061 7947 856 -1685 -2757 -2219 7468 2824
598 2824 3482 -2991 -6919 175 2260 6832 -1573 -6154 -8593 -4405 7592 2853 563 -9412 -9219
613 -9219 2823 6068 8863 -2592 -6350 -4042 4709 12313 2606 -1380 -7957 -1041 8538 5257 2444
628 2444 -8568 -6151 174 5436 5406 -5287 -5520 -7957 29 5094 460 -2 -7582 -3119 376 3992
644 3992 6039 -692 -828 -4761 3150 6871 4274 2894 -6598 -2275 1945 7015 5647 -5371 -5979
659 -5979 -6197 5117 7249 760 -4380 -11037 214 5729 7331 1367 -8141 -3970 -833 7741 4425
674 4425 -2847 -4410 -6009 4023 3614 3060 -943 -5893 -169 889 6647 1880 -2709 -3829 -5427
689 -5427 4277 3623 3519 -3131 -8725 -2401 392 7513 1259 -4967 -7143 -4735 7337 5187 2499
704 2499 -4365 -4468 5128 7375 10026 -202 -4224 -1099 2934 8547 -138 -4152 -8647 -5251 2357
719 2357 143 489 -7871 -6330 -3021 -281 4848 -910 -414 -4271 -1037 4434 3408 5795 -2202 -2428
735 -2428 -1160 2461 6954 -871 -3100 -7049 -1078 5796 4305 2313 -7472 -3018 3086 8164 8243 -3056
751 -3056 -3779 -4180 4723 7647 979 -2779 -8014 -45 2968 3504 524 -6855 -2174 -1315 4564 2969
767 2969 -1812 -822 -3726 3107 3495 3419 678 -5795 -2723 -3943 1399 170 -4335 -6567 -10226 -1290
783 -1290 1303 3078 -275 -5223 191 2852 10274 6178 208 -72 433 9553 6602 3324 -2694 -5239
799 -5239 2269 2801 3904 -3887 -7518 -4778 -2761 4051 -660 -1246 -4022 -2631 3598 1850 4253 -811
815 -811 -2221 -1355 -1049 3846 -1184 -1721 -5523 -4437 1739 832 2847 -4541 -4630 -1208 2817 7448 674
832 674 -1385 -4462 981 7641 3929 2319 -5502 -2825 1425 2980 3100 -4922 -3425 -2796 3021 5029
848 5029 -428 1024 -2163 3435 5822 4517 3556 -2110 466 -884 2211 1613 -2341 -1805 -7330 -3257
864 -3257 -1713 -1164 -830 -6612 -4637 -4946 1655 2498 -842 -1274 -4544 3524 5175 4650 1722 -4396 352
881 352 2481 6753 1682 -3734 -2906 -2622 6227 3407 162 -2554 -4277 3519 3069 3495 -1146 -2377
897 -2377 314 322 4971 -638 -1064 -1152 -1731 2718 -289 1136 -1691 -2544 -1197 -1176 3481 -762 -78 -3147
915 -3147 -4101 2430 1309 2412 -3599 -4924 -2438 266 3972 -2454 -2779 -4516 -549 5829 719 346
931 346 -3156 -237 4442 4535 3493 -2917 358 670 3671 4898 -1135 854 -2521 -33 1920 555
947 555 947 -3326 -1241 -3605 82 1879 -1738 -426 -4703 -1006 1894 1267 919 -4440 -1906 -349
963 -349 4944 3395 -3020 -1516 -3374 3872 5139 825 -1571 -4634 947 2362 3414 -1149 -4538
978 -4538 -865 -1866 3789 275 -2553 -1332 -2087 2717 1506 1939 -858 -1584 1793 628 5053 1115
994 1115 -120 378 -2562 2227 1616 2418 -1345 -3093 -1703 -1536 3431 -859 -2064 -3427 -3815 2939
1010 2939 1302 677 -3065 -3401 853 2449 4905 -2431 -2400 -1883 1084 6468 1187 -324 -3533 -744
1026 -744 4061 3434 2348 -4238 -1282 -539 987 3178 -2900 -1922 -3029 -666 1154 -454 -66 -4041
1042 -4041 -1107 -1042 1476 3259 -1962 -95 -2671 974 4593 3340 1887 -3399 -724 941 4616
1057 4616 3625 -3159 -2426 -3338 2619 3884 -760 -2547 -4905 975 1740 2359 -1115 -5072 -593 -470
1073 -470 3907 1576 -2150 -991 -2310 2445 1912 2363 -160 -2719 199 -1195 3486 1843 -410 -1474
1089 -1474 -3450 1513 1412 2060 -2025 -5189 -2289 -968 3922 -518 -4203 -3736 -2011 5468 3851 1945
1105 1945 -2395 -2076 4300 5183 6242 -852 -2454 78 1630 5203 235 -1741 -3629 -1563 1930
1120 1930 -416 152 -4423 -2672 -1114 -339 2649 -1464 -667 -2458 -1067 2432 1439 2310 -3819 -2927
1136 -2927 -1770 678 3661 -1376 -2103 -4804 -506 4150 2472 915 -4607 -1347 1729 4237 4256 -2744
1152 -2744 -1882 -1134 4046 4935 153 -1396 -4634 594 2497 2616 360 -4258 -791 -315 3789 3801 950
1169 950 396 -2245 2285 2043 1893 45 -4318 -2645 -3061 895 6 -3587 -4437 -5729 553 1455 1538
1186 1538 -1795 -4970 -310 2237 6488 2826 -1091 -1101 -49 6347 4360 1715 -2190 -2986 1780 1676
1202 1676 2797 -1989 -3319 -1669 -59 3772 488 79 -1888 -1341 2431 1726 2980 -1229 -2358 -1226
1218 -1226 -174 3886 474 -717 -4577 -3815 1134 1592 2246 -3572 -4134 -1733 1312 4943 -299 -2287
1234 -2287 -3765 -119 4245 1419 -798 -5967 -3383 668 2587 2362 -3765 -2468 -1261 3093 4969
1249 4969 1744 1178 -1434 2138 3638 3927 3275 -979 405 -576 1658 2303 -446 -1047 -4234 -1447
1265 -1447 -175 1019 175 -4745 -3099 -2511 2366 3071 -946 -2143 -4249 1323 3506 3169 -362 -4795
1281 -4795 -1328 356 3960 1127 -3041 -2822 -2385 2968 2003 189 -1923 -2977 1735 1735 3413 336
1297 336 -2069 -469 -521 3296 1521 606 -1818 -3133 693 950 3377 50 -2021 -1051 -379 4490 2439
1314 2439 72 -2516 -2144 1885 2072 2002 -3319 -4097 -1629 334 3240 -2015 -3883 -4011 -1557 2394
1330 2394 790 -220 -3793 -1361 1483 2206 3467 -651 172 498 1611 3430 1506 1319 -1345 -70
1346 -70 5 969 2086 -2580 -1907 -2630 -568 2510 185 -763 -3883 -1344 1587 3562 2658 -2779 -1012
1363 -1012 -576 2967 3989 -514 -1522 -2801 1010 2245 1337 -917 -4343 -860 -466 1929 314 -3645
1379 -3645 -2019 -1709 1685 1699 639 -661 -1920 892 594 2674 788 -1476 -288 -1600 1213 1395
1395 1395 530 -1117 -2392 309 280 2965 128 -1836 -579 -607 3449 1993 -171 -1939 -2130 1331
1411 1331 1353 1809 -2518 -3920 -1211 -734 2604 -595 -1789 -1893 -119 3157 1937 1666 -959 621
1427 621 2195 1661 3365 -702 -560 -278 -88 1235 -601 -896 -3390 -2468 -1770 -1193 1324 -2809 -2209
1444 -2209 -1998 -157 3399 2059 1454 -1420 876 2715 3300 2503 -2399 -997 -335 1715 2207 -1962
1460 -1962 -2720 -2530 1005 1157 15 -920 -2989 862 1135 2055 2053 -749 954 75 1438 1261 804 431
1478 431 -1725 196 -1287 562 713 -1861 -924 -2166 1063 1373 471 -918 -2515 492 949 2774
1494 2774 -16 -3143 -1139 -781 2310 564 -1868 -2750 -2558 1301 326 520 -2128 -1968 1560 1350 3164
1511 3164 793 191 1377 1917 3483 1046 1193 -1017 -754 510 -423 1046 -1695 -1897 -1729 -1516 586
1528 586 -357 263 -2190 -1445 330 311 2132 -665 -653 -53 910 2957 88 -456 -2168 12 1460 501
1546 501 474 -3395 -1527 -348 829 1301 -1830 -1389 -1434 893 1777 146 475 -1439 1205 1146 1693 1757
1564 1757 -336 1150 64 1521 1727 314 319 -1719 170 155 1433 602 -2412 -1443 -1822 1100 738
1581 738 -857 -2122 -3409 255 811 1467 -877 -3050 -146 297 2398 391 -1712 -1372 -510 2447
1597 2447 676 75 -1155 -1552 1570 1089 1907 -198 -557 547 260 2228 249 914 -567 -942 691
1614 691 -267 1478 -239 -909 -960 -952 1740 377 32 -1882 -928 1489 1522 2372 -1034 -1191 -2 1635
1632 1635 3326 -277 -1185 -2431 -812 1327 85 -725 -3835 -2079 -401 392 468 -1901 -1030 -870 1808
1649 1808 2587 823 1113 -355 1531 2070 2178 2265 -651 1 -1211 443 1133 -571 -885 -3582 -1298
1666 -1298 -135 826 331 -2301 -1165 -796 2002 2231 -192 -1112 -1945 1778 2280 1466 -628 -2619 -118
1683 -118 408 2358 18 -2313 -1325 -1406 1656 482 -138 -906 -1774 932 517 1907 170 -673 -8 -538
1701 -538 2095 822 345 -937 -1730 464 117 1890 -378 -1720 -1219 75 2983 1486 85 -1649
1717 -1649 -1666 1800 1962 1881 -1697 -2317 -243 741 2319 -1178 -2028 -2109 -541 1518 -96 -484 -2654 -997
1735 -997 788 1278 1825 -579 -242 -12 1431 2534 1014 1387 -1296 -268 841 858 1758 -1276 -1495
1752 -1495 -2253 -348 1140 -532 -1050 -3724 -952 647 1333 1444 -1927 -622 464 3319 3062 206
1768 206 -547 -1194 1712 2066 1130 -148 -2991 -864 -110 1267 337 -1940 -1364 -1864 1105 683 66 -319
1786 -319 -1706 859 724 1984 1252 -626 -284 -662 1726 930 506 -1270 -2927 -309 312 1652 -193
1803 -193 -2342 -1370 -471 2246 1157 59 -1927 -1681 1779 1027 1124 -1412 -2102 -253 659 1982 -517
1820 -517 -1245 -1682 -148 2027 251 846 -863 -505 1277 1006 2351 591 142 -1080 -59 1430 335
1837 335 904 -2052 -2016 -491 121 1185 -1233 -2049 -2133 -35 1830 115 -395 -2777 -617 2020 2048 1827
1855 1827 -1751 -1065 448 2134 2132 -633 -561 -2095 797 1090 -143 -60 -1909 62 165 829 608 -814
1873 -814 -181 -1429 748 704 585 826 -1810 -291 337 1933 1902 21 -852 -1309 1539 1310 918 -676
1891 -676 -3081 -493 27 839 -866 -2750 -1779 -903 1535 172 -856 -1453 -1750 1711 1237 1443 193
1908 193 -855 536 1273 2283 427 379 -753 -900 1200 -30 981 -592 -1492 -61 31 1408 50
1925 50 -330 -1365 -723 1797 758 751 -1226 -1394 461 805 1491 -1112 -1459 -1762 -297 1305 -437 -162
1943 -162 -2441 -1060 1161 1007 1107 -995 -380 47 1330 1543 -666 -81 -1323 -113 815 -165 -40
1960 -40 -1658 -435 -284 587 1059 28 689 -695 1058 1902 1736 2161 -489 438 483 1747 1631 -710
1978 -710 -1104 -2216 192 209 -948 -1672 -3362 -642 2 763 -428 -2081 -647 -95 2293 976 22
1995 22 216 -369 1843 903 1001 125 -711 261 -651 538 -453 -503 -547 -1386 621 42 1105 60 -768 147
2015 147 312 2452 891 -60 -746 -608 1917 825 724 -1295 -1690 207 395 1143 -969 -1475 -1182 -201
2033 -201 1460 -393 -401 -1297 -676 1109 17 483 -1604 -749 -531 27 650 -1006 -417 -1182 -216 437 118
2052 118 1120 -421 317 81 923 2058 569 796 -544 1062 1768 601 596 -1250 -300 -339 640 622 -1823
2071 -1823 -1195 -1552 578 577 -693 -968 -1687 430 1037 1081 546 -1050 485 237 1503 489 -320 96
2089 96 -936 540 -215 -197 -564 -1074 -82 -1048 270 58 -467 -620 -734 767 639 1257 357 -918 361
2108 361 474 2101 503 -403 -573 -549 1652 500 95 -1289 -1145 743 414 1085 -798 -1211 -273 269
2126 269 1295 -462 -641 -1163 -311 923 -70 114 -1001 -531 123 59 923 -529 359 -302 -108 1070
2144 1070 400 1194 -191 220 493 677 1407 -531 -619 -1268 -167 810 -409 -429 -1983 -917 -57 502
2162 502 783 -1417 -662 -320 1480 1365 -99 455 -694 1001 1136 442 205 -1169 84 -129 456 78
2180 78 -1123 -324 -1396 94 133 173 196 -793 53 -45 1243 654 -279 -185 -878 921 900 623 -630 -1363
2200 -1363 95 399 1023 -169 -1399 -559 -239 1533 235 -417 -1183 -844 832 633 575 -1245 -1286 -166
2218 -166 -86 892 -895 -707 -352 -201 1006 299 966 88 106 971 695 1699 352 436 -586 -387 1048
2237 1048 95 396 -1275 -1323 -660 -2 801 -946 -1093 -1272 -182 1418 -3 -78 -1330 52 1298 1299
2255 1299 483 -1325 -332 -293 926 961 -820 -674 -1103 50 505 63 -38 -1109 -37 -276 960 815
2273 815 -280 183 -723 481 1034 893 447 -773 -103 -17 1342 800 -562 -138 -1001 1002 1174 484
2291 484 -540 -1403 239 352 1026 -599 -1871 -1027 -750 686 -278 -913 -982 -970 256 136 478 -577
2309 -577 -496 433 74 1488 218 11 206 -167 1126 643 962 -201 -590 -85 106 1539 -83 -329
2327 -329 -640 -704 1267 500 -21 -855 -919 280 606 1304 -491 -510 -536 12 1657 -8 -310 -1249 -187
2346 -187 552 843 482 -1582 -741 -269 237 768 -821 -625 -1071 -306 194 -55 -67 -1121 -156 -530 242
2365 242 1035 -10 444 -446 345 1449 1276 505 -554 6 370 1364 968 -645 -1007 -1152 500 1085
2383 1085 -66 -519 -1579 -4 221 851 -141 -1510 -423 -302 1032 387 -546 -403 -670 405 186
2400 186 273 -301 -753 -18 -790 1072 473 -338 -429 -1058 291 271 957 -216 -845 -84 -78 1520 208 -668
2420 -668 -787 -463 1280 696 530 -739 -671 688 889 1370 -372 -333 -31 56 1467 114 -108 -770 -473
2439 -473 307 -276 354 -1295 -768 -664 -672 402 -518 -181 -1035 -577 374 516 594 -627 -162 12 745 1500
2459 1500 280 -197 -908 135 1146 787 385 -1428 -756 -22 672 562 -1113 -700 -859 475 744 161
2477 161 -417 -756 510 551 819 207 -490 171 -99 1082 432 -43 -320 -797 90 -104 336 71 -915 -233
2497 -233 -815 378 192 -132 -96 -1058 311 442 1146 -38 -622 -100 -45 1122 442 -332 -578 -558 1177
2516 1177 487 587 -668 -751 364 303 1212 -276 -564 -331 -271 777 -116 116 -691 -663 198 -234 398 -392
2536 -392 -259 -421 -357 874 113 387 -317 -224 858 636 1335 -175 -337 -398 422 1087 -485 -682 -1337 -694
2556 -694 171 -207 -459 -1518 -825 -249 361 636 -810 -124 -223 736 1034 298 513 -273 820 181 374
2575 374 296 -397 60 -725 151 171 -119 51 -531 153 12 291 536 -435 -1 -625 527 559 -48 -237 -1068
2596 -1068 381 485 718 -61 -993 -58 -165 979 193 -498 -166 -115 818 232 -117 -544 -866 225 -287
2615 -287 -107 -762 -845 -252 -461 389 -299 -144 -274 -64 214 -231 962 54 185 254 62 1453 221 674
2635 674 -514 -474 410 362 764 -936 -678 -190 15 659 -520 -311 -915 157 778 341 -87 -824 -105
2654 -105 311 354 516 -728 -215 -387 123 313 -334 8 -748 -4 -63 68 216 -852 207 -517 256 445
2674 445 -162 168 -647 93 402 771 253 -648 29 75 784 958 37 42 -277 891 818 660 173 -757 250
2695 250 5 578 -192 -907 -381 -748 186 -401 -389 -617 -728 142 -402 188 -62 -335 545 -162 921 363
2715 363 396 133 -95 517 -11 543 71 -552 -119 -514 579 -92 -354 -575 -474 359 174 647 -808 -527
2735 -527 412 163 1018 -253 -422 -520 236 529 -100 -146 -626 -34 656 199 388 -692 -281 30 -10 120
2755 120 -427 -106 -562 84 -151 -237 208 -693 -255 -277 -48 754 3 -81 -806 275 399 852 700 -669
2775 -669 123 202 1017 972 -188 17 -456 539 329 4 -182 -1003 7 -25 24 -136 -825 -63 -71 576 -209
2796 -209 -66 6 -167 559 -155 537 296 -345 64 -272 299 71 196 -511 -869 102 25 452 -251 -1082 -233
2817 -233 -162 851 166 -428 -442 -238 981 200 520 -517 -265 664 349 712 -397 -537 -176 215 501
2836 501 -211 0 -657 -97 294 3 271 -544 -278 -291 -29 412 -71 43 -843 -332 90 46 616 -616
2856 -616 -376 -77 370 679 290 302 -438 284 910 661 262 -799 -97 124 431 413 -894 -560 -698 254
2876 254 311 -191 -145 -1050 362 -3 273 352 -435 178 -29 744 288 54 130 -604 421 -56 265 128 -724
2897 -724 -255 -587 122 290 -137 -481 -869 215 308 737 128 -607 210 236 1075 196 -384 -580 -122 801
2917 801 113 99 -719 -714 190 201 654 -509 -538 -88 -285 551 -313 160 -487 -473 257 -283 307 -273 -412 -259
2939 -259 -50 600 158 155 -345 -214 567 537 1019 -469 -144 4 347 846 -42 -483 -729 74 323 -164 65
2960 65 -906 -499 114 358 478 -743 -210 -344 375 263 209 69 -261 145 285 257 436 -432 -121 -305 363
2981 363 395 251 -138 -644 -98 164 433 180 -648 -537 -515 650 167 -3 -147 -820 244 397 665 -79
3001 -79 -693 184 381 1021 191 -196 -134 -297 890 107 132 -519 -854 -82 -449 280 -391 -569 -429 -409 423
3022 423 -84 154 -93 -404 232 170 730 288 61 -387 140 970 402 307 -555 -195 447 371 256 -620 -360
3043 -360 -198 49 847 -19 -304 -716 111 722 -153 302 -636 -246 -76 303 430 -414 49 -442 -32 195
3063 195 -263 85 -662 45 -225 50 436 -150 -82 -552 -80 451 -118 146 -708 -165 141 266 511 -744
3083 -744 -373 -189 852 678 135 210 -475 1033 687 567 77 -415 111 29 508 -130 -355 -399 -384 149 -147
3104 -147 -92 -152 -639 -110 -618 363 48 -310 -125 -243 372 222 498 31 -265 47 221 398 -63 -304 -382
3125 -382 -436 399 284 -94 -489 -494 397 177 378 -325 -183 270 410 633 -109 -84 -112 154 583 193 424 -481
3147 -481 -103 211 -71 392 -401 35 -351 -427 46 -50 81 -583 -497 -125 -2 181 -399 -105 -327 128 477
3168 477 -14 198 -647 161 439 357 514 -266 109 81 581 689 -140 21 -444 456 261 155 -4 -596 -10
3189 -10 -230 181 -219 -261 81 -584 -2 -125 81 362 -259 75 160 299 420 -218 23 -515 513 432 341
3210 341 -43 -689 6 -168 145 -282 -715 -532 -162 667 83 -181 -421 -355 484 203 201 -99 -95 409 219 556
3232 556 -66 141 -169 21 583 -257 242 -288 -145 -38 -318 379 -102 -124 -286 -196 -151 -251 195 -425 -167
3253 -167 39 112 394 -29 -103 -300 139 466 24 246 -419 127 388 88 97 -532 -141 -157 277 150 -451 -66
3275 -66 -206 129 -232 37 169 -417 257 235 372 52 103 250 -75 383 60 96 84 -462 -177 -224 183 193
3297 193 -110 -347 -576 448 96 42 -138 -362 148 132 289 -21 -373 33 -99 569 -65 -272 -69 -293
3317 -293 686 337 133 -141 -255 449 69 563 33 90 137 -188 427 -277 147 -79 -668 -151 -193 222 -126
3338 -126 -297 -204 -277 547 93 281 -292 -71 347 251 638 5 216 69 228 700 -89 -181 -480 -163 192
3359 192 -229 37 -515 -257 53 89 293 -338 181 2 283 133 62 252 -85 146 -38 161 134 -353 -135
3380 -135 -526 -101 -20 -65 27 -626 -20 11 516 142 -164 76 -67 528 670 31 -70 -205 252 267 201 -135
3402 -135 -553 272 -120 446 106 -227 81 -72 285 267 268 -109 -177 78 -396 -66 -107 -142 -100 -513 -124 -305
3424 -305 56 -441 -288 -92 -140 445 49 -51 -16 198 756 554 -46 -8 39 365 313 306 -394 -434 -294 -7 266
3447 266 -443 -334 -537 -127 185 255 133 -326 312 89 437 597 -76 99 -6 53 392 5 204 -452 -182
3468 -182 -198 -293 6 -472 -180 -582 -110 -26 -207 -94 -660 -166 247 635 388 -83 -174 81 474 439 -137 -14
3490 -14 -244 414 258 94 -29 -249 264 -128 461 129 -179 -7 -46 489 99 227 -25 -261 -364 -529 229
3511 229 -370 -333 -166 -615 111 58 90 -219 -380 -65 299 360 25 -199 -93 139 625 113 -32 -275 -342 -21
3533 -21 144 260 -638 -279 -230 -71 287 -262 -61 -101 113 449 363 570 187 30 198 94 543 129 190 -194
3555 -194 -211 43 -160 -10 -503 -367 -307 177 76 -335 -170 -510 -296 399 253 -66 -562 150 245 254 381 -394
3577 -394 -69 -270 299 637 -52 31 -329 6 -22 129 126 -425 41 -231 205 160 -60 12 -40 75 56 284 108
3600 108 -191 -123 -349 95 131 46 -71 -255 403 -8 -106 -65 -355 290 15 425 -241 -550 -128 -297 365 -127
3622 -127 -131 -338 -266 47 -71 193 -32 -126 63 14 214 261 324 -218 -41 326 -91 221 -166 -69 -39 -194 470
3645 470 -11 -23 -293 -50 429 -69 -215 -365 -29 83 177 449 40 -9 -238 -7 595 -40 -75 -139 -72 188
3667 188 394 139 -237 -126 -116 -66 63 -362 -27 -450 -146 -146 -89 15 -377 72 -127 162 195 91 300 -235
3689 -235 127 303 298 144 -8 -48 -204 355 353 -55 -251 -433 217 101 -42 -259 -550 -3 16 276 -132 -469
3711 -469 -60 -207 421 -42 -22 117 -197 375 44 115 -49 28 192 -207 170 124 -74 -15 -335 28 -144 66
3733 66 -304 -427 -327 -209 357 -21 -144 -126 -99 273 269 188 -222 -6 165 320 445 -285 13 -176 95 441
3755 441 304 158 -324 133 269 -158 215 -483 -58 -61 -189 76 -88 155 -388 -153 -258 54 82 -97 -26
3776 -26 -74 234 359 144 344 -259 178 192 462 103 -524 -95 -50 145 -24 -214 -110 -208 350 197 -69 -379
3798 -379 -242 113 -61 176 7 -160 266 -8 236 28 47 141 -38 211 -131 42 -132 -155 83 -344 120
3819 120 120 9 11 -46 227 75 11 51 -170 77 88 278 220 -223 -125 -169 209 -62 110 -264 -264 165 24 77 -273
3844 -273 -285 -240 -54 452 -149 149 -221 40 125 -186 441 -181 238 -2 71 118 -29 25 -169 -136 42 102 437
3867 437 61 42 97 175 173 -165 6 -363 -215 -41 -154 -383 -318 -260 -103 71 37 -407 40 -15 378 33 -186
3890 -186 -57 -4 363 -38 343 155 -201 225 -59 99 47 -16 -38 -367 59 -225 -6 -242 -123 -106 -205 172
3912 172 56 23 -98 -383 279 223 18 34 -420 -216 169 620 75 -186 265 111 399 51 -23 -370 -240
3933 -240 53 -127 246 -140 -195 -148 81 254 -12 123 124 12 204 -130 295 -104 -107 196 54 215 15 -8
3955 -8 94 -31 58 -68 211 -315 -195 -157 37 257 -54 -151 -173 -28 95 22 -88 -373 149 111 425 240 -217
3978 -217 208 23 -147 197 33 -206 122 483 243 -172 -125 -148 122 -285 18 174 -339 37 -274 132 -45
3999 -45 -95 115 -243 247 -45 445 229 -102 56 -140 299 217 144 -87 -373 -25 -101 89 -241 -188 -29 -225
4021 -225 186 -131 -128 -94 -2 -29 96 96 -111 -15 32 188 215 -34 299 -45 -293 302 -67 179 -186 121 -194
4044 -194 -223 334 178 227 -185 75 47 191 432 -164 -126 -3 51 222 -85 147 5 78 401 139 143 57 175
4067 175 -39 73 139 -224 -160 -235 0 6 -231 -16 -246 75 -30 -2 120 24 -20 -185 217 173 114 23 -138 94
4091 94 -15 235 303 -545 58 11 139 305 -173 -376 -497 340 150 -90 -150 -389 73 -37 166 -14 -198
4112 -198 -253 51 420 -5 -12 -106 195 148 -105 403 187 -181 14 -169 272 2 75 17 -186 41 -176 112
4134 112 -105 -213 59 -98 207 60 -53 -253 -413 170 -93 10 -260 -224 109 -25 424 3 175 -58
4154 -58 -13 181 -245 -156 -343 159 -8 85 189 -21 -73 97 -184 -173 -42 320 -306 151 225 162 -2 -97 72
4177 72 41 16 274 168 -100 -217 188 273 -107 -84 -292 40 -133 -77 -148 -272 -335 -125 243 -149 -50 -21 -211
4200 -211 153 218 270 -63 133 57 71 73 159 130 -51 -295 83 -194 -37 189 46 52 -182 167 -128 79 -131
4223 -131 -307 -38 -404 131 -146 -492 88 -375 122 -23 -98 -168 -173 392 55 182 -385 -76 253 60 93 -339
4245 -339 -22 -223 -155 128 38 40 -142 15 14 -217 181 -146 -60 427 -21 332 230 127 301 72 204 82
4267 82 263 19 46 -191 -141 123 131 -148 -404 -235 -71 -117 129 -363 -130 116 -34 143 -204 56 -136 -60
4289 -60 -9 12 136 -121 101 191 -46 200 191 74 -194 -83 21 -35 151 -199 183 -122 198 337 -101 42
4311 42 -212 76 105 -7 -111 -99 221 -90 118 63 -70 -81 -147 285 -130 -32 -122 -194 219 164 -17 -32 -79 120
4335 120 -271 225 -457 -122 41 -63 142 -97 -107 -55 -371 164 0 435 -103 -76 200 -29 388 48 118
4356 118 -11 -103 182 -76 176 -209 -203 -130 -111 -14 -334 16 -215 -100 -59 -19 -54 -168 112 112 35 173 59 3
4380 3 84 -14 124 -70 195 52 -120 -87 -69 242 -210 -13 -142 -1 -57 81 -159 -268 66 -162 113 46 -238
4403 -238 17 -44 186 147 234 -71 -167 66 -55 -18 -177 -147 276 11 308 75 -170 182 -130 155 -90 -13
4425 -13 -158 -36 126 -209 181 12 -208 -197 71 121 -96 -39 28 136 252 -234 168 240 -64 -160 9 185
4447 185 -168 127 66 -316 -84 -138 -84 -118 128 -51 221 25 -118 -113 -9 293 297 64 127 208 136 71 74 435 -167
4472 -167 135 -161 47 121 -179 218 -177 81 64 39 99 -142 -163 -91 -25 96 -21 233 -297 -55 95 -55
4494 -55 306 86 226 -13 125 57 -292 -1 -273 80 3 37 53 -74 152 -56 28 -269 12 93 -220 4
4516 4 147 103 -22 7 -19 32 246 -92 -21 -164 49 191 -247 209 -12 184 -148 43 34 -186 81 -112 -398
4539 -398 107 -160 0 -94 -201 203 16 -29 -209 17 10 -67 180 -67 232 -49 78 265 -86 17 -135 -257
4561 -257 -42 43 -10 7 95 0 -138 67 3 181 -99 65 -106 -18 228 145 57 -210 63 351 171 172 -140 -97
4585 -97 14 -14 3 -177 -123 -132 55 -84 -235 -233 -120 41 221 34 11 -242 -37 316 -9 -146 91 177 -71
4608 -71 78 -68 -53 -19 -2 -39 45 165 375 -157 -72 -47 150 -92 5 -22 -271 209 -21 -81 -247 -208 -43 -13
4632 -13 213 -40 -21 158 -180 208 100 76 73 -37 356 17 153 -33 -219 -92 -187 -176 -219 41 -176 -157 -201
4655 -201 -79 -5 30 75 -155 -71 301 91 -14 -12 -114 207 187 265 -201 49 -64 52 317 37 -130 -101 -119
4678 -119 -50 -62 207 -466 -33 34 2 116 -247 29 -299 159 41 -25 139 -15 81 -21 132 -9 111 116 29
4701 29 -275 106 -181 45 -175 -183 173 95 79 6 -233 -193 146 -46 62 191 -171 174 -158 -62 264 -204 463
4724 463 -41 146 -45 -27 148 -15 169 -231 -146 86 -75 82 43 166 -190 17 -102 -108 101 11 112 78
4746 78 -105 47 -2 317 -6 -2 -93 -25 245 63 102 -211 -16 119 30 148 -88 -78 -100 -51 17 -78 -65 -160 35
4771 35 -7 270 -15 -101 105 138 -18 -61 6 -16 -219 -35 -147 114 106 -207 -329 110 -18 199 -23 -91 -280
4794 -280 -69 -75 -11 75 -234 -78 46 243 9 -203 -139 -120 201 166 154 -37 40 144 80 288 93 -210 38
4817 38 -166 169 -218 -135 -105 -271 83 -58 165 -153 -269 150 -267 28 181 81 143 -3 165 -111 26
4838 26 180 41 -181 -223 -26 -101 73 -77 -73 71 -15 -128 -91 48 -73 -68 -7 72 -64 29 199 84 -43 21
4862 21 -8 -85 245 -217 61 -115 105 226 54 248 239 166 -59 -259 -15 81 109 -21 48 -35 -31 224 -58 65
4886 65 -215 18 297 -45 84 -354 -78 62 -99 -72 -88 290 55 -187 33 86 -5 31 -10 -173 -74 192 -49
4909 -49 69 110 12 -193 110 -67 -22 236 -8 -18 100 -274 -11 9 -30 -34 131 117 -29 97 116 -14 -100 -92 -10
4934 -10 76 -168 -126 -13 -64 -17 161 -93 -44 61 -134 132 127 196 -25 -170 38 -112 186 -257 81 -157 -254
4957 -254 100 -63 289 126 -96 -38 -240 68 -177 75 79 -42 65 -91 98 -13 90 -201 -172 218 2
4978 2 43 99 -47 268 -75 150 87 -7 -2 -158 457 12 77 88 101 -1 21 -189 -234 45 -202 67 35 -78 68
5003 68 -85 -41 68 -252 178 -87 41 98 181 84 -65 243 -164 164 109 106 140 6 84 8 -68 -197 -231 126
5027 126 86 31 -101 8 44 -103 69 105 123 114 144 210 -261 79 39 161 54 120 -49 -43 -49 -54 -22 258 -125 149
5053 149 -288 -158 -150 -68 114 16 -59 209 70 219 -108 123 63 2 257 -34 74 -396 357 29 101 -121 -140
5076 -140 166 -182 191 -24 -242 -247 -135 259 32 -165 -115 -23 235 23 -81 -12 46 -4 -57 -60 114 3 67 119
5100 119 45 142 -30 165 45 -113 -142 117 46 -294 92 -180 -78 -100 -140 55 -47 -54 48 -86 -227 97 27
5123 27 -3 248 -14 239 -123 16 285 110 -6 -160 95 -3 -161 96 -41 131 -77 33 -122 -221 64
5144 64 -212 146 72 -36 -26 105 298 215 -52 -33 -35 201 0 156 64 -253 91 239 10 -271 -147 0 218
5167 218 -118 -210 45 -48 -104 39 -44 -76 111 -46 53 92 176 38 94 106 -21 -289 121 290 137 37 39 72
5191 72 -129 -161 167 -133 -274 -62 19 -135 -143 -96 -170 75 63 -50 -70 -156 27 172 -35 59 6 173 -44 -49 -120
5216 -120 -31 136 -99 202 -56 57 -47 -129 139 -40 140 -129 46 95 -93 96 177 -97 76 -49 -166
5237 -166 123 226 13 10 -134 -53 117 185 141 25 -259 160 16 57 -111 17 105 -232 154 40 -156 -99 65
5260 65 67 -60 -88 -35 6 136 -351 48 83 71 57 6 127 264 -205 -188 -120 -175 97 90 -55 -92 -36 -107 72 -148
5286 -148 12 83 25 -3 158 100 -38 41 39 -10 109 170 128 128 37 -6 -279 15 -123 -18 -167 -88 -45 -244 128
5311 128 -169 -49 220 -32 156 -237 -141 87 202 50 -168 62 -131 -4 -72 46 300 59 -13 -130 127
5332 127 131 -109 154 162 31 -4 -10 105 -72 484 3 267 81 -4 21 -100 80 -82 -82 -264 -112 -177 11 19 71
5357 71 -64 79 19 175 -142 -65 -38 -61 -21 -167 4 5 -114 34 -159 65 -19 -182 81 225 261 24 -242
5380 -242 -107 181 46 -80 79 -126 121 62 -35 31 -200 -87 -121 -210 3 -142 33 -64 -93 14 48 185 -87
5403 -87 241 51 -139 -156 43 -21 -147 -80 129 -196 -5 64 -108 -43 -42 181 -41 55 -38 37 -31 46 -38 73 177
5428 177 31 136 -240 -232 56 -24 370 -213 2 178 -94 -205 -110 186 36 -17 186 95 -74 4 79 -17 -294
5451 -294 -178 43 -76 -214 -169 111 -336 118 -331 60 -78 -76 139 288 261 -217 98 165 -73 31 -30 30
5473 30 107 -136 -119 23 -21 -201 52 27 151 92 3 61 -174 13 103 -90 -75 59 5 171 234 137 -39 342
5497 342 132 145 116 83 53 -139 -7 145 61 59 110 15 -168 -50 254 81 -32 -91 181 145 -223 -89 139 2
5521 2 -34 -58 138 -4 299 136 137 -98 60 221 -54 291 35 0 77 -310 -144 81 -31 -230 -95 -64 -76
5544 -76 213 -137 81 108 -4 181 -312 277 -1 -116 117 1 223 142 211 30 2 -41 -39 21 29 -192 196 -98
5568 -98 174 -176 -9 8 -269 153 42 9 58 222 -99 24 -83 -213 76 -114 47 143 195 -65 -71 26 -23
5591 -23 -167 190 -164 -72 -14 -138 -64 -129 40 -134 117 -163 -123 -63 -187 104 46 -27 208 112 93 96 53 152 -244
5616 -244 -75 108 65 123 151 55 2 42 34 172 -101 102 130 -94 2 -39 -134 47 182 -168 -197 169 -13 36 301
5641 301 -2 11 -35 50 -233 277 -21 -27 -103 -53 -142 -150 123 -43 114 -96 159 25 23 -21 43 127 -107 113 187
5666 187 -18 26 -61 -88 212 70 -69 -60 8 116 27 99 195 -87 12 12 -86 175 -167 87 -195 169 13 53 262
5691 262 -185 101 -84 20 -83 -122 -94 -116 -235 -183 -258 107 -21 206 -50 -115 -253 -271 -224 -46 -11 24 -120
5714 -120 -28 133 -3 -85 -104 3 351 -20 -60 151 -66 -75 8 210 -1 57 -292 -84 -213 86 -141 102 -89
5737 -89 84 -180 -50 28 128 191 -234 151 38 82 31 10 41 51 20 217 -236 39 68 46 47 -292 5 -64 -38
5762 -38 47 -259 83 -110 9 -165 -99 33 -45 -97 -62 136 -120 -123 -155 -62 143 -67 -44 11 77 -31 -53 159 100
5787 100 -3 159 -223 96 78 -85 -97 99 48 -150 18 43 10 -41 -69 152 155 -20 -237 93 111 26 139 96
5811 96 18 -34 78 -28 16 -175 -40 -56 -57 64 70 -120 -90 -96 -104 6 -225 154 -24 -100 119 -144 150 -59 -51 -172
5837 -172 -103 200 -121 157 120 -146 -97 -83 61 -146 70 -63 -54 -17 -194 -82 -112 4 -46 -16 -56 -84 191 -54
5861 -54 -1 -155 20 6 -77 117 -107 59 12 -65 165 169 298 104 197 -143 -204 -169 34 8 -124 51 48 62 9
5886 9 7 61 17 126 119 93 -172 -46 38 -53 110 47 -257 113 124 -150 52 -286 -63 -205 -97 187 -77 73
5910 73 74 -55 117 50 121 41 175 -172 -71 -63 -99 20 -185 143 34 -177 263 -194 157 34 -191 -49 -255
5933 -255 185 -81 -125 -87 -71 61 -152 -22 34 -117 5 -74 3 44 -126 38 111 159 32 198 295 69 -54
5956 -54 5 44 -160 227 -88 24 -6 -247 66 -110 1 -90 -210 -196 95 36 -164 -113 -13 -34 244 -219 40
5979 40 96 -64 -114 -169 37 -18 -10 -158 58 242 180 84 -152 -175 189 -48 -38 31 -115 241 -11 35 -65 157
6003 157 -23 26 57 22 35 57 -49 -2 -45 -88 -48 -194 -231 288 215 63 -28 -22 222 62 147 -64 12 21 -65 -60 197
6030 197 109 -77 68 41 33 55 -124 66 -114 50 68 13 -7 79 -116 51 37 -31 244 -152 -123 -60 -122 -186 27
6055 27 -31 -191 12 -107 -94 131 45 19 -282 -81 -46 -85 170 -46 -10 -51 -75 227 -71 143 97 91 74 -128 -88
6080 -88 -64 76 -196 -231 -141 -60 79 -72 67 2 -128 115 168 -121 -23 171 -90 193 18 151 41 207 -136
6103 -136 175 -116 131 -168 -12 -274 -217 62 -182 -40 205 253 -144 -113 -65 68 154 99 -60 -160 187 135
6125 135 125 95 109 -72 82 -132 118 205 96 91 -36 -85 78 121 126 -115 198 -20 -129 -5 31 -170 53 117
6149 117 -58 57 -221 -18 60 -73 -80 -50 -33 328 -69 -51 191 -13 -77 59 -71 -179 172 121 -48 64 -203
6172 -203 95 38 82 -258 82 -7 -34 254 -172 -22 -51 -113 -155 39 -10 -10 102 137 -66 132 10 57 145 86 -180
6197 -180 -223 -59 -124 -12 -136 59 -121 28 -315 70 -88 8 35 116 -90 89 86 94 72 -232 -105 94 18 183
6221 183 -96 -252 -56 -72 -19 35 130 147 5 0 42 132 46 -88 -17 71 -61 -169 13 -135 337 37 -124 161
6245 161 -119 -216 205 -135 243 -110 -126 -340 -180 -191 82 80 -194 -62 -79 -104 -23 -43 -20 -44 25 -173 172 45
6269 45 -41 -45 -60 -174 32 41 32 173 -69 183 94 -88 -24 118 73 63 -229 130 -103 -159 148 -170 80 -117 148
6294 148 62 47 -178 -43 87 64 -98 -33 -61 104 -126 -163 -64 -237 38 -196 -26 -160 -96 -81 -109 165 -118
6317 -118 99 -193 -130 -169 142 49 -140 -46 -195 25 15 -73 113 -58 3 165 32 230 -110 54 -17 -26 -102 -13
6341 -13 21 133 83 -39 -77 -208 -78 -78 214 30 -156 155 -27 -383 -159 -160 -120 67 76 -43 -3 94 47 -66 -89
6366 -89 58 19 -125 206 149 -170 49 -40 -174 -139 -153 74 -93 58 -223 24 -117 51 -208 -70 26 49 -59
6389 -59 -241 -164 272 -17 -71 95 -71 124 -39 -25 -117 -106 -7 -5 31 102 -213 -272 -136 -21 -148 103 211 -11
6413 -11 -177 -111 110 101 -67 190 -386 -80 207 135 -31 93 -102 -126 17 -91 78 50 122 81 52 28 155 -59
6437 -59 -7 58 -38 -24 63 -56 176 35 54 159 6 31 10 80 -42 -102 -194 89 192 -25 -165 12 28 -66 227
6462 227 -75 -82 188 143 -105 160 -141 -22 -57 22 34 178 -27 243 -25 -10 35 -12 -63 -58 380 -158 7 105
6486 105 -83 12 -44 -31 41 219 221 204 -84 -129 22 59 -10 87 -92 -8 -33 -64 227 -42 292 -78 56 -289 -27
6511 -27 209 196 -169 -114 -124 16 47 96 -91 -70 147 -176 -189 -53 64 -13 116 -31 30 127 -135 -3 -160 -176
6535 -176 88 126 89 -255 -3 132 -112 -34 145 -236 -66 -163 85 -186 -52 140 -143 -52 -271 196 153 -49
6557 -49 -232 -160 -177 -116 -21 -73 -122 -59 -20 -52 -68 37 92 66 -261 -81 123 -123 41 -205 25 -45 80 35 -66
6582 -66 26 150 117 -24 13 -5 -79 73 231 -282 103 184 37 -280 -151 -26 218 125 10 -58 -99 -75 109 -13
6606 -13 230 -133 -141 61 -175 -101 23 51 -163 12 -163 -22 127 -99 -61 -57 8 -8 -159 -306 227 -260 -121
6629 -121 129 66 194 -43 49 -104 79 44 -128 98 156 21 -135 -92 261 -68 -88 53 59 -27 217 111 -43
6652 -43 -59 -380 164 -104 -441 -228 38 66 -73 185 -103 -64 -184 -77 226 38 -54 102 5 182 -151 -18
6674 -18 -48 301 -21 -73 58 73 163 70 39 158 151 183 -51 155 -40 -159 63 -21 -28 26 -80 71 -147 43 -107
6699 -107 30 -155 -176 7 -215 128 27 159 -118 -186 131 13 229 -110 -24 -180 55 -52 -62 129 97 -52
6721 -52 -92 -39 57 96 2 25 -30 306 98 -64 -69 -173 31 -134 -18 83 7 -181 29 53 137 87 143 -174 82
6746 82 -189 133 -73 -32 258 63 134 8 98 114 11 11 179 -95 178 -91 -96 -332 -54 -148 -34 -160 -37
6769 -37 -85 -165 -113 155 55 -66 -403 171 -81 326 158 -41 89 -165 4 -21 -82 -233 147 0 -110 -108 -86
6792 -86 -160 63 43 153 98 -52 -160 -58 -15 -164 165 -57 -110 -107 -5 -93 59 -193 -229 42 -47 198 246 170
6816 170 36 71 -51 -22 81 -93 -174 78 -31 -79 -81 -89 114 -111 -23 7 -60 70 -2 -77 175 29 108 134 122
6841 122 -32 -85 155 70 157 91 17 -161 96 53 -132 -164 -25 108 -85 -7 11 15 157 -80 194 46 -28 63
6865 63 -184 229 -26 -329 75 45 160 -134 -83 10 -300 132 -33 -286 -302 126 39 53 105 -16 -42 -26 -35 -105
6889 -105 101 -41 73 65 7 32 -154 201 -83 -161 110 173 101 -1 -279 25 -37 -103 294 -59 -4 25 -14 254
6913 254 67 -208 54 -249 -173 2 -51 114 60 107 6 12 75 119 -88 272 119 -39 67 379 9 237 -48
6936 -48 230 92 117 54 -169 109 194 -56 -99 -126 122 168 101 84 -240 -22 -20 -6 -186 -291 11 97 -150 204
6960 204 -63 -115 28 6 -148 -77 12 -31 -13 -111 0 57 -7 -48 -125 20 23 320 -130 34 120 -24 -31 -347 -148
6985 -148 57 219 -119 8 -69 -141 -128 -160 -51 112 315 -21 13 122 -35 74 -38 102 -76 -48 34 73 168
7008 168 94 -48 18 -5 -193 51 27 308 48 48 -137 -134 -101 -14 180 -290 62 -53 -56 -155 -262 203 46 62 62
7033 62 65 -121 -69 128 161 56 134 67 138 -56 25 -75 -196 124 1 217 -260 -192 -117 -24 34 -117 45 -2 -43
7058 -43 -52 -324 135 41 12 -101 124 71 135 -65 130 -155 122 -50 -177 -60 83 -281 118 -90 -302 -180
7080 -180 -94 224 138 119 -100 -182 137 -14 -36 -11 -267 -25 19 290 53 316 261 -27 152 263 137 -184 46
7103 46 113 51 -58 26 146 30 -90 254 -208 -109 -71 -120 -216 15 248 128 -104 -48 -24 -22 11 -30 -287 70 103
7128 103 -85 -8 -74 72 7 -13 -159 165 -96 -179 -14 -44 -10 0 109 80 52 23 -175 -32 55 -61 185 -90
7152 -90 31 82 -71 -12 -29 6 29 67 -70 63 157 0 -174 -27 -168 -154 -62 303 -102 -146 58 -86 62 -122
7176 -122 23 60 -115 -243 137 177 -4 -149 -78 97 -11 -10 226 60 149 -68 19 -70 -68 93 56 -178 118 77
7200 77 -96 -35 -92 201 -33 -370 -18 148 103 -105 -121 -104 43 113 110 -138 -191 -188 -388 -53 108 -62 14 100 70
7225 70 208 178 -16 -188 191 164 50 73 -160 -27 -156 9 29 6 110 -126 126 196 -48 56 -95 -15 -10
7248 -10 -18 65 -164 125 -133 -143 -61 35 -24 189 294 -84 -8 -4 -148 -91 1 57 34 -29 0 17 -82 -86 -4 -72 -223 127
7276 127 -36 21 -5 -172 58 -92 -36 -99 -120 145 -203 136 -40 -153 -165 -140 27 281 -114 -160 -40 1 -245
7299 -245 8 89 -10 44 -13 -205 32 25 3 -137 -67 227 -94 98 -45 -276 -192 -105 160 265 91 -37 -64 -164
7323 -164 102 -300 -78 -17 -113 101 52 -109 -106 226 -2 241 -88 48 -305 -47 70 13 -367 70 -10 -185
7345 -185 -18 109 22 38 54 92 -64 160 -135 273 189 -55 9 227 23 6 149 -212 107 -127 -158 -103 154
7368 154 -65 -5 94 -117 -15 144 -59 179 -63 -294 68 -107 188 -139 66 67 -52 -68 -156 17 -167 197
7390 197 51 87 28 -158 52 -133 -29 92 -158 -31 1 -31 -101 -55 -122 -237 107 41 122 281 80 207 -5
7413 -5 -100 183 -89 16 -74 81 -204 150 5 45 91 93 9 141 -74 19 -1 -157 212 89 27 22 222 77 190
7438 190 -32 -153 159 -94 -112 9 23 -81 65 -8 94 -1 241 -84 -101 -274 45 -34 2 52 -151 206 -5
7461 -5 -65 143 274 14 -221 221 39 62 131 67 -31 -201 -8 201 12 0 -126 -120 -294 -38 -1 -118 97 -48
7485 -48 106 -67 -52 -178 222 -32 -37 99 19 -152 60 -80 -140 70 -14 -34 31 15 -72 108 -169 -233 214 -12
7509 -12 226 -147 -15 -38 138 54 18 217 55 -53 -18 -93 -49 352 28 -98 224 -67 1 275 132 -81 47
7532 47 7 153 -112 80 65 61 -138 82 -64 -88 -31 82 -160 -129 -153 111 -15 -256 63 -55 -54 -105 -38 -87 -81
7557 -81 135 -58 -114 134 -31 73 37 151 326 -44 82 76 37 -179 -98 126 50 59 -47 60 -68 -5 -30 -57
7581 -57 59 91 61 102 17 -158 -104 106 -119 130 -6 45 -95 35 -83 -141 2 -79 -44 79 134 122 76 -92
7605 -92 98 -19 -169 -151 85 174 35 21 -59 -278 246 -84 -154 -124 76 -28 -3 156 9 108 -99 -77 74
7628 74 278 -58 -91 4 -180 -232 -99 -327 -32 -22 -205 37 -104 216 -137 74 146 75 42 74 43 68 -47 -51
7652 -51 110 -153 110 36 14 -6 -112 -111 -32 -119 177 -141 -110 49 57 -57 59 -129 16 -20 -135 -82 -58 -206 63
7677 63 -129 -79 -33 38 168 1 197 -222 -226 -40 -107 15 -181 140 213 202 -103 -78 -15 -157 -42 -76 -106 -48 -118
7702 -118 -27 65 -48 9 -90 -8 -54 124 -276 107 180 132 123 35 147 -43 221 36 -56 252 -20 79 90 61 142
7727 142 60 303 -30 155 -46 186 -25 3 -84 33 177 68 -136 171 -186 -41 -359 -13 -11 -49 -80 33
7749 33 -17 83 186 -223 70 -137 -86 -87 210 -37 36 68 -133 -65 -50 -105 55 68 34 -126 -11 24 174 -33
7773 -33 -12 -71 -84 28 -15 36 148 -49 253 20 -20 -98 18 59 -53 8 -114 -148 5 -76 128 -96 -7 -14 -244
7798 -244 147 62 36 -36 -60 -86 -198 -65 19 34 -102 145 -113 -338 138 -134 89 -235 -90 59 44 223 51
7821 51 73 32 274 -123 -266 87 -7 -127 -30 16 67 230 -83 -71 -21 7 -220 -219 2 61 41 -15 -8 159 80 -180
7847 -180 100 -3 232 27 107 -207 -176 -55 -171 78 -11 100 -175 -122 67 4 -40 -99 -7 180 241 -116 -48
7870 -48 -124 218 -185 107 2 35 229 36 -57 152 95 -117 63 39 53 172 174 45 98 -170 -14 229 126
7893 126 27 -123 -11 42 139 163 -172 177 -147 42 -90 -137 -105 -81 140 11 4 -141 158 -111 96 -177 -39
7916 -39 215 -40 -62 -18 90 122 116 250 200 -177 14 161 -31 212 106 -109 -7 68 107 60 42 150 -61 167
7940 167 -26 -49 29 -89 130 -2 147 -153 -108 -61 -143 -19 142 343 -77 114 130 -20 -328 -2 -36 143
7962 143 -95 -69 186 -69 -65 -47 -209 50 19 -204 -10 -68 224 2 177 -56 216 -213 -61 112 13 -93
7984 -93 -240 29 286 -213 54 91 74 56 -165 -91 -76 10 103 -282 -61 51 212 -83 10 -55 -194 -126 -67 -21
8008 -21 17 -252 72 82 90 -81 -159 -102 -47 29 71 209 -3 -25 87 -227 30 32 8 70 92 -38 27 60 8 -270
8034 -270 114 -56 164 216 -107 -55 -23 9 -65 233 40 -144 -97 -146 -46 -40 93 -55 86 -61 -244 163 221
8057 221 8 131 -72 -243 168 86 116 220 -54 -75 3 113 -58 218 -53 -107 94 94 -273 -38 -104 -163 59
8080 59 -173 -118 -94 -34 34 -126 -138 39 -116 43 63 61 -50 -73 -226 -114 -15 8 23 -147 -109 35 -71 70 133
8105 133 138 23 -48 335 262 6 -122 -3 -157 -42 -91 61 16 26 -211 -110 -9 -29 30 -78 205 -70 -27
8128 -27 -158 239 -113 78 9 -92 106 -102 155 59 -229 -33 -59 -36 -83 98 42 -40 112 -101 -220 13 -7
8151 -7 -6 17 21 -78 -119 68 52 -5 -39 103 -78 215 -137 -136 -32 72 129 -246 46 0 -12 -6 77 -99 37 -69 92
8178 92 94 -12 38 88 -57 64 3 192 101 -32 -176 -64 96
8191I6
$$ Imaginary data points
##PAGE= N=2
##DATA TABLE= (X++(I..I)), XYDATA
0 0 0 0 0 0 0 0 0 0 0 0 0 0 0 -8 8 -8 8 -8 16 -16 16 -24 24 -32 36 -40 48 -56 65 -73 87 -97 112 -124 141
35 141 -161 177 -201 225 -250 277 -310 342 -382 422 -463 511 -565 623 -686 755 -832 917 -1011
54 -1011 1118 -1238 1375 -1529 1709 -1924 2178 -2493 2885 -3399 4097 -5112 6729 -9727 17257
69 17257 -81484 -122222 -40759 -30086 -10614 -49437 -19830 10047 68464 61045 42116 22019
81 22019 9248 48510 41936 29130 14032 -21831 -5075 -3757 11964 -3056 -13728 -23571 -33149
94 -33149 3072 5676 18629 8577 -18254 2839 14191 43713 36128 13297 -10930 -15838 20393
107 20393 11835 6358 -26569 -52357 -23314 -12496 3736 -18470 -35845 -31091 -7787 28137 15826
120 15826 15333 -5264 -1758 33265 31737 36809 7150 -9103 -9002 -3007 11236 -9168 -15070 -37924
134 -37924 -31745 -6027 -5647 10291 -9282 -11133 1374 18688 38167 20960 13411 -6061 7486
147 7486 27669 20359 15859 -21144 -22082 -6557 7268 13146 -15180 -24643 -32024 -4451 12880 1999
161 1999 -2947 -25075 -5511 11019 17559 15425 -8375 -4514 -3918 14020 11043 -5206 -7928 -23998
175 -23998 -6210 -2492 -789 -2596 -19725 -12028 -11878 7878 13046 7547 3958 -11171 9870 17853
189 17853 25259 18645 -5150 -1039 1541 21373 15609 -3185 -13342 -18451 9033 10368 6165 -10798
203 -10798 -24220 -3337 5987 17359 -951 -15874 -13320 -8408 13927 4029 -1844 -12540 -14432
216 -14432 3233 936 8441 -3589 -7286 -4057 -3781 11934 3056 4090 -3967 -6019 8195 7571
230 7571 16975 256 -6359 -3809 2048 18329 4487 -2361 -16486 -12775 6892 5858 5748 -15684
244 -15684 -14950 -4880 4198 14131 -4327 -6074 -8710 3942 15274 4769 2910 -10066 -544 6254
258 6254 7837 8320 -9112 -4670 -6912 1489 7240 -1128 -494 -13775 -5668 -683 4175 7874 -6839
273 -6839 -4056 -8315 5288 12422 3002 -389 -11697 2158 8448 10297 4777 -12537 -3826 1040
287 1040 15012 10094 -5624 -6460 -8865 8971 8730 2358 -7541 -15987 -1730 -2394 2924 -4841 -11535
302 -11535 -5405 -6351 5548 225 375 788 -1336 8829 4990 13099 7574 2590 4940 773 12140
317 12140 7090 5002 -4606 -12162 -1004 -354 6500 -6592 -14597 -10632 -6367 8912 95 -5463
331 -5463 -11740 -6712 9340 5667 5023 -9091 -6641 4217 6963 10511 -6998 -8048 -6304 902
345 902 7989 -2310 -2081 -9781 -1260 6614 5512 9949 620 4870 3019 6269 9969 1311 2554
360 2554 -8253 -4348 -2354 -3112 -300 -12036 -8887 -7146 2837 7507 -889 -694 -7055 6911 13430
375 13430 11107 7079 -6615 1244 4359 9781 4682 -7847 -7880 -10688 1159 -2000 -7918 -8387 -13156
390 -13156 -255 522 4286 1134 -3483 3139 2705 12442 7435 4985 3308 -4406 4897 3243 6160
405 6160 108 -8072 -7018 -7998 3968 -291 -2699 -7553 -9729 7074 8077 10547 1937 -3367 4930
420 4930 9995 16009 838 -6815 -9691 -5811 7149 -2611 -6888 -15663 -12869 470 2194 3145 -7808
435 -7808 -4756 -1981 2745 8708 -2329 330 -3651 -1194 4208 -296 1954 -4785 -2597 -4079 671
450 671 6540 -623 2672 -5539 -347 10313 10981 12360 -475 -720 2530 12035 13585 -521 -4147
465 -4147 -12196 -448 6111 -2415 -8067 -17427 -8788 -1536 2729 -2849 -12444 -5847 -3619 9635 8933
480 8933 653 2096 -2345 6505 8839 8646 2955 -4228 -2291 -5798 3990 1719 -3095 -3740 -11166 -251
496 -251 3677 5975 871 -6230 -2809 73 12073 3793 -4282 -6097 -7591 8065 7593 3069 -5704
511 -5704 -9390 -49 5667 10885 -1787 -5382 -4136 -2740 10421 3519 -146 -5099 -5515 2023 2256
526 2256 3750 -6060 -6242 -6506 -3796 5703 -2505 -3150 -7050 -6721 3612 6065 7425 -2565 -3182 -1999
542 -1999 5088 14058 4049 1467 -6108 -2678 9127 7331 3821 -7998 -6943 -2448 5920 8154
556 8154 -6070 -6630 -8085 2775 10826 2628 -1998 -9489 -2139 4725 8534 3538 -8251 -3878 -4150
571 -4150 4434 6968 -833 -1163 -6285 208 2318 4031 2147 -4764 -2264 -5675 3567 4906 -1240
586 -1240 -2645 -9593 -1181 4322 6826 1084 -9318 -5424 -1537 11173 7562 -2596 -5468 -7997
600 -7997 7022 10037 5611 -3273 -8393 10 3462 8888 -615 -7363 -5363 -4167 6326 1411 -2407
615 -2407 -6123 -7044 797 1951 6239 -1640 -4551 -3156 -2142 8730 5529 3024 -3617 -6256 3123
630 3123 6152 9193 -1448 -5717 -4243 863 10462 1285 -4435 -9410 -5186 5738 4082 1332 -9694
645 -9694 -7812 -613 5371 8162 -3455 -4296 -4854 1710 8684 3669 2281 -5343 -1387 1912 4021
660 4021 5657 -2648 -1771 -4983 -235 4905 1436 1223 -6717 -3043 939 5254 6348 -4441 -5203 -6013
676 -6013 3765 8373 1581 -3213 -10871 -1853 5598 8088 2576 -8564 -4531 -1032 8243 6394 -3051
691 -3051 -5097 -6220 4760 5538 1996 -3048 -8194 -865 646 4756 -551 -6854 -5078 -5569 2983
706 2983 2383 2350 -624 -4830 1809 3247 9599 5879 710 -401 -2106 7053 5749 3418 -3672 -7786
722 -7786 11 1605 5333 -3078 -8956 -6447 -1989 7305 1068 -3328 -7310 -4658 5829 5321 5384 -4034
738 -4034 -5322 -454 1909 6228 -1672 -3250 -5778 -2789 3532 895 2056 -3689 -2319 998 2773
753 2773 7067 228 -987 -3791 338 6560 3493 2552 -6424 -4629 758 4623 6320 -3940 -5219
768 -5219 -5281 2179 7853 2541 176 -5639 1843 6675 6383 3436 -5486 -2706 -1473 2758 881 -7128
784 -7128 -7103 -9346 -1961 -857 -1613 -2144 -6988 -1821 -693 4302 4582 1229 1989 -2183 4508 5991 6348
801 6348 3638 -3094 163 101 5126 2781 -3997 -4971 -5724 4033 3941 1141 -3025 -6285 2279 5216 8031
818 8031 508 -5191 -2154 -510 6595 1067 -2732 -5213 -5026 2575 455 666 -4513 -4220 -345 -358
834 -358 3989 -1005 -781 -1139 -757 4151 1798 2900 -2015 -3443 -1697 -873 4142 -2082 -3055 -5447 -3498
851 -3498 4320 3287 3411 -2817 -1448 3779 6385 8217 49 -74 -490 3765 7549 246 -1927 -5871
867 -5871 -1363 1745 220 -1534 -8359 -4536 -3396 -7 1345 -3968 -1463 -3972 177 2111 2060 2017
883 2017 -2722 273 -1475 2256 3432 -1635 -786 -4478 1249 3749 2300 -30 -4882 -75 1322
898 1322 6277 3041 -3672 -1403 -1864 5628 4981 647 -1668 -3619 2681 2749 3559 -1582 -3816 836
914 836 -134 4550 661 -2150 -870 -1316 3416 386 822 -2907 -3414 -751 -2537 2315 -1925 -3114
930 -3114 -2809 -4054 638 208 1831 -2497 -2688 -463 136 5590 287 -400 -845 -283 6281 3182 1584
947 1584 -3165 -1092 2896 3439 4274 -4355 -3584 -1388 1379 5273 -1839 -3183 -4573 -591 2560 945
963 945 -5 -5389 -541 358 1167 2595 -2918 -297 -1025 1486 2465 608 864 -2679 862 -491 1845
980 1845 3177 -2970 -1413 -3752 193 2477 887 -1240 -5810 -804 790 4182 2049 -4467 -754
995 -754 -397 4870 4632 -551 -1676 -1560 4656 3159 2551 -1300 -4136 1461 379 3030 -310 -3713
1011 -3713 -1543 -2495 1364 -345 1050 -1649 -3405 -144 -1809 2954 618 -1791 -1620 -2938 2987
1026 2987 2628 2217 -2326 -2696 2399 2744 6310 -1119 -3991 -1458 1085 5744 980 -2112 -5339 -2015
1042 -2015 2632 1299 853 -5729 -3736 75 226 2611 -2525 -1861 -2164 1319 3474 717 1577 -2650
1058 -2650 528 1482 1539 3902 -1429 -764 -2456 351 2834 1564 1557 -4166 -1675 -102 2114 3540 -3084
1075 -3084 -2546 -3110 1389 3962 576 -1229 -5050 901 3016 3691 1457 -5298 -1266 246 4768 3938
1091 3938 -1399 -2051 -2834 2859 2474 1496 -1628 -5580 -1272 -1721 774 -807 -3806 -2671 -3852 1485
1107 1485 1042 1369 -79 -2662 1676 1675 5394 3020 -1016 -680 -606 5700 4074 2145 -2329 -4221 1332
1124 1332 2051 4239 -1760 -4980 -2245 -375 5095 950 -1058 -3482 -1835 3988 1721 1458 -3689
1139 -3689 -3222 -464 184 2662 -1809 -2480 -3414 -1570 2064 299 1504 -3067 -2682 -206 1098 4574
1155 4574 -97 -637 -2895 -370 3902 2476 1196 -4777 -2777 793 2598 3455 -3018 -3203 -1564 3886
1171 3886 6965 2250 244 -2819 2184 5115 4789 1723 -4466 -1886 -996 1864 1150 -3624 -3670 -5411
1187 -5411 -1015 -308 -907 -1626 -4737 -1317 -933 2351 2551 -418 -247 -2052 2955 3887 3231 588 -4092
1204 -4092 -984 505 4183 2173 -2895 -3208 -2931 3642 3757 1528 -1760 -3871 1922 3154 4650 42
1220 42 -3009 -845 663 5227 1441 -1508 -3063 -2681 2217 962 1850 -2427 -3370 -725 273 4024
1236 4024 917 -444 -2186 -2463 1433 736 1209 -3646 -4748 -2393 -1133 2445 -1423 -3146 -4335 -1217
1252 -1217 4285 2437 1304 -3406 -1280 2823 4951 5994 -469 -1233 -368 3398 5333 1075 -340
1267 -340 -3625 -653 1481 967 677 -3781 -1576 -1432 587 2229 -464 -472 -2760 362 1528 1921 1870
1284 1870 -3104 -1999 -1614 1753 3032 -1254 -2390 -4749 -298 1923 2580 158 -5050 -1442 333
1299 333 4057 2579 -2231 -2543 -2009 3029 3165 174 -2527 -4243 1360 1817 3014 81 -3185 -586
1315 -586 452 4194 2398 753 -924 -1513 2048 1220 2881 103 -2436 -710 -1489 1505 79 -1279
1331 -1279 -3172 -3687 146 -110 1254 -2469 -4125 -1223 393 4275 1408 -1328 -2084 -91 4464 2894
1347 2894 2792 -2183 -1904 1587 1926 2941 -2044 -2813 -2096 235 2204 -461 -1016 -3418 -665 1676
1363 1676 868 2033 -1677 -649 -77 1402 2994 971 565 -2200 -154 1388 1835 2630 -2513 -2556 -1685
1380 -1685 848 2608 -737 -2027 -4101 262 2240 1553 165 -4007 -453 1367 2818 1849 -2740
1395 -2740 -2133 -1152 2764 1667 -374 -1401 -3338 1062 593 1142 1025 -1521 297 -92 1712 1448 1426
1412 1426 441 -1848 785 -50 1352 231 -3190 -2039 -2164 1254 873 -993 -2930 -3017 1963 2055 3135
1429 3135 42 -2445 1075 2460 4822 1792 -354 -869 317 3164 541 -202 -3289 -2874 72 -1278
1445 -1278 -598 -2769 -2872 -1744 -339 1933 332 1155 -868 331 2316 1363 3173 41 -762 -556
1461 -556 228 1478 -373 -276 -3166 -1760 292 -92 1244 -2632 -1491 -238 1662 3097 197 -383
1477 -383 -1678 1850 2849 1130 917 -2866 -628 1022 1359 1153 -1926 -1238 -1068 1679 1283 -239 338
1494 338 -2179 1479 1287 824 796 -1051 -45 -747 952 17 -1230 -1587 -3396 -928 -1112 70 -238
1511 -238 -3181 -1571 -561 2761 2189 999 -65 -740 3518 2709 2449 47 -2092 1381 1407 2146 -707
1528 -707 -2237 -1550 -495 2391 -670 -1153 -1921 -1843 1250 8 1133 -562 -289 567 206 2080 39
1545 39 1185 -482 -829 882 -312 1051 -1164 -1659 -1463 -968 1638 -498 -1162 -2875 -1696 1412 574
1562 574 819 -2732 -1760 480 2182 2847 -713 -487 -764 1949 3078 855 360 -1507 903 2052 1408
1579 1408 938 -1536 -183 -253 1166 733 -1427 -841 -2312 -200 158 114 543 -2046 -534 -933 896
1596 896 1370 -386 -799 -2687 -211 582 738 -257 -2529 -540 173 2260 1179 -983 -960 -822 2639
1613 2639 1768 630 -806 -1934 1006 1248 2018 -590 -2132 -749 -588 1841 -347 -446 -705 -1370 1556
1630 1556 630 1925 344 -65 1046 161 2614 1137 634 -1046 -1590 799 164 860 -2233 -3404 -1863
1647 -1863 -909 1607 -1150 -2194 -2745 -817 2584 1586 1334 -1545 -342 2469 2818 2987 -853 -576 -268
1664 -268 1448 2462 -812 -1082 -2506 -439 501 89 249 -2044 -811 -721 537 1463 -349 310 -1368
1681 -1368 97 1089 1302 1575 -1413 -671 -729 1207 1647 -469 -1071 -2938 378 1422 1021 -154 -3146
1698 -3146 -719 615 2632 1303 -1662 -1123 -1123 2370 1770 -149 -1155 -2496 586 785 1243 -364 -1759
1715 -1759 -215 -217 2270 904 245 -129 -1229 1671 1240 1753 362 -1109 -485 -398 2437 519 -474 -2112
1733 -2112 -2540 493 606 869 -1896 -2979 -1324 211 2397 -252 -813 -1388 41 3627 1958 1064
1749 1064 -1289 -423 1886 1791 2138 -1197 -1518 -1416 -252 1472 -1125 -1175 -2418 -1834 -48 71 838 -1247
1767 -1247 -358 -836 802 2606 847 1158 -1400 -42 1960 1717 1554 -1848 -1449 -930 1449 2213 -1104
1784 -1104 -1974 -3178 -43 1716 702 -238 -2906 -574 723 2598 1596 -954 -70 -546 2098 1367
1800 1367 -304 -795 -1874 -48 213 761 -131 -1583 -552 -1172 1636 1222 157 -202 -2134 -12 477
1817 477 1844 187 -1803 -1490 -1174 2036 899 -856 -1732 -2561 1081 1304 1171 -966 -1731 223 1439
1834 1439 3473 797 -274 -581 -139 2993 1288 781 -1101 -1590 61 417 1179 -1005 -1477 -1587 -1027
1851 -1027 1272 -480 -4 -1292 -1651 280 783 1450 -389 -380 -925 350 2467 336 -21 -1966 -1310
1868 -1310 807 1251 1160 -1804 -1601 -905 1070 2049 -691 -646 -2083 -284 1574 607 224 -1977 -297
1885 -297 643 2090 1611 -644 207 -141 1646 1880 286 386 -1304 -466 -210 640 261 -1537 -1366 -2547
1903 -2547 -375 406 -427 -498 -2832 -903 497 1610 1025 -1038 -563 -615 2475 1594 -120 -677 -1808
1920 -1808 1191 1817 1177 -980 -1812 -239 394 2112 -39 -868 -199 -481 2140 774 632 6 -394
1937 -394 754 321 1148 -512 -377 -674 -1394 633 -105 40 -1310 -2016 -173 378 1934 256 -795
1954 -795 -770 -34 2255 535 -267 -1742 -1499 611 600 423 -2311 -1701 -1080 307 1325 -1052 -429 -992
1972 -992 779 2161 1235 1418 -123 1165 1550 1573 2161 199 559 -837 -51 743 -606 1 -2010 -1599
1990 -1599 -1153 -94 320 -1433 -510 -1560 649 1608 511 219 -1553 524 1183 1495 771 -1342 -693
2007 -693 -679 1468 630 -1116 -982 -1764 569 500 368 -538 -1325 654 287 1785 374 -329 309 -448 1338
2026 1338 508 646 70 -772 365 -377 1267 79 -639 -622 -1050 1268 485 736 -532 -1366 107 258
2044 258 1314 -345 -1181 -1048 -731 1227 -766 -897 -1875 -1666 724 254 328 -1796 -974 368 696 1767
2062 1767 92 336 154 965 1891 567 880 -558 91 98 57 528 -772 -80 -1190 -687 260 -302 401
2081 401 -1320 -655 -57 446 1538 -492 56 -729 1082 1959 298 59 -1492 278 791 658 57 -2227
2099 -2227 -726 -588 536 -56 -1459 -637 -1210 810 462 142 -163 -769 768 431 1208 509 -161 189
2117 189 -558 784 366 523 58 -902 145 -193 1200 424 -465 -327 -930 951 344 -92 -1105 -1243
2135 -1243 327 287 676 -1104 -1481 -706 -32 1325 -411 -834 -994 -64 1281 583 601 -381 121 1091 767
2154 767 1553 -145 -68 -88 -326 220 -792 54 -1178 -1007 -339 -486 605 -599 -328 -857 -14 1385 348
2173 348 698 -839 -16 816 1303 1577 -857 -656 -471 296 1148 -668 -606 -1480 -110 862 383 -23 -1689
2192 -1689 -67 442 1190 688 -911 -309 -717 921 701 249 110 -911 384 -98 566 569 -691 124
2210 124 -693 714 425 381 245 -984 470 278 927 -18 -1319 -974 -961 748 126 -700 -1239 -1530 532
2229 532 825 1134 -369 -729 353 678 2029 424 -175 -117 52 1377 305 545 -865 -660 163 -474
2247 -474 687 -682 -794 -720 -774 673 121 225 -603 -409 433 310 1369 -123 -543 -538 -41 1368 209
2266 209 -173 -1572 -859 581 452 560 -1726 -921 -286 604 1124 -715 -413 -1095 478 1152 523 -16
2284 -16 -1320 312 522 813 961 -569 40 0 794 933 783 723 -478 595 0 729 693 -793 -365
2303 -365 -820 -122 544 -144 -725 -2070 -498 -377 956 42 -1546 -807 -536 1165 958 -395 -675 -710
2321 -710 1308 791 979 -596 -1216 461 228 1071 -159 -764 -449 -325 824 333 379 -655 -601 302 -176
2340 -176 1249 194 -429 -291 -462 968 612 739 -483 -851 328 326 1436 -319 -1042 -747 -152 1236
2358 1236 236 -615 -1672 -877 555 14 29 -1451 -1206 -326 -114 826 -360 -442 -529 594 1201 510 738
2377 738 -444 267 579 712 1420 -190 166 -397 113 886 414 344 -1231 -357 -109 736 743 -697 -700 -862
2397 -862 405 1087 173 -146 -1373 180 242 670 393 -1430 -481 -274 937 557 -576 -941 -1071 442
2415 442 454 354 -274 -1209 99 51 684 158 -443 -425 -632 616 27 648 -22 -788 201 -12 1058 636
2435 636 -198 -219 -420 1084 1202 863 -352 -1027 346 484 1184 -729 -1156 -1077 -638 878 5 -498 -1323
2454 -1323 -751 412 234 453 -662 -570 87 119 1226 97 199 -366 243 668 195 579 -660 -183 -15
2473 -15 -34 949 -158 -310 -1095 -408 435 567 622 -1092 -504 236 759 1347 -411 -449 -382 908 1294 300
2493 300 -79 -1160 244 615 433 342 -1064 -421 -446 214 441 -579 -309 -1105 358 121 177 295 -524
2512 -524 -112 -552 630 479 -281 -60 -792 300 376 812 311 -978 -113 65 1100 806 -114 -579 -461
2531 -461 834 982 160 -569 -1144 182 -16 771 -493 -1273 -664 -434 978 -62 33 -201 -80 1175
2549 1175 371 741 143 139 425 121 811 108 95 -359 -872 -87 -556 235 -919 -1026 -927 -572 534 -390
2569 -390 -31 -792 -187 918 413 509 -688 -383 226 508 749 -542 -481 -473 219 703 -81 -22 -1073 316
2589 316 242 50 612 -659 -76 1 384 697 -296 182 -404 242 321 -123 392 -719 42 -147 332 763
2609 763 26 42 -693 447 661 907 306 -838 -72 -263 540 146 -1103 -792 -986 380 -145 -412 -634
2628 -634 -1178 380 257 863 -180 -372 323 304 1137 110 205 145 -152 706 30 429 50 -458 -82 -462
2648 -462 463 52 145 -363 -248 303 81 614 -198 -625 -164 63 1092 58 -478 -626 0 713 226 -11
2668 -11 -1244 -421 131 44 466 -709 -563 -566 -22 499 -667 -53 -671 -153 333 -140 432 -557 -6 67 262
2689 262 608 120 541 -168 602 559 650 964 -205 243 20 442 625 -169 -414 -1018 41 -46 -151 -309
2709 -309 -1436 -597 33 445 101 -627 -290 -453 868 551 -75 -248 -611 693 249 419 -54 -530 157
2728 157 -268 375 -179 54 -251 -695 263 -431 431 90 -385 -46 -84 598 414 266 -206 -398 511 327
2748 327 631 -262 -560 506 488 1042 -99 -366 -518 -186 894 -264 -79 -804 -337 206 -98 181 -1101
2767 -1101 -640 -150 -137 93 -661 -140 -710 -363 467 83 679 -613 201 382 481 713 205 553 -432 176
2787 176 625 274 602 -783 -456 -142 28 595 -460 -421 -875 315 297 190 27 -844 185 286 728
2806 728 344 -506 47 -250 936 409 -80 -158 -911 432 130 -182 -200 -866 -44 -103 458 -138 -163 2 -739
2827 -739 417 63 393 273 -404 300 -146 834 170 -70 -386 -627 867 466 389 -383 -624 232 318 853
2847 853 -373 -450 -453 -52 819 -507 -220 -749 -496 508 5 191 -750 -513 -126 116 707 40 188 -178
2867 -178 141 932 304 643 86 -3 -43 266 754 -215 -169 -981 -330 412 -60 102 -1161 -521 -212 232 595
2888 595 -441 -185 -456 657 1156 77 -77 -545 148 315 335 122 -672 -181 -345 511 149 -420 6
2907 6 -631 101 233 220 -20 -699 265 -47 444 247 103 75 -619 278 205 352 115 -825 -235 -69 628 69
2929 69 -588 -277 -515 833 281 260 -121 -1036 -21 -137 448 -549 -634 -323 -265 371 -74 221 -309 -306 638
2950 638 160 596 -24 64 -6 83 812 32 255 -455 -445 233 129 437 -468 -678 -493 -65 547 -9 -77 -593
2972 -593 -48 932 220 263 -973 -7 376 262 673 -417 -120 -291 522 495 171 182 -746 0 -16 36 24
2993 24 -600 120 -398 6 131 -331 163 -927 -178 -116 111 248 -469 247 -100 924 491 322 211 -524
3013 -524 538 555 827 192 -883 -226 -258 834 2 -777 -701 -955 198 -69 28 -639 -728 328 98 282
3033 282 -13 -367 68 82 696 319 216 52 -228 195 7 449 -27 -588 -203 -177 477 61 217 -280 -567
3054 -567 324 283 871 -133 -171 -83 -71 825 -16 -120 -640 -480 694 188 128 -626 -129 -74 -94 506 -726
3075 -726 -231 -400 49 392 -233 42 -483 -264 325 24 124 -327 -81 -429 -80 290 17 310 -369 108
3095 108 314 525 597 97 -14 -124 666 711 90 -250 -682 -84 456 152 -181 -881 -196 -112 299 40 -320
3116 -320 -234 -393 350 242 34 -112 -333 614 30 457 280 -309 5 -362 306 -42 -217 98 -738 -164
3136 -164 -131 473 -103 -492 -58 -267 696 541 -37 -249 -225 815 181 575 -118 -320 -39 247 882 -252
3156 -252 -12 -82 -79 545 244 -97 -691 -114 -39 -167 257 -426 -94 -543 -384 174 -240 49 -421 -380 219 -14
3178 -14 183 -240 24 -140 155 780 -261 183 -142 -104 273 429 354 -367 -224 -327 309 288 -236 -181 -701
3199 -701 -177 352 201 48 -510 180 6 408 296 -310 417 -297 340 341 -111 287 -431 -9 -179 257 -284
3220 -284 -479 227 -705 -56 -70 104 -103 -396 244 -173 370 48 -243 -244 -229 795 484 36 -55 -239 359
3241 359 487 402 -98 -368 -180 313 583 -225 -139 -84 -175 197 -222 -55 -419 -107 8 -60 -67 -404 135 -145
3263 -145 -240 466 -64 198 -132 -95 -38 -25 463 -297 -285 -73 98 453 -75 135 -406 -347 83 28 58 -677 -108
3286 -108 50 278 321 44 -15 90 243 443 150 15 -408 238 170 437 334 -350 27 -95 177 173 13 145
3308 145 -466 76 23 -48 -51 -118 -140 -352 33 212 -107 -36 -625 36 -72 157 66 -336 146 196 837 409 78
3331 78 106 -461 497 191 165 -247 -707 -51 -28 65 -457 -467 -147 -410 185 -85 -163 -119 -221 -16 461 503 76
3354 76 289 174 30 399 37 131 -233 -322 199 -66 221 -314 -368 -419 -317 456 77 -4 -66 -99 570 272 280
3377 280 -128 -61 247 348 -3 -334 -182 -298 252 461 -182 -333 -242 66 -202 -53 115 -166 117 -356 125
3398 125 303 16 53 -503 80 -25 -27 303 -320 5 -240 44 311 24 -49 -413 296 438 268 130 -234
3419 -234 232 -149 495 -44 -281 -346 -349 381 -281 -85 -450 -405 -2 -61 -54 -209 -276 36 -83 545 341 365 230
3442 230 -349 215 169 519 -118 -118 -217 -210 210 7 -217 -584 -471 -119 48 190 -511 -445 -90 214 598 212
3464 212 348 -88 150 485 517 241 -222 -375 24 -138 110 -651 -380 -476 -252 -247 -129 14 -589 46 -112
3485 -112 -72 21 -92 51 -315 -14 322 -100 253 -442 -188 154 396 303 -243 -394 -126 250 317 119 162 -41
3507 -41 246 520 465 28 -670 -76 -26 -16 -11 -430 -295 -403 419 -1 -184 -15 -348 218 60 197 47 -72
3529 -72 239 -60 154 26 120 161 -357 -43 -73 141 48 -248 -450 -109 318 83 -54 -256 -432 651 198
3550 198 630 109 17 490 249 744 342 15 -38 174 440 -164 16 -279 -489 -143 -336 227 -409 -381 -289
3571 -289 -41 159 -48 70 -236 -382 144 -47 304 -115 -163 -342 -229 265 -119 186 -170 -112 184 141 352
3592 352 -460 -162 -213 192 167 -303 -152 -310 172 91 183 -11 -416 4 -124 379 -29 -324 103 -226 158
3613 158 141 -46 159 37 230 -49 120 227 -232 -62 -238 -23 25 244 -421 -433 33 -296 282 166 -384
3634 -384 -257 -368 325 233 137 -245 -255 292 247 290 -135 -298 103 -114 272 100 -266 -178 -168 83 -325 108
3656 108 -147 -29 52 -218 260 56 -88 141 -256 165 86 295 57 -174 -123 42 529 -73 -55 -163 -125 93
3678 93 -252 -151 -758 116 51 -254 97 -364 -219 -86 103 403 -67 107 -108 134 42 104 336 -75 353
3699 353 120 136 228 -31 28 -312 -22 -12 -12 73 -661 -75 -273 80 228 -89 -62 -211 -93 151 61 -32 -353
3722 -353 133 147 307 441 -287 329 -95 554 15 -124 105 -244 313 -98 107 -45 -573 -46 -116 -44 -252
3743 -252 -277 -248 -153 241 -182 101 -126 -447 104 24 213 145 148 72 -274 207 163 448 -137 -179 209 103 658
3766 658 -13 -247 148 -174 456 -344 80 -504 -253 159 -99 310 -567 -312 -63 -7 350 -218 -308 40 189
3787 189 188 -184 267 31 58 -170 -236 143 -116 115 -250 50 123 98 30 -508 61 -11 139 418 -407 -223 -251
3810 -251 276 318 137 -19 -342 194 172 133 72 -270 189 -102 224 -84 -199 97 -118 135 -244 -10 96
3831 96 -168 197 -224 50 101 115 81 -100 -20 -205 273 170 -61 184 13 -10 147 -48 -92 -216 91 47 114
3854 114 -90 -151 178 129 202 -181 -132 -209 41 380 148 -50 -159 246 463 136 153 -79 24 193 26 122
3876 122 -83 75 108 -123 -18 -10 158 -64 28 -407 -245 52 -28 -86 -237 -36 150 -42 242 -277 63 162
3898 162 161 515 20 -39 100 259 133 -98 -49 -423 102 391 101 122 -398 151 -177 63 -70 -225 -12 -193
3920 -193 112 -41 -44 440 -8 482 -93 152 -111 -121 -213 -70 267 115 77 -221 -185 -136 -98 105 -116 -272 -260
3943 -260 -71 270 160 47 -47 -323 26 181 512 -54 -16 185 -66 437 -83 289 169 -1 338 74 15
3964 15 -38 -208 -26 83 142 6 -1 -302 -276 -72 -48 178 -116 -313 -109 -340 320 -96 222 -120 256 347 232
3987 232 123 -284 -2 261 154 262 -25 -17 -175 -60 161 -300 -182 -532 26 -103 25 -5 -551 -106 -27
4008 -27 37 -66 53 88 60 321 147 24 97 -86 67 -22 216 -55 -93 -98 -465 193 -33 -25 -30 -424 154 -162
4032 -162 84 20 -218 113 -189 512 56 -44 71 -77 213 124 118 59 -163 -104 -113 312 -83 -66 -1 -340 112
4055 112 -161 -23 -57 -86 18 -188 -6 45 22 -219 -127 323 -12 8 -137 -62 171 -42 286 -32 -159 -22
4077 -22 170 17 -76 226 -208 38 201 -149 8 -188 -152 -120 71 -18 -64 180 -63 164 367 289 315 18 151
4100 151 -100 95 304 -106 126 -175 38 71 -61 47 -239 97 -209 -172 178 -142 -104 -57 -24 275 43 226
4122 226 -230 -9 85 100 123 -222 100 4 362 87 100 20 -224 234 -91 187 -204 -111 -27 -174 69 -172 -99
4145 -99 67 -237 -63 15 14 -4 -302 33 -227 154 279 18 -85 -180 369 153 414 35 -108 155 97 134 -163
4168 -163 -91 -323 -112 217 -213 -115 87 -119 282 -85 59 4 -23 86 41 127 -149 384 -44 -112 261 -107
4190 -107 236 117 -10 -37 -99 233 -117 48 -279 -65 -36 -133 91 -377 76 95 156 106 -155 -87 -191 254 -4
4213 -4 53 -29 -158 18 153 189 189 -209 5 -18 205 115 -38 191 -113 -123 29 45 112 -182 50 27 7 114 -194
4238 -194 -38 -530 273 36 127 119 -162 -170 73 172 240 120 -109 -154 -20 84 104 -244 -466 18 -110 189 1
4261 1 -16 -76 -126 140 201 -127 170 -12 332 34 111 -289 243 13 -88 250 -379 294 53 -41 2 -40 0 -32
4285 -32 -101 -47 -312 329 -27 220 -241 -86 15 -54 301 -135 45 -1 182 174 4 32 -145 258 183 205 319
4308 319 -95 -17 4 133 157 -78 152 -51 24 26 38 217 -409 -124 -18 177 240 296 182 38 172 390 295
4331 295 -48 -214 65 154 315 114 -235 15 202 354 -149 -73 4 -81 -59 30 7 -293 -208 42 -196 8 92
4354 92 99 -7 29 269 82 164 90 75 66 111 195 104 -114 -181 9 62 -146 -91 -222 -93 22 -151 272 -155 57
4379 57 -85 -179 137 -22 86 -217 97 -5 173 303 -171 -195 -47 59 248 -109 -307 7 -9 68 -371 -193
4401 -193 -192 -26 60 -58 138 -91 -4 -100 156 110 -250 389 -123 99 -80 29 261 -35 245 -264 158 95
4423 95 -240 -100 -219 -32 -166 12 -132 -202 37 126 92 -53 -184 4 -152 219 109 35 -138 -62 28 -19 226
4446 226 -101 2 -23 37 131 -127 337 183 97 42 -133 165 176 -321 -169 -52 -74 -48 25 13 -226 21 53 79
4470 79 -30 -127 195 221 186 138 28 -133 -72 238 4 -53 -103 84 -157 -23 -37 -181 -56 -54 111 82 -64 1
4494 1 -259 75 -104 173 177 39 22 -162 83 168 4 0 -21 85 39 -51 142 -134 74 -19 12 -8 -106 82 -181
4519 -181 18 -45 45 146 -247 235 125 220 190 -328 103 104 327 99 212 22 -68 174 97 8 -65 -256 -99
4542 -99 -207 79 241 61 205 -128 -7 -54 113 -186 0 -201 -86 305 268 -69 250 8 163 179 222 -38
4564 -38 -283 418 -2 162 -272 76 -130 -142 -22 -213 79 -6 -55 -32 -56 142 -103 84 57 20 186 -120 147
4587 147 -40 135 84 183 238 -165 92 -330 -224 315 64 44 -478 92 -223 -38 -20 -252 205 -124 257 113
4609 113 -243 29 238 206 44 18 148 -203 72 -67 16 68 -55 24 12 47 261 -100 -29 -235 -156 146 -45
4632 -45 71 -27 -47 -105 283 177 -80 -168 -103 196 -4 7 92 -20 8 33 250 -18 99 -50 30 167 -87 -212
4656 -212 -75 -181 28 -67 -200 -260 2 -81 -220 -2 193 -81 -16 -40 185 0 -128 157 45 21 -324 326
4678 326 3 113 -58 -61 177 -57 185 -9 37 53 -23 175 16 -124 -101 -359 -104 -17 39 -218 79 -51 376
4701 376 30 9 95 12 168 91 -136 -110 -222 14 61 15 101 -238 -104 -113 108 56 63 -48 -387 245 31 -102
4725 -102 28 172 106 -136 180 139 -29 175 -208 169 77 -8 164 -263 204 -48 131 -144 -418 -108 -342
4746 -342 -43 -36 113 -141 27 -103 -56 339 125 -1 124 -97 61 268 115 44 -109 93 -39 200 -103
4767 -103 -138 27 -211 -67 40 -36 64 -142 -202 83 203 -19 -89 50 21 50 105 -57 -351 251 106 14 185
4790 185 -240 -36 22 -50 177 138 -10 -121 31 -117 -64 173 -64 -92 -25 -156 81 -212 68 34 -53 405 -48
4813 -48 174 39 -177 159 75 131 106 -44 -270 -94 2 -17 -149 1 36 54 -32 -29 -249 55 184 -30 54 -318
4837 -318 -14 148 112 23 208 174 -26 245 18 177 -20 -50 -4 7 192 -230 0 -109 -245 -167 -211 246 22
4860 22 33 -319 -270 103 -200 -1 83 -290 388 72 76 -222 -172 180 -115 265 -66 29 98 57 316 -60 50
4883 50 -58 -12 6 -86 153 -433 351 -89 21 140 -187 -54 -37 138 184 53 467 96 -46 -210 -83 77
4905 77 -108 63 -381 -154 -29 -109 70 -127 2 -327 -237 230 -209 -186 -186 40 142 -190 -127 73 32 -62 -56 210
4929 210 96 57 111 -77 -36 205 152 -43 -97 17 38 44 -23 93 -100 160 79 190 10 -116 153 -95 111
4952 111 182 -100 160 40 86 -252 -121 -40 -280 132 140 62 20 -71 35 -79 187 -225 -48 -103 -52 -4 -219 -2
4976 -2 -245 20 76 -153 260 -125 166 224 -144 33 13 -44 68 136 296 8 257 -136 143 -9 77 221 -110
4999 -110 310 -223 112 317 31 -71 -53 145 -136 -77 246 -1 -66 -466 -56 -97 -82 53 -34 307 136 109
5021 109 -150 162 118 -187 120 -72 -69 221 -251 -136 -216 74 -13 -214 139 -242 309 270 15 118 -10 104
5043 104 -29 26 -152 54 -24 -87 68 44 -101 -202 2 -65 73 -77 123 -215 130 17 68 -138 -89 115
5065 115 -4 51 84 79 6 -33 -98 -57 149 -22 -75 -63 -50 259 -12 268 18 96 11 26 170 35 -16 -9 121 83
5091 83 -135 38 -156 3 171 -206 -80 67 -46 -146 23 95 115 -37 204 -156 143 58 265 131 74 -54
5113 -54 -145 65 5 86 28 -122 -165 -21 116 -57 -43 -131 -182 20 -103 47 68 -11 -50 18 65 229 129 119 21
5138 21 155 -99 80 -22 -72 -63 -211 144 -49 13 -141 91 33 -51 73 -134 -41 40 -56 227 -73 34 -113
5161 -113 177 56 -131 326 -140 115 -164 -306 -178 -95 153 -74 -35 -98 -178 -12 29 150 118 68 59 -123 14
5184 14 -52 196 -5 -11 91 -45 187 -14 25 33 154 -132 -162 -3 -241 -116 -36 -84 -18 -144 -14 -9 -158 134
5208 134 43 92 51 236 249 -270 -53 15 157 -126 -179 60 -64 -57 -227 212 -100 -120 51 56 126 106 -83 -80 -176
5233 -176 -120 -59 15 168 -73 49 -123 130 168 -59 -61 56 181 155 213 209 -8 230 -123 84 290 -125 82
5256 82 -47 231 -125 121 7 10 51 -169 7 -106 -23 -335 -365 81 1 -21 -37 -48 87 -34 139 180 -166 -184
5280 -184 -86 -23 -78 83 22 -259 -16 -43 69 -23 108 46 -187 -95 11 113 -6 219 153 -154 137 86 62 70
5304 70 80 125 14 91 -313 48 -56 -141 17 -30 -180 20 63 152 -193 140 246 90 -102 -160 -85 -63 25 -139
5328 -139 -30 50 -172 -232 88 39 -3 -76 -25 -146 93 51 24 46 44 31 -125 -25 -4 69 54 -27 7 47 20 -274
5354 -274 -87 323 -62 231 -28 -12 38 -197 138 255 50 -47 -23 172 -72 76 -189 -11 -148 -40 -164
5375 -164 -263 64 -37 -179 171 -43 169 71 -155 -4 -49 51 -102 22 88 5 207 -49 101 -193 -179 -99
5397 -99 109 91 -36 95 -156 -90 -161 -16 26 135 322 66 29 -108 -66 116 -142 -49 -98 -117 142 188 -184 -47
5421 -47 -63 34 -119 8 59 -28 102 -11 -125 -151 117 22 -280 39 -5 162 -46 145 92 159 118 -102 110 226
5445 226 140 154 -139 187 133 4 -14 -1 -124 -166 -156 -61 -69 -286 137 9 -148 137 87 -107 -17 1 -84 -21 70
5470 70 115 -9 165 94 287 -10 -64 65 -115 -120 47 9 -61 -534 186 89 -223 -34 20 -146 -103 109 -153 69
5494 69 102 121 -24 -92 214 -14 -214 278 -360 -131 -270 195 158 -104 31 -157 128 -232 94 -156 37 174
5516 174 -240 -16 72 62 71 37 -32 -104 3 -151 148 104 162 145 -58 -215 -127 -50 79 -9 127 117 150 219 124 -222
5542 -222 -179 68 37 15 -203 -80 -210 -96 13 -128 280 -50 43 2 118 23 -69 -64 32 102 77 -94 54 -25
5566 -25 -126 150 79 -181 52 -58 -91 11 -308 -160 -2 22 18 116 34 -151 -197 25 -102 296 -306 -34 -20
5589 -20 110 131 -12 -125 93 101 36 8 -26 120 49 -3 96 -135 12 14 177 173 33 53 -86 147 -52 -52 129 7
5615 7 -110 114 92 -19 11 -6 -134 286 18 124 82 -331 -276 111 -57 67 -92 -36 27 46 43 64 16 -199 349
5640 349 80 -14 -102 86 -31 -192 -117 -42 71 81 -176 141 -244 129 118 31 46 -94 87 -165 35 267 230
5663 230 -28 -98 10 -178 -16 -94 -205 135 -60 32 218 21 237 113 87 115 -49 31 -113 102 80 -61
5685 -61 -2 -12 79 3 10 -104 90 25 93 28 -169 279 -146 -25 -97 38 262 326 172 46 -77 35 8 130
5709 130 22 -38 44 -205 198 -66 -36 -56 7 92 -95 -12 -406 -74 23 -90 20 51 -26 -32 -178 87 72 32 29
5734 29 -42 9 41 196 -119 271 -368 -36 26 -89 -93 -147 -35 55 40 -161 -95 29 -198 -178 108 -182 -168 -38
5758 -38 -62 -85 -136 103 -81 76 -1 126 184 -2 46 -137 132 145 -136 -88 -109 -65 78 52 4 5 87 -19 -139
5783 -139 -143 171 44 -77 64 11 -32 252 78 -16 -40 124 67 17 -90 -164 -50 -108 -4 297 21 42 -40 -5
5807 -5 -58 85 41 -163 -170 -98 -59 46 -101 77 173 249 -31 -25 298 -54 288 0 197 -54 234 -149 -6 49
5831 49 87 -197 -128 -127 56 9 174 215 -87 -71 -60 40 -3 102 -198 149 130 -9 41 -138 -17 -53 -16 12 -156
5856 -156 75 43 88 76 45 -5 -115 -112 -181 -146 21 -176 0 168 48 127 -334 -41 -99 31 99 -113 113 -102
5880 -102 153 94 21 220 -68 196 -109 95 111 -52 -53 -42 -119 -110 -129 -86 -188 198 141 -172 26 133 -331 -38
5904 -38 -44 -120 -134 0 26 108 52 316 -83 -100 -97 -220 295 -168 -62 40 -7 32 -36 -21 -4 -25 -154 15 9 157
5930 157 -57 -93 130 -12 152 16 -47 112 -47 78 6 -17 17 -216 -8 -185 -232 102 4 159 -103 154
5952 154 -207 -183 94 -120 46 249 120 -34 -187 101 52 34 49 203 -18 123 -23 104 157 33 -127 116
5974 116 -98 -231 111 -34 -11 -153 91 -84 160 88 -77 -28 116 198 36 13 -51 -174 29 190 17 28
5996 28 73 -12 -21 -113 -28 -155 179 -174 1 100 -45 39 213 200 2 -107 -10 149 -46 -45 88 -152 18 64 -59
6021 -59 195 -103 12 176 126 -245 -95 -19 -47 -166 -101 -55 28 -69 166 -154 223 -112 248 154 -15 -85 2 35
6045 35 -41 -81 94 134 -66 -96 -176 -6 3 141 219 62 46 -259 8 19 12 8 172 31 19 -21 13 -183 33 -40
6071 -40 114 -25 -66 132 234 285 -15 -394 -115 -85 -23 257 -114 5 -2 -67 -212 31 -80 -8 -285 93 12
6094 12 -145 160 -97 -55 166 -199 197 -79 26 28 21 -2 -215 40 118 47 -27 -50 -61 130 198 -24 213 -42
6118 -42 -32 74 5 -92 -48 -44 -1 173 -214 -179 26 3 16 103 -106 32 171 -28 34 -28 -22 -71 -62 -156 8 -142 -32
6145 -32 -13 -129 -48 36 -178 11 -253 -109 -154 -214 -106 -21 -56 -89 82 111 -12 111 110 -6 232 -165 65 40
6169 40 211 -52 -201 -97 47 109 -154 -37 51 -37 -275 -31 -160 189 -108 227 51 -66 -25 186 252 -217
6191 -217 -25 22 98 62 -52 102 344 -180 5 -26 -52 -311 75 153 131 -376 -152 -157 36 144 189 165 92 -24
6215 -24 124 14 2 109 -27 -84 36 175 -24 -39 -88 -199 -68 29 111 76 162 28 -38 34 -38 -30 -2 137 -150
6240 -150 -44 -124 -19 36 -82 182 -152 195 -167 87 304 -125 90 50 223 44 -96 4 -215 -14 -91
6261 -91 -17 -153 -29 -18 -61 0 16 -226 148 113 -70 289 -34 9 277 73 133 82 -127 107 151 38 59 35
6285 35 1 182 17 60 -154 -122 26 2 9 60 -10 37 -56 149 -80 112 -126 -86 34 187 -178 -47 85 -70
6309 -70 150 165 -286 190 192 62 74 104 -56 -128 -123 71 256 94 23 76 -163 121 14 -156 -117 97 193 -310
6333 -310 79 32 -62 -182 50 -153 8 -128 -106 -157 18 -132 214 -80 -275 -24 65 120 -79 -110 45 6 86
6356 86 -123 3 98 220 202 -11 -164 -196 -40 6 35 -48 -179 -29 -335 27 -54 65 126 75 -89 -135 -66 -29
6380 -29 87 -16 8 -123 89 -166 74 -8 -29 286 -24 226 118 -26 38 -4 188 78 225 -114 -82 -14 25
6403 25 -83 -18 -40 7 -51 -96 -271 -62 -246 -2 15 139 -81 -45 89 -166 322 19 7 124 80 124 45 22
6427 22 176 -165 276 64 361 130 51 -27 -83 95 40 -83 44 78 -143 9 -62 -25 -181 95 -281 -57 -81
6450 -81 -52 81 213 82 19 107 -180 94 -10 48 -39 229 228 -293 154 64 -102 -88 22 39 -2 -154 131 -158
6474 -158 8 -22 181 166 -58 192 -27 33 15 105 58 -109 25 -102 -62 17 124 5 83 -207 154 -39 -302
6497 -302 -304 245 145 -49 -66 -106 212 47 74 79 66 133 60 -172 172 4 83 73 225 -50 -114 -324 -249 99 -414
6522 -414 124 128 -122 106 -191 -144 -120 -239 23 15 13 202 7 213 40 200 -7 -27 36 -114 166 -30 251
6545 251 -318 70 4 109 139 -23 -27 -196 -278 -69 -9 141 -36 10 -91 -119 73 169 222 -84 -1 85 254 -186
6569 -186 -20 117 -24 187 23 -95 139 36 200 -18 -297 -41 55 79 -59 87 -43 78 -71 -206 -55
6590 -55 38 -150 3 -23 98 -127 13 109 -135 -6 -191 159 -37 -133 351 -55 30 -125 9 -57 104 46 254
6613 254 230 -162 -76 -18 228 145 226 -22 -34 -289 29 140 131 6 133 29 107 225 -74 177 -34 -57 10 209
6637 209 59 8 -212 -188 -15 -43 -106 -2 -51 -142 -19 -30 31 -12 -1 100 -66 -108 10 40 26 144 -60 -64 -54
6662 -54 184 117 46 -68 -80 -143 -59 -252 310 121 86 102 35 -68 101 366 -193 70 166 5 36 -61 96 172
6686 172 -103 88 -115 -104 -107 48 268 62 50 -115 181 57 36 79 -108 -215 -117 -20 -142 -113 -20 -48 170 -2
6710 -2 -157 -127 41 122 -73 -133 124 -46 22 -10 -203 134 -83 172 59 165 -149 111 -118 49 141 180 61
6733 61 -60 89 115 -82 104 0 44 28 -252 141 75 -67 -34 26 6 41 -32 -152 96 -145 73 63 -139 32
6757 32 339 -135 71 79 190 40 124 -111 -182 8 -77 -42 116 228 -203 31 173 114 -21 44 83 -86 241
6780 241 173 -113 77 -39 53 238 -227 18 -68 -29 -27 19 -20 -57 -80 4 -118 123 -106 7 43 270 2 -107
6804 -107 144 235 253 13 -109 -32 212 -121 188 -20 -36 -41 179 -4 -48 44 -162 154 -74 -14 -67 119 -64
6827 -64 -109 188 25 50 49 100 107 -50 22 53 -62 42 35 70 -10 43 87 -67 -148 63 105 -7 289 258 182 -81 65
6854 65 83 37 57 -212 -68 -117 -10 45 -63 -109 -141 -24 -39 48 -31 23 -141 -176 133 -84 15 135 57 -221 130
6879 130 -67 -46 40 47 -67 -103 42 27 -45 -152 -44 52 -42 -39 113 -120 181 46 119 -94 21 41 -215 -60
6903 -60 76 -35 -41 51 8 174 17 272 -36 16 419 63 112 55 -80 154 -38 -18 35 -33 43 -103 202 162
6927 162 -117 -30 12 -19 134 35 137 99 56 -76 193 -32 62 -57 -146 8 27 -117 145 -161 -137 102 -7
6950 -7 -40 85 62 -108 -3 -53 156 -100 -31 1 70 55 10 17 -40 -127 289 -30 207 54 -62 35 -28 206 -103
6975 -103 17 -67 -65 -107 -6 3 98 -28 -149 -106 -8 -4 -2 25 78 -73 151 -56 -104 -117 221 -109 332 -77 -84 -255
7001 -255 -232 196 -59 132 -13 120 182 111 147 18 66 70 -46 21 76 -25 -2 128 233 -158 -43 -50 181 31
7025 31 -82 32 96 114 26 6 -6 204 322 -4 114 26 95 21 -33 173 218 -150 -89 35 145 -71 -184 23
7049 23 -136 -127 72 -177 -50 22 -1 130 -23 104 67 29 14 -26 -104 -289 -38 142 -11 72 25 -34 281 33
7073 33 -77 -146 147 65 0 11 -6 -169 7 21 -22 -99 45 28 -96 -40 -3 -13 -52 -85 148 16 50 45 -21 -127
7099 -127 -18 155 12 79 30 53 32 -113 116 35 46 160 19 -45 -282 -49 -51 21 -17 -197 -119 -151 34 -129
7123 -129 -73 -154 -191 120 85 -30 -73 202 -24 -147 -120 27 -215 9 -46 -32 -38 197 33 -20 442 -55 -31 -117
7147 -117 -117 61 178 192 -97 -125 118 7 17 53 13 -36 -15 -24 -109 67 -68 259 33 87 -62 77 -45 -120 87
7172 87 157 187 -73 -83 63 -16 -91 -270 -199 103 -53 -157 55 -21 -109 49 -163 -105 113 -4 324 -143 -164 73
7196 73 -58 47 -85 -35 150 -29 -73 194 -274 -137 127 -177 -19 -38 30 78 31 86 -262 -140 1 -61 14
7219 14 120 152 74 106 68 208 147 129 92 -112 -21 -112 109 -29 21 113 85 12 96 -97 -110 11 -185 93 134 130
7245 130 -62 -160 -397 -185 -64 54 90 125 -28 -121 -66 160 190 -74 -26 119 118 67 -180 240 136 -79 -1 -21
7269 -21 93 110 -64 42 3 154 160 119 -78 -142 76 71 12 39 -304 23 34 44 109 99 152 -57 -137 28 -109 7
7295 7 -68 54 79 -143 -204 -244 -149 -21 -53 136 323 59 -176 3 -83 42 70 -134 -129 26 15 75 47 -88 -4
7320 -4 -39 -146 -33 46 91 -146 -178 -191 109 -63 156 31 -64 -187 254 75 76 -77 165 113 128 180 118 -31 -3
7345 -3 309 -78 -57 27 -27 -4 303 -110 -119 8 134 -38 89 -26 -13 -159 -231 -233 15 -5 215 33 76 106 -178
7370 -178 72 -11 200 -96 328 -187 61 -92 13 0 194 75 30 -89 19 53 -155 107 117 -171 158 168
7392 168 -87 -404 187 148 -208 4 60 154 -102 49 -55 316 112 0 25 54 -57 411 107 -181 -166 -10
7414 -10 -46 111 -124 -11 -82 -194 -186 -16 5 -136 -22 65 -5 -29 157 -32 231 26 -210 -2 -106 -115 -85 74
7438 74 -86 -115 96 -225 79 90 133 -71 75 238 90 284 -148 151 157 -206 232 -103 -134 -61 88 84 48 215
7462 215 148 204 -205 -61 -200 -116 79 -83 89 -111 -18 10 -87 -255 -95 -256 50 -89 58 215 -65 80
7484 80 103 87 57 158 6 89 -116 7 -96 79 169 -42 171 4 11 229 -140 31 97 0 3 -41 59 -258
7508 -258 246 186 -15 -206 111 -67 60 50 -88 10 -35 -105 16 39 -65 13 -61 -2 -165 87 -268 0 1 -65
7532 -65 229 -42 148 -40 31 56 5 32 -14 -105 -110 -62 135 -158 -175 -154 -33 -53 125 234 243 -20 64 5 -6 -100
7558 -100 110 -16 188 -196 -40 102 -62 109 -113 165 117 -93 248 -242 178 106 27 -16 -232 -37 -110 99
7580 99 243 183 24 -45 103 -149 56 15 -45 119 -46 59 63 -119 -57 -47 -6 5 -73 31 -5 -109 14 -11 -30
7605 -30 157 -48 128 53 50 -158 -168 3 -20 94 -257 125 -120 18 87 -248 -107 -94 118 88 -149 12 90
7628 90 -59 -58 -61 -122 -90 -154 -24 -10 -38 161 54 204 -129 28 -28 -34 -50 160 104 14 -252 -121 62 -14 32 43
7654 43 89 -110 216 -181 -13 114 -67 -13 -59 44 -89 33 165 -198 -90 -142 -74 10 -232 139 -7 -1 -128
7677 -128 12 169 59 40 -56 -174 18 186 182 -17 34 20 -115 -8 180 -38 -68 180 -24 -71 -53 136 162
7700 162 -142 -85 92 -84 46 -9 -126 -197 18 99 -50 69 -88 -58 -140 106 83 -207 -86 -59 122 207 -137
7723 -137 -53 -74 -189 -17 -2 1 -151 35 -75 -108 -22 72 -38 100 214 201 -161 90 106 -70 24 -13 8 15 156
7748 156 56 -146 -73 -7 -33 -169 -184 -35 213 -76 204 173 -63 -10 -138 -97 -59 -209 -288 -55 -13 -71 -81 106
7772 106 -124 -159 -98 5 -10 -80 108 95 137 66 -68 161 122 -146 184 -118 2 97 31 -60 -1 160 -93 -91 -242
7797 -242 -48 20 148 7 -111 67 -69 11 -304 -216 -87 -160 -54 -129 56 -104 -183 96 79 178 -201 40 154
7820 154 -113 -19 194 -131 -107 -146 6 27 58 -45 -68 32 182 -136 101 26 -37 -74 -94 -8 189 82 310 -42
7844 -42 -108 -59 92 66 -210 8 -18 -148 -266 -261 -19 -119 -155 179 -168 30 -233 -153 -239 81 15 25 65 35 157
7869 157 144 -107 -17 123 69 -220 -19 140 98 145 -33 -64 90 7 193 -18 93 260 -50 98 3 139 38
7892 38 44 -156 64 66 -152 179 -102 100 14 -52 -53 -64 -71 -35 -34 -1 84 21 -30 33 37 -71 54 32 101 10 126 18
7920 18 -79 60 -54 -136 -63 141 -24 196 -37 147 -97 69 51 44 36 -78 54 260 52 51 70 -200 52 32
7944 32 -15 -99 214 87 -114 128 116 24 51 89 -33 -133 202 -218 14 -56 44 -112 -41 156 -65 -99 28
7967 28 7 100 -105 -86 125 77 -227 195 -33 -187 28 -127 176 61 215 -90 -170 51 -173 67 -217 7
7989 7 29 92 -60 16 290 127 -155 59 152 142 -116 97 -27 55 126 -239 -79 -241 240 -109 -73 -216 31
8012 31 69 61 157 104 60 -1 42 189 -122 -4 204 31 -21 27 161 114 -31 -12 29 -10 -126 205 -28 103 97 96
8038 96 -42 3 81 -139 -168 -40 -43 202 183 15 102 -44 79 -247 97 -110 76 87 175 -118 -56 -55 69 60 -98
8063 -98 113 -44 -61 117 130 -8 233 43 184 -216 -159 -74 -52 -128 -257 -3 -16 183 10 52 -18 256 -140
8086 -140 167 25 300 -43 -80 -15 -128 27 -164 127 111 141 -18 -43 190 -60 -28 153 46 49 8 56 71 94
8110 94 -120 25 174 127 -42 -63 -149 -76 -180 232 96 -77 -12 -11 144 125 -93 7 48 175 82 -105 11 242
8134 242 -78 324 35 118 -27 66 23 -77 -53 101 -10 -18 34 122 57 -136 -26 -140 -154 -105 16 -198 9 177
8158 177 -91 216 56 -178 -92 66 -206 227 -26 -44 -57 -168 29 236 -70 -73 -32 257 10 70 103 58 -105
8181 -105 101 -94 57 -56 50 125 1 120 30 158
8191A58
##END NTUPLES=NMR FID
##END=
