##TITLE=1H_Q-6-1
 200.13MHz,DMSO.
 8 sc
 
 6.1.2026
##JCAMPDX= 6.0         $$ Bruker NMR JCAMP-DX V2.0
##DATA TYPE= NMR FID
##DATA CLASS= NTUPLES
##ORIGIN= UXNMR, Bruker Analytische Messtechnik GmbH
##OWNER= pz
$$ XWIN-NMR		Version 3.5
$$ Fri Feb  6 15:38:50 2026 Russian Standard Time (UT+4h)  she@DPX200
##.OBSERVE FREQUENCY= 200.1317
##.OBSERVE NUCLEUS= ^1H
##.DELAY= (6, 6)
##.ACQUISITION MODE= SIMULTANEOUS
##.ACQUISITION SCHEME= undefined
##.AVERAGES= 8
##.DIGITISER RES= 18
##SPECTROMETER/DATA SYSTEM= spect
##.PULSE SEQUENCE= zg30
##.SOLVENT NAME= DMSO
##.SHIFT REFERENCE= (INTERNAL, DMSO, 0, 14.3821)
##AUDIT TRAIL= $$ (NUMBER, WHEN, WHO, WHERE, WHAT)
$$ ##TITLE= Audit trail, XWIN-NMR		Version 3.5
$$ ##JCAMPDX= 5.01
$$ ##ORIGIN= Bruker BioSpin GmbH
$$ ##OWNER= she
$$ F:/spectra/data/she/nmr/H-C/1/audita.txt
$$ ##AUDIT TRAIL=  $$ (NUMBER, WHEN, WHO, WHERE, WHAT)
(   1,<2026-02-06 15:37:20.89 +0400>,<she>,<DPX200>,
      <created by zg, POWCHK disabled, PULCHK disabled
       configuration hash MD5:
       00 E9 B6 7A A2 85 ED C7 34 08 36 98 17 FE 4E 26
       data hash MD5: 16K
       40 C2 A0 6F FB 00 9A BC A8 56 C2 2C 6C 07 1A 5B>)
$$ ##END=
$$ 
$$ hash MD5
$$ 5A C6 16 14 7D 0A B9 B8 EF 18 6F A6 98 A0 1B 3B
##$RELAX= 
##$RELAX= 
##$RELAX= 
##$RELAX= 
##$RELAX= 
##$RELAX= 
$$ Bruker specific parameters
$$ --------------------------
##$DU= <F:/spectra>
##$EXPNO= 1
##$NAME= <H-C>
##$PROCNO= 1
##$TYPE= <nmr>
##$USER= <she>
##$AMP= (0..31)
100 100 100 100 100 100 100 100 100 100 100 100 100 100 100 100 100 100 
100 100 100 100 100 100 100 100 100 100 100 100 100 100 
##$AQSEQ= 0
##$AQ_mod= 1
##$AUNM= <au_zg>
##$AUTOPOS= <>
##$BF1= 200.13
##$BF2= 200.13
##$BF3= 200.13
##$BF4= 200.13
##$BF5= 200.13
##$BF6= 200.13
##$BF7= 200.13
##$BF8= 200.13
##$BYTORDA= 1
##$CFDGTYP= 0
##$CFRGTYP= 5
##$CHEMSTR= <none>
##$CNST= (0..31)
1 1 145 1 1 1 1 1 1 1 1 1 1 1 1 1 1 1 1 1 1 1 1 1 1 1 1 1 1 1 1 1 
##$CPDPRG= <>
##$CPDPRG1= <>
##$CPDPRG2= <>
##$CPDPRG3= <>
##$CPDPRG4= <mlev>
##$CPDPRG5= <mlev>
##$CPDPRG6= <mlev>
##$CPDPRG7= <mlev>
##$CPDPRG8= <mlev>
##$CPDPRGB= <>
##$CPDPRGT= <>
##$D= (0..31)
0 0.7 0 0 0 0 0 0 0 0 0 0.03 0 0 0 0 0 0 0 0 0 0 0 0 0 0 0 0 0 0 0 0 
##$DATE= 1770377840
##$DBL= (0..7)
120 120 120 120 120 120 120 120 
##$DBP= (0..7)
150 150 150 150 150 150 150 150 
##$DBP07= 0
##$DBPNAM0= <>
##$DBPNAM1= <>
##$DBPNAM2= <>
##$DBPNAM3= <>
##$DBPNAM4= <>
##$DBPNAM5= <>
##$DBPNAM6= <>
##$DBPNAM7= <>
##$DBPOAL= (0..7)
0.5 0.5 0.5 0.5 0.5 0.5 0.5 0.5 
##$DBPOFFS= (0..7)
0 0 0 0 0 0 0 0 
##$DE= 6
##$DECBNUC= <off>
##$DECIM= 32
##$DECNUC= <off>
##$DECSTAT= 4
##$DIGMOD= 1
##$DIGTYP= 9
##$DL= (0..7)
0 120 120 120 120 120 120 120 
##$DP= (0..7)
150 150 150 150 150 150 150 150 
##$DP07= 0
##$DPNAME0= <>
##$DPNAME1= <>
##$DPNAME2= <>
##$DPNAME3= <>
##$DPNAME4= <>
##$DPNAME5= <>
##$DPNAME6= <>
##$DPNAME7= <>
##$DPOAL= (0..7)
0.5 0.5 0.5 0.5 0.5 0.5 0.5 0.5 
##$DPOFFS= (0..7)
0 0 0 0 0 0 0 0 
##$DQDMODE= 0
##$DR= 18
##$DS= 0
##$DSLIST= <SSSSSSSSSSSSSSS>
##$DSPFIRM= 0
$$ [...]
##$SUBNAM0= <"">
##$SUBNAM1= <"">
##$SUBNAM2= <"">
##$SUBNAM3= <"">
##$SUBNAM4= <"">
##$SUBNAM5= <"">
##$SUBNAM6= <"">
##$SUBNAM7= <"">
##$SUBNAM8= <"">
##$SUBNAM9= <"">
##$SW= 18.0516967727041
##$SWIBOX= (0..15)
0 0 2 0 0 0 0 0 0 0 0 0 0 0 0 0 
##$SW_h= 3612.71676300578
##$TD= 16384
##$TD0= 1
##$TE= 0
##$TE2= 300
##$TE3= 300
##$TEG= 300
##$TL= (0..7)
0 120 120 120 120 120 120 120 
##$TP= (0..7)
150 150 150 150 150 150 150 150 
##$TP07= 0
##$TPNAME0= <>
##$TPNAME1= <>
##$TPNAME2= <>
##$TPNAME3= <>
##$TPNAME4= <>
##$TPNAME5= <>
##$TPNAME6= <>
##$TPNAME7= <>
##$TPOAL= (0..7)
0.5 0.5 0.5 0.5 0.5 0.5 0.5 0.5 
##$TPOFFS= (0..7)
0 0 0 0 0 0 0 0 
##$TUNHIN= 0
##$TUNHOUT= 0
##$TUNXOUT= 0
##$USERA1= <user>
##$USERA2= <user>
##$USERA3= <user>
##$USERA4= <user>
##$USERA5= <user>
##$V9= 5
##$VALIST= <valist>
##$VCLIST= <CCCCCCCCCCCCCCC>
##$VD= 0
##$VDLIST= <DDDDDDDDDDDDDDD>
##$VPLIST= <PPPPPPPPPPPPPPP>
##$VTLIST= <TTTTTTTTTTTTTTT>
##$WBST= 1024
##$WBSW= 4
##$XGAIN= (0..3)
0 0 0 0 
##$XL= 0
##$YL= 0
##$YMAX_a= 288946
##$YMIN_a= -387019
##$ZGOPTNS= <>
##$ZL1= 120
##$ZL2= 120
##$ZL3= 120
##$ZL4= 120
##$ABSF1= 10
##$ABSF2= 0
##$ABSG= 5
##$ABSL= 3
##$ALPHA= 0
##$AQORDER= 0
##$ASSFAC= 0
##$ASSFACI= 0
##$ASSFACX= 0
##$ASSWID= 0
##$AUNMP= <proc_1d>
##$AZFE= 0.1
##$AZFW= 0.1
##$BCFW= 1
##$BC_mod= 2
##$BYTORDP= 1
##$COROFFS= 0
##$CY= -3
##$DATMOD= 1
##$DC= 2
##$DFILT= <>
##$DTYPP= 0
##$F1P= 0
##$F2P= 0
##$FCOR= 0.5
##$FTSIZE= 0
##$FT_mod= 4
##$GAMMA= 1
##$GB= 0.15
##$INTBC= 1
##$INTSCL= 1
##$ISEN= 128
##$LB= 0.25
##$LEV0= 0
##$LPBIN= 0
##$MAXI= 10000
##$MC2= 0
##$MEAN= 0
##$ME_mod= 0
##$MI= 1.114404
##$NCOEF= 0
##$NC_proc= 0
##$NLEV= 6
##$NOISF1= 3.799351
##$NOISF2= 2.8
##$NSP= 1
##$NTH_PI= 0
##$NZP= 0
##$OFFSET= 14.38212
##$PC= 1
##$PHC0= -3703.606
##$PHC1= 13.59231
##$PH_mod= 1
##$PKNL= yes
##$PPARMOD= 0
##$PSCAL= 0
##$PSIGN= 0
##$REVERSE= no
##$SF= 200.129724274929
##$SI= 16384
##$SIGF1= 3
##$SIGF2= 2
##$SINO= 400
##$SIOLD= 16384
##$SREGLST= <1H.CDCl3>
##$SSB= 0
##$STSI= 0
##$STSR= 0
##$SW_p= 3205.1282051282
##$SYMM= 0
##$S_DEV= 0
##$TDeff= 0
##$TDoff= 0
##$TI= <>
##$TILT= no
##$TM1= 0
##$TM2= 0
##$TOPLEV= 0
##$USERP1= <user>
##$USERP2= <user>
##$USERP3= <user>
##$USERP4= <user>
##$USERP5= <user>
##$WDW= 1
##$XDIM= 8192
##$YMAX_p= 0
##$YMIN_p= 0
$$ End of Bruker specific parameters
$$ ---------------------------------
##NTUPLES= NMR FID
##VAR_NAME=  TIME,          FID/REAL,        FID/IMAG
##SYMBOL=    X,             R,               I
##VAR_TYPE=  INDEPENDENT,   DEPENDENT,       DEPENDENT
##VAR_FORM=  AFFN,          ASDF,            ASDF
##VAR_DIM=   8192,          8192,            8192
##UNITS=     SECONDS,       ARBITRARY UNITS, ARBITRARY UNITS
##FACTOR=    0.0002768,     1,               1
##FIRST=     0,             0,               0
##LAST=      2.2672688,     0,               0
##MIN=       0,             -387019,         0
##MAX=       2.2672688,     288946,          0
$$ Real data points
##PAGE= N=1
##DATA TABLE= (X++(R..R)), XYDATA
$$ [...]
1827A72p34M21L71n33J88M24p16N9M10k24j97O77l61j37N06n62N8Q21p25M7L78
1848C43l29l53P72o48l4P19n73q2N88m13k08M47k14j20M80o35P5M24k9l25L34
1869B19k19j12L37l24j73N71k18n35P85l63k65M03k69j80P04m29n40R02j45m07
1889b58P20k37o60P24l65l18M15L1k78L42m4l84J69J65m01R8K99o22R65l04l55
1910b98K83N20p66L52L99o93K75J03m63N22J76r61Q04j2p89M23J38m8K58J11q36
1931e02N12L90n61J88L79o92L37L45q15K99L54n00L0L74R4l35O63p37j12Q05o31
1952a15J93n6n25L90L47j77j04M57l29m26O91l64k17O76p67J78L44q2k27L28l23
1973a08j07M93m22m22Q49l96J03M78n39l8K37km01O60n59n6P97o42J24K22o68
$$ y = [172, -562, -141, 230, -303, -115, 309, -407, -348, 62, -162, -359, 318, -43, -180, 326, -236, -178, 643, -82, -35, 343, 14, -339, 433, -215, -249, 470, -103, -185, 403, -10, -218, 229, 15, -105, 375, -260, -185, 239, 210, -115, 219, 0, -112, 225, -99, -272, 299, 81, -454, 331, -32, -297, 106, -163, -343, 361, -68, -608, 294, 149, -258, 462, 225, -435, 289, -76, -394, 21, 52, -226, 116, 72, -312, -143, 22, -379, -281, 18, -604, 361, 57, -298, -15, 505, -261, 91, 490, -203, 72, 175, -288, 234, 410, -551, 253, 241, -548, -125, 13, -35, 223, 334, -502, 10, 400, -161, 27, 406, -286, 51, 396, -419, -120, 234, -266, -236, 138, 232, -103, 560, -177, -289, 516, -115, 78, 22, -503, -113, 234, 57, -47, 410, 81, -345, 346, -18, -235, 441, -326, -148, 196, 114, -113, 215, -108, -215, 278, -144, -566, 283, -113, -10, 468, -71, -109, 128, 126, -275, 385, -174, -230, 567, -75, 49, 271, -397]
1994c97K21N4K87m00K34J77o59O93j95k03N77o78P4J08J56m82J85L31q21J314
2014E76m69n18N52l57M71k4k93J6q5O44q45K28K06n36R67m61M2J51k43j43N8M20
2036C57l84K26K18p39L73p1k24M19k31J03j63M41m90j45P08p63L42l4m53M55J45
2057I0j46j91N70j80q10J069j079O40L53q57J030k41j74j68K67Q8n72Q35o23l24
2077d23J183j095O01k61l78R33q09L54k65O37m02o15J306r46n5Q45j068Q24m17
2096e1K82m65J34L92o51P48m79k18Q54j186N61L19k93m5J56M70j042O82j16m82
2116d30N89k37K16p5j67K63k87N06o62N40j01q48J111o96L8M53j31K4m19R80o14
2137E3j15L57m69O03n59k24P00o63L76m5M1l91J00J150j484O84L25o63N69n56
$$ y = [-397, -176, -122, 165, -235, -1, 176, -483, 210, 15, -188, 389, -289, -215, -107, 49, -433, -248, 83, -738, 576, 107, -411, 141, -216, 255, 231, -62, -46, -131, 513, -332, -104, 102, -434, 533, 72, 114, 265, 22, -121, -63, 357, -27, 199, 417, -322, 51, -20, -244, 175, -56, 47, -116, 325, -165, -310, 398, -365, -23, -57, -510, -55, 90, -56, -247, 323, 143, -667, 402, -677, -37, 316, -541, 489, 248, 74, -94, 173, 261, -311, 524, -99, -423, 760, -335, 266, 5, -373, 560, -249, 105, -160, 477, 75, -540, 766, -180, -235, 610, -458, 366, -51, 231, -234, -100, 292, -359, 389, -90, -308, 546, -640, -79, 240, -53, -98, 58, 528, -514, 168, 52, -430, 159, -78, 138, 63, -104, 159, -128, 378, -284, 256, 155, -693, 418, -278, -240, 213, 82, 106, -313, 667, 53, -62, 295, -174, 429, -130, -354, 346, -317, 59, 14, 55, -336, -236, 914, -570, 114, 439, -224, 345, -211]
2157b11M37l36l83O19l25M41p99O45K72o53Q15j33m69L44j4n9o03N72k09j98M82
2178B35k35N34m87n8M49o19Q0n8M32m06l27J065p54K89R6k50J82k04K41k56oK49
2200A92k09L64n27J85M64r41N43p9j0J70j35N22j218Q15J8l00L41o31O45J7m41
2221b15L65J26l68l00M32j40j76P78m71r8P1k20L07m16O39m77K96J37m28K84j92
2242f6j17L68k03Q4r5j0P1j92M23n88L82lj4P1J02m88K04j13R4J29K19l12J1J25
2266H2k80K77N6k0k54K26nj15J90k17n3L38m18J47j43J78J16k00rRK94j91m48
2289d40P08m25J79J34l2j31J0K48l85K23N3k94K08j11J79j7k67m6K10j70K26P1
2311A31l80K79K42k39j72K65n3m6q9Q2k06M28l12m8K03J27m40L71j68q9K08j58
$$ y = [-211, 226, -110, -493, 126, -199, 242, -557, 88, 360, -293, 522, 389, -80, 264, 250, 191, -412, 160, -49, -247, 235, 0, 534, 47, -11, 438, -181, -101, -159, 273, -133, -460, 605, -149, 140, 236, -14, 168, -36, 205, -51, -57, 192, -17, 347, -180, 5, 469, -472, 71, -8, -18, 152, 17, 539, -679, 136, 154, -146, 195, -436, 209, 226, -215, 150, 276, -92, -392, 40, -100, -276, 502, 31, -67, 4, -216, 91, -325, 314, -163, 133, 270, -158, 126, -66, -183, 185, -18, 66, -29, -39, 32, -160, 263, -325, 57, 54, 40, 111, 213, -275, -71, -184, -90, 39, 258, -54, -43, 82, -198, 79, 135, 115, -139, 87, 82, -33, 157, -60, -113, 225, -193, -46, -189, -11, 105, -95, -104, -95, 199, 8, -440, 268, -157, 22, 156, 124, -7, 3, 251, -134, 89, 142, -152, 56, -55, 124, 107, -160, -206, 4, -166, 60, 131, -249, 30, 272, 33, -139, 126, 73, 27, -62, 20, -186, 242, -70, -118, 85, 212, -228, 143, -25, -114, 94, -64]
2333f4J6P7R2j26KJ24n6K0j34j6Q3N0j25l5J91k19joM1n5j19K55L4P0l84M58p5
2360I8k17J15K45j87p5j54K12k17K34j4J29l21j1M17k51q0K50k74O6K18O1k32
2382A2L5K24n12K43p1q8K38j61K04Q1Nm17L28j13K06j16K13j84r7K03k47l6j3
2405f3P6M3n5K03j5k21m0K03P1l61n3O7j56M49k48J26j33J03J22l14J04k2O2K6
2429b6j30J55k7j36K56k74Q6K18j15j20Q3J6K1J23j60K30k03J98k24o9R8k75K25
2452e0J94k13mN5r4N2J20QK66m04K55J26m7j51j71J3j36L20j75O3k10J24K97l38
2476a00L7j90J93r0K0j9L76m19K71K6m3k25M66k71O8j12o0J88l83K89J3p7l9K09
2500A28j02Q1k40K55J16k75M4L63k34m71J78M30l35M26k22l5k13J47J89l29M8
$$ y = [-64, -48, 29, 121, -5, -3, 121, 65, 85, -49, -65, 18, 68, -57, -92, 99, -120, -121, -127, -86, -141, -260, -5, 29, 99, -285, 173, 98, -119, -4, 241, 54, -21, -175, 37, -180, 54, 40, 169, -152, -163, 254, 3, -77, 173, -101, -35, 183, 244, 12, 47, 271, -241, 2, -69, -157, 81, -80, 124, 205, 210, -207, 121, 8, 214, 98, 311, 127, 30, 233, -14, -50, -63, 13, 56, 1, 204, 189, -32, -72, 131, 202, -159, -212, -145, -301, 148, -100, 26, -107, -4, 118, -196, -92, -114, -52, -26, -156, -1, -28, -164, 92, -182, -96, 122, 7, -113, -30, -14, 7, 130, -30, 200, -3, 195, -29, -98, 0, -275, -50, 144, -69, -73, -18, -112, -60, 60, 68, 334, -70, 185, 311, 264, 113, -58, -45, -181, 139, -36, 27, -183, -59, 238, -100, -63, -253, -60, -150, -130, -149, 227, -192, 79, 105, 62, -163, 303, 32, 100, -12, -72, 116, -267, 22, 35, -42, -81, 128, 26, 107, -133, 122, 238, -37, 7, 370, 136, -335, -157, 273, -62, 364, 142, 107, -106, 41, 230, -99, -51]
2521e1L7j70K45q1O0q5M2J22l64R3M38j93J51l56M11k82k6J45j64K36k38M3pk74
2545b68O80m05l9J76k57J06k25L73j01j80K86J18j87j40j30J20pM74n29M05l70
2566a00K07L0q8o5J74l4k49pK27j2k30J91q4K29l20J22J5o8R2j27K0L1m9J73j77
2591i9J79j31K13k25K18k69j55N33j38l04J79p4Q4L5p6K70k26rJ42J70n30L4K00
2614B1Q5m9N7l36N20n41L08J28l28K33J36k78j63J98J55K1K1j68j37j7K02%l3
2637C5J38l15L64J7l63L39k37k28M88l75K50j36j1J77nJ16o20K74J42Q9k63k6
2659a50O5J13J53l52m3N39n67K52L7m7j01l02K59J84l00O13m58K19m05N44k67
2680a4j29L18k93p8K28J9m1L4P7M6k20j33J59J28k22J9Q3Q3j50R5j09K68k76J67
$$ y = [-51, -14, -184, 61, -20, 40, -45, -3, 119, -245, -152, 286, 93, 244, -112, 299, 17, -9, 136, -28, 208, -30, 13, 6, -268, 412, 7, -32, 144, -113, -7, -232, 141, 40, -140, 146, 264, 77, -63, -193, -73, -80, 394, -135, 270, -100, 107, 137, 49, -16, 158, 124, -125, -132, 95, 83, -147, 44, -40, 189, -131, -9, 6, -62, 30, -97, -77, -46, -95, 78, -99, 80, -51, 162, -63, 155, -114, -269, 264, 126, -178, 1, -73, 11, 46, -30, 240, 14, 5, 147, 317, -213, -179, 21, 106, 57, 114, -222, 298, -243, 65, 193, -135, 98, 234, -44, -207, -9, 146, 167, 188, 20, -117, -134, 68, 68, 35, 173, -142, 222, 239, -124, 215, -22, -250, 238, -137, 113, -23, -34, 143, 138, 254, -366, -92, 50, 139, -124, -150, -85, 28, 181, -171, -214, 325, -242, 10, 47, 0, -101, -403, -144, 40, -260, 353, -105, 114, -291, 253, -14, -143, 175, -118, -196, 32, 51, 10, 44, 121, 167, -53, -186, -27, 101, -121, -102, -19, 64, -86, 9, -100, 168, -108, 59]
2704E9o4qJ24J68p3k18K53K8k99j29J66l1j44R4L55m00J31o4j49M19k47L4l8J91
2728A58Kk60Q3mJ63j6Q2j02k64K33l16K69n8P2K11k41l7J97m27J38J27o5P4j31
2752a12J76j06L07p3m09L54j59J58pk24J3K2L62k63p3J7J05Q4l5k6j68q4J45L31
2776C35l92k01l2L09m26N13Q2k99J31m9J09k41J87k58K85m8O1j57L72l64K9P2
2798A8J75l49mQ8jj4J31L8o7L57m05l2m1J25N8k81J77J75O2k30o0J59l2k25K24
2823D6n7l2P9J53p7j45K29k20j07J36J35K2l53j57M56l78K42J27j28K44qk75J42
2846G4k18N7K38j5q8k93K73j77K80r0O7J24k38o6oK23j23M0n3l4J02O4k28k01
2870b88K03J56J18k52R2K61j24k55j18L65j90J61r8J23n32K79J52j21L52l09o0
$$ y = [59, -5, -13, 111, 279, 206, -12, 241, 269, -30, -159, 7, -24, -168, -74, 281, -119, 12, -52, -201, 218, -29, 5, -33, 158, 160, -100, -17, -21, 142, 126, 208, 106, -158, 75, -241, 28, -30, 42, 253, 12, -25, 172, -255, -117, 10, -55, 19, -112, 64, -42, 265, 192, -217, 137, -22, 136, 129, -95, -82, -60, 302, 39, -34, -17, 88, 172, 137, 111, -57, -141, 4, 335, -57, -258, -290, 19, -407, 106, 188, -111, 20, -29, 80, -161, 26, -232, 53, 5, 66, -91, 281, -83, -54, 18, 193, -156, -160, -72, -73, -87, 44, 82, 15, 372, -33, -65, -106, 19, 77, -204, -27, 148, 210, -20, -80, 79, 47, -178, 46, -11, -43, 36, 189, 112, -33, 196, -24, -131, 5, 140, 162, -191, -348, 108, -270, -28, 99, -29, 215, 207, -68, 74, -144, -87, 151, 136, 48, -245, 28, -149, 131, 41, 108, 232, -6, -72, -78, 145, 22, 62, 9, -25, 77, 141, -87, -288, -85, 71, 189, -63, 29, 290, 166, -89, -207, 158, -32, 129, 31, 154, -378, -99, 53, -68, 284, -25, -85]
2891h5L32m62J74L2K17n29M9J07k8K50j01K98j31J0j20m2K32Q8n17L62Ol09N7
2914a10K28k37o4J29n2K23j14p5R3k67O27p16M04Q5j74j47O3M09l85O2L55n48
2936b11L67q2k27N8j67KJ86q2K77k2q8o3K23l37J29J00K4l48L16K27l36J66j95
2959h3K3j02P1J61j91J39R7j66K0P1K06n9k65N9kJr7J35P8p9J05k26J30j38J33
2984B1k01P3L25l02J03m2J86n7J31m39J9L17J2k83J41L0o1l0j22K94k15L2J27
3007E9k1N2j53J00J47j04K6k76K30j71J58l8Q1k14L64j28m4j35j30J21R5P5J5
3030A09M8k95K99j08ml09K96L5j8j56r0Q4N6J95M0l24p9N29l68q6J40K4k08L20
3054A30l23R8J74j95M4Q9M9j01l4J29q9Q3NO1j50R6m11L80l01K45O8J4k61K96
$$ y = [-85, 247, -215, -41, -9, 208, -321, -272, -165, -193, 57, -44, 254, 123, 133, 13, -29, 203, 291, -226, 136, 142, -167, -110, 118, -119, -183, -54, -106, 117, 3, -72, 21, -246, 381, -335, 69, 154, -20, -167, -104, 305, -80, -18, 337, -211, 156, 74, -153, -95, -262, -260, -74, -156, 121, 99, 11, -52, 171, -166, -37, 63, 87, -261, 55, 282, -54, 112, -83, -60, -162, -91, 70, -121, 18, 115, -51, -31, 40, 246, 187, -78, -19, -21, -20, -117, 18, 96, 17, 122, -104, 26, -112, 21, -180, -107, 218, -84, 19, -23, 163, 106, 237, -202, -183, 134, 146, -137, 4, 34, -27, -57, -179, 115, -100, -68, 59, 38, 90, -63, 37, 184, 80, 106, -170, 60, -111, 47, 9, 90, -124, 240, 112, 68, -67, -197, -76, 19, 94, 109, 157, -138, 161, 53, 49, -260, 36, 71, 53, -103, -193, -109, -53, 142, 182, -142, -221, 308, -60, -146, -6, 18, -190, 130, -193, -95, 79, -116, -72, 17, 66, -35, -69, 60, -29, 54, 59, 120, -30, 66, -345, 35, -266, -21, 47, 61, -200, 96]
3078I6k2J3q7l5K05J3l55J58r5J44j65J41r2J37j66M9J05j92K50l13J79k27K40
3101a9p5l4qK6J15k4Qr1L1J37j88J92j30j05L13l02J87J42k54K11m7l10L28K51
3125C54m78j2J80Q7k03O7Q7j44j47J77J39nk09J75J5l69M02k44L2L8K21j92J37
3148A08j14L4m9J31k77K30j41K42k38OK42r6r1j32J47J19j68p6M44m10k79K44
3170a24M11k67k03K12Q5o5J6l30Q5k08M08p9r3L16k41L01k31l15K82J54J12l10
3192h4O3J60j08j02R1o8J42j63R3j81lR6j11M3L9J93l01J37q5q0L11k10kj50L99
3217A19J3l05L41j99J43k54K10j38n0n4k01K08j34L11J48j51L2n2rl4O8j34L00
3240A78j96j49J7K98m54L76p9J29q2l74O06k52k19O1nL00k58l1K09l02L34n8J13
$$ y = [96, 74, 87, 0, -35, 170, 183, -172, -14, -109, 35, -130, 11, -81, 56, -110, -61, 44, -148, 102, -211, -32, -259, -19, -94, -128, -136, -110, 5, -19, -11, -102, -71, 66, -122, 70, -60, -165, 148, -154, 33, 175, -79, 132, 85, -225, 103, 354, -124, -136, 44, 131, -72, -5, 82, -62, -209, -32, 107, 102, -107, 68, 83, -286, 116, -128, -96, -58, 163, -29, 108, -6, 28, -21, 110, -167, 63, -78, 164, -74, -68, 174, 78, -13, -145, 2, 121, -47, -123, 321, -89, -368, -124, 287, 20, -183, 29, 114, 49, 65, -265, -180, -388, 20, -59, -152, 164, -77, 224, -7, -322, -40, 114, 226, -84, -21, 139, 31, -71, 20, -48, 94, -69, 24, -157, -160, -64, -175, -132, -93, 100, -201, -64, -149, -229, 82, -128, -130, -280, 119, 132, -173, 168, -31, 112, -142, 68, -70, -120, -174, -375, -167, -301, 10, 158, 7, 39, -13, -22, -56, 12, -122, 178, -18, -167, -150, 148, -306, 70, -9, 120, 38, -336, 270, 18, -201, -140, -145, 155, -103, -134, 75, -227, 107, 49, 162]
3263A62l1j76m6N8k34M16Q0r8l01R1m0J49LK35m14J51j63J59J82m85L98O0k3m68
3287c35M56k03O4J16p1J71l44J33J81j94J01k04J36j45L7K12k11P4j1j67P9K10
3309H5J58k41L46k78l5o7O6j98K76j13L4J14j31l47K97o6j1K05j82L36n79L74
3331D3l50j0L12N6J1p5j45J19O2k45j2J95o9r6J48rL68k59r3O7l51L37M3k54J15
3356i2K58Qj72p8J10k21M54k45j08L1M5O6l67L28R0k50R2M5J95j72R6J23k11q5
3380f0J41j77K16k20J47k19J29J35k44K55l05K95j99K11p0j25p9L09q8k87R0J44
3402aJ19j06QO0o7J19j18n3K68O3k78o5l8J81k31K05n5j50K51K3k14r7J48k7Q3
3427B8O8n6j81M1j87L40o9K10l92M46p42M22J75l76J69J24J16k16p8J34j97M44
$$ y = [162, 131, -45, -91, -33, -267, 149, 229, 131, -170, -79, -119, 30, 33, 268, -146, 5, -158, 1, 183, -302, 96, 156, 133, -335, 121, -82, -18, 98, 27, 198, -146, -13, 168, -26, 75, -129, 7, -138, -101, 111, -100, -26, -37, -204, -125, 85, 243, 2, 348, 70, 35, -32, 34, -164, 112, -1, 33, 147, 16, -331, -34, -100, -111, 94, -88, 248, -331, 43, -307, -317, -5, 51, 62, -13, -158, -39, 23, -222, -234, -39, -108, -204, -56, -65, 303, 44, -49, 18, -333, 4, 47, -207, -92, 166, 174, 2, -76, 34, -187, 267, 22, -86, -55, -10, 56, -311, 17, 107, -143, -51, -6, 189, 17, 113, 236, 25, -60, 81, -96, 120, -100, 47, -172, -43, 92, -152, 103, -202, 93, -106, 105, 35, -90, -169, 140, 52, -235, -145, -1, 118, 12, 20, 80, 13, 132, 14, -39, 229, 292, 14, -51, -89, 92, -139, 66, 11, -139, 112, 135, -79, -176, -28, -55, 28, 96, 40, -141, -100, -287, 53, -16, 194, -198, 248, -494, -72, 103, -273, -104, 20, 136, -80, -158, -24, -221, 223]
3449B23j81j70K52n3k87J62O5L2j24J46N2n03M37J41o9m70L77jP5k00K74J30k91
3472A7j62K29j05k02J10L03j57p2K44R0j62l93J79j11J16J51j70K43j21L51m19
3493d1j19J89P6j84J61l36N7J81J00J15l26J15l0J00L36m83l7n1J19J17k42L52
3515A69j76j79N7q8J96P7j50n9J67K27k52L4j6l05N91p1k94J4k90M01q6J13q5
3538eJ32J0k22j77oK98j55K26P1Nl08o4p9o4L89K0k21K40k42J93M8j08Q1j97N6
3563g9J08m3J16KR1j36J21J0P9k76k16K45J2m6O6j85N8l22K62j18P5J5J82q7l7
3588a03K21J07m17q8J19J30J30l3K87k03o2r0j30P3j60K37R6j21P3K4o5N5n7o7
3612d4N2j6p5M3o9k4J14m3j36n1L95k31J56k25L14j70L9K5j65L73o9m20K66oq9
$$ y = [223, 42, -128, 124, 71, -216, -54, 11, 43, -81, 65, 117, -386, 51, 192, 123, -347, 30, 29, 104, -96, 178, 308, 17, -145, 84, -21, -223, -113, 190, 33, -39, 205, 295, 133, -260, -81, -192, -76, 75, -95, 148, 27, 378, -41, -160, 29, 105, -79, 82, -254, -197, -16, 84, 199, -127, -12, -42, 58, 394, -89, -126, -177, -58, 59, -183, 169, -7, -186, -129, -217, -21, 56, -94, -153, 14, 241, -11, 23, 7, -298, 293, 222, -72, -58, -348, 53, -33, 80, -5, 127, 137, -85, -262, -268, 30, -125, 101, 172, 177, -131, -195, -274, -338, 51, 71, -150, 90, -152, 41, 89, -19, 62, -135, -79, 29, -14, 102, 104, 195, 59, 180, 190, 269, -7, -223, 22, 34, -12, 54, -131, -73, -395, -133, -251, -176, -161, 21, -66, -103, 118, 225, -192, -280, -161, -31, 99, 66, 353, 150, 88, -2, -132, -59, -219, 18, 114, -7, 66, 90, 25, 80, 23, -44, 8, -8, -83, -40, -109, -133, -19, -62, -198, -249, 146, -85, 71, -154, 160, -10, 29, 54, -111, 262, 193, -227, 39, 33, -56]
3637e6J64k18j56O30l45q7K22l93N78j98j62j90K11j6J29l08K79k57J83K11m42
3658b21K05Rn2L20k47k0J9J65j11J56r9k84K85M7J16J4m63L4Q5q4N6mO3J40rm0
3684H0m15M35l13P5J59R5m49K13J72q6Q0J16j21L8j42k7K72k50K53l6k57J88j53
3707g3J12o9j23P9M0R6l7O5j74M9m0K2M9o6N6n4P4J20j07L2L3j60K16j30r1M57
3733C76m79J9o9j64J54K46k30K8L50j8j17o0K82l07l5On1K5j95K62r6O5k3K4j72
3758a79K87N7K6l75K67l16P3M9Q9l95N53j62K4j35J33K3l02J52K11j43J83r8r9
3781g7J38j21K35O1n4r9j90L16Q9m70L72l51J39R8j14k9K13l68J13J30j94j13
3803b76Q5J96M9J27k00m5n8K28j06j26J47m9P1j95L16q8L64k88j96Q1k26J62k39
$$ y = [-56, 108, -110, -266, 364, 19, -68, 154, -239, 339, 141, -21, -211, 0, -16, 113, -195, 84, -173, 10, 221, -221, -16, -7, -59, 261, 14, -6, 13, 178, 67, 223, 124, -160, 125, 172, 288, 302, -161, -127, -42, -126, -70, -74, -11, 129, 120, 80, -335, 100, -213, -138, 21, 116, -333, -120, 52, -34, 46, 162, 41, 79, -63, -90, 182, -68, 185, 149, -108, 80, -73, 39, -30, -153, -74, -34, 62, 25, 90, -84, -35, -75, -53, -4, -70, -14, -68, 6, 126, 19, 51, 84, -76, 140, 10, -81, 376, -103, -84, -153, -317, -163, 83, -147, -119, 231, 213, 96, 36, 318, 11, -24, -18, -69, -44, -239, 23, -73, -8, -31, -7, -179, 108, 165, 191, -184, 83, -233, -160, -111, -22, -417, 136, -26, -2, -137, -4, 19, -283, -131, 80, -63, 120, 22, -77, 61, -60, 175, 236, 182, 83, -107, 209, 298, -172, 200, -151, -12, 86, -28, -57, 156, -212, -99, 31, -163, -276, -191, 5, 54, 181, -19, -64, -122, 106, 0, -126, 21, -28, 43, -152, 164, 76, 440, 152, -44, 37, -189, -27, -266]
3826b66L91J68j2m13J45j61J4J48K0R4r6r5N4M7j75J69n9N4j15O1Jj89J91K09
3850A85k94J49O4j54J32j19o8l4J47KmJ0n5p9J29J07m24K74O2j31M68l40K5M6
3874I8k0l7l4k4k20L31m56L05J15J71k03j06n1j48K37j09J79j07L00k45J05J2
3896I3k54JQ9q1K15k31J05O7j46J70K34j59J13l37k49K57Q1J24q1J59m0l0Q5j25
3920F0L1j76l1J72j52O5j57K71R8m04J30p6O1j06J48M0P8R3j9l50L27M9lo3k39
3945a53J99j98M13m12O3JJ90n55M69q8L00m58L42J5k11k7J91q8K09k01r5K69m2
3968A33j40j04r5M6K34J15l43K07K04m24M68n64M12N2l37O0J94j88K7L2j88K55
3990E6J59l14J74j64L16k76N3J41n9n1J64n03L00n7l9o8Q4M41n06Q3J35j87R0
$$ y = [-266, 125, 293, 281, -132, 13, -148, -134, 14, 34, 128, 32, -63, -9, 38, -137, 32, -27, 27, -88, -27, -26, -215, -24, 185, -109, 40, 104, -50, 82, -37, -105, -139, 8, 10, 6, 16, -39, -118, 11, 118, -306, -32, 30, -101, 367, 27, 52, 98, 78, 41, 7, -17, -237, 94, -362, -57, 58, 229, 26, -80, -131, -279, -42, -151, 28, -79, 221, -24, 81, 93, -161, -160, -71, -152, 63, -168, -63, 4, -142, 28, 262, 103, 216, -121, -370, -113, -32, 92, 11, 170, 130, 100, 185, 60, 91, -85, -116, 56, -96, -31, -188, 83, 181, -223, -93, -169, -108, -214, -66, -26, 52, 145, 126, -224, 103, 152, 149, 86, -153, 46, -152, 261, -151, -88, -87, 103, -452, 17, -71, 229, -229, 113, 128, -83, -110, 81, -7, 202, 1, -94, 175, 133, -7, -111, -206, -160, 74, 189, -154, 53, 257, -167, 301, -263, 149, 201, -136, -76, 118, -70, -43, -11, -199, 56, 215, -99, 75, -89, 227, -49, 4, 145, 86, 35, 199, -304, -4, -61, -100, -168, -84, 357, -149, -66, 69, -118, -28]
4013b8P9l48K21J9J26J22j82j62J63k26j5j38K99K38k03J1j24J32L43m41L65p2
4035A79r5J44k41j34L24k63J44JM8Lj01J05j57K02j87q1J06m4k2r6J22m1K76O9
4059B61j76l68L94l8J92l09J15j17j38J66k31J46J59J35l14J69J08k91J66J21
4079A50j36J06q9k14L71k5j57K3j1J5L4r2J62j15P2k37K00O0p3N9K7l8m7j92Q8
4104e9J95k34K70J77m25N5J56j23J17k00PL7J58j76O1j68J64M1J38K7l34J55j62
4127a23J76j71O8q1R0J73J41m31q3P8l6L92j51j63J77j7J07k47m8M14l48L0K16
4150A63k78M7J50j89n3J31l5J37k42L12l06J13LJ10n2m0K8Q1j47R1j98J39j01
4173a36q6K35j76n5L87k53L69j28j37L5r3R3k4m7j03K10j39J27Q7j09rJ03l43
$$ y = [-28, 51, -297, -76, -57, 69, 191, 9, -153, 10, -216, -231, -369, -70, 168, -35, -24, -148, -16, 327, -114, 251, 179, 84, 228, -13, -147, 177, -86, 58, 59, 107, 110, 9, 114, -43, 159, -28, -109, -3, -47, -69, -165, -43, -84, 192, 261, 85, -283, 111, 73, 265, -44, 71, -46, -184, -18, -249, -103, 56, 191, -123, 46, 154, -137, 29, 150, 14, 120, 31, -183, 188, 163, 6, 29, 18, 33, 67, -25, 137, 22, 94, -143, 57, 117, 44, 103, 130, 92, 45, -147, -59, 136, -98, 172, 349, -76, -21, 135, 12, 129, -71, -64, -27, 131, -45, 16, -152, 12, 53, 191, 218, -116, 39, -123, 53, -118, -50, -131, -41, 132, 273, -158, -241, -163, -199, 193, 42, -121, 56, 39, 146, -101, -149, 265, -83, -53, 163, -115, -68, 82, -107, -160, -29, -64, 73, -169, 143, -163, -50, -47, 63, 11, -29, -1, 80, -67, 24, -174, -35, -136, -222, 13, -163, -218, 169, -84, 285, 157, 20, 55, -38, 55, 31, -16, -119, 91, -48, 79, 166, 57, 48, 151, -192]
4196a92n8M29j71n7N1M8j09j05J04J40j38P2j71J76J50j97j12K76j25k25J74r8
4218a38N1R7k08M8L03P0J7l03L0OP5J63j21p0K08l83o9K41M3n5n9K34k53jK6M5
4244cj90J36M9L13l86j83K62R6Pk86L50k03o3l4l6J51j92J48rJ17J60k58L97n16
4268a73K18k77K06k89L13k7R4M0j46J08j76K52r8M8m00J31K19R0l1k20PJ44k55
4291b22O0K79j68L28k51r3j57J11P1M3J98l83K41q5j46L70j71K91k31j10Q1m7
4313In7M50j91m15k4Q5J01q5J80l4j73J82J32Lo18L43k86L49kQ9K9K00j62k1J2
4338I6l4L2k92K42q7N1L18k42k37j2M61l47j99L50j86J1J44n5J5k05k40K67J22
4361b7J47m6j0p5J12M4J9j50kJ42j96k11L56k27J12R4j22N02n79k08K78RR0n2
$$ y = [-192, -250, 179, 8, -49, 2, 50, -59, -164, -60, 80, -58, 14, -157, 19, 169, -28, -140, 136, 11, -214, -40, -138, -87, 10, -198, -150, 153, 223, 240, -63, -33, -27, 48, 211, 90, 20, 228, -155, -224, 17, 60, 5, -54, 180, -73, -74, -48, -3, -193, -57, -8, 305, -81, -264, -2, 94, 101, -185, 165, -38, -101, -135, -171, -20, -212, -64, -73, 44, 204, -54, 343, -173, 45, -232, -26, -315, -2, -29, 65, 105, -41, 67, -109, 143, 45, 93, -307, -176, 43, 133, 102, -118, -111, 33, -222, -162, 117, -51, 277, 26, -67, -224, -113, -42, 1, 199, -184, 57, -28, -174, 196, 25, 316, 85, -25, 56, 9, -48, 402, 211, -204, -228, -143, -42, -127, 53, 19, -154, 28, 160, 163, -455, -112, -398, -49, -51, 38, 67, 267, 105, 84, 96, 62, 94, -198, 44, -43, 8, 326, 84, -153, -165, 296, -51, -250, 100, -86, -75, 69, 14, 29, -176, -416, -149, -27, 120, 74, 64, -11, 101, 145, 164, 14, 12, 154, -42, -253, 103, -124, -12, 82, -40, 462, -117, -325, -47, -38, 52, 0]
4385@J33j52j29L16l38J4nL23K6l48n6K57K48l29Q7oJ50j54P8j25j03L21j77L5
4409F6j03K29k79K89K20n34J62Q4l74L28j80p6K3K36o6M04k34j97J45n54N59k42
4431i4K74k54K81k05R9J25k78K20qn0J8J4j81J14j57J64j0j54K50l31M16j4l03
4454f4K52l3o8l07M14j53K06n06M87k86k44K60J23m3r7R4P9m8l5j5j2K6R4j34
4478a0l0Mq7L31l17j3M70j00l12K48k11j36k2L7Q0j44J67J20l7q1k93K96N7OJ96
4503B19l45J00j3r9k6R8l9k77K86L9k35J92R2k27J92r5K42j75K2l5j37L75J14
4526B68l89k78O23m43K34R6K9j43J63k30P9L67j20k18j06J39L2r3M9j00K3N2J0
4549D4j65N26m72P4j04K88l00q6K02q0L6N3J92n7j74J12j41j71K24J08M7j94K87
$$ y = [0, 133, -19, -148, 168, -170, -156, -161, 162, 188, -160, -216, 41, 289, -40, 47, 41, 191, 37, 115, -10, -113, 208, 31, 66, -37, 192, -87, 202, 422, -112, 50, 134, -240, 88, -92, -168, -145, 91, 25, 429, 195, -2, 143, -411, 148, -94, 180, -74, 207, 2, 101, 226, -52, 168, 160, 110, 128, 142, -39, 75, -82, 82, 72, -82, 168, -163, 253, 239, -64, 188, 155, 87, -220, 194, 41, 247, -259, 228, -58, -302, -42, 81, 38, -59, 35, 114, 66, 31, 16, 4, 30, 124, -10, -40, -36, -123, 208, -109, -122, 348, 248, -64, 184, -27, -163, -185, -148, -68, -212, -45, 75, 38, -43, -336, -40, 17, 23, 219, -126, -26, -39, -138, -164, -66, -105, -382, -96, -57, -292, -100, -8, -235, -43, -138, 104, -71, -49, -84, -221, 154, 268, -121, -399, 224, -219, 15, 111, 140, -3, 160, -70, 9, 376, 256, 38, -68, 71, 103, 10, 59, -41, -18, 34, 44, -121, 405, -67, 7, -97, 191, -109, -195, 7, -73, -37, 16, 208, 151, -23, 89, -52, -223, 1, 109, 156, -38, 249]
4572B49l10j8R1m52L67k3o8L35O8k44M5k75K74j71J63j72L5k4k1M69l18rn1L9
4596b1r3J27k0nJ96j81J01k16L51l07l7j3LJ37j99J92J15o0L0m5j69J27J27l56
4620b16K16l8J97j58m7m4N3J09O0k79P4J34r2R3o1k39L12M8m0k1o9J9k86K14J98
4645A37k27K78k33L07j86n9K4n5n3J48k19O4J83j4j94L00N5l10K02l6j77K36k24
4668e3P8j6n3K33j74k1J24j20j63L43j04j57m4r4K13L1J85j53k13K72q5o7L44
4691C06k40k02J11j98N67r8j44j74k3J68j5j05Qo7PP9R5l53l3K00J59o7K3P4m5
4716C3j34j07J78J11J02l05L0K05p1j66p6J6n5R3P9J7j31K64L7j94K90k23N3o0
4740a4l8K6Mj05j31K74M8p3K1k49J60P7k4J32k18K89j02j5R2m30NJ13J20k23M06
$$ y = [249, -61, -79, 12, -440, -73, -96, -164, 171, 239, -5, 40, -235, 39, -132, 31, -141, -106, -130, -151, 318, 0, -9, -60, -21, -114, 13, -7, -12, 184, 3, 104, -112, 239, -68, -105, -118, -115, 22, -177, 15, 130, 70, 100, 55, -114, 13, 140, -216, 0, -38, 159, 1, -46, -90, -37, 72, 132, -147, -73, 61, -31, 62, 1, -238, 74, 122, 82, 61, -8, 11, -275, -61, 137, -90, 188, -45, 262, 76, 17, 41, -14, -67, 81, -138, -74, 109, 95, -99, 201, 256, -54, 148, 112, -65, 171, -53, 25, 9, -44, 189, 15, -6, 118, -2, -165, 178, 74, -83, -127, -221, -8, 23, 208, 55, -158, 114, 29, -38, 306, 66, -136, -25, -223, 344, 246, 102, -72, -95, 73, 58, -47, -39, -106, -99, -20, 75, -278, -311, -111, 48, -19, 4, 78, 33, -101, -208, -30, 81, 183, -122, -92, 113, 42, -124, -200, -184, -239, -146, -67, -50, -181, 83, 120, -74, 216, -7, 46, -14, -52, -26, -22, -127, -258, 16, 64, -9, 12, -237, -77, 0, -24, 108, -110, 179, 77, 62, 154, -276, -271, -158, -38, -261, 145]
4765A45j47k11O9L25J76k71j03k85M13Q9k03J14M8L0p1j12J14j36J13l80K20j58
4787b21M12j14j13J41l6J1m06L14J32j1K15q1j60K5j92K21l43L54k17J3P1K4J64
4810B03l10J02J14l16J90n0q9K35q7J03n0M1j73k40K52K66l29q6M6L14j53l4K94
4833B43j54j76N51m72L5J34j28K25l51k73N96k46K06l06L76k88kJ16j64J75N5
4854A52p3Pj37j15J52L9J62j91j61K84q7J65k50J05j07J00k14K32o3J06j36m0
4876g0O7j77O4j3K15q9J28j39L8q3l1M3K69j57j91L62k54k26M95j13k52L65k92
4899d1o0m1J61L1j61m3L1R8J00j27j22L81k19j55N9Q6KL2j54J73J08j59k5O3J24
4924A42j41J45m7m39L77K69m33R0J56j58J04j33L54m31m6K05k21J32M2k17K00
$$ y = [145, -2, -213, -144, 181, 357, 86, -17, -302, 111, 200, -3, 111, 159, 189, 118, 6, 120, -16, 97, -283, -63, -221, 191, 77, -36, 105, 69, 80, -326, -12, 120, 109, 324, 243, 83, 108, -84, 137, -206, 148, -69, -56, 15, 39, 203, -107, -5, 109, -207, -17, -67, -156, 79, -8, 95, 45, 86, -87, -327, -75, 191, -138, -224, -178, 136, -17, -51, 243, 89, -87, 464, -8, 27, 161, 33, 258, -93, -366, 230, -16, 190, -116, 260, -28, -30, 86, -78, 97, 152, 79, 86, -51, -166, -14, 25, 187, -4, -165, 119, 32, 197, -53, 52, -55, 45, -169, 63, 0, 106, -30, -70, -3, -180, -116, -129, 86, -3, 125, -14, 24, -59, -90, -47, 222, 65, -126, 236, -18, -244, 251, 138, -114, 251, -41, -101, -142, 19, 50, -111, -154, -123, -25, 75, -52, -174, 207, -12, -167, -108, -22, -20, 12, -142, 31, 139, -20, -45, 18, 142, 1, 146, 99, -340, 37, 306, -127, -37, 119, -39, 65, -68, 286, -145, -191, 14, -207, -75, -33, -250, -50]
4945e0J04O3k03J84p9K0n3L9J13k21P9j94O3K15l14K29L2N1k20L6J51n3R4K31
4969C17k95k66K41RJ8j90J97L6k41K58k7j23J40n2L4J48k46M28l96K6j29j94L44
4992C7P4j23J41n4J07j17j20K42r6m6j22j26J08K44j01J1R4l89L03J06j39k82
5014b48J66q8J71J0j66L96l31K62l33J28j4j7j27J65l56L99j06j38J25K0p4J54
5036bK2R7j84J68j71j82J88Nj38J29J37k99k11P0N08k29K5J81q0rk3j61Q9M1J60
5061A31P1k52nr2R5M5j45N43k03j50o9k74L64O0K19l76J31P9N1k51K19m26J50
5084h5j7J76l22J80K73j20J27j26J93k65m1r1J96P4l51LL02k30J04j36K21m4m
5107A7r0J76o7j1K40j95j57J1K00J4n9k82L2J50L47k27l51L34M6l70K59n1K50
$$ y = [-50, 54, 117, -86, 98, 19, 39, -14, 25, 138, -83, -4, -198, -135, 80, -234, -5, 27, 78, -142, -106, 45, -8, 86, 317, 22, -244, -3, 6, 24, -166, 31, 67, -174, 84, 57, -66, 74, 22, 56, 204, -42, 386, -10, 16, -113, -307, 37, 111, -12, 129, 75, 182, 65, -55, 187, 91, 45, -77, -203, -95, 149, 48, 59, 153, -236, 67, 173, 34, -248, -82, -170, 1, 11, -155, 241, -90, 172, -161, -33, -47, -64, -191, -26, -382, 17, -89, -227, -102, -82, -156, -2, 20, 117, -67, 101, -70, -252, -64, -59, -197, -68, 69, -230, -441, -371, 137, -92, -67, 114, 34, 25, 2, -159, -70, -29, 131, 202, -50, -55, -147, -52, -7, -152, 391, 188, 38, -31, -305, 59, 119, 338, -38, 93, 172, 223, -28, 191, -235, -85, -102, 74, -248, -68, 205, 85, 212, 86, 279, 14, -27, -118, 78, 152, -199, -196, 106, -124, -20, -156, 65, 21, 17, -73, 103, 36, 25, 265, 70, -87, -76, 124, 138, 79, -203, -171, -21, 326, 99, -252, 82, 128, -242, 17, -34, 216]
5130B16k66J49p3J8J11r6j11OJ75Rj97j35M3K39m9k91L83l05L02j7r0p9OOn7K29
5156A26j65r9L60k24K4J12O3j26j83P7K06j55J6k24O1L3J85j76J06o3L62m50J32
5179bj03o6M4%L14j54j76J01P0m15L16K02p0K34m09QmJ25p4k1K0m2J19J67j55
5204B9k18k1L14r7j94L18k51q1L65k89K49j2l95L79k98K09J17r7j83K22p4mm3
5227e5J07k01J99k06R8j5J8J34p8m4J31k79J30p1K53k55K3K74l15J82O1j35K50
5250B06j74k12J38M46m78N2j29j9J73q5J26Q2n0j16p2K29j16r5P1J36P1l56L22
5273A50j45L3J5j8n2J13k24j11J19M8r5J78L00n47M57n3m74M80k91J97M5k45J15
5296eO6O6k6m34L94k32K31k80qK38p5L34N8l63J55q2P4p3l07L51krPr2j8l8K9
$$ y = [216, -50, 99, 26, 44, 155, 59, -52, -46, 129, 138, -59, -194, -151, 88, 39, -252, 131, -174, 128, 111, 21, -58, -52, -46, -103, 126, -39, -138, 222, -2, 22, 134, 197, 71, -112, -35, 171, 16, 32, -192, -131, -98, 87, -89, 17, -46, 316, -134, -2, -105, -171, -127, -127, 187, 33, -143, -42, 28, -387, -71, 131, 61, 295, -114, -106, -110, 15, -59, -80, -60, -102, 17, 184, 29, -189, -210, 104, 7, -187, 131, -120, -201, 164, -125, 124, 112, -283, 96, -202, 7, 124, 27, -156, 66, -8, -12, -55, 52, -149, 50, -156, -58, -73, -55, 79, 1, -43, 88, -191, -61, -132, 121, -134, -111, 163, -152, 30, 91, -44, 206, 32, -180, -42, 404, -74, -22, -151, -170, 3, -82, 44, 126, 76, -40, -112, 117, 1, -94, -23, 113, 184, -172, 150, 5, 38, 53, 35, -17, 96, -128, -239, -120, -72, -167, 11, 311, -236, 221, 168, -306, 174, -117, 80, 125, -120, -5, 61, 127, 101, -333, 61, -171, 60, -220, -228, 10, -65, 269, 327, -36, 119, 37, 111, 38, -269, 82, 80, 71, 78, -14, -32, -70, -41]
5323d1j06L0L27j82P8L3m3J5k0O6l61M61j90Q8j14J66l69J31J43k28R9J21q2J21
5347A43Q0n38J52J63k13J93k04K79k89L8J73j63K27r7J01R3k69J82nN8j1j72P8
5370ak52L21p1L4M7j78n2R6M22n78L55O7l57P1r8Q8J31j31K88l32l5L33r3l06
5394b31J86m7Q2O4o5M1j02J32k02K13n5jL0J37r0o3P6r1j04M8j2j4J81P6n09J35
5420a85k58L66M4q7L26m6K0j81K12l47J06o7q3J49j9o4J32j77J75J36j51L4k1
5443A4j56L10j48J39M5k81K16k32m3j24K85j67J82m5q2PJ62j41J30j87K56p7n03
5466d40N37j70Q9Q5p5O0p6k96K21J83k84J71j31M0M45l38J28j30j11m4j52N39
5488B51k71J37j07J05lq7k39J86KMr5L7J03j60q1K60m3j03J68j06l5J71J05K6
$$ y = [-41, -147, -117, 210, 28, 106, 139, 96, 111, 91, 157, -204, 257, 67, 155, 41, 207, -162, -31, 112, -116, -17, 104, 22, 143, 223, -315, -163, 0, -213, -20, -224, 55, -234, -196, -23, -186, 41, -56, 45, 138, -131, 51, 46, 104, 93, -79, -1, -253, 68, -3, 31, 78, -100, -152, -56, 366, -212, 143, 210, -147, -76, -174, -86, 45, -86, 202, -130, -165, 168, 75, -231, -45, -92, -10, 54, -11, 30, -72, 60, -142, 71, 16, 15, 45, 182, 92, 29, 105, 14, -90, -42, -54, -68, 113, 189, -320, -185, -443, -77, -33, -120, 206, 160, 180, -1, 211, -136, -30, -97, -180, -31, -50, -114, 18, -159, 16, 152, 1, 35, 14, -142, 168, 20, 159, 204, -77, 139, -93, -136, -260, 25, -142, 40, -5, -87, -80, 82, -59, 71, -116, 140, 63, -440, 97, -73, 16, 101, 26, 86, 10, -286, -65, 118, -166, 5, -126, -86, 359, 21, 149, 19, -92, -136, -288, 251, -20, 117, 10, 115, 112, 25, -214, -28, -26, -22, -117, -80, 23, -137, -218, 42, -1, -104, 64, -42, -77, 94, 199, 225]
5512B25j75n5K6J19l9rR8r5j3Kj73L26m02QM30j93m3k03K31m6J33k50j66M68k83
5537g9J25O4o9K07r9m42M08K15k69k82K11K57l62j42NJ24K44m38J96K63o2J5j00
5560a0J66K7p3m68K68J12M4k00K83m88L80P1j21j02L2KJ68k16J12K2rq1J41K19
5584B79k42J56k26J22k81J59Qj36j11K78k16K19n0K89k75K4P9J94j56j98O9K18
5606B03l01J60M2k02J64R8k47J53n0q2J81ll12O5j40J58L0J37j7n4m2L6K32k00
5630Ij33J63j89K19J69J62m65Q3pJ99k74k23J27K22k29L13r0J21l32R7N9J20k88
5653a67JK59l63N80m87K89J27k79M1K45q0N5kj23j47J91j93K5N5J96l06J29N9
5676A05m4j51J01J42k12l7q4L30j63J17l05Q1K28j58O6j27R2l21L26l58N52j21
$$ y = [225, 50, -5, 21, 140, 101, 92, 190, 95, 82, 84, -89, 237, -165, -157, 273, 80, 37, -166, 65, 19, 152, -98, -264, 204, -79, 46, 110, 41, 248, 149, -293, 115, 330, 61, -221, -10, 247, -115, -257, -252, -128, 116, -322, -126, 137, 75, 90, -10, 156, 183, 110, -358, -90, 22, 66, -134, 149, -339, 41, 112, -9, -111, -79, -77, 91, -125, -13, 9, 0, -81, 60, 279, 37, 193, -33, 89, -192, -33, -25, -161, -272, 6, -210, 9, -41, 248, -27, -3, 76, 270, 114, -84, -15, 203, -98, 62, 104, -98, 66, 164, -83, 70, 20, -62, 119, 116, -196, -131, -271, -113, -83, 54, 37, -17, -59, -23, 209, 9, -124, 39, -150, 69, 238, 400, -65, 18, 11, 210, -64, -287, -160, 62, -167, 146, 56, 177, -155, -58, 1, 121, -167, -166, 93, -270, 310, -177, 112, 239, -40, 1, 246, 166, 221, 219, 96, -51, 140, -53, -28, 27, 223, -83, 46, 105, 61, -90, 11, 153, -59, -96, -180, 150, -13, 104, -201, -120, 108, -50, 16, -111, -19, -340, -14, -372, 180, 59]
5698E9r8K69n62O02m91K2J41j8K81k16k27L31L6k65J38J50k76MK5P5p9O5j84J34
5722h4K05k16J73o6j70K28nj52K4mK69j64q0l9k61J65K35k41J79J2j05jJ17j12
5746i3M9jJ30j46j66N0L11j09r1j10L15j45O9k9K1j10k66K29k4J56m3k28J60J2
5770e9K01l13M09k04Ok58L84j78p6J96j29K10j55m0j10L87j54k84R7K3J12m6J9
5793C8p9p1J37K27n30R1J03J90k36K44J02j81R3J9K2k62j86P9M85k05j60q6K09
5816D3n8p6R4L38l52J3l7J65r5k0l4p4L51l12M3k0J3J29j41Q6J51l76O7J41j5
5841B4j17K80k58J70j04J1K20m8j90p9K1R4K07l07R4o9J54l8J35l66J70R5k25
5864a26K45O2k48K76k26r3P5L98m04k6M19j88l32J74j29K82J6j06K18j43j62j07
$$ y = [59, -39, 230, -332, 270, -221, -199, -58, -76, 205, -11, -238, 93, 129, -136, 2, 152, -124, -120, -95, -20, -99, -34, -218, -84, 121, -95, 78, 12, -158, 70, 65, -87, -63, -67, 202, 38, -42, -81, -342, -177, 58, -183, -4, 8, -97, -98, 19, -93, -44, -45, 85, -61, -227, -177, 134, 25, -66, -176, 139, -6, 63, 34, 55, -55, -321, -92, -116, 40, -3, -231, -71, -59, 142, -171, 238, 34, 40, -218, 166, -12, -88, 108, -21, 189, 34, -6, -116, 271, 117, -167, -70, -47, 65, 19, 38, -41, -112, 25, 252, -278, -187, -84, 106, -130, 114, 216, 35, 128, 147, 169, -93, -279, -200, 285, 80, -80, -166, 43, -15, -91, 3, 341, -11, 2, -35, 130, 35, 15, -19, -93, 258, -54, -11, -31, -18, 111, -30, 56, 207, -169, -102, 39, 24, -93, 187, -71, 99, -5, 6, 226, 178, -12, -91, -70, 24, 231, -76, 18, -51, 103, 65, 200, -166, 4, 99, -126, 119, 181, -67, 209, -17, -110, -35, 363, -41, -67, 352, 164, -168, 6, -123, 159, 175, 69, 287, 144, -18, -125]
5886a25pN9J41j32J03Q0j78J99Q2k10J77k84J59N9n1K8j19k4J84j77l3J38RQ2
5910A60k07r9O6k24L59q8q8J91J93o2k93J34k57L91l19L25l87J68n0Q4LL8M3p2
5934IJ02k83J52J73k39l7Q7p9l3K97p2j54J05j12L93o49J49K8L6K99j09p2R7j62
5958g4K1J55j09N7J19J1k93K48J2n3k23J24J19k48k1K69k21L19k73j17L71q4l4
5981G5L6j94Q2L67l15J39j08P1N8j77R4m0j96j26M77j72m07O3M74l38J67r3L09
6004B46j43l58M13k65L23l65J66l58M81k13J68Mj8j63K56k36K51k26m4l1L48l34
6026i8r7L42o1J5j45L3NK13j85j89J66M5J28j09J57n2l78J5K15O4K2j93K40k89
6050a36L6J00Q8m1j13N5L80l78l30L52J62j95R8j59L7o7J54k1PK61m02J16j58
$$ y = [-125, -132, -73, 68, -64, 39, 119, -59, 140, 222, 12, 189, -95, 64, 123, 72, 100, -19, -43, 141, -36, -69, 69, 78, 160, -47, -146, -80, -304, 55, -33, -121, 70, 263, 201, -92, 42, -215, 176, -143, 182, -205, -37, -87, -3, 0, 38, 81, 9, 111, -172, -20, 153, -86, -123, -36, -115, -148, 149, 77, -77, 28, -84, 309, -340, -191, -163, -127, 172, 63, -9, 88, -74, -53, 102, -7, 50, 169, 180, -113, 135, 147, 94, -129, -5, 114, -134, -155, 114, -107, 212, -61, -178, 193, 109, 75, 111, -83, -1, 366, 51, 190, 82, 153, 211, 34, 128, 88, -108, -234, 243, 71, -336, -273, 201, -137, 30, -63, 246, 103, -255, 158, -107, 216, -149, 17, -341, 140, -73, 95, 99, 81, -82, 174, -62, 189, -37, -81, -112, 236, -98, -195, 147, 86, 101, -44, -11, -6, 207, 22, -167, -1, 44, 172, 63, 220, 168, -210, -195, 20, 84, 106, -87, 153, -136, -100, 0, 88, 47, -66, -11, 369, -9, -339, 13, 175, -20, 78, -81, -44, -111, 43, 22, 29, 290, -112, 4, -154]
6073a54K64M0j82l13N80j98j30J51k12J72k28m0K03L6m3K82l72k9J91j90K69m02
6095c05N16n2j64L20j26l55J46N3R4r3l0j27L9L6%R7n5k1n3N2M5O7k36m9L89k77
6121h9K52k07j48j37K48q1M5M3j18Q0j42L10M2k01J79J40j06k21J68L0k0j16J72
6144A23q9j14Q9k27L01J13j79Lr8K52l19J39R2Pj00J17O3j07j00J79k32J50nj3
6168D5J25j02j00P4qJ17J50l12J89j56l22K50N9l3J66N5j60j23k7p8J50P6R0l17
6192a92L07j79O9k79L66j21j38J85J01pj31K88k04q3K48k66J91n5l05K95j4j81
6214a05K18r9k19J70L2J85j61k18L76j31J7J25k81M4J60k0k55L36k72M8O6j30
6236a14N9J16k41J32K9r0R4K67n9j44o3J6J6J54l49J05K22k15J81R1j65m1J54
$$ y = [-154, 110, 150, -32, -345, 235, 37, -93, 58, -154, 18, -210, -250, -47, -11, -54, 228, -144, -173, 18, -172, 97, -305, 211, 159, -5, 315, 189, -166, -20, 33, 127, 34, 4, -123, -84, -48, -48, 49, -6, -27, -80, -28, 17, 84, -152, -201, 188, -89, 163, -44, -192, -329, -81, -162, -117, -74, -192, -112, -254, 56, 98, -103, 76, 216, 110, -111, 57, 87, 67, -49, 123, 34, -80, 9, -218, 83, 196, 17, 20, -78, 174, -145, -6, 86, 93, -7, 110, 173, 66, -34, 145, -87, 63, 58, 45, 170, 68, -32, 42, 34, 151, 301, -11, 178, 22, -300, -50, 9, -24, 142, 197, 37, -86, -113, -191, -41, 35, 125, -192, 115, -64, 5, -274, 92, -29, -167, 18, 119, 112, -19, 269, 65, -18, 230, -36, 155, 100, -205, 90, 76, -105, 113, 14, -205, -35, -3, 182, 21, -197, 179, 48, 65, 190, -91, -47, 113, 93, -162, 174, -98, -50, 16, -114, -55, 61, -180, -48, -19, -109, -15, 252, 193, 49, -14, 2, 18, 172, -177, -72, 150, -65, 116, 207, 42, 1, 155]
6259A55j69L3k61N40K2k38k01K47j95J3K06k35o3O6M0K96l61N3k7k12L73k4J34
6282A92j95J51k85L59M8k59j10J1J51l9K18l06M3J07k31l2K72m4q6k22M28j28
6304D3J33l59K91j27K56j52kR5j77j74K44m9J64j96P7k22j2J6M30j16j17l29K73
6327a0R4l58L27l11J71J09k8M6K9O2p7J0r1j78J85j37M79m11K44o50O86J8Pk73
6351e7r0K59j6M3j85k45M35j02j86K43j59k38M94nk64J57n7j1O4J65j17k82M30
6374B76k42R1l5q2J67J83l29j17J69J06l50N2K58j81j68L84l21N9n5n6J49K0l1
6397e3R7m04K76R7k9K87m27J06Q2jj06jJ59k19J10k35K04K44m00L55l41J28R8
6420B7r1J76k18j08M36k22k34K14k08J70K70m07L74j01n5J01j39O1j80JR2L8j6
$$ y = [155, -14, 19, -242, 298, 320, 82, -119, 128, -67, -54, 152, -83, -146, -80, -40, 256, -105, -52, -79, -291, 82, 58, 192, -3, 148, -137, 222, 270, 11, -99, -88, 63, 24, 242, -64, -21, 86, -145, -177, 95, 51, -35, -257, 171, 43, 176, -183, 108, -19, 237, 85, 83, 178, 1, -173, 71, 22, 186, -10, 67, -155, -167, -151, 279, 163, 46, -283, -10, 84, -274, 53, -258, -87, 22, -6, 40, 69, 131, 54, 64, -27, -205, -20, -157, 322, -89, 155, -495, 191, 209, 216, -57, -147, 112, 96, 139, -46, -291, 144, 42, -144, 99, -60, -298, 196, 191, -73, 84, 27, 16, 80, 245, 128, -154, 276, 34, 125, 90, 8, 175, 358, 29, -88, 81, 187, -163, -111, 147, -34, -202, 182, -139, -80, -135, -191, -42, -22, -53, 44, -360, -84, 13, -16, 271, -156, -50, 32, 31, -75, -76, 83, -136, -26, -261, -57, 187, -213, 142, -199, -71, 27, -64, 112, -106, -214, 222, 0, -234, -20, -228, -58, 212, -195, 179, 78, 23, 124, -15, 46, -134, -133, -41, -3, -19]
6443a9J79q0o2m8R9k70L17Ql00J20J24j97N7P8l0o0LN5q3K06j8j73J62Pk43M08
6469B40l63J77j79K75J2l46K19K48k08o3k6k9J05k52K1K96k6k20m7J57j51N4M1
6492f5J52j27j4J57k58J06J25R3L6J4j22j59o7o6j48L43N3n8J07j8K33k20j97
6515a00J04p3j61L06n1N1M5m0q7l1r0K80j95j4l3L1O2j52J90j17p5J69J34k85
6539a32K34k12Q1L03m51qR9J92k66J67o2m3K76n9k21P9Q1l44Q2K15q9K05k37L20
6563B10k12j42J86m0j29J1J75J25o1O4m48j1L86Q1j14j72J57j51K76k29k4J11
6585D9o9j70j50J20J98J35N4k12j13L26J10j69k27j29j4K49j55L27m3j0p7Q9J7
6608A36Q0k64L8q8K9jj01K42pJ07M6o9l7j03J78oj26k18K77j45R0Rj54OJ0J43
$$ y = [-19, 160, 80, 18, -30, 69, -201, 116, 124, -176, -56, 68, -129, -72, 6, -24, -84, -81, -26, -109, 97, 79, -94, 68, 75, -168, 240, -123, 54, -125, 150, 162, -184, 35, 283, 75, 12, -14, -43, 62, -190, -169, 127, 101, -119, -166, -9, -160, -106, -65, 87, -40, -54, 103, -155, -49, 76, 169, 205, 219, 97, -62, -129, -195, -343, 0, 53, -5, 102, 84, 317, 97, -100, 4, -69, -230, 76, 25, 76, 121, 81, -6, -37, -127, 153, -42, -56, -89, -58, 4, -148, 42, -75, -150, 19, 153, -132, 102, -110, -29, 274, -177, -185, -86, 106, -160, 7, -55, -98, 178, 119, -102, -23, 58, -286, -204, 11, -78, 127, -110, 210, -2, -144, 42, 2, -127, -116, 59, 184, 123, 187, -261, -272, 114, 195, 81, -91, 66, -85, 191, -38, -62, 49, -20, -190, -340, -220, -22, 113, 167, -45, -158, 168, 278, 109, -118, -247, -261, -12, -167, 160, 117, 107, 30, 119, 136, 216, -48, -10, -98, -69, -70, -171, 71, 64, 171, 217, 148, 111, 8, 186, 180, 54, -164, 113, -32, 58, 67, -87, -81, -71, 72]
6634G2N1k37K8J84j75o3K16k77jK09k69N13l26j56K91k1J07j91r8Q4j44J93K91
6657B81m29J17P3J2K8l17K62m5N1k34K26K39j29k14J21K02j62j79J43Pn9K67j28
6680A33j43j9q4o8J63k73J18K01P9j53k0k8N0J39N2j59O2j33J71R7j33M5O2l18
6704a59M01Qm12J08K43j36j72J83J10l06K34j78M7nM9J78j21J6k7o2O1K03n03
6727b40J68k3k2K85J81k90P1k32J38q6m7m5O8j6n6K27j55n1k15M86j44J39j98
6750e7j39J64Nj1j01R3l0J02rl6K65L2m30K21l4Q2p4O4R4j06j19j34R2J98j95
6775f3k02N11l47J33j26J92J46o21L08q1J33l68L74O9J78o3m61j0J59J78J41l0
6797A50k66J47p5K09P3j53j10P8L34p00K72J16Nj20M6l34K53J34K14l37K68j87
$$ y = [72, 123, -114, -86, 98, -77, -140, 76, -201, -202, 7, -262, 251, -75, -231, 60, 39, 146, -45, -143, -59, -203, -10, 281, -148, -31, 42, 54, 82, -235, 27, -18, 33, -201, 25, 264, 135, -79, 42, 244, 82, -97, 46, 53, -6, 261, 133, -10, -29, -113, -181, -18, -291, -173, 28, 107, -46, -66, -94, -44, 95, 147, -12, 50, -83, 88, 185, 52, 97, 159, -159, 242, 250, -162, -54, 189, 53, -119, 64, 174, -132, 102, -76, -29, -34, 15, 193, 72, 88, 61, -1, 60, 263, -240, -72, -95, -117, 168, 349, 59, 130, -102, 36, -50, -97, -142, -74, -90, -146, 81, -74, -125, -340, 146, 2, 141, -57, -196, -32, -27, -38, -139, -46, -76, 26, 17, -19, 246, 278, -152, 69, 35, 117, 43, 107, 201, 95, -24, -158, -66, 132, -63, -265, 246, -101, 32, -94, 98, 244, -377, -69, -150, -17, -385, -11, 58, 236, 173, -288, -298, -139, 39, 180, 150, -116, 31, -44, 165, 238, 85, -25, 53, 387, -313, -41, 75, 80, -40, 6, -328, -75, 59, 273, -64, 204, 17]
6819A7J75m82L17J97rl17R3P1k50J37r8nj22L99j32oQ2l3N2j3j07L26l22m9R9
6844B0L4j16J20j82J0j72M06p6o3J42n48L62K59l37L58k07q2O0L6j68K95l06Q8
6867f7L65k85m5j76K09j76J8o3J53k81M20j02l48K79K38l10P3K36k82j92L72J18
6889A54l96O9L03q4m4o5P7j12J28J31K3o4j70K25q9k11L19l30J98K10l47J91j34
6912a8J50k34J33k28J60l00N71j20j76N7L05n25K31J74r2k30J41J59l89N47m71
6933a55L19k16J07j40M6K17q1m6k0J14j43P8k52K47N9m35M98P9k72q2N5k8J19
6956F8j70n7K94l76J6J20K9K05l20K01K50n8j06k54J24N2K9j8j48L79j26k19J35
6979E0K57m89K15q5J76l0j54L32j52j64R8J2n7J43P1R5m23P5J90k32j14K47N6
$$ y = [17, 192, -290, 27, 224, 215, -102, -9, 62, -188, -51, -149, -154, -276, 123, -9, -15, 67, 34, 86, 73, -34, 292, -30, -79, 20, 54, -62, 58, -124, -114, -286, 120, 44, -19, 123, -425, -63, 196, -141, 217, 10, -72, -12, 24, -144, 151, -155, -67, 298, 13, -32, -208, 1, -175, -157, -220, -67, -348, 72, -30, -378, -99, 139, -171, -98, 138, -144, -336, 36, 154, -242, -173, 130, 46, 2, -63, 14, -98, 30, 161, 184, 120, -50, 175, 86, -125, 194, -136, 62, 272, -75, 116, -18, 132, -102, 31, -197, -37, -337, 234, 114, -62, -5, 300, -225, 6, 180, 88, -142, -1, 158, -231, 316, -155, 164, -52, 55, -85, -39, 178, 97, 51, 31, 145, 2, 80, -172, 75, 134, -301, 197, 276, 4, -78, -23, -51, 68, -102, -159, 135, -241, -225, -105, -76, 129, -191, 10, 260, 202, 96, -158, -34, 18, 47, 29, -119, 260, 134, -85, 50, 307, -182, 33, -52, 124, 94, -60, 272, 120, -44, 54, 66, 9, 152, 223, 318, -105, -30, 160, -72, -186, 61, 117]
7002A17j22R1j04J64j78j12J20Q0K62m49J22r3J68k35R0M7q8K73j2k49j9j46L84
7025A11L5j10j12J2L2L1J30J78k71l18J58P4J36k73J54K80l80K10L09k67k57K83
7047A45j73OK7K1L6k07M0J06K7n6j33M20l38Q8J67j95R3K8N1k8j80L2j25J27J94
7072A73j95k15p7M46l05J52K4q5J41o1j98K94j22J13k97J42J26k48L6P5K46n3
7094A12k14r8K07j65M13k70J31J73m03J15m8qL61n00J53O9pj57L40m7p8j39J34
7117G4q3m7K06j95J80m9J92m18L38j99K05p2j77K9K71r0P5j58j42qJ75r3K50l81
7141a17J88j12J15k14J67lk84K23K6j28L63j16n6j30j0K9J5N5j11J59J3K36n90
7164b82N18k12k02J69j1j20J84K8J35Nk25j18J32J42k04M8K27J28m29J50P4j51
$$ y = [117, -5, 86, -18, 146, -32, -144, -24, 56, 318, -131, -9, -102, 66, -169, -79, -32, -120, 153, 141, -108, -127, -273, 111, 146, 36, -76, -64, -32, -1, 129, 307, 36, -282, -124, -50, 86, -187, -33, 247, -133, 77, 386, 119, -138, 145, -28, -22, 5, 26, 62, -145, -105, 1, 28, -28, -161, 259, -79, 9, 176, -19, 74, 102, 153, 125, -55, -23, -148, -21, 173, -22, -237, -314, 132, -173, -21, 3, -82, 59, -2, -200, 94, -28, 85, -212, -70, 56, -192, -156, -81, 165, 112, -102, -200, 7, -158, 255, -15, 116, 289, -114, 1, -47, -55, 306, -194, -41, 28, 21, -136, 204, 157, 79, -60, 74, -9, -56, 150, -45, 135, 86, 278, -140, 198, -1, 204, 132, -45, -16, 255, 165, 240, 82, -60, -68, 107, 14, 264, -117, 71, -41, 74, -140, 27, 24, -260, -37, -11, -139, 224, 108, 52, -78, -88, -59, -44, 11, -100, 59, 72, 308, -282, 236, 24, -178, -9, -20, -140, 44, 72, 207, 212, -13, -131, 1, 143, -61, -13, 214, 342, -87, 63, 137, -14]
7186a4N1k28J94J52r1k94M08r7l1K5j17P7K24m25J02k7J29l64L24j90O1n7j03
7209b91M16j76o3J81j79K24N0k0k94J16j15l4R0J31k3L4k24K78j46r3m8J72q8
7232a02l8J00J57n8Q1j71j19J72O1Ll9k56K60MO0k20k3O6O8l22L23O2j69k27O50
7257C23o7l57J73k51J23m1QK49k60N4J86j19J09k90L90k85k00L40Q1l65K26k4
7279Cj25M06o25L19j04K98k9p5J67l36J68qk3k85l9O7J85P0j52q9K39j91J02J85
7303A28l7j60M1O7q8j30O6r2N21k75j3N2Q7k32L24r1L7l05Q6j05J83J31k37K67
7327B25k53j24J58J35j25K68J9k32r2N5k12L14L07l49Kj28J36k08j73M44j18l49
7349c00L52o4J16j13o4k66J95L42j36j8j43L67m9m5k51J2P3L7K85k86O3r6J81
$$ y = [-14, 37, -191, 3, 155, 64, -230, 178, 81, 50, 75, -42, 35, 259, -166, -64, -91, 38, -326, -2, -192, -131, -188, -291, 125, -51, -114, 67, -112, 112, 162, 142, -152, -36, -151, -185, -95, 36, 13, 47, -177, 101, -45, -138, -186, -14, -102, -140, -40, 117, 59, 140, -31, -150, 22, 83, 86, 47, -209, 51, 55, 115, -105, -128, -62, 6, -316, 7, 69, -100, -327, 323, 256, -101, 72, -179, -56, -97, -89, 160, -100, -46, 140, 21, 130, -160, 230, -55, -255, 85, 166, -199, 27, 3, -122, 284, -341, -22, -126, 172, 143, 68, 235, -101, 67, 59, 36, -249, -288, -221, -36, 34, -118, -207, 32, -159, -57, 128, 91, -69, -28, 39, -49, -179, -113, -205, 316, 41, 28, 80, 167, -65, 259, 168, 205, -100, -14, -119, 64, 195, -42, 225, -28, -152, 6, 141, 16, 284, 303, 71, -21, 34, -178, 136, 443, 94, 96, -32, 104, -104, -277, 167, 49, -300, 52, -12, 104, -9, -73, -339, -144, 198, 62, 44, -99, 268, 219, 174, -77, -65, 8, 45, 330, 44, 107, 11, 192]
7372A92k03Om3m1nR0m0L38j67k26o3N7Q4J83j3m8k35O5Q6N2J70l05O2J59j00j20
7398f5N4K1j51N2k3J89N1K3j09P9M9k5n5k54L49j45k18R0L39l46k9n3N2J61p9
7423d3l7R1n6L0N8K14l60J3J56O3k64K45r4K14l40O4J01J33k10K33l23R0K90l85
7447a17PJ5L35j89J69k39J22j67L0j44L09j69M5K18l71n1J14M8J69l19K50j99
7469a34K82Qj73p5J31j75N5P6r1L05l34J41r5K64m6k24J04O1Q1j83o9M5o1L1J09
7494C3J35k49N0j73J69L9QP4J27k57M1J90n5k83N6j78K21J84k18N6r3K37q5m5
7518a6R0L5j24K36k44k2J80j30n6K47k28K79l31K07J19m76L48l78J87J0M8O1j9
7541B3k32J57J66j77K41k17Ol9lN3L62l77L4L8J7k33J59K08o2j79J54J10k34M7
$$ y = [192, -11, -5, -48, -89, -94, -4, -44, 294, 127, -99, -162, -105, -21, 162, 149, 101, -134, -69, 17, 69, 239, -66, -4, 155, 55, -65, -11, 10, -141, -89, -112, 77, 128, 151, 42, 121, 170, 145, 90, -164, 185, 40, -178, -88, 251, -95, -124, -177, -125, 36, -43, -80, 11, -45, -15, 43, 257, -103, -90, 66, 129, -135, 110, 16, 230, -110, -46, 55, 188, -22, 211, -112, -22, 268, -117, -110, -95, 240, 51, 220, -19, 103, -64, -34, -178, 131, -38, 7, 225, -146, -197, -83, -35, 134, -185, 65, -134, 148, 156, -17, -92, 39, -136, -81, -5, -96, 209, -125, 16, -79, 185, 139, -85, 19, 80, 161, -22, -91, -46, -107, -76, 33, 168, -81, -31, -204, -35, 4, 12, 86, 213, -44, -3, 187, 132, -151, -95, -273, -52, 132, -86, -30, -123, 114, 29, -16, 74, 109, -15, 221, -23, -45, 135, 5, -51, 196, -32, 247, -84, 123, 242, -234, 114, -264, -77, -67, -19, 42, 23, -209, -52, 114, -63, 178, -39, -33, -72, -75, -22, 340, -37, -3, 35, 52, -181, -22, 186, 124, -55, 99, 209, -25, 22]
7565B2j99J41K41k38k17K52j62R6J69M8J53l24K55k86k0J62j7j1M9j69K41k81
7587i5J25NR5J74n94M32k04L0R8j52J43J35l17N8K47p8j07j78K89j67k54L45K7
7610E7j46J86o7P1o5L34n82J47K39m19L30J48m60J54Q0k4L11m07k8L3P4K7j54
7633a61Q2j7NJ15j23l3j34M23j93L5M15m19Q1M6j68k2Q5K6p9r2J65lPKN4J73l52
7660h2j9K8o5o4j13L29Rl6J08j62n6P5J7J36j27J57n7j79K28k18K43k77K72q8
7684E9j51K83j75M30l91K20m08K29j43j91L52k34n4J93kO2m5O0j76J83P9k72L5
7707e7j00L0K17j22J15J3l65P4J36J2N2k46L96m19J67P6j7P9j45j27K38o5kNJ07
7732E2Kk51K26k19K68l02K62p8K4k99J70n7J47j65M25l16j2K07m6j89N6Pq5P9
$$ y = [22, -177, -36, 205, -33, -250, 2, -160, -64, 105, 153, 306, -18, 237, -49, -69, 93, 76, 65, 114, -55, 186, -95, 30, 35, 130, 304, -290, 142, -62, -32, 66, -86, 57, 192, -125, -67, 180, 102, -5, -183, 106, -61, -315, 30, 57, -89, 97, 30, 101, 36, 370, -212, -65, 174, -245, 85, 233, -227, -73, 7, -17, 294, -113, -141, -108, -34, -7, -161, -79, -96, -91, 24, -99, -132, -266, 157, -36, -1, 414, -5, 76, 122, -46, -68, 17, 43, -36, -128, 37, 34, 41, 43, 97, 270, -82, -101, -73, -138, -202, -315, 14, 23, -13, 95, -67, -123, -48, -31, 105, -22, 135, 78, -101, 127, -91, 152, -125, 147, 59, -92, 191, 16, 446, 55, 275, -133, 96, -47, -238, 114, -120, -174, 19, 17, 79, 34, 94, -82, 101, 180, -92, -57, -157, -127, 90, -32, 83, 96, -269, -195, -59, -47, 5, -241, 155, -264, -97, -21, -38, 41, -104, -231, 7, -58, -60, -55, 52, 54, -197, 29, -190, 78, -224, 38, -40, -16, -315, -145, -202, -55, -220, 205, -111, -123, 84, 38, -151, -95, -88, -173, -94]
7756i4k09N16j41R5k42M6L67m03K38k10P8On7J62k55J27j66P0J54Ok7R8k82j19
7780b42K90j04K20l50K66Nj91J49j2j01K05p6l23J53J86O2K4j56j30M7l0Q7J59
7803A38j95k7K45m04L31j72LJ6k63M7K72K39l69K3L36k56M0j37k3K65r6O3K01
7826B77l46L19r5j11r0J28k00O7P8k08L00R5j97L7k57K08M7M0k11K89k46M7j54
7849a83L05k24Q0J59m21K82j3K87m68K14j81K26OK47l49k09K07J1p3M86m35l67
7871d13M13o2j22R0J26N1K21j87M0l69K96j86J48j30j5J49j51K19l62J65L30k1
7893B30n2l2k22o6K06n4Q2l18J59K18k25q8j09J18J04P4J13j51O2K4k42K03k23
7916a89J08l3J76k86j1J34m9J8J93j85K51M4l20R9N6O7j11M00n70K24o7O7j74
$$ y = [-94, -303, 213, 72, 167, -75, -29, 338, -65, 173, -37, 41, 47, -10, 152, -103, 24, -142, -72, 82, 88, 61, 159, -123, -242, 48, -56, 164, -186, 80, 85, -106, 43, 31, -70, 135, 59, -264, -111, 75, 137, 161, 5, -125, -78, -108, -21, 138, -57, -84, 161, -243, 88, -84, -81, -65, -328, -281, -9, 230, -139, -116, 220, -36, 4, -133, -156, 109, 13, 76, 277, -69, 250, 155, 44, -46, 82, -118, -51, 27, -181, 119, 214, 17, 54, -203, 5, 52, 92, -119, 170, -76, -29, -183, 122, -102, -22, 137, -284, -2, -15, 272, -196, 18, -163, 63, 69, 316, -33, -242, -35, -24, -97, 389, -46, -413, 0, -62, -184, -94, 32, 83, 304, 117, 157, -212, 84, -102, 46, -84, -99, 50, -101, 118, -244, -79, 251, 230, 178, 146, -76, -142, 64, 10, 92, -226, -67, 151, -74, -162, -271, -153, -49, 25, 138, -13, 49, 73, -169, 34, -189, -81, -114, 62, -224, -235, -101, -150, -132, 61, -124, 127, 171, -149, -50, 6, 73, -38, 362, -208, 16, -51, 16, -158]
7939a58K21l63M73j2k72K05j98J43j88P7j21M39m1l81J29L1l4Q8j1K5k1k27j9
7962b15K86K7j4J22l07j47L55p7K0l61M13k0k2K29m88R8J48qo4j30K79j16L8m0
7986Fk6K43l05N7O1m0J78m1o7J02j54J64l02J54m4m2Q6n7R1J40k26n7j87q5L12
8011c9J66l22J93j92q9K39j21L76l19K40j39L6K9j99L17j09k30L11l64k0K48L5
8033D7k45N9Q6J61m02J07K31l0K48k57q4N9K52l07J14j97J61L08l59K31L6p8k13
8056g2R2j52K80J14l42j17K84j02m6R7j42L13l06K53Lk30J16m9l3j18K58N3j62
8079hq2J66j29K72k44j1K9l7n1K70k03P3n3m3K29k67jL7l0K66k07n4P4m3J42j72
8105g7k19J91J0J60j76M4L0j87J19O8L48l26L3K9Q6k10J72j48K31m97J73L06j77
$$ y = [-158, 63, -300, 173, 161, -111, 94, -104, 39, -149, -72, -193, 246, 205, -176, -47, -16, -50, 38, 27, 52, 31, -196, -215, 71, 98, 84, 206, -101, -248, 107, 30, 50, -311, 102, 82, 60, 289, -199, -101, 47, 39, -25, -155, 124, 8, 46, 6, -20, 223, -82, -25, 36, -4, 174, 133, 66, 168, 14, 178, -124, 30, -14, -56, 30, -27, 64, 204, -22, -79, -266, -351, -39, 127, -195, -2, -194, -283, -44, -165, 211, -108, 132, -7, 29, 58, -141, 176, 67, -163, 148, -216, -236, 12, 47, -198, -139, -53, 108, -294, -187, 44, 14, 262, 5, -79, -20, 232, -75, 39, -158, 3, 311, -48, 183, 219, 141, -72, 20, -132, 148, 262, -80, -197, 87, -15, -61, 36, -106, 207, -99, 154, 157, -73, 43, -6, -39, -157, 101, 154, -8, -90, 76, -53, 219, -25, -36, -7, -44, -95, 175, -28, 45, -8, -51, 178, -89, -90, -53, -83, 183, -24, -78, -4, -47, 95, -77, -296, -105, -95, 65, -111, -67, -37, -224, -105, -37, 311, -15, 18, 47, 133, -77, 95, -53, 178, -319, -146, 160, -17]
8128a7J81j59j50j5L04q4o5J26l0k32N7k35J31K42J01J3j93J09Qo0J14j25j5j18
8152a12M5K6K21j93O6PP5K0N5n7j97J53l63K48p3K93l41M15n44L10j68K07m15
8175c22K53J96r6k71K46J43q4r0J3k1R9j00k4o2J30m9
$$ y = [-17, 164, 5, -145, -160, 144, 60, -5, 121, 91, -141, -84, -319, -188, 54, 155, 168, -25, 84, 92, 32, 146, 21, 6, -112, -67, -41, 180, -13, 53, 60, 135, 155, 210, 153, -44, 109, -254, -6, -79, 214, -127, 288, -256, 54, -114, 93, -322, -69, 127, 31, -240, 6, 149, 65, -25, -12, -33, 66, -34, -58, -120, 10, -39]
8191c9
$$ Imaginary data points
##PAGE= N=2
##DATA TABLE= (X++(I..I)), XYDATA
0@%%%%%%%%Qj6J6j6K4l2M0m8N6p2Q8j12J36j60J92k29K69l13L69m32M96n68O52
31C48p45Q48r63J089j227J380j549J734j937K158k398K663k953L267l612L991
47B094m401M850n344N887o485P143p875Q694r613J0652j1837J3204j4802J6698
61H865j8989K1825k5439L0225l6902M6929o3846R9581k99190K88949K36938o33963
73c45017K94328J79227j05378j82360J04065K29071k06324j35348L02513o3319
83G1458j56954O1025P8115K6250j28175l8456K72763j45186j89076K33268K6112
94A11144j61751j4399J38914N0706k47950Q8613K08778k28187m1197J81077k8832
105E6916q1014l1769J10195M1811j97909N4485J84372j56906q0700J47007K2542
$$ y = [0, 0, 0, 0, 0, 0, 0, 0, 0, 8, -8, 8, -8, 16, -16, 24, -24, 32, -40, 48, -64, 72, -88, 104, -125, 144, -169, 200, -232, 264, -304, 348, -397, 451, -512, 577, -650, 730, -819, 915, -1022, 1136, -1262, 1401, -1552, 1715, -1897, 2094, -2307, 2543, -2801, 3086, -3399, 3744, -4131, 4563, -5050, 5602, -6235, 6969, -7833, 8865, -10124, 11701, -13738, 16487, -20415, 26514, -37332, 62249, -236941, 52008, 288946, -345017, -50689, 128538, 23160, -159200, -55135, 173936, -32388, -167736, 134777, 71458, -85496, -24471, 53644, 79894, -48281, -86737, 186026, 40840, -148236, 85032, 111144, -50607, -65006, 73908, 124614, -123336, -34723, 174055, -54132, -95329, 85748, 56916, -24098, -55867, 54328, 96139, -101770, -47285, 137087, -19819, -100519, 46488, 69030]
116F9030j17237m6739J56216K482k09740J33347J40647k08360j9765J66598n3869
127A2610r2840O3532M7851j6250n6380q743J18037n3729j14624J44142L6309j37585
139e7670J7451J20119m2909j25426J04868Q8667j41011o747J16424m3394p6989
150d6617L7781M8093j9539n7676K5461P3542q4975l6787R6629j3960n2769K095
162b8722O0242O207j09177N6198Q8419j09440j3891R0752j1480n9645j318P1326
174C9471j3097r9477Q3801O4728j25605K4580O7420m7181j3719j1478N8712P099
186C5254j03363P4452N0883r3657M770O5635j944o6691K2984P5666p1406l7986
198d5403Q1095j1786m8096K3713K3279l581l2469j4560O2884k3027o2743P0168
$$ y = [69030, -48207, -94946, 61270, 63752, -145988, -12641, 128006, -80354, -100119, 66479, 12610, -80230, -16698, 31153, 14903, -41477, -50220, 67817, 14088, -100536, 43606, 79915, -57670, -40219, 79900, 36991, -88435, 16433, 105100, -35911, -42658, 73766, 30372, -46617, -8836, 39257, 19718, -37958, -12497, 61045, -23930, -60717, 35912, 21952, -30817, -28722, 31520, 37727, -71450, -15252, 73167, -36273, -50164, 40588, 29108, -30537, -31855, 39471, 26374, -73103, 10698, 75426, -50179, -25599, 41821, -5360, -19079, -30557, 28155, 35254, -68109, 6343, 57226, -36431, -31661, 33974, 32030, -34661, -11677, 63989, -7417, -45403, 35692, 23906, -24190, -477, 22802, 19221, -13248, -27808, 35076, 12049, -50694, 19474]
210A9474J4295o9202J3994L8687j2375l8236K2922M1633m0823j8193L5854R848
222A7878l4304j1721M9905p27n3408K9966L6562m8137j4515M8527j839l5085J5904
235i94J9409j4120j9310N491K9883j1731l7546M0964J8168n7072J5589L7966k8158
248a461j4274K2805J1852j9744j3846K2557J955k0250L77K3027M633l4120L838
261a2651M1747l5510k5492N8011j2178m0004K9689O111j7025l494L161K2024j7287
274b898j4541L0115m071k2777N249J7686k399k2576J7105J9859l3414k99K3446
287A0485r140m668K398Q441P614l0130P231L2021l3594o792L5791j3178j9771
300a3292J2330J1061j0855j3671K0144N657j6447K136P252P26j2985m679K6517
$$ y = [19474, 33769, -35433, -21439, 17248, 4873, -33363, -10441, 31192, -9631, -27824, 8030, 17878, -16426, -28147, 21758, 21031, -32377, -2411, 34151, -13986, -28501, 20026, 18187, -16898, -994, 18415, 4295, -15015, -9524, 20359, 8628, -28918, 12046, 30214, -26858, -11269, 26697, -1461, -15735, 7070, 18922, -822, -14668, 7889, 9844, -10406, -10029, 12998, 17631, -16489, -12651, 29096, -6414, -31906, 26105, 13927, -26077, 3612, 9723, -7302, -10796, -7635, 14389, -2898, -17439, 12676, 8605, -14172, -8923, 8763, 6364, -16212, 893, 20752, -12662, -12961, 10485, 1345, -3323, -925, 7516, 15130, -15000, -7769, 24252, -9342, -16134, 19657, 6479, -13292, -962, 10099, -756, -14427, 5717, 11374, -5073, -2937, 4315, 5041, -7944, -12623, 13894]
313A3894p662k3661K6026L940k8135J0640J6514j2871j327M912J609j760j0139
326h020L482J3074j0933q447J9189K511k2765O478J9315k0001m281K0747m529
339E820j2297M369L559j885m762K429J1005l119j3935J0200R667k1280M533J7359
353A1663j2150n563J0393j314m985l109M815N334n768k340R041k94j5000M151
367e126J3658j1674m484J6718o254j1212Q025K914n054K825m51L649J704j3257
381h019Q455P186j6010M210J3230q457m721O036K363r687K887O708l584J676l083
396h10RL912j0313K012J3873r433n988J3474k172j3843J0554L468q325L542J844
411A804L84k577k898L004J031k517j38Q420l119j0175R159p28o798M377L947k077
$$ y = [13894, 6232, -17429, 8597, 12537, -15598, -4958, 11556, -1315, -2642, 2270, 3879, 2119, -8020, -4538, 8536, -2397, -10844, 8345, 10856, -11909, -5431, 13884, -6117, -10398, 10349, 5820, -6477, -2108, 1451, -434, -5196, -2767, 8238, 5119, -8816, 1384, 11051, -10229, -5696, 11663, -487, -6050, 4343, 3029, -1956, -5065, -250, 5084, -684, -3024, 6017, 5723, -9277, -5126, 8532, -3142, -7626, 9092, 2838, -8374, -349, 2565, -2489, 336, -115, 3534, 5238, -8019, 436, 7622, -8388, -4178, 9052, 595, -4126, 1910, 4273, -5414, -2527, 4181, 597, 2273, -810, -801, 3111, -7202, -5190, 8683, -750, -6738, 6736, 4564, -9279, 1275, 4743, -3582, -40, 1804, 2188, -389, -3287, -283, 748, -1769, -1907, 6513, 3394, -6781, 2378, 1650, -5148, -771, 3176, 1099]
427A099k583J550j846J984j118k527J0106o992l450J0198p931j749J938L769j936
442E12k857O838n379P46k80l916R976m964k586O842m459m178M90Q723r145m50
458d087J2442j0330p56M491k633J031j354J436J183N98l778o61N473q985M493
473a437P233o476j089N160j693o633M305K455r37J020m908N099j541n402O994
488B150k679J059p65K426p01n551O133m161L101j775k787J3063j2566j559Q606
503C994n332K855n045J0258m412q896J3841j0009k18M161L76J382r488J1204m282
518C89m025N750q172J2784p826l508J1431j0428L04L220K133m733L90J0972j1784
533c103l83N914l329L462o031N879J073o399J992K299k543k739R502n729m159
$$ y = [1099, -1484, 66, -1780, 204, -914, -3441, 6665, -327, -3777, 6421, -1510, -3259, -1321, 2448, 512, -2345, 4493, -886, -140, -420, -4336, 5640, 676, -1910, 4932, 473, -3705, -3215, 5508, -3637, -4087, 8355, -1975, -2731, 1760, -873, 158, -1196, 240, 1423, 2021, -1757, -2418, 3055, -5930, -1437, 5796, -680, -1769, 3391, 1698, -4935, -630, 1825, 888, 1908, -3000, 2099, 558, -4844, 2150, -529, 530, -235, 2191, 1490, -4061, 2072, -2089, 1012, -763, -3550, 9513, -3053, -4612, 3994, -1338, 1517, -3528, 6730, 2318, -6578, 7263, -2746, -2964, 1197, 1573, 2955, -6533, 4671, 389, -3636, 2114, -6058, 6726, -1100, -4608, 6823, -3605, -3301, -81, 2052, -2681, -2291, 8681, -3103, -3486, 2428, -901, 2561, -3470, 2409, 3482, -2917, -925, 1374, -1169, -3908, 5594, -135, -4294]
548d294R340n504q17p23Q35M153m501M112n265L340J275o582P022l232M094k060
564A193l683P177j0578P874K071j0347R504l015K349n319l32Q792j0387N284J053
579A636j608N24l950P889j0568K924J0453j1010M803j719J423J029n636O436j993
594F33Q55n80j455K693o072N382R38o449M682L050k547n009M603N7k152M28P82
611a61K769n759L080J326o419O462P90j137k373J145N641r248L514J879j450J197
627A256l175N783o416R05N365q333N965q02q6J773p897P171k614n64K460k781
643a990N984n942J519K722n729N599p20l91p39j321N254o368Q71J488K50Q76l126
660a763L648j723j913J687o28M28k96K170j117l393K301Q30N92l609M708O56m242
$$ y = [-4294, 5046, -458, -1275, -1998, -1163, 2990, -1511, 2601, -2664, 676, 1951, -4631, 2391, -841, 3253, 1193, -2490, 4687, -5891, 1983, 4054, -6293, 3211, 196, 2545, -2774, -3106, 5686, -4701, 583, 1636, 28, 552, -3398, 4491, -6077, -3153, 7300, -3710, 1093, -626, 797, 1826, -3810, 2626, 633, 1488, 908, -547, 2146, -3926, 1456, 2394, -4055, 627, 3677, 1130, -3879, 724, 781, -1371, -943, -161, 2608, -3151, -71, 1255, -5164, 1298, 2088, 951, -1422, -277, 5364, -3884, -370, 1509, 59, 1256, -1919, 3864, -2552, -1647, 3718, -4615, 1350, 548, 462, 2235, -5662, 1509, -1105, -1669, 791, -1990, 3994, -1948, -429, 2293, -3436, 2163, 1443, 1052, 313, -1008, 4246, -2122, -1251, 237, 487, 1363, -1763, 1885, 162, -1751, -64, -692, -264, -560, 1610, 493, -2900, -599, 231, 823, -2786, 1922, 2578, -1664]
677a664K364p97P35j897J526K196m771L751j94l214J522j125L632l115J219J082
693A250k441J729l535L819k50k593M729l411k48J616j362K573l902L677N89l554
709a314K677j745M96j80k73J624j230M96l91n99q92P27K234k247L40K69j09n10
727f27j616K684m31m65J089m71N8p80J341r27l70K103j256M51j293O64k55j251
745a352K376j192J049k02j678J482j892J049J018j838K117j807J388j169j77J944
761A116j722J799k15q83J117j570O75m09m71J884j413J069j119n37P66j131R81
778f3N45k24n51j00k05l72N30O82l08N09m84Q15r23R4L51m87P06N6l17Ln25l94
800f62N05j26J001o20J29m76Q2l22M30m2P6J08l19J98l16k94L78J08M75N65q01
$$ y = [-1664, 700, -97, 638, -1259, 267, 2463, -2308, 1443, 1249, -1965, -443, -1568, 2064, -1051, 168, 1250, -1191, 538, -2997, 822, 572, -2021, 2708, -703, -951, 665, -697, 1876, -2026, 1651, 2240, -1314, 1363, -382, 114, -66, -339, 1285, 55, 551, 160, -439, -1331, -604, 1630, -617, -277, -8, -117, -627, -2243, 441, 10, -455, 634, 163, 221, -559, 782, -145, -515, 1588, 332, 783, -510, 154, -101, -1352, 1024, -168, 881, 679, -999, 483, -1409, -360, 658, -1180, 937, -870, 518, -651, -828, 1116, -606, 1193, 978, 95, 1212, -358, 317, -92, -563, 1321, -92, 977, -142, -679, 87, -1044, -63, 482, 258, -293, -393, -598, -970, -440, 242, -66, 443, -41, 774, -149, -55, 296, -191, 515, 571, 254, 257, -268, -662, -157, -283, 718, 98, 227, -249, -167, -489, -59, -101, -25, 83, -236, -38, -354, -648, -270, -162, 313, 878, 77]
821G7L29p06l42N74L3J06O04m91k87L5o25P87k98N75r7Ln63j77J42pnN78k61M04
845C88k99l40J46l18M24M9O95q18K08N4m78n64J473j81j86K12k78k35k94M44m6
866E6P7o2J1j05o63J85O74j406J870j82l24J62n78L07p60J177M2j009J291o74
886H9j013J245j053P10J06k63M73p20M84m73K59j45K53L98o8m52L29r75R99m00
906b17R66o61K66M59j272J60K88m11O27m44O23l24k79P6N3K72m24J035p04L3k63
927a41RJ39r97J994o97n30R32j493J136n59k02J635j942J226m76l28K54r88K051
946A023j496J30J349j417J102j529O65R93k284K752j474J27K34r89J721k487K322
963G42M34j845Q55o03R93j088m37K161j632P04n72K34L28j204J732j132p4R35
$$ y = [77, 406, -300, -642, -68, -35, 71, 675, 184, -103, -68, -693, 94, -204, 371, 274, 277, -286, -463, -321, -328, -333, 245, -16, 388, 89, -251, -105, -423, 1, 50, 745, -73, 135, 189, -289, -853, 620, 439, 253, 465, 187, -48, -342, 102, 56, 133, 71, 82, -23, -686, -501, 173, -1233, 637, 455, 131, 293, -285, 22, -738, 439, 481, -528, 763, 89, -924, 321, -732, -22, 84, -179, 294, -426, 58, -415, -156, -301, -48, 350, 282, -170, 159, -816, 183, -217, 749, 88, 354, 813, -459, -299, -11, -422, 205, -239, 384, 60, -219, -143, -90, 182, -242, 793, 89, 122, -141, -132, 7, -990, 1004, 307, -223, 709, -784, 352, -207, -409, 1226, -716, 510, 34, -294, -40, -1028, 1023, -473, -343, 1006, -411, 691, -838, -173, 820, -1464, 1288, -186, -59, 175, -814, 907, -1580, 742, 1176, -669, 186, -417, 576, -512, -949, 1212, -420, 284, -288, -54, 274, -930, 802, -330, -404, 531]
981E31L81j070j238K268q12q46J348m17M58j600J658j027n58K108j700J769k475
998a222P32K253l844K254l38J58O10k214L707l349P54K088l075K181j657K317
1014A355j363k969N156k384J26j02q7K603m351L126n47k387L462k176J061j331
1030h08J05K943l915J322Q92K52j64k308K896j457r62J714j95o99J88J722k275
1047g49j22J124O20p08j717L405j112j822J509j111J615k502K068R59l959L976
1063A474j234m32n34L43K951m725K089R82j849J946k820L325j776q47L664l780
1079a223J153j56Q42Ql438M862j499j990K060j409K272k744J505R30k479K334
1095A028r48k37m78O96J699k973Q18Q71J77j149n30K471k076J100n29J37K89j633
$$ y = [531, 912, -158, -1396, 872, 60, -786, 562, 145, 603, -997, 661, -366, -924, 1184, -516, 1253, -1222, -490, 1763, -2081, 173, -165, -7, 603, -1611, 2096, -1253, -499, 1589, -1486, 695, -962, 1355, -8, -2977, 2179, -205, -79, -181, -268, 2335, -2016, 1110, 563, -1824, 1638, -538, 523, -808, -703, 2240, -1675, -353, 539, 791, 627, -1681, 1215, -242, -1204, 510, 315, -384, -196, 1526, -749, -871, 253, 873, 165, -1552, 1853, 741, -1081, 428, -683, 932, -1570, 498, 1457, -2502, 1474, 240, -192, -726, -383, 2568, -2157, -68, 914, -935, 1011, -1809, 1516, -260, -1107, 2557, -1223, -70, -226, 616, 624, -2814, 2048, 549, -1441, 619, -790, 1482, -1262, 243, 1173, -1306, 1028, 80, -157, -635, 61, 1760, -1213, -395, 476, 653, -496, -1026, 1445, -631, 469, -60, 77, 366, -1267]
1113a267K732k205K2J435q19R11k821K794M13l261L584k371J822q92j140K762
1129A699l730L134p15o96R11j615L402l335o49L552k974K297k823J896Q01l371
1145b216L920k471O10J059j508J783l038K027J343k699J534p79J657k110J82J933
1161A227j992J106m04M29o94J88J284k035P41L33K75K22k272L011j718q1P57n58
1179a81J069k125K111n15j656K472j612R92j218K74K208l309K202p11J1P26k359
1196a621L486k892Q93J322k560K151j350J475k12k399L122k035O42j66m75J782
1212A163k374J789o59l10O41m74J063j634Q81Q70j998J672j405J351p73n90K079
1229A292j980Q75m96L33M1o75J567j004l82Q48o93O74j066J047J11j029J075r27
$$ y = [-1267, 1465, -740, -718, 717, -102, 809, -2012, 782, 1195, -2066, 1518, -853, 969, 77, -1063, 1699, -2031, 1103, 388, -308, 603, -1012, 2390, -945, -1594, 1958, -1016, 1281, -1542, 354, 1155, -2216, 1704, -767, -157, 902, -606, 1177, -1861, 166, 1509, -1190, 344, -435, 1222, -888, -706, 1227, -765, 341, -63, 366, -328, -140, 1144, -891, -150, 183, 458, 680, -1592, 1419, -299, -380, 377, -181, 888, -1237, 874, 359, -1297, 1175, -437, 555, -663, -389, 1819, -1490, 712, 1, 12, 738, -1621, 1865, -1027, -134, 1188, -1372, 779, -571, 904, 692, -1707, 1415, -620, 22, -144, -619, 1163, -1211, 578, -81, -391, 250, -224, 839, -795, 86, 956, -1042, 630, -775, 576, -197, -787, 1292, -688, 187, -309, 24, 65, -610, 957, -47, -429, 419, -274, 400, -666, 381, 492, -537, 538, -389]
1247c89Q61r38K68J062j742J367n77J2O35j456K024j650M11Q61j475J235n67K22
1265A64j44n84R52m91J33K09l78M14j133J224r2n80Q12q21N19l58j74N40k65R7
1285D4K27l10o8l10N67n72L46N56m23Np4K33k72N9j17J9J81k81K29qr4K50j00
1308H7J79k81j73K17j46J71j80L86k31j24K80j03P5k96J30L60n44J61Q2j17J53
1329H6k31J46J15p3j3P6k63N13o20M88l60J39L8O2j88j43J93J34j58j47M65l46
1351h7K84p40O58k44J67J10K1j30j28k11L05J10m9N3j95J36k59J51m3J09Pj29
1373a04K99l5j30j60K88j52J35J43k30o0K48m62J84K63m0k66K68k13J09o8K26
1394B43K26p50K94J6L9kL1j3M2l49M39l14K50j99oj42K23j19J54R1j96n8k44O38
$$ y = [-389, 472, -466, -198, 864, -878, 489, -88, -76, 559, -897, 1127, -523, -112, 749, -726, 509, -58, 164, 20, -564, 388, -103, 30, 239, -139, 275, -858, 366, 274, -306, 506, -315, 204, -154, -328, 212, -53, 44, 271, -39, -107, -417, 150, -422, -76, 480, 57, 62, -12, 221, -51, 8, -109, -90, 91, -190, 39, 31, -63, 187, 87, 266, -15, -188, 29, -117, 54, -126, 260, 29, -95, 185, 82, 157, -139, -9, 351, -193, -32, 50, -67, 86, -145, 1, 116, 43, 30, 106, -157, 356, -264, 224, -136, 3, 41, 103, -85, -228, -35, 99, -59, -206, 259, -87, 197, -543, 115, -129, 38, 148, 169, 39, -89, -300, 5, 115, 66, 119, -76, 60, -199, -48, -91, 18, 25, -104, 195, 160, 30, -130, 158, 6, 141, 284, 54, -6, 242, -220, -36, 227, 187, -79, 189, -24, 85, 17, 243, 469, -281, 13, 29, 68, 66, 97, 84, 126, -223, 216, -98, 152, -47, -53, -195, 28, -91, 63, 154, -42, -100, -344, 294]
1418B94k26J41j33j33j18K63l41L49k38M52l36Q8Q2l07L77l51K28P3j16p8j51
1439a81j52Q99r99P17m59Q6M69q39N67m82K41N7j62N37m29R4N87q91N29m75N41
1460B55K48r88P47l40l23O06l33N17p64L33L42l47N22r37P69j92J50K49r16M26
1480B4j41N38o01j82M94m01Q0J68L7q1m60O37k10r8J12J34L74j402J479m30l57
1501b86O72p16Q64q62k5P96r26J271q78J38j42o10J518j303L30Q65q00M84j271
1520h81J328m25p44J391j151O64j01l56R19j371J158j18l94m18N09P08j271J14
1538d39J103r38L33n9M28q98K48P25r08J58r8J114q54m31J155p16j52N2M59Q1
1558C63j437J972j246j58R92j105J463k021J345P18j954J411o39P30o82p60K486
$$ y = [294, 68, 209, 76, -57, -175, 88, -253, 96, -142, 310, -26, 62, 144, -163, 214, -137, 91, 164, 48, -30, -181, -333, 566, -433, 284, -175, -89, 380, -459, 108, -374, -133, -76, -238, 299, -130, -36, 551, -340, 189, -286, 255, 503, -485, 262, -78, -401, 205, -128, 389, -375, -42, 300, -47, 475, -462, 307, 115, 265, 514, -402, 24, -117, 421, -180, -362, 132, -269, -189, -21, 16, -65, -525, 112, -98, -196, -84, 50, 424, -978, 501, 71, -286, 386, -330, 534, -328, -353, 443, -483, 788, -90, 48, -94, -704, 814, -489, -159, 706, -94, 390, -881, 447, 22, -722, 669, -482, 182, 81, -275, 644, -727, 431, 313, -81, -499, 10, 718, -553, -439, 664, -274, 59, 0, 428, -470, -222, 503, -405, -247, -345, 769, -85, -516, 639, -77, -229, -177, 282, 363, -1074, 898, -348, -506, 486, -619, 844, -1177, 168, 886, -1068, 343, -296, 434, -248, -1008, 1478]
1575A478k613J320M20j623J312j013J812j490k05J988j685Q02j113O70R25k377
1591a392K236o30p81O78j11Q39k020J623Nj124R06j70N93j287L57J111j276P14
1609B71p55Q87q49m01K175k361O58N91j1k01j088K376j300n78J017j077J503j678
1627h21J180M46k030K147p79Ln73J86J893l261K115K03j391J261j533K118j500
1644c36L3J583k146J369q25Q23p3j643K444j178q30J162n47M96j192J631q77m46
1662e52J149j145J089j050M13J031j505N86J59L72p26l32K120k387O29O80r27
1679c96R33j003J581j593O7J265j154Q46j517J016M83j802K131j007L51n24K12
1696a11O93j669J668l67q39J338j414J147n10l42J297j311P55m33J65L58j340
$$ y = [1478, -1135, 185, 605, -1018, 294, -719, 1093, -397, -602, 1386, -299, 503, -610, 60, 985, -1392, 844, 214, -567, 111, 0, 839, -1181, 442, 447, -677, 229, 59, 652, -635, -278, 833, -443, 271, -484, 403, -446, -847, 1328, -1033, -375, 216, 205, 4, -1084, 1292, -8, -586, 431, -646, 857, -821, 359, 805, -1225, 922, 143, 146, -427, -241, 1652, -1609, 506, 709, -682, 579, -954, 1164, -336, -303, 1280, -866, 503, -322, 501, 428, -1215, 1229, 51, -779, 383, -164, 332, -860, 771, -106, -552, 597, -548, 541, -509, -96, 935, -570, 16, 175, 547, -179, -511, 1609, -778, -149, 531, -396, 537, -466, 1115, -478, -411, 854, -300, 546, -971, 45, 528, -1274, 857, -150, 201, -323, -111, 582, -1087, 581, 214, -625, 713, -701, 446, -64, -406, 891, -420, 335, -98, 67, 425, -915]
1713i15J976j400k1Q41m38J98o60O11J7m12N55p17R67p27k49R21p60K41pj2l55
1734c46K48P65j201Q25l11m25R65p47K70K40n82L31M3N33j022Q66k1j125R49k23
1754C2l47O01l13J46k97M40m31k9N96j066J226n20j57M68l03j78J04K10r8m71
1774c87J111j047J4P77r24Q69l63j37L56p8m35J07L08n30M23L59o37J90K98m89
1794b15MN00j18l73O40o69J27M39o52J95N75p52N82J66q55J06O32l14L7K24n50
1815b71L81K59n45j00P13n68oO10m39j66M88m38k08N49l45M0K49j83N6P3m68J59
1837a60N07m30l56Q11m14k78M85k3l71O70m58k73P85p82J15M40l46j92P41o8q33
1858d30M90J36m08K44J53o02L02m3o0K67O7m90P35p8m75K17J41n40N10L47r28
$$ y = [-915, 1061, -339, -360, 481, 43, 241, -419, 192, 209, -203, 352, -365, 602, -125, -374, 547, -213, 28, 21, 9, -346, -98, 667, -534, 291, -20, -445, 520, -227, 43, 283, -299, 32, 75, 608, -414, 452, 431, -694, 255, 32, -315, 286, -27, 119, -178, 262, -169, -198, 398, -668, 558, 38, -119, 349, 46, -132, -28, 182, 84, -387, 724, -323, -309, 468, -456, 413, 50, -87, 269, 191, -244, -137, 171, -359, 64, 423, -214, -24, 274, -215, -211, 289, 171, -202, 438, -231, -104, 335, -317, -122, 453, -299, 283, 449, -406, -300, 332, 18, 55, 279, -271, 110, 369, -176, -276, 437, -131, -137, 473, 34, -132, 356, -82, -290, 259, -86, -46, 203, 20, 76, 149, -319, -160, 347, -83, -439, 372, -42, -320, 165, 142, -229, 441, -17, -290, 495, -287, -172, 268, -78, -270, 471, 403, -430, 60, 196, -212, 32, 185, -417, -115, -158, -218, 49, 116, -374, 361, 283, -192, 25, 166, -374, 136, 483, -445]
1879d45M36O8l47L94K75o64L67J99l92K33J97p84L76L52n93P95k29k09J71j58
1899D2l67K92P6o42N46O93j312Q19K03o34L59r7k08K02K91o48L35L87o26J39L22
1920A72m45K13L52k25k51O90o60K21L97o06J21J49p4j91M45m66k8M27q02L13N14
1941B66n68L27L21l98j12M28r3n90J030o18m17Q79n94q1M22k66j49L62L29o22
1961a44K61K76q48R30m78k18N40l52l59N14O0m65N10j13l85Q49m61n26N16j23
1981a6l49L03L30n23M27Lo85Q47m19J4K87k31k99L51J1k59L34K12p56Q40k25o55
2003d58O81j62J17j37J80m01J35N84q41L99O60j571J013k57l45M08j24J50k27
2022a96L80j82l03P36q10N09K81r54Q78l75N8k60K54k20l66R46o67J11M56p71
$$ y = [-445, -9, 59, -288, 106, 381, -283, 84, 283, -109, 124, 321, -463, -87, 265, -328, 467, 238, 29, 200, 42, -325, -33, 43, -599, -53, 640, -672, 147, 350, -284, 75, -22, -230, -28, 263, -385, -50, 337, -289, -150, 172, -273, -60, 292, 67, -184, 506, -154, 67, 464, -142, -21, 128, 54, -137, 308, -158, -186, 241, -561, -248, 266, -302, 25, 346, -52, -164, 264, 171, -419, 611, -7, -424, 455, -139, -220, 202, -64, -213, 149, 478, -144, 117, 393, -455, 475, -3, -221, 319, -33, -392, 122, 182, -283, 227, 114, -271, 578, 117, -409, 107, -16, -365, -62, 268, -255, 172, 175, -510, 337, -82, -68, 219, -12, -311, 40, 51, -208, 126, 338, -418, 422, 197, -458, 223, 61, 178, 41, 221, -180, -45, 539, -302, 97, 757, -814, 199, -58, -403, 5, -119, 31, -196, 184, 2, -301, 435, -375, 134, 415, -539, 339, -36, 22, -238, 16, -204, -570, 376, -291, -180, 276, -495]
2042d95N62N0m28K43p4J82l04Q56q77J79L76m98K89K17k68p8oL14p47P65O1n19
2064b00N78j189J032J66n25k8K67j14m15M27K95j183J389m66j26P27j169J043
2082E09n35l77O00k74L01p22P88l41n01J157j065K92K96k82K79p44Q78n22L38
2101G5P3k14P33j063L07L39l96R9j06M17m80J23N60j081Q96n3k62J83k82P2L6
2122b4k9kMO38j199Q35m31m85R26m68Q6OJ0Q45j094P86m77j0J36o03J092r97K62
2145a93L59l43J89l07R81p73k96R80r49M95l22J15L27n93N58l19j40K45k38M23
2165A99n54J14P89q16K00P9J67k67j13K87o26N47k78K79L09n35R37q00j72L7M27
2186B10k48n02R15k40m47N95l68l2k20J15M93p68O68m68K97Q0k90L56n37K36M11
$$ y = [-495, 67, 117, -311, -68, -142, 40, -264, 592, -285, -106, 270, -228, 61, 278, 10, -68, -74, 240, -507, 258, 319, -200, 378, -811, 221, 387, -138, -166, 101, -13, -428, -1, 294, -889, 500, 34, -92, 635, -534, 509, -26, -403, 197, -77, 224, -498, 290, -51, -552, 605, -460, -168, 128, -154, 125, -619, 259, -263, 75, 148, -66, 667, -396, -89, 250, -146, -47, -153, 264, -216, -93, 467, -614, 282, 229, -33, 150, -132, -60, -24, -53, -55, -51, 587, -612, 223, -208, -693, 233, -235, -149, -143, -133, 712, -382, 404, -73, -83, 53, -550, 542, -455, -193, 166, -177, 12, -295, 686, -87, -383, 597, -352, 143, -179, -64, 263, -330, 228, -91, -231, 14, -224, 199, -355, -241, 548, -268, -68, 11, 178, -89, -202, 85, -541, 6, -272, 7, 316, -219, 718, -82, -254, -217, 210, -38, -540, 375, 135, -312, 283, -85, -117, -337, -222, 271, -497, 171, -297, 0, 80, -210, 146, -391, -155, 256]
2207B56m20R1M8L44p40K52N96o23N39l60l6O7o88O44K46k85k94L13L97n99L46
2228I4K10m47N64k55k65q0K18Qr3J08l10K30l09K54K79j91N5N6j16k03J20M77
2250D04n39m4O77o57jK66k47K18M4J90l82n9P3j54M57n80K91L48n13O2M02l81
2272a25j4L11k07N1L13l52j8K15m87L65m0k12K02J29j13j22L41l50J04K23j29
2293H5k33Q2K1L2R0l56L00J31j16Mm4m9j11J71QN5Kkp7k10J50k09M18l23J91l8
2319b8L5J2M2J8J08j20l6k70J29K20m15J68p4M63m08J39k08K79q5Q1J8q0k61L82
2343A09j10k47M42J47k95k33L75l37K40n8P4m0J16l67NJ99j34P6o8N5k49O42o26
2366b84L79R7m89M05J09n4o6Q9m86L99r3k65J62L37m51M15k86J80j91K83l04J29
$$ y = [256, -164, -73, -25, 319, -421, -169, 427, -196, 343, -17, -53, 14, -674, -30, 216, -69, -363, -50, 347, -252, 94, 304, -143, 421, 166, -99, -179, 39, 47, -46, 62, -248, -18, -327, -73, 206, 15, 70, 126, 10, -193, -73, 404, -135, -179, 498, -159, -160, 106, -141, 77, 121, 311, -71, -130, -57, -211, 246, -334, -43, 305, -208, -146, 256, -125, -139, 172, -35, 16, 329, -23, -41, 174, -313, 52, 12, -200, 2, 131, 18, -104, 237, -113, -9, 214, 85, -148, -66, -45, -13, 77, -279, 21, 152, 36, 40, -4, -53, -164, 7, 15, 70, 72, 70, -7, -217, -67, -276, 142, -181, 10, -28, 7, 19, 61, 79, 187, 67, 31, -239, -110, 110, -305, -137, -211, 252, -156, -17, -225, 54, -31, 50, 68, -12, -273, 109, -1, -248, 194, 341, 46, -187, 188, -149, 91, 33, 107, 67, 183, -184, -179, 20, -114, -38, -106, -51, -300, 342, -284, 95, 192, -297, 108, 217, 163, 97, 186, -300, 99, 6, -259, -97, 240, -211, 204, -82, 98, -93, 190, -114, 15]
2388A5j77J03l63M54RJ40l59r1K04J26J83l60r6K05j88K85O4j06oj49K22j28j87
2411b00J37m2J52J62r0J0j46K21k19K1j65O9o8J08N8j71M13j46k86K03j71K2K66
2434A38P3k17J03j00j14K89k87J53r8M6R1o3L7j6m8J12M5j83J37m3l2k08j81K50
2458a16J26L3j12%P5P1j13p1N43k48j90o9J23oJ49l43J5R8Q7k34M29m67j05K19
2482a06j57K74J21j59J35o0J38j88O3j63k7J11J71n1l14K84J32l46J48k50K75
2503C1%k86J07k5O6l5J84j22K7p7l6O3K07j64L0K25j55K58l58JK7j65K26R7J04
2528B30k23K2K13l25j17r3J81%O8p3J9j06P7KJ83J35k6j24o1J15j03K83k90RJ81
2553A77j40K57k82J01P1j30J78k71j39J04L0J55k09J45j68P1K28l13K9Q1Np3J9
$$ y = [15, -162, -59, -422, 32, 41, 181, -178, -269, -65, 61, 244, -116, -212, -7, -195, 90, 154, 48, 42, -107, 115, -13, -200, -63, -105, 47, 209, 119, 129, -17, 204, -15, 6, -159, -90, -158, -50, 8, -163, 250, 104, -182, 21, -150, -128, 138, 211, -6, 97, -3, -117, 172, -115, 38, -60, -14, 77, 14, 51, 35, -13, 99, 144, -39, 98, 55, 23, -185, -366, -116, 10, 43, -69, -69, 6, 77, -36, -107, 436, 188, -2, -71, 52, 46, 195, -148, -133, -35, 52, -182, 247, -220, -325, -106, -263, 11, 132, -27, 108, 48, 186, -2, 61, -102, -129, -18, 153, 102, -212, 72, 204, -142, 6, -244, 31, 31, -255, -148, -173, -107, -142, 42, -80, -53, -130, -166, -103, 104, -60, -30, 195, 40, 298, -60, -59, -32, -197, 29, 126, 230, 7, 29, 242, -83, -200, -293, -112, -112, -44, -117, -98, -204, -127, -125, 58, 193, 167, 43, -18, 97, -6, 277, -13, -4, 177, 37, 294, 12, 113, 184, 54, 232, -39, -178, -74, -44, 111, -98, 47, -121, -50, 178, -135, -106, -25, -20, -93, -74]
2576g4K51k21q0j93L52P7m19K61K01k08J46k47K97j17o2J09l54K79K18j71Pp0
2598a8J48j96rn2K6K34k93MJ90p5j8J41j19r4J01J88k70J1p4L59j6l51K62l68
2622b89N16k25r6n9J41K33j38m3l4m17L31l5K38j10m7J14j03p3j3J00l16K50K82
2645B07j40p6K94k78J65l36J86K3m3j03L08j55J15l43L70r8J44j96k67L46l25
2666b02J27K6J8m64O30j17r1J21r4K1j25Q3L89o09N02j99j30K24j91k08L46k81
2688b24M49k20J62k9k44J89k86K83J06o0m7J3j94n2M1j21m4K49K3lK47o6l15p0
2712b13l6J48j31M30j64j9M6k43N08n90J96J63R0l01j29K27O1k6K08j74n8j35
2734a42K21m8m4J9R2j14J40k12O1J35oj39L9Q2k64N05m64k9o1M60l47J50J01m72
$$ y = [-74, 177, -44, -124, -317, 35, 112, -307, -46, 155, -53, 93, -154, 143, 26, -36, 73, -281, -2, 216, 45, 52, -18, 130, -66, -75, -127, -101, 133, -160, -156, 34, -41, -59, 82, -37, -131, -30, 158, -112, -101, -175, 184, 168, -183, 79, -289, 227, 2, -94, -153, -12, 221, 83, 40, 6, -411, -80, -115, 123, 13, -34, 80, -23, -96, -109, -9, -325, -75, 207, 67, -9, 285, 7, 172, -164, 22, 45, 2, -101, 207, 52, 167, -176, 194, 96, 240, 44, -223, 123, -202, -75, -49, -31, -495, 135, 18, -73, 48, -46, -25, -150, -67, 322, -287, 215, 16, -114, 110, -81, -289, 57, -224, 225, 5, 167, 138, -106, 83, -203, 80, 186, 126, 79, 92, -102, -154, -113, -234, -278, -29, -6, -9, 238, 172, -143, -213, -249, -101, -232, 198, 34, 15, 61, -182, 326, -264, -68, 95, 185, -116, -245, -18, 43, 17, 225, 51, -7, -142, 79, 31, -13, 6, 98, -16, 124, -88, -27, 108, 102, -37, 2, 84, -180, 325, -139, -168, -229, 231, -116, 34, 135, -337]
2758c37K84n1P6J07O8l77M54j71l4p3K02j94J64J17o3m29N8N7K26l08L34l18L3
2781a75r2L85k78L45j03k57O8K69j49l51K83L65l20L8L6N8q9J88l19K47pl60J64
2804e4K02j25k26J78l8J00L28l41M0r4j68K90L6K79l92l6R3j92K1J03l59K87P2
2827DQ4j56r3r9K23j40Q6j00L08k02K53j5o2r2Q1j50j70M63k34J07JL3o7K56j74
2852A45l4j23K05l53J93J50j49p8j34R4p2K69ok1k49J10J31M1m59K55J52k53j40
2875c26K62M6K42m69K63J41k00J28l6j98k46K74M25k39l7J22l25K97k39n8K80
2896A07r0p9lk7N7M3Q0K31j47r6J85k02k24J84l0j77N5K04Ro2j14P6P7m61O5L97
2922E8k44L9L01j19J23k44R5K51o1l83L32j38J80j03m09J77J08l02K93k2J68o
$$ y = [-337, -53, -104, -28, 79, 147, -230, 224, 53, 19, -54, 148, -46, 118, 235, 172, -257, -199, -142, 84, -224, 110, -208, -175, -267, 118, -160, 185, 82, -175, -107, 162, 13, -338, -55, 310, -10, 28, 64, 122, 33, 221, -98, 149, 142, -218, -54, 148, 23, -203, -25, -63, 37, 365, 24, 64, -30, -198, 92, 128, 407, 15, -21, 72, -120, -99, 4, -355, -68, 4, 88, -68, -161, -260, -37, -177, -91, -191, 117, -85, 168, 153, 91, -1, 80, -70, -240, 223, -11, 96, 97, 130, 63, 319, 145, 111, -12, 193, -160, 33, 183, 34, -44, -178, -84, -156, 113, 107, 86, -163, -53, 78, 119, -340, -85, 67, -186, -326, -64, -18, 224, -245, 18, 159, -41, 87, 51, -147, -393, -119, 306, 67, 30, 152, -173, 124, -115, -173, 107, 17, -62, -65, -92, -35, 8, 88, 319, 172, 76, 261, 59, -165, 19, -11, -188, -133, 71, 80, 18, -96, -20, 57, -404, -339, 58, -186, -147, 154, 35, 158, -86, 9, 260, 199, -184, 148, 10, 190, 87, -322, -145, -37, -339, -46, -68, 100, 94]
2944I4J3k36J52R4R7k52Ok3O0k9k3m7j15J14K93k50j19J20O4N5k41L24j69J43
2968A25o1J58j45j36o0J36O2J71k16k6j01N3j62J08l8K93K4k21N0n4J46k31J59
2991C4p7j3N2p5J04P6k8j17J51j29o2l2k61M57j05m7j23J75L4j59J74J31m14L21
3015F7k78L91l79L09O1j13M0r1j86J29q7N0K35j40n1J78o0k53K24k63J49L42m15
3038a41J92j94O2m0n5L70J79k44j27R0l1J2j44J84j56J8lK51l8J5j85Jj33K44
3062A27k15J63j4k80L59l12R6K92k77M2j67K02j67j68R3M65k57K52j24m7q3J31
3084A11l49J21k3p5J17l0J45j2m32N93j07l74J26K41J25p1p5k50M9J95j39J06
3106hj07K14oJl17J39L28j31P3J41m06J2J88l52J42K48k80L2J43q6j00J00L2J55
$$ y = [94, 107, -129, 23, 117, 214, -38, -32, -55, 5, -24, -47, -94, -209, -95, 198, -52, -171, -51, 13, 68, -173, 151, -18, 125, 64, 222, 77, -59, -119, 17, 79, 250, 34, 8, -93, -40, -202, -94, -132, 161, 185, -36, 14, -40, 106, -125, 34, -43, -56, -4, -79, 25, 101, 73, -44, 107, -22, -84, -116, -377, 80, -25, -72, -195, -20, 14, -145, 29, 160, -254, 67, -211, 180, -199, 110, 171, 58, 98, 7, -179, -50, -137, -87, 148, 8, -43, 135, 75, -178, 46, -217, -68, 274, -141, 51, -143, -81, -121, -176, 194, 373, 129, 2, 92, 61, 73, -71, 113, -43, -25, -28, 223, 185, 200, 15, 16, -117, 127, -88, 75, 61, -219, 140, -172, -76, 216, -61, -19, -186, 16, -151, -319, -226, 239, -18, 234, 110, 63, -20, 111, -238, -117, -140, -215, -98, -128, 17, 5, -427, 166, 59, -315, -189, 52, 177, 106, 31, -219, -170, 25, -114, -8, -115, 99, 93, 94, -223, -84, 244, 113, 186, 327, -79, -67, 121, -231, -89, 159, -121, -89, 54, -32, -132, -32, 0, 155]
3130A55l71K7j5J38M8K20n9k14J47Kr1Q6n3J92k28m4J78k10o8R8M9k95K73q4M6
3155g3K19j27j59q0Q3jJ2J5J28k4m5mJ4N9k30P9Q8J35O0J07j95m1q4p2M8J79j26
3182c5K25k17R8oM9j90Q0L8k41L37j91o9L20l20J87j0K08j69j35J06j57q3K48
3205G3K95l48m6j20J06nn0pO2j14J85J18l93K58j10Q8q9K5J55k31K92j55P5M26
3229D90n80R6n9M95p46L59L02m91L84K6l37q2l3K05J6j06K30k87p7K56r0j64J17
3252g6j45K05P7j72K23J39o9l26L90m3l92O6K28J69k69j60O9J40o9j49J2J82j25
3275i5j22K04J16r2n1j87K12J94p2l4K76k82N5l08J24K6p4J91j2j66j82J46K68
3298A35r4j31J63k4oJ77j76j04K8O2j83j03J62j11M80j39j05N0k56O3M31k65j58
$$ y = [155, -216, -189, -204, -66, -18, 202, 143, -71, 76, 78, -13, 73, 20, 212, -16, -60, 118, -92, -160, -62, -13, -308, -35, -119, -73, 146, 19, -140, -220, -137, -138, -126, -111, 17, -7, -52, -56, -42, 17, -213, -134, -46, 89, 149, 256, 61, 20, -64, -136, -88, 91, -35, 190, -27, 71, 65, 114, -76, 4, 42, -199, 138, -53, -122, 198, -122, 65, 55, 263, 94, -41, 65, -92, -175, 73, 368, 20, -26, -146, -40, -45, -95, -102, -40, -154, 31, 149, -244, 14, -96, -8, -97, -72, 83, -148, 144, -11, 64, 490, -90, 6, -53, 442, -304, 55, 357, -134, 250, 276, -61, -143, -176, 29, 45, -61, 169, -118, -195, 61, -29, -193, -76, -221, -16, 61, -111, 112, 251, 182, -144, 246, 203, -189, -123, 105, 274, 5, -155, -86, 54, -15, -164, -152, 30, -95, -217, -13, 103, 11, -40, -227, -15, 179, 107, 73, 349, 67, 122, -186, -62, -36, -110, 81, 69, -97, -279, -133, 135, 41, -90, 73, 49, 43, 220, 44, -60, -32, 30, -153, -256, -94, -205, 275, 136, 31, 81, -175, -112, 319, 54, -104]
3321a04J81l5J60j64N9k21j37N66m90P9M4o9O1J79L2l30L50K1j35J27j95P5l5
3344A9L0m38L36J86k66L10r3j22J55j92j05P7L22m34j76K15L85j81L4k09J22k17
3366b42L66k17P0m0R2j23K70m54J83k3Q4J78k84j40K08R2J27k32k14L34M2q8k11
3389b22L63k03M2O3k9j45q5K41n7R4o1P5j6k57J65J63p9J90k45K1j81K39j50j79
3413b53K36J97p4k74L00m0M7j52p4L3N1k1J16r5j73K54j44J02k45J39R2N2k84
3436b10q7K18J87O9j52J85o8k79L68k01O0j16P0J58k01Jn3rJ34l49R9K54p1R0
3460I7j91J46m1q2K30n26O28l51M26l27p2J16N3l21L97j21mpk9Q1L9l6M8j90R0
3485E3K7k97M4K54r5O8J98k79N0j76J4K17M3j82P9n9J88n3o6J25k04j14L22N9
$$ y = [-104, 77, 42, 202, 38, 97, -124, -261, 305, -185, -106, -62, -131, -70, 109, 141, -189, 161, 182, 47, 174, -21, 54, 19, 49, -389, -53, 133, -133, 177, 84, -38, 117, -75, -180, -103, 219, -215, -391, -176, 209, 28, 62, -147, -25, -242, 124, -93, -23, -63, 29, -94, 176, -278, -95, -118, -34, 144, -140, -280, -72, 20, 147, -85, -299, 35, 77, -11, -222, 141, -62, -20, 43, 14, -131, -216, 25, -32, 62, 1, 76, 60, -197, -32, 131, 52, 242, -3, 18, -163, 76, -74, -253, -17, 180, 106, -168, 132, 92, 139, -13, -87, -54, -3, -24, 92, -3, -176, 78, -66, 36, -209, -70, 22, 74, -210, -297, -79, 108, 177, 25, 210, 142, -137, 231, 30, 90, -26, 44, 202, 1, 2, -51, -60, 74, -275, -176, 78, 7, 97, -94, 52, 11, -71, 159, -367, 261, -90, 336, 9, -63, 53, 106, -215, 182, 61, 57, 50, 21, 102, 141, 105, 153, -37, 53, 80, -217, -173, 81, -14, 54, 252, -27, 23, -153, -139, 78, 121, -61, 18, -41, 147, 94, 28, 153, -51, -165, 157, 216]
3509B16l97K26P8r4p5J18R5L0n39L24Q8j32K57j19j41J25K5j81K85l2j05rj88
3532a45K49l52J0N18l37K68P5l35j62J38J19l07J77O4J66k38J25O6k68r6K03J65
3554A03l38J41K59l28R3J31J67k90M5j16Q9j90K15L14j02j91k73K73j2r3L08l47
3576a42K03J61j60oPj75K81r0k65kK69r8N9j58l9J06J83k16k41M29o1j19J51k56
3600a79J09J34l15M52j25l9K87k99J13L1k37L87J7n33J25R8M8k42L00l14K05J06
3622A29r4N6k71J2J96j36J04k2q5m9J53m4%J3Po5j70K57j35o9J81J54l11L34m70
3647c25N76l28k09J13J80J22l49M9K72j80M1K60kj4j59l13K71K54k59J80j51m00
3669c71L89J57j2q9j37m7j55N4J03J96o4M5l7MK20m31j50L53p2j13R0K0l25M05
$$ y = [216, -181, 45, 123, 29, -46, 72, 167, 197, -342, -18, 70, -62, 195, 76, -65, 60, 85, -96, 189, 157, 52, 43, -145, 104, -248, -238, 280, -57, 211, 286, -49, -211, -73, 46, -261, -84, -20, 146, -92, 33, 99, -169, -265, -62, 103, -235, -94, 165, -163, -70, 61, 228, -62, -17, -133, -44, -234, -19, 295, 193, 2, -271, 2, -10, -103, 205, -142, 61, 222, 62, 56, 63, -112, 169, 79, -186, -188, 81, -17, 42, -116, -155, -49, 134, -82, -323, 106, 45, -74, 77, -179, -70, 64, -251, 201, 76, 37, 324, 25, 138, 169, -68, 319, 336, -197, -72, 26, 74, -168, 132, -182, 23, 129, 35, 91, -180, -168, 28, -108, -4, -26, -111, -160, -7, -51, -51, -38, -31, -96, -266, -9, -144, -213, -32, 122, -189, 145, -325, 251, -77, -286, -173, 7, 129, -220, -171, 101, -79, -38, 222, 220, 206, 47, -266, 5, 259, 0, 180, 29, -371, 18, 175, 163, 74, -63, -110, -265, -211, -108, 88, 24, 69, 32, 36, 256, -175, -325, 28, -44, -157, -67, -47, -372, 33]
3693C3k96L98k62J04l8j94K98M2J29m23K22j69K60J59l33RkL9K05k90L04k7j4
3716A54Ll49K25l84J92K80k76J81j53J80l1J79l63l9J13J03k5L22l95J32k02J70
3738A7K5J58K5m06K19k28K21k4rj36KJ86j1K62m20o2J6P8K1J75Q5l13J87k13K21
3763G6M8k22k28M76k31q2M56l09M7K00l41l5m8K43P0j53Q9j03J50J56k81K7k45
3786b40L85m4j85j63J5J34jK76RRk83K91j31k95K16j09J52k04K28p9n2j74L04
3809E9j44K55Pm33R3J6l82O14j74j27J01J38j52J30l9O7oJ42m5l94M00p5j19O0
3833hJ27k36j29K63k10J44l22M15J44j95K59n24K35M1K2j76J44o4J0L2r7K9K22
3856A26j34J02j93j07L86j47mq2J84k9j95j70K98M6m7k20J21j14K10M31m39j29
$$ y = [33, -263, 135, -127, -23, -61, -255, 43, 85, 214, -209, 13, -156, 104, 263, -70, -61, -63, -24, 181, -109, 195, 168, 154, 157, -192, 33, -351, -159, 121, -155, 26, -127, 53, 22, 201, -162, -201, -88, 15, -10, 312, -83, 49, -153, 17, 42, 200, 225, -181, 38, -190, 31, 7, -2, -138, -136, 50, 39, 301, -119, -181, -165, -87, -66, 109, 194, -119, 68, -145, 76, 124, -98, -326, 150, -81, -163, 293, -16, 31, 231, -110, -145, -193, 50, 120, -33, 56, -47, 103, 259, -22, 5, -240, 145, 101, -84, -247, -232, -98, -99, 177, 186, 195, -88, 203, 72, -223, -7, -116, 36, -168, 60, -19, -71, -245, 59, -85, 170, 177, -256, -163, -147, -529, 85, -89, -216, -115, 23, -129, 1, -38, 29, 23, 165, 120, -274, 126, 51, -68, -8, 119, -117, -246, 17, -193, -49, -371, 44, 188, -7, 252, -272, -37, 4, 26, -150, -6, -70, -60, -28, -125, -96, 126, -8, 94, -99, -206, 180, 33, 29, -53, 131, 102, -93, -263, 35, 81, 34, -186, -65, -179, 31, 462, 23, -106]
3878a06O0J80j95j39L4K51j73Q2N9L0N8k6j06J4J87j15k19J51L7l32N03k72J28
3901I1k9j37L58j62N0r0J27l5j05j28O0J78l18J57J27k14k76L47j34J2L7K0rm
3925g7O3q4K04J40n41J93j06K12j08m9K07k94K75R9l91K48J22k70J41J71k88J14
3947a9K26k10k22L35J57k08k12L99r5J56j70l39M0o7J75l3LO8K55N7o2k69k67
3970c02K64J01j21L08m49M37j92j78K28k82J63J9j8J83k94J28n6K19j53K0q3J61
3992A03k3m7J7J0L3j62l23L53O4k52J77j44M75k34RK50l26J85l45L29nj63O9j03
4016e3k77N1J89l7K20k95J72j10K32l00J94m6P8j9k2N3j64J82K60m98m5M25j20
4039G0j51o3J65M8j75rP5k12K42KJ19j29J61k00Q9j29J55k67J00Q9r0K18k03n5
$$ y = [-106, -46, 134, -61, -200, -166, 85, -88, -6, 53, 83, 141, 115, 9, 23, 210, 95, -124, 27, 64, -268, 235, -37, 91, 62, -75, 283, 121, 171, 81, 208, 173, 68, -60, 0, 178, -140, 17, 144, -70, -346, 1, -133, -121, -84, -64, -73, -77, -14, -98, 106, 246, -295, -102, -208, 4, -104, -153, 54, -240, 35, 134, -257, -9, 113, -157, -16, 155, -133, -19, 207, -3, -225, 110, 267, 59, -153, 246, 151, 307, 137, -202, -162, -229, -54, -87, -84, -16, 239, 296, 234, -35, -302, -38, 63, -58, 250, -199, 238, 46, -132, 96, -186, -23, -4, -22, 161, -133, -5, -61, 158, 5, 25, -58, 103, 80, 33, 50, 60, 93, -69, -392, -39, 25, -227, -50, -194, 281, 47, 56, 306, -20, 165, -180, 149, 144, -19, 50, -53, -330, -279, -90, -127, 93, -202, -30, -140, 92, -208, -14, -60, 18, -1, -23, 30, -134, 48, 308, -190, -235, 190, 70, -81, -144, 21, 69, -106, -115, -40, -252, -10, -8, 111, -18, 143, -57, 32, -97, 58, -209, -109, -20, -110, 108, -95, -150]
4063a50K55K01k71n5J88k6k98Q1J47j80J5J76n3j70J08j36J32j69R4j09R0J84
4085E4n9p4K14L1r5j60L5J92M8m31L14j77q9L35n1j68J2J79l6m9K14m10LK6l7
4110a79K68m6j71J44j01J20j5O8L7l2J69q7J11j82k70J68k7M6j59J70P3J06lo0
4134A48j64q2J85j12K1K7l1k89J77K63k78j18N23n21J00J31J44l16L43l04j64
4155c17K39L8J90J96k19m7k60J30j43L51l0j87j02N5r4O8L55m96K48R7j24J3p2
4178a11o2K03J25J4j26j48j5l86M52Nr1j41M97j89j75J06K61k94J78k62L6J05
4200a8J04l44K4L67k22J94j36K54k44l11M18j26P5M6l1k06L12k00n7K42n07k01
4222e67P83l4k81j19L8M25k24l9J12JO9q5j66J30j37J66j76jl1J87k00K07P6k14
$$ y = [-150, 105, 306, 35, -20, 168, 142, -156, -75, 72, -108, -93, 83, 30, -140, -32, -168, -36, -205, -111, -220, -130, 54, -5, -79, 135, 166, 71, -89, -54, 138, 186, -245, 69, -108, -197, 138, 87, -81, -69, 110, 74, 25, 239, -171, -168, -142, -179, 89, 43, -128, 16, -85, 35, 20, 88, 125, 93, 262, 175, 286, 104, -166, 2, -25, 21, -138, 32, 105, 211, 208, 148, -16, -98, 87, -25, -4, 23, -8, -297, -120, 143, -135, -253, 270, -251, -151, -20, 124, -192, 151, -153, -317, -78, -40, 150, 346, 127, 80, -180, -50, -193, 158, 128, -59, -161, -106, -200, -132, 223, -273, -25, 72, -52, -39, -111, -173, 30, 155, 169, 43, -105, -120, -506, -54, -49, -140, -281, 216, 27, -148, -42, 219, -75, 103, -159, -123, -18, 86, -258, -234, 133, -89, 105, -31, 223, -21, -332, 86, -40, 35, 81, 50, -156, 156, -44, -101, 141, -366, -567, 216, 182, -99, -218, -180, 245, 21, -18, 94, 95, 164, 79, -87, 43, -94, 72, -104, -105, -136, 51, -149, 58, 134, -80]
4246h0J83Pjl23lJ41J88k62j11L37j07rJ20K7j82K34R7j79J4J2JL7l60j04K23
4271a00J07K62l53K19j89K06j93j01J73L7r0rJ29j37K76j96K0q6J27l1p2l2m0
4294g3K53k27L04l58K70j43p5K1K46k29l6K46j83o0K9P4j30o2J44MJ08j59p7J36
4318B3J29ql57l2M0R8l0K4L04j97L5J60k85K50k7o9j37J33j8kp3o2R3k68N52j50
4344A26j64j8n8Q0J04mN6q3j08J14j03J28m7j03j14Q0j23L68l29M29j07j54j39
4367a69M45k67M7N1j33P3l03n7K67m6p1K83k34J23J96j25Kk03K00J12Om9k58J07
4391cN1k48K27p0j3Q0k1j42J05R3k40L86l38J50Q3k30l1R6K14k79K08Q1j02J32
4415A89J02k20l5j17J24rk61L20p3J99j49k16J70L5P6m33J86P0K42k91J85N3k78
$$ y = [-80, 103, 110, 109, -214, -217, -76, 112, -150, -261, 76, -31, -40, 80, 107, -75, 159, 256, 77, 91, 103, 104, 141, -219, -323, -100, 7, 269, -84, 135, -54, 152, -41, -142, 31, 68, -22, -31, 98, -39, 237, 41, 61, -25, 102, 71, -1, -33, -73, 180, -47, 257, -101, 169, 26, -49, -28, 218, -11, -47, 199, 16, -44, -15, 59, -71, -133, 11, 15, 123, -36, -113, 23, 152, 144, -213, -245, -205, -107, -137, -113, 191, -6, 29, 189, -96, 154, 127, 58, -79, 54, 36, 34, -39, -101, -8, -276, 276, 126, -38, -56, -114, -34, 70, 66, 122, 39, -69, 45, -58, 70, 23, -80, -194, -114, -237, 131, -198, 231, 124, -30, -169, 276, 9, 56, 107, -26, 47, -256, -313, -46, -92, -163, 120, -114, 9, 205, 80, 82, -121, 79, 191, 197, 148, -110, -3, 48, -200, 27, -43, -56, 24, 3, -139, -34, 59, -181, 205, -133, 17, 100, -130, -161, -65, 149, -130, 78, 159, 57, 189, 291, 71, 36, -81, 43, 34, -227, 93, 20, 219, 70, -146, 24, 59, 135, -298, -112, -42, 200, -91, 94, 147, -131]
4438a31n6N23k80J09k50m6M6K87m64M04o8O2k88K10O0P7j76k04K17j8R9k88L03
4461A28l38K63k69K6J16Q5K85k86K5O2kr7J70r5m29L68j11J48n4q0J49j08J29
4484H5J77j67j0l03J98K20l00N5K29j48j0L4L81l14j07R6k08O0j4j49J80j96K81
4507G0k66J84m2l0m6R8o3p1K08k29R9N9J21j36J0q6L5j7N8K30l17L74k95J15J54
4532B17jl35J22M8mj17q3J44j82K01KJ69l12K09j29L7k7R0j32RR1l7j1j2L0MK42
4559B33k43Q9J64k14j18J88k79J98K7P3m2m61N23j92l7K31k18J73R6P5o5m9k10
4582e8p2j63J82K15j23j5m0p2K05k20J89J00j02K0N0k41J13k78M7Q0J05j95j0
4605b83K43l4J00k0j38N7QJ13r3K06k29o9l6j6j20L73N5m3l6j3k0k01J34k0O1
$$ y = [-131, -187, 336, 56, 165, -85, -131, -85, 202, -262, 142, 74, 136, -152, 58, 118, 195, 19, -185, 32, 14, 113, -175, 128, -210, 53, -216, -190, -74, 11, 296, 10, 35, 97, 95, -2, 168, 73, -356, 12, -99, 49, -5, -85, 64, -44, 85, 262, 95, 85, -218, -20, 200, -100, -45, 184, 36, 26, 60, 441, 127, 20, 116, -92, -32, -46, -195, -15, -211, 70, -196, -12, -54, -84, -130, -32, -95, -166, 42, -187, -88, -29, 92, -44, -34, -120, -85, -102, -44, 186, -131, 243, -52, 63, 217, 216, -119, 3, 51, 47, -70, -153, -9, -191, 10, 12, 181, -131, 78, -51, -14, -41, 49, -83, -74, 17, -20, -31, -43, -13, -9, 233, -10, 79, 243, 29, -89, 99, -180, 18, 45, 118, 76, -385, 138, -54, -91, 140, -78, 95, 191, 266, 201, 152, -58, -130, -293, -111, 104, -19, -34, -74, -146, 59, -161, 28, 128, 26, 46, 96, -145, -32, -310, -263, -183, -78, -273, -283, -40, -74, 26, 6, -132, -75, -67, 46, -47, 159, -70, -139, -175, -191, -311, 62, 117, 74, 38, 25, 5, -196, -62, -82, -21]
4630b1rK11r0j92J46j54K13k30K92k98j5J55M1j92O4k22J64N90q58J31J91K0L10
4653B47k65j62J30M3P0j20Q6k01N5j34L38j1j60q3K05m4j43J41n4m1j14p9M54
4676A58k7o5Q9l7j17j68J28j35M25n95J19J65p3j3K08K9Qj55K6j62j20K35J60
4699H3j34J01l66L93k8j71L13k68K8O8o3N9j94J74mL9J06j60K30m34K46j05L4
4722e3L7k38N05l19J06j87j72K92K79l36q1KJ43j72NM24k00R0Q6l55K61k42J16
4745iR4l71nK51J93j58j01K54o9J31k62p9J53k49K50J21j29K29l29K6N4L3J68
4768A96m76K74J40m26O3K81j51Q8k84L91k0k61L91k13J12P0Mj17m3NK42l77J73
4791F2k29M26j55k73L16k27K31m29L25j82J69j73R0K78o3n51P09l06J24k60K76
$$ y = [-21, -30, 181, 91, -101, 45, -109, 104, -126, 166, -132, -147, 8, 49, -143, -79, -301, -137, 453, -405, -274, -83, -63, 247, -18, -180, -50, -7, 63, -57, 29, -172, -117, -251, 87, 76, -84, -167, 38, -6, -149, -8, -62, -103, -217, -296, 158, 131, 66, 155, 118, 1, -167, -39, -174, 251, -344, -225, -60, -133, -146, 62, 91, 99, -56, -30, -192, -312, -77, 83, -51, 50, -316, 77, 49, -122, 191, -77, -49, 19, -44, 15, -179, -5, -9, 30, 136, -24, 206, -228, 18, -87, -53, -16, -254, 251, -68, 38, -149, -321, -29, 250, -86, -167, -165, -22, -194, -189, 235, 35, 125, 211, -144, 117, -125, -9, 85, -286, -291, -40, 153, -5, -106, 148, 79, 210, -52, -131, 22, -227, 23, 144, 15, 244, -85, -59, -5, 28, 196, -280, -6, 134, -292, -229, 52, -99, -11, -295, 96, 76, -185, 206, -7, 105, 175, 179, 62, 19, 24, 266, -111, 62, -167, 259, 104, -169, 147, -80, 151, -278, 47, -135, 34, -139, -49, 229, 166, -385, 324, 18, 142, -118, 158]
4812A58j01qmq4j62O8K12k59N0M0k50M34j32P7q2J98o6j00l8J6N9nj52m3K11J04
4838A41l8J53k90N7m1j71K62j59J76K62k10l29J54j55J4K53J96l65J31m5k4J13
4860H5j48jj36Q8K30j11J04j90Q9K57k33J16m11J26J38Np0QJ07oj0j41Q1j84J68
4885c9J8J02k73n6K49j20k2J97No1q1l8R5J48r7j8K16j6ko1Kj97o9j23L96j10
4911D5j62L06j28k03J13O2k05l9J89kK2K6J56k52K77k82J43%k6Oj07K68k78J24
4935E3n6J23p4n8N8q2j33K45j69J05k5k49M60l36m4J09r1j52K58n7P1k43M67l14
4959a34J25J82J4k49L6M4n7J24l27K66k41J96o5j08L28j24j6O7j05j73K24o7P2
4982A2Q1O9qk09J6j7l9K9K60k69K20L1K9J5l32J5J89q2p6k91K66K8M9j90M3k7
$$ y = [158, 57, 49, 45, -39, -201, -133, 79, -180, -130, -90, -340, 94, -38, 39, -43, 155, 89, -11, -49, -33, 26, 21, -131, -174, 37, 141, 103, 256, -34, 23, -18, -189, 73, -86, 90, 352, 142, -187, -33, -188, -174, 79, 275, -90, 41, -4, -28, 85, -63, -64, -200, -112, 118, 7, 111, -79, 10, 267, 34, 150, -261, -135, 3, 8, -62, -54, 53, 47, 37, -104, -23, -207, -39, -21, 81, -192, -248, 1, -119, -141, 56, 61, 0, -81, -119, -24, 124, 27, 9, 225, 209, 207, 146, 148, -49, -118, -241, 155, 45, -117, 189, 61, -142, -29, 33, -172, -211, -22, -24, -2, 24, 180, -72, 205, -77, 66, 66, 40, 46, -61, 207, -71, 53, -3, 120, 46, -12, 46, -36, -169, 76, -93, 12, -13, -262, 198, -138, -182, -73, -164, -316, -58, -115, -44, -287, 180, -134, -9, 173, 187, -62, -26, 18, -39, 85, -242, 24, -217, -21, -86, -194, 134, 10, -6, 61, -44, -217, 7, -60, 12, 93, 162, 154, -55, -39, -56, -95, -66, 194, -75, 145, 176, 205, 220, -112, -97, 92, 10, -66, -357, -91, -63, -14, -204, -161, -188]
5008a88K0K78k47lJ81j26K9R4k85M13l42Q9M05n00K44q7j08K38j11K50k24nO8
5031H3l5j45K71r1Q7p2K34j93j19Oj40J60J35j24r1J92j54n0l51P42k91k31K22
5054D5M9LO4j37K10l67j4L71k06L8L7q8l5J88l69L18j5J0K72j47l60J92Ok31K56
5079I0J86n24L47l66L22j08j57J34p9LJ8K70q3J6J28k84M6J55j93o0K58k09K14
5102A24j71o0K26N9p4j76L3k1J51R1m62M02l22L05M5r7pJ39j47J62p4k00p8m0
5126a92p2L30p9J64k54J81l0m0j82K15K62k79R0k84J49j57J31J55R6n2J40k43
5148D9R3k52M9p4N1oj32K19J17M4j51J00n3r6J68k77L98l50J7KL3j21K23O2j9
5173I4K57n73J46J18J09j69O3K4j92J29k3R9l30M33l32J18j02J24N1J58j55o4
$$ y = [-188, -168, 110, -137, -140, 41, -85, -56, 38, -247, 166, -176, -87, 318, -182, 62, -25, -133, 105, -6, 244, 20, 15, 83, 48, -97, 174, 83, 170, 98, 332, 139, 20, 26, -114, 46, 181, 57, -34, 158, 4, -46, -397, 345, 54, -177, 45, 94, 97, 161, 24, 234, -133, -147, 224, 18, 56, 93, 5, -30, 158, -211, 107, 92, 102, 374, 227, -133, 59, 65, -166, 90, 276, -248, 99, -267, 55, -53, -210, -76, -155, -152, -134, 136, 53, 69, 197, -87, -41, 114, -79, -139, 119, -90, 124, -47, -107, 119, 178, 104, -72, -39, -60, 91, 182, -280, 122, -200, 105, 150, 53, 46, 185, 38, 200, 126, -74, -152, -192, -264, 66, -13, 151, -103, 78, 48, 8, -174, 41, 303, 24, 114, -170, -21, -178, -47, 108, 204, 152, 292, 49, 142, -110, -61, -135, -84, -90, -222, -3, 114, 158, 7, 107, 54, -42, 126, -151, 247, -103, -86, -84, -51, -172, 51, 113, 94, 351, -222, -76, 42, 151, -18, 45, 69, -123, 6, -17, 82, -248, 185, -147, -29, -131, -7, 44, 202, 47, -17]
5195a7j30K33j39M1J23j88L85k2k28j71K41n1q6k50K57nL4O2k59J11M5j73L14
5218A27n21L20J54p6R0J20l81m9J26r7m2L71r4p8k82L25j04J1L09l24o7J06j51
5241b07N72l30k58J59j16R5M57k21r2M0k18K97o7l7j55j26R6R6pk55K56P8r0K66
5265B33q4J1k09N2q2m0L42m62L73k10O7J74j45N3j54k65K58Q5M5q7j6J99k3k27
5289a12J31j27k45M92k02k61M63k58KJ95j52L61k76On0J64m9k85n6K60j87J26
5311f0J84k33L9J79k39O0r0j05K62j14K50l84J43j34J77J23j42J78k3Lq6j7r1
5334a20m5L37p2j38QL25n40K61j53K13m8j73Q9KR2l7j38L51q2j52j03K39k35L97
5358B78k47JJ7jK22j92j58K29k88K80l85K21q1M68j34k85K8L0J04j48J28j02O3
$$ y = [-17, -147, 86, -53, -12, 111, -77, 308, 286, 58, -113, 128, 77, -9, -259, -2, -7, 27, 89, -170, -59, -14, -187, 127, -394, -74, 80, 4, 94, 214, -167, -216, -90, -187, -229, 142, 48, -30, -312, 13, -91, -80, 229, -95, -162, -56, -207, 365, 35, -223, -64, -180, -85, 372, 151, 59, 99, -119, 178, 111, 74, -81, -207, -111, -15, -22, -277, -21, 57, -33, 233, 149, 160, -49, 3, -79, -119, 223, -239, 134, -76, -9, 165, 20, 73, -81, -346, -88, -3, 42, -45, -61, 138, 115, -112, 19, -108, -353, 139, -63, -324, 139, -119, -117, 78, -74, 287, 11, 17, -33, 131, 82, -203, -259, 1, -186, -60, 124, -109, -70, 109, -130, -70, -160, -265, -3, -117, 133, -251, -108, -242, -65, 58, -84, 94, 71, 74, -12, -29, -120, -165, 172, 100, -38, -30, 295, -245, 16, -137, 76, 28, -145, -56, -54, 38, 1, -137, 214, 132, -20, -123, 116, -119, 278, 31, 32, 49, 48, 270, 78, -80, 149, -139, 141, -244, -23, -104, 364, 230, -55, -27, 3, 107, -41, 87, -15, 48]
5381D8P2l18P6M4R9K62l63J69n2p0p0L06j02k7p4j74K40k26M40l73J05j64J85
5404C3k26K86l48J11J35R2Q1pl23M1K54l74L6L97j80k7Qo5j2J16J97l18J68l11
5428b36L36j58K26k67k7K96k50J69k74J20J90J44k45O7j29j11J52m7L21j69j18
5449a0n3o9P6M04m54l05L70O6oJ6J7k16L22m5l54K48p1J43j7J0L4j37L59o13L76
5474I1j00P0k4K01j9j69J76j81Q7j15l7j30J52R1q4J5rl5k85L36J49R7j78q4K02
5499B17j40n8p9j6j38J75Q4rJ56k02J92l35L32l00K02j97QJ17r9L05m40L47l94
5522b72L67k19L12j02J04q6j78n6K08j68o6K83l08K27j86J78k59L78k40j56L51
5543A12j37r1J00R7n7Q6j22j05P5J90J04l39J8J80k34n3J72mo9J26n6l21J22Q0
$$ y = [48, 120, -198, -122, -78, 21, 283, -80, 89, 37, -33, -103, 203, 101, 74, 0, -174, 66, -160, 280, -93, 12, -152, 33, -193, 93, -255, -144, -9, 83, 164, 157, -166, -125, 129, -245, -209, 188, 8, -19, -11, -76, -88, 28, 225, -93, 75, -236, 100, -58, 168, -99, -126, 170, -80, 89, -185, -65, 125, 269, 24, 91, -38, -149, 3, -44, 277, 108, -10, -63, -132, -56, 348, -106, -411, -41, 25, 19, 35, 52, -164, 158, 113, -241, 7, -64, 79, 62, 72, 106, -31, 328, -285, 91, -9, 61, 37, 238, 219, 50, 226, 45, 132, 17, -20, -150, 2, 93, 9, 24, 15, -20, -305, 31, 180, 277, 99, 15, 217, 77, 19, -60, -76, -214, -39, 45, 36, 192, -10, 182, -153, 179, -121, 81, -116, -108, 9, -90, 215, -225, 122, -272, 95, -124, 188, 86, 190, 104, -74, -130, 78, -90, -156, 127, -181, 46, -140, 38, -221, 157, -83, -239, 112, -25, -116, -16, 81, 24, 110, -12, -117, -42, 148, 252, -87, -69, 111, -123, -176, -4, -8, -77, 49, -7, -328, -206, -126]
5567a26R0k6J91J09m49N2K48n1j11J3j0p5L12l31j81K31l1K83Qk13Q4K05l13K61
5591A70j00k48O2J44j77J01M4J24J75m09R9q0j24K25J57j4J29l39j44K71j96m3
5613a73P7K36k95K56j4J28j54j93K55j1J37k11J19j04R4j79j12K15N7l13l3MM49
5636B35k63l7p8Q1K81l94MK37k4l9J27l38J48K23q4L9o4j16o5m8R7K73k09K04
5660A90p9j40q2J76k79L55N1Nl57L53m19K23K76j61m6r3J79k18Q3J38q0j27J77
5683A25j65K32l02M3L58l32P1Q0k66L19n70M54l10L11J90m28Q1K02K2k10J56K
5705F3j21J28j32n1K7R3P2M5M1n6j00n5K34l23K26j15O7j17J01j71j2k11M34k95
5729b28K35k22R9P9k88L63K1K02k52J13Q1l30J22l9O3m05K85N5n5N3J8J07J2M1
$$ y = [-126, -36, -62, 129, 238, -211, -159, 89, 38, -73, -60, -70, -145, 167, -164, -345, -114, -145, 138, 146, -67, 17, 222, -91, 170, 70, -178, -116, 28, -149, -48, -4, 120, 295, -114, -15, -95, -219, 6, 163, 149, 278, -61, -205, 66, -130, -173, -96, 140, -155, 101, 87, 215, 61, -132, 123, 112, 249, 38, 157, 53, 147, -32, -144, 71, 128, -185, -218, -214, 235, -28, -65, -143, -62, 219, -175, -171, 66, 42, 3, 130, -208, -60, 163, 79, 118, 54, -62, -127, -175, -78, 195, -14, 190, 111, -29, -111, 65, -214, 141, 192, 197, -160, 193, -226, -3, 273, 112, 66, -27, 152, -66, 17, 155, 75, -52, 125, -40, 192, -110, -67, 291, -41, 30, 110, -156, 163, -407, 47, -263, 48, 238, -190, -109, 93, 115, -95, 61, 63, -58, 70, -62, -113, -86, 7, 79, 124, 165, 109, 9, -46, 188, -135, 91, -24, 43, -74, 27, -144, -156, -367, 67, -228, 7, -215, -116, -37, -325, 38, 59, 261, 9, 122, 203, -127, -5, -44, 19, -386, -101, -46, -101, -48, -30, 77, 89, 130]
5753A30k23OJ56Nq3l7J70j81j8L3K73j87q0J17l4K26k20j66Q6j13J06J3J49m15
5777b87K81k0j30K32J38M4l29K63l49J46R1J7mn9k07M02j00j53K3j96J45K27j08
5800F7k55K59m6L8J44j64q8J80l9k15L23k56J09j4j23l8q1K33n9K5qO1q0l7J15
5825E1J34lj44Qj21J33j12j17J06j8J41j53J10J22l48J79NJ40j68q3J37Q0R9P7
5849B55k95K1n6J95j31P1j24R5k17m8K97k08j58J02K23J02p5k88K15J60m7p2Q3
5872A00j75Q3k36M08m06L47K0K0k10J52k24J08J38m4k9j89kK00K00k94p9J95l13
5895b30K96N9j95k15L92L2k14l22J65J93K26j6l51K30J05J02j80p9Q8k05M4k01
5917b76K72o5K78r5k6k28J34k27J35L03j79k23J4K98r2p1L29n23J92k9k27L30
$$ y = [130, -93, -87, 69, 74, -9, -46, 124, -57, -75, -42, 231, 44, -36, 81, 47, 273, 53, -113, -27, -140, -34, -21, 128, -287, -6, -26, -156, 76, 214, 258, -71, 192, -157, -11, 80, 97, 93, 34, -173, 229, 129, -24, -1, -197, -52, 175, 67, -188, 71, 25, 63, 207, 43, -45, 135, 96, -119, 204, -52, 57, 43, -80, -118, -199, 34, -25, 0, -8, 53, -27, -64, 51, 185, 182, 38, 46, -75, 58, -54, -171, -65, -83, 58, -95, 15, 137, -211, -32, -27, 113, -55, -138, -1, 79, 178, 255, -40, -19, -75, 120, -11, 60, -64, 31, -186, -234, 63, -145, -303, -201, 22, 124, 49, -239, -24, 136, 89, 17, 100, -75, 8, -228, 180, -226, 121, 141, 161, -49, 103, -121, -13, 125, 81, 52, -137, -139, 61, 261, -33, -112, 83, -230, 66, 125, -70, -285, 107, 139, -75, -397, -232, -39, 187, 171, -180, 50, 155, 257, 77, -2, 86, -119, -75, -276, -4, -69, 209, 114, 88, -140, -6, -233, -98, 205, 26, -197, -183, 115, 23, -48, 281, -242, -50, -79, -306, 24]
$$ [...]
8191A90
##END NTUPLES=NMR FID
##END=
