##TITLE=1H_Ser Q-6-1-A
 200.13MHz,DMSO.
 8 sc
 
 6.1.2026
##JCAMPDX= 6.0         $$ Bruker NMR JCAMP-DX V2.0
##DATA TYPE= NMR FID
##DATA CLASS= NTUPLES
##ORIGIN= UXNMR, Bruker Analytische Messtechnik GmbH
##OWNER= pz
$$ XWIN-NMR		Version 3.5
$$ Fri Feb  6 16:14:52 2026 Russian Standard Time (UT+4h)  she@DPX200
##.OBSERVE FREQUENCY= 200.1315
##.OBSERVE NUCLEUS= ^1H
##.DELAY= (6, 6)
##.ACQUISITION MODE= SIMULTANEOUS
##.ACQUISITION SCHEME= undefined
##.AVERAGES= 8
##.DIGITISER RES= 18
##SPECTROMETER/DATA SYSTEM= spect
##.PULSE SEQUENCE= zg30
##.SOLVENT NAME= DMSO
##.SHIFT REFERENCE= (INTERNAL, DMSO, 0, 14.3821)
##AUDIT TRAIL= $$ (NUMBER, WHEN, WHO, WHERE, WHAT)
$$ ##TITLE= Audit trail, XWIN-NMR		Version 3.5
$$ ##JCAMPDX= 5.01
$$ ##ORIGIN= Bruker BioSpin GmbH
$$ ##OWNER= she
$$ F:/spectra/data/she/nmr/H-C/1/audita.txt
$$ ##AUDIT TRAIL=  $$ (NUMBER, WHEN, WHO, WHERE, WHAT)
(   1,<2026-02-06 16:13:05.26 +0400>,<she>,<DPX200>,
      <created by zg, POWCHK disabled, PULCHK disabled
       configuration hash MD5:
       00 E9 B6 7A A2 85 ED C7 34 08 36 98 17 FE 4E 26
       data hash MD5: 16K
       B1 12 97 B5 6D 04 20 17 7E 36 B8 4F 1C 19 B3 79>)
$$ ##END=
$$ 
$$ hash MD5
$$ 88 4E 2F 77 60 0E 42 C5 20 44 A1 E9 EE 16 85 91
##$RELAX= 
##$RELAX= 
##$RELAX= 
##$RELAX= 
##$RELAX= 
##$RELAX= 
$$ Bruker specific parameters
$$ --------------------------
##$DU= <F:/spectra>
##$EXPNO= 1
##$NAME= <H-C>
##$PROCNO= 1
##$TYPE= <nmr>
##$USER= <she>
##$AMP= (0..31)
100 100 100 100 100 100 100 100 100 100 100 100 100 100 100 100 100 100 
100 100 100 100 100 100 100 100 100 100 100 100 100 100 
##$AQSEQ= 0
##$AQ_mod= 1
##$AUNM= <au_zg>
##$AUTOPOS= <>
##$BF1= 200.13
##$BF2= 200.13
##$BF3= 200.13
##$BF4= 200.13
##$BF5= 200.13
##$BF6= 200.13
##$BF7= 200.13
##$BF8= 200.13
##$BYTORDA= 1
##$CFDGTYP= 0
##$CFRGTYP= 5
##$CHEMSTR= <none>
##$CNST= (0..31)
1 1 145 1 1 1 1 1 1 1 1 1 1 1 1 1 1 1 1 1 1 1 1 1 1 1 1 1 1 1 1 1 
##$CPDPRG= <>
##$CPDPRG1= <>
##$CPDPRG2= <>
##$CPDPRG3= <>
##$CPDPRG4= <mlev>
##$CPDPRG5= <mlev>
##$CPDPRG6= <mlev>
##$CPDPRG7= <mlev>
##$CPDPRG8= <mlev>
##$CPDPRGB= <>
##$CPDPRGT= <>
##$D= (0..31)
0 0.7 0 0 0 0 0 0 0 0 0 0.03 0 0 0 0 0 0 0 0 0 0 0 0 0 0 0 0 0 0 0 0 
##$DATE= 1770379984
##$DBL= (0..7)
120 120 120 120 120 120 120 120 
##$DBP= (0..7)
150 150 150 150 150 150 150 150 
##$DBP07= 0
##$DBPNAM0= <>
##$DBPNAM1= <>
##$DBPNAM2= <>
##$DBPNAM3= <>
##$DBPNAM4= <>
##$DBPNAM5= <>
##$DBPNAM6= <>
##$DBPNAM7= <>
##$DBPOAL= (0..7)
0.5 0.5 0.5 0.5 0.5 0.5 0.5 0.5 
##$DBPOFFS= (0..7)
0 0 0 0 0 0 0 0 
##$DE= 6
##$DECBNUC= <off>
##$DECIM= 32
##$DECNUC= <off>
##$DECSTAT= 4
##$DIGMOD= 1
##$DIGTYP= 9
##$DL= (0..7)
0 120 120 120 120 120 120 120 
##$DP= (0..7)
150 150 150 150 150 150 150 150 
##$DP07= 0
##$DPNAME0= <>
##$DPNAME1= <>
##$DPNAME2= <>
##$DPNAME3= <>
##$DPNAME4= <>
##$DPNAME5= <>
##$DPNAME6= <>
##$DPNAME7= <>
##$DPOAL= (0..7)
0.5 0.5 0.5 0.5 0.5 0.5 0.5 0.5 
##$DPOFFS= (0..7)
0 0 0 0 0 0 0 0 
##$DQDMODE= 0
##$DR= 18
##$DS= 0
##$DSLIST= <SSSSSSSSSSSSSSS>
$$ [...]
##$SUBNAM0= <"">
##$SUBNAM1= <"">
##$SUBNAM2= <"">
##$SUBNAM3= <"">
##$SUBNAM4= <"">
##$SUBNAM5= <"">
##$SUBNAM6= <"">
##$SUBNAM7= <"">
##$SUBNAM8= <"">
##$SUBNAM9= <"">
##$SW= 18.0517148125397
##$SWIBOX= (0..15)
0 0 2 0 0 0 0 0 0 0 0 0 0 0 0 0 
##$SW_h= 3612.71676300578
##$TD= 16384
##$TD0= 1
##$TE= 0
##$TE2= 300
##$TE3= 300
##$TEG= 300
##$TL= (0..7)
0 120 120 120 120 120 120 120 
##$TP= (0..7)
150 150 150 150 150 150 150 150 
##$TP07= 0
##$TPNAME0= <>
##$TPNAME1= <>
##$TPNAME2= <>
##$TPNAME3= <>
##$TPNAME4= <>
##$TPNAME5= <>
##$TPNAME6= <>
##$TPNAME7= <>
##$TPOAL= (0..7)
0.5 0.5 0.5 0.5 0.5 0.5 0.5 0.5 
##$TPOFFS= (0..7)
0 0 0 0 0 0 0 0 
##$TUNHIN= 0
##$TUNHOUT= 0
##$TUNXOUT= 0
##$USERA1= <user>
##$USERA2= <user>
##$USERA3= <user>
##$USERA4= <user>
##$USERA5= <user>
##$V9= 5
##$VALIST= <valist>
##$VCLIST= <CCCCCCCCCCCCCCC>
##$VD= 0
##$VDLIST= <DDDDDDDDDDDDDDD>
##$VPLIST= <PPPPPPPPPPPPPPP>
##$VTLIST= <TTTTTTTTTTTTTTT>
##$WBST= 1024
##$WBSW= 4
##$XGAIN= (0..3)
0 0 0 0 
##$XL= 0
##$YL= 0
##$YMAX_a= 306741
##$YMIN_a= -363536
##$ZGOPTNS= <>
##$ZL1= 120
##$ZL2= 120
##$ZL3= 120
##$ZL4= 120
##$ABSF1= 10
##$ABSF2= 0
##$ABSG= 5
##$ABSL= 3
##$ALPHA= 0
##$AQORDER= 0
##$ASSFAC= 0
##$ASSFACI= 0
##$ASSFACX= 0
##$ASSWID= 0
##$AUNMP= <proc_1d>
##$AZFE= 0.1
##$AZFW= 0.1
##$BCFW= 1
##$BC_mod= 2
##$BYTORDP= 1
##$COROFFS= 0
##$CY= -3
##$DATMOD= 1
##$DC= 2
##$DFILT= <>
##$DTYPP= 0
##$F1P= 0
##$F2P= 0
##$FCOR= 0.5
##$FTSIZE= 0
##$FT_mod= 4
##$GAMMA= 1
##$GB= 0.15
##$INTBC= 1
##$INTSCL= 1
##$ISEN= 128
##$LB= 0.25
##$LEV0= 0
##$LPBIN= 0
##$MAXI= 10000
##$MC2= 0
##$MEAN= 0
##$ME_mod= 0
##$MI= 1.114404
##$NCOEF= 0
##$NC_proc= 0
##$NLEV= 6
##$NOISF1= 3.799351
##$NOISF2= 2.8
##$NSP= 1
##$NTH_PI= 0
##$NZP= 0
##$OFFSET= 14.38212
##$PC= 1
##$PHC0= -3702.414
##$PHC1= 9.99231
##$PH_mod= 1
##$PKNL= yes
##$PPARMOD= 0
##$PSCAL= 0
##$PSIGN= 0
##$REVERSE= no
##$SF= 200.129724274929
##$SI= 16384
##$SIGF1= 3
##$SIGF2= 2
##$SINO= 400
##$SIOLD= 16384
##$SREGLST= <1H.CDCl3>
##$SSB= 0
##$STSI= 0
##$STSR= 0
##$SW_p= 3205.1282051282
##$SYMM= 0
##$S_DEV= 0
##$TDeff= 0
##$TDoff= 0
##$TI= <>
##$TILT= no
##$TM1= 0
##$TM2= 0
##$TOPLEV= 0
##$USERP1= <user>
##$USERP2= <user>
##$USERP3= <user>
##$USERP4= <user>
##$USERP5= <user>
##$WDW= 1
##$XDIM= 8192
##$YMAX_p= 0
##$YMIN_p= 0
$$ End of Bruker specific parameters
$$ ---------------------------------
##NTUPLES= NMR FID
##VAR_NAME=  TIME,          FID/REAL,        FID/IMAG
##SYMBOL=    X,             R,               I
##VAR_TYPE=  INDEPENDENT,   DEPENDENT,       DEPENDENT
##VAR_FORM=  AFFN,          ASDF,            ASDF
##VAR_DIM=   8192,          8192,            8192
##UNITS=     SECONDS,       ARBITRARY UNITS, ARBITRARY UNITS
##FACTOR=    0.0002768,     1,               1
##FIRST=     0,             0,               0
##LAST=      2.2672688,     0,               0
##MIN=       0,             -363536,         0
##MAX=       2.2672688,     306741,          0
$$ Real data points
##PAGE= N=1
##DATA TABLE= (X++(R..R)), XYDATA
$$ [...]
$$ plain form
1848 -365 110 399 -403 -187 319 27 -411 127 417 -369 -234 321 191 -171 -162 318 -30 -389 51 223 -217
1869 -217 -499 600 169 -29 -104 116 -254 -343 105 525 -236 -282 484 207 -258 73 217 -214 -440 166 332
1890 332 -218 -568 475 -55 -646 160 367 -178 -279 638 5 -354 -64 214 -148 -98 174 369 41 81
1910 81 146 469 -456 -183 428 -206 -328 -63 107 -228 -60 207 440 -294 -368 185 -212 -434 294 143 -251
1931 -251 -56 245 401 -373 -101 452 36 -345 137 -6 -561 160 204 -169 -557 -66 478 -159 -554 520
1951 520 314 -715 243 68 26 -179 -37 78 -106 -254 519 268 -560 -103 282 -335 -139 13 378 -257
1971 -257 -269 297 113 -282 47 376 -518 -33 376 -220 18 -197 39 285 -804 163 482 -332 114 401
1991 401 44 -195 60 23 417 -236 -38 333 -651 -141 653 -183 -359 308 141 -136 -193 -145 0 -171 -474
$$ packed form
1848c65M75K89q02K16N06k92m38N38K90p86J35N55j30l62RM80l48l59M40J72m40
1869b17k82J099m31j98p5K20l70q9M48M20p61m6P66k77m65L31J44m31k26O06J66
1890C32n50l50J043n30n91Q06K07n45j01R17o33l59K90K78l62N0K72J95l28M0
1910H1O5L23r25K73O11o34j22K65J70l35J68K67K33p34p4N53l97k22P28j51l94
1931b51J95L01J56p74K72N53m16l81M82j43n55P21M4l73l88M91N44o37l95J074
1951E20k06j029R58j75m2k05J42J15j84j48P73k51q28M57L85o17J96J52L65o35
1971b57j2N66j84l95L29L29q94M85M09n96K38k15K36K46j089R67L19q14M46K87
1991D01l57k39K55l7L94o53J98L71r84N10P94q36j76O67j67k77n7M8J45j71l03
$$ plain form
2012 -474 288 -152 -613 272 200 -227 -236 -144 119 -241 -253 563 131 -735 281 280 -228 337 16 -57 -16 -501 210
2035 210 75 -224 372 -293 -677 276 221 -4 -39 -329 7 463 -610 138 623 -509 46 544 -464 408
2055 408 331 -160 74 -40 125 680 -731 -310 838 -151 -549 296 -329 91 44 -162 54 -106 -38 781
2075 781 -405 -277 711 4 -431 251 70 314 -172 -172 602 176 -542 231 81 58 163 -126 -90 -43 142
2096 142 451 -177 -638 734 238 -774 149 207 99 -25 -372 329 337 -292 34 178 -488 649 206 -680
2116 -680 12 409 74 -118 -366 438 595 -880 -391 613 -178 73 214 -112 125 200 -280 286 56 -7
2136 -7 527 -654 -323 424 -46 -260 21 97 301 -180 -511 603 17 -113 34 -276 37 199 56 -324
2156 -324 -254 131 607 -376 -374 892 113 -615 357 19 211 -19 -818 194 -35 16 377 -91 -276 336 -169
$$ packed form
2012d74P62m40m61Q85p2m27rR2K63l60j2Q16m32q66J016jn08N65l21p3M1m85P11
2035B10j35k99N96o65l84R53n5k25l5k90L36M56j073P48M85j132N55M98j008Q72
2055D08p7m91K34j14J65N55j411M21J148r89l98Q45o25M20m7k06K16j60O8Q19
2075G81j186J28R88p07m35O82j81K44m86%P74m26p18P73j50k3J05k89L6M7J85
2096A42L09o28m61J372m96j012R23N8j08j24l47P01Qo29L26J44o66J137m43q86
2116f80O92L97l35j92k48Q04J57j475M89J004p91K51J41l26K37P5m80N66k30o3
2136gN34j181L31P47m70k14K81P6K04m81l31J114n86j30J47l10L13J62j43l80
2156c24P0L85M76r83KJ266p79p28R72l38J92k30p99J012k29N1L61m68j85O12n05
$$ plain form
2177 -169 -666 181 -44 402 292 -429 355 287 -446 108 123 -155 -146 47 -381 -90 231 -19 -163 -72 363 343
2199 343 -461 -82 157 -44 112 151 172 298 -125 -97 237 117 191 216 -174 -24 394 -100 141 57 86 475
2221 475 -387 -106 436 -317 -45 93 -64 167 145 -237 193 -232 126 570 -264 -330 380 47 -155 152 -140
2242 -140 -168 51 -391 486 -209 -267 209 50 23 234 -220 -167 -126 -54 219 117 -186 309 386 -621 -85 290
2264 290 -376 53 -37 87 -236 -90 108 187 -372 84 356 -461 -131 48 -75 50 -243 145 156 -189 -111
2285 -111 140 -209 -152 87 -212 132 156 -93 -27 -148 102 226 140 -92 355 50 -91 227 -102 40 -280
2306 -280 154 70 76 -141 -66 116 -102 180 20 -275 -119 21 36 222 -221 -25 -135 -95 102 62 -12 115 -57
2329 -57 67 -171 -200 44 -2 -108 -21 -149 -119 122 37 37 -44 60 141 -48 -157 221 240 -71 104 17 30 -43 91
$$ packed form
2177a69m97Q47k25M46j10p21P84o8p33N54J5k78RJ93m28K91L21k50j44R1M35k0
2199C43q04L79K39k01J56L9K1J26m23K8L34j20P4K5l90J50M18m94K41q4K9L89
2221D75q62K81N42p53K72J38j57K31k2l82M30m25L58M44q34o6P10l33k02L07k92
2242a40k8K19m42Q77o95n8M76j59k7K11m54N3M1P2K73j02l03M95P7j007N36L75
2264B90o66M29r0J24l23J46J98P9n59M56K72q17L30J79j23J25k93L88J1l45P8
2285a11K51l49N7K39k99L44K4k49O6j21K50J24q6k32M47l05j41L18l29J42l20
2306b80M34q4Ok17P5J82k18K82j60k95J56J40J5J86m43J96j10M0J97m0p4J27j72
2329e7J24k38k9K44m6j06Q7j28L0K41q5%q1J04Q1j89j09L78J9l11J75q7J3p3J34
$$ plain form
2354 91 254 -290 -94 41 17 -6 -87 83 -223 -283 4 -123 -252 -256 97 -33 58 60 259 43 67 -52 20 -97
2378 -97 105 86 -32 -46 -186 143 26 224 -31 -31 322 -42 134 32 38 261 46 46 20 -17 65 -9 5 -143 31
2403 31 -176 186 226 -102 -25 -96 -115 -216 126 -35 13 -266 282 197 126 -27 124 255 -171 -184 153 -147 167
2426 167 -82 314 278 -92 -172 80 -29 70 89 -263 131 -84 -21 30 -99 121 -34 -226 -6 266 -260 37
2448 37 165 -300 -259 268 7 -95 -236 -199 -140 -117 -226 79 -156 -180 -33 164 -51 -9 -183 124 119 180 128 -383
2472 -383 -80 164 94 -209 95 180 -38 -233 -100 -50 141 -125 49 329 -42 -72 283 -27 182 -38 37 53
2494 53 -100 -43 63 -265 -55 19 -58 153 249 -240 -148 -79 -35 27 62 -327 253 93 -62 188 -51 91 -10
2517 -10 -39 -213 -67 -9 113 -48 -405 235 -7 -219 -47 -87 -64 216 -149 -100 -107 -49 6 103 -155 118 -88 -101
$$ packed form
2354I1J63n44J96J35k4k3q1J70l06o0K87j27j29mL53j30R1KJ99k16K4j19P2j17
2378i7K02j9j18j4j40L29j17J98k55%L53l64J76j02OK23k15%k6l7Q2p4J4j48J74
2403C1k07L62M0l28P7p1j9j01L42j61M8k79N48q5p1j53J51J31m26j3L37l00L14
2426A67k49L96l6l70q0K52j09R9J9l52L94k15O3N1j29K20j55j92K20K72n26K97
2448C7J28m65M1N27k61j02j41L7N9K3j09L05k35k4J47J97k15M2j74L07nO1n2n11
2472c83L03K44p0l03L04Q5k18j95J33N0J91k66J74K80l71l0L55l10K09k20P5J6
2494E3j53N7J06l28K10P4p7K11R6m89R2O9M4O2L5l89N80j60j55K50k39J42j01
2517a0k9j74J46N8J22j61l57O40k42k12J72m0K3K80l65M9pN8N5R7k58K73k06j3
$$ plain form
2541 -101 248 214 -4 -34 -143 -148 232 -132 183 -289 -12 150 11 -96 -21 -275 -21 -134 -391 152 -11 -209
2563 -209 231 74 -220 442 -1 -300 140 4 -179 -33 -152 -3 277 -299 -18 160 16 -54 -106 -320 119
2584 119 85 -184 37 -17 109 82 88 -113 -50 -117 -131 -366 -241 418 111 79 298 22 -35 31 -345 -143 69 -203
2608 -203 -294 43 117 256 -392 -91 110 -107 79 -20 -201 158 90 40 -68 381 220 124 -302 -73 351 -150
2630 -150 -468 175 86 -52 -5 -290 94 121 -288 -96 19 33 142 -122 84 280 237 -261 48 -286 206 406
2652 406 -355 -34 125 61 164 -90 -159 315 53 -306 6 -14 172 274 21 282 61 -33 233 -105 -76 376
2674 376 -137 -21 364 -247 152 -39 -63 232 361 -312 -67 -187 -9 108 -168 -162 233 -82 -206 207 180
2695 180 108 -3 -221 20 113 28 209 -131 -150 104 -252 29 -32 -78 -54 -310 -378 61 -138 -130 -75 99 73 342
$$ packed form
2541a01L49l4k18l0j09nL80l64L15m72K77J62j39j07P5k54K54j13k57N43j63j98
2563b09M40j57k94O62m43k99M40j36j83J46j19J49K80n76K81J78j44p0n2k14M39
2584A19l4k69K21n4J26k7Ok01O3o7j4k35J25O59l07l2K19k76n7O6l76K02K12k72
2608b03r1L37P4J39o48L01K01k17J86r9j81L59o8n0j08M49j61r6m26K29M24n01
2630a50l18O43q9j38M7k85L84K7m09J92J15J4J09k64K06J96m3m98L09l34M92K00
2652D06p61L21J59o4J03k54o9M74k62l59L12k0J86J02k53K61k21r4K66l38K9M52
2674C76n13J16L85o11L99j91k4K95J29o73K45j20J78J17k76OL95l15j24M13k7
2695A80p2j11k18K41R3q5J81l40j9K54l56K81o1m6K4k56o8M39j99QN5J74k6K69
$$ plain form
2719 342 -218 -21 165 -16 64 209 10 153 62 -90 87 91 108 468 -313 16 235 -207 280 64 -14 -134
2741 -134 518 -108 174 248 -76 179 7 10 333 142 172 240 -240 157 116 -5 96 -49 -203 286 4 141
2763 141 -127 -45 -343 105 149 -120 -117 -306 172 -247 -222 54 338 -238 109 -347 -12 -148 6 186 -79 -147
2785 -147 27 -76 -237 -25 120 103 13 134 -136 4 -41 -252 324 -156 50 241 64 76 -14 50 -98 -134
2807 -134 -303 273 247 -62 71 -237 248 306 91 -7 144 -35 22 -108 -150 335 -42 180 -185 76 41 5
2829 5 -249 -215 -51 467 -184 286 -78 270 103 -108 131 89 -174 -190 -89 -277 -53 35 214 302 -150 -135 -87
2852 -87 160 -26 -34 114 -58 98 71 -43 -231 -200 -186 10 47 -8 57 -80 -34 -228 73 19 308 -153 -197 -246
2876 -246 -205 81 168 -12 -41 -17 35 -54 -3 99 238 -29 -93 -80 -50 -211 1 59 -66 -25 280 -8 104 -1
$$ packed form
2719C42n60J97J86j81Q0J45j99J43r1j52J77MJ7L60p81L29K19m42M87k16p8j20
2741a34O52o26K82P4l24K55j72LL23j91L0O8m80L97m1j21J01j45j54M89k82J37
2763A41k68Q2k98M48M4k69Lj89M78m19K5K76K84n76L47m56L35j36J54J80k65o8
2785a47J74j03j61K12J45j7r0J21k70J40m5k11N76m80K06J91j77J2r0O4j48l6
2807a34j69N76k6l09J33l08M85N8k15r8J51j79N7j30m2M85l77K22l65K61l5l6
2829Ek54L4J64N18o51M70l64L48j67k11K39m2k63j6J01j88K24Q8J79Q8m52J5M8
2852h7K47j86qJ48j72J56k7j14j88L1J4J96L7n5O5j37M6j94L01n4K89m61m4m9
2876b46M1K86Q7j80k9K4N2q9N1J02J39k67o4J3L0j61K12N8j25M1L05k88J12j05
$$ plain form
2900 -1 -3 -187 141 154 74 -302 -3 71 210 -208 165 -156 -7 255 -298 0 56 33 -28 239 10 61 -74 -295
2924 -295 11 40 226 61 267 301 -51 178 18 34 165 22 30 -40 219 201 -67 -42 -284 -70 -112 78 -79
2947 -79 -330 206 13 156 -8 89 -44 45 163 -13 62 -38 -202 307 23 -101 11 -67 172 50 -235 -33
2969 -33 -243 -331 111 -194 -47 -6 231 -84 -111 88 90 -60 196 -161 65 68 24 313 -73 142 150 -287 187 -303
2993 -303 -89 56 -58 89 253 -95 136 206 -202 237 165 -181 -83 -177 -107 -253 -144 -105 19 -111 171 279
3015 279 -27 42 -282 0 -57 -163 0 122 136 46 340 -179 -164 130 -40 96 -91 -134 385 -211 -178 -237 -55
3038 -55 -136 -222 232 45 452 -17 7 -171 50 -140 102 -172 169 -8 -26 51 -82 -63 -167 -63 -252 -213 14
3061 14 -3 -422 -284 -11 187 -152 294 -15 -73 -83 -13 54 97 -82 -51 -88 -171 296 -104 169 85 -150 87 -194
$$ packed form
2900akj84L28J3q0l76K99P4J39m18L73l21J49K62n53K98N6k3o1K67k29N1j35k21
2924b95L06K9J86j65K06L4l52K29j60J6J31j43Qp0K59j8k68K5k42K14m2J90j57
2947g9k51N36j93J43j64R7j33Q9J18j76P5j00j64N09k84j24J12p8K39j22k85K02
2969c3k10q8M42l05J47M1K37l15k7J99Kj50K56l57K26Lm4K89l86K15Qm37M74m90
2993c03K14J45j14J47J64l48K31P0m08M39p2l46R8r4P0j46J09L9J24j30K82J08
3015B79l06O9l24K82n7j06J63J22J4r0K94n19J5K94j70J36j87m3N19n96L3n9J82
3038e5q1q6M54j87M07m69K4j78K21j90K42k74L41j77j8P7j33J9j04J04j89L9K27
3061A4j7m19J38K73J98l39M46l09n8j0P0O7M3j79L1l7q3M67m00K73q4k35K37k81
$$ plain form
3085 -194 -27 176 -153 -85 -49 462 148 -28 14 141 -26 -90 -94 241 -35 50 -218 -104 -15 -193 -222 206 15
3108 15 169 166 -40 -36 16 -259 -146 192 87 116 74 -74 -67 61 123 -181 -194 100 345 -147 -96 -71 -79 79 226
3133 226 79 255 64 106 61 -32 51 152 1 -47 36 22 -137 79 60 -72 -178 -89 90 73 -34 3 -446 -94
3157 -94 87 5 1 73 51 -32 126 61 -83 218 -183 -150 -11 -70 -68 -215 -167 -21 -51 309 -136 -225 77 -87 -335
3182 -335 109 -139 70 201 -44 183 159 -32 -127 -252 189 -41 103 77 23 -126 -240 166 -235 -83 80
3203 80 -160 -85 205 252 42 46 -21 74 80 -31 146 121 23 249 -11 49 -266 -296 -106 -4 33 78 -41 -199 265
3228 265 74 -85 111 23 58 70 148 327 113 89 86 -71 -99 34 180 149 64 -212 34 -24 -153 -43 67 21
3252 21 79 -125 131 154 52 -295 40 -102 -79 221 -574 151 -69 -5 69 26 -206 -61 -119 -370 -60 -43 -169
$$ packed form
3085a94J67K03l29O8L6N11l14j76M2J27j67o4mL35k76Q5k68J14Q9j78k9M28j91
3108A5J54lk06MN2k75J13L38j05K9m2j48PJ28O2l04j3K94K45m92N1K5qJ58J47
3133B26j47J76j91M2m5r3Q3J01j51m8Q3j4j59K16j9j32j06Q9J79j7j07L7m49L52
3157i4J81q2mP2k2q3J58o5j44L01m01L3J39n9Kj47M8J46l0L60m45q9L02j64k48
3182c35M44k48K09J31k45K27k4j91r5j25M41k30J44k6n4j49j14M06m01J52J63
3203H0k40P5K90M7k10Mo7R5Oj11J77k5r8K26k60O0l15l0J90J02L7M5j19j58M64
3228B65j91j59J96q8L5J2P8J79k14k4lj57k8J33J46l1q5k76K46n8j29J10J10m6
3252B1N8k04K56K3j02l47L35j42K3L00p95P25k20O4P4m3k32J45n8k51L10J7j26
$$ plain form
3275 -169 -53 -3 -14 167 -334 183 -70 85 -69 66 -53 62 -173 51 14 156 -212 70 -186 -37 9
3296 9 -320 -68 77 34 -15 105 -102 96 52 -89 232 -29 49 208 25 -158 98 -10 212 125 -32 137
3318 137 -63 46 6 -108 28 1 -33 200 2 42 -117 -43 -117 138 43 278 -57 -25 8 -4 -93 289 129 -183
3342 -183 112 -139 101 52 -88 -17 -41 238 172 52 -282 -41 86 -96 35 -124 81 -105 -39 148 230 -331
3364 -331 -27 38 -101 -18 -99 5 -174 2 97 -14 152 -236 52 -48 -7 160 150 -81 295 26 -82 -100
3386 -100 -250 338 8 11 -11 180 16 69 207 -79 84 -163 -32 22 120 213 -398 -168 41 -302 26 356
3408 356 222 -131 62 175 -35 24 -88 52 -285 -35 189 97 -68 149 198 26 -117 68 40 133 -15 56
3430 56 163 -136 355 125 -152 -149 79 -49 24 -8 -164 285 141 -325 67 -91 58 55 137 -110 125 109 -27
$$ packed form
3275a69J16N0j1J81n01N17k53J55j54J35j19J15k35K24l7J42l68K82k56J49M6
3296Il29K52J45m3m9J20k07J98m4j41L21k61P8J59j83j83K56j08K22q7j57J69
3318A37k00J09m0j14J36k7l4K33j98M0j59P4p4K55r5K35l35L2L3j2q9L82j60l12
3342a83K95k51K40m9j40P1k4K79o6j20l34K41J27j82J31j59K05j86O6J87Q2n61
3364c31L04O5j39Q3q1J04j79J76R5j11J66l88K88j00M1J67j0k31L76k69j08j8
3386a00j50N88l30Lk2J91j64N3J38k86J63k47J31N4R8R3o11K30K09l43L28L30
3408C56j34l53J93J13k10N9j12J40l37K50K24r2j65K17M9j72j43J85k8R3j48P1
3430E6J07k99M91k30k77LK28j28P3l2j56M49j44m66L92j58J49lQ2k47K35j6j36
$$ plain form
3453 -27 9 46 -102 225 -221 -18 43 -169 88 82 -213 67 9 9 -100 -288 -107 86 65 -8 -77 69 -24 -247
3477 -247 -81 -43 136 39 -347 120 107 23 -163 63 -134 -97 106 -174 89 69 143 228 -26 -59 86 -167 -72
3500 -72 -72 127 152 -205 -42 93 -51 165 -175 128 210 -73 158 54 351 -49 84 -167 -93 -297 10 -207
3522 -207 -15 -264 -97 -222 -152 71 5 -43 -6 -87 -8 90 -213 -114 -32 59 -3 71 42 163 181 -106 -30 76 -125
3547 -125 -5 184 67 119 -90 -30 246 70 -17 346 -39 -6 -112 -216 62 41 -97 -77 270 233 -140 -60 -4
3570 -4 300 144 9 -111 116 -14 -108 -94 195 -12 -3 393 -47 -229 122 -180 110 237 -63 -34 -195 58
3592 58 204 197 351 -20 70 -129 234 113 -11 61 83 18 -109 -1 137 152 85 100 -269 -47 194 -43 -67 275
3616 275 9 39 -301 187 61 -80 21 39 -268 -274 70 -44 -47 -302 -75 4 27 -210 115 -14 -100 -93 -32 -129
$$ packed form
3453b7L6L7j48L27m46K03O1k12K57ok95K80n8%j09j88J81J93k1p3o9J46r3k23
3477b47J66L8J79r7l86M67j3q4j86K26j97L7K03k80K63k0P4Q5k54l3J45k53R5
3500g2%J99K5l57J63J35j44K16l40L03Q2k83K31j04K97m00J33k51P4k04L07k17
3522b07J92k49J67j25P0K23o6m8L7q1P9R8l03R9Q2R1o2P4k9J21J8k87P6J06k01
3547a25J20J89j17N2k09O0K76j76q7L63l85L3j06j04K78k1j38K0L47l7l73Q0N6
3570dL04j56j35j20K27j30r4J4K89k07RL96m40j82L51l02K90J27l00K9j61K53
3592E8J46pJ54l71R0j99L63j21j24P2K2o5j27J08J38J5o7J5l69K22K41k37k4L42
3616B75k66L0l40M88j26j41J01J8l07oL44j14lk55K27P9K3k37L25j29q6PO1r7
$$ plain form
3640 -129 -1 -10 17 -56 -30 -272 -123 -30 -239 108 104 -4 -56 -108 203 -194 -161 -206 7 111 -200 -159 -80 80 -8
3665 -8 -25 266 -162 153 -60 -35 147 26 88 0 147 201 -37 -93 107 -80 62 -223 305 223 34 -42 -55 56
3689 56 -63 5 -40 -38 45 99 12 -23 -107 5 -96 155 -50 132 22 -306 196 35 15 -16 -222 -68 127 -50
3713 -50 -331 16 -168 -136 -467 -212 158 28 113 -37 53 201 158 -95 108 -193 -61 -149 -52 53 -179 -13
3735 -13 -133 -83 93 -76 97 211 198 81 99 -48 6 -163 -194 263 -64 -78 92 -97 -7 -168 111 104 -3
3758 -3 -210 53 -119 -35 -248 127 145 215 121 19 -261 -119 -148 -146 -2 33 99 82 51 -243 -136 24 52 -139 -131
3783 -131 -20 -37 116 -220 -219 108 -91 -60 -224 -273 -54 -6 5 67 76 -24 5 -20 -28 64 80 108 -110 -38 153 65
3809 65 -190 1 -58 126 -90 -277 438 -10 -24 -85 -192 -287 -160 106 17 250 45 -234 112 74 -296 227
$$ packed form
3640a29J28rK7p3K6k42J49R3k09L47mj08n2n2L11l97L3m5K13J04l11M1P9J60q8
3665hj7K91m28L15k13K5J82j21O2q8J47N4k38n6K00j87J42k85N28q2j89p6j3J11
3689E6j19O8m5KQ3N4q7l5q4J12j01K51k05J82j10l28N02j61k0l1k06J54J95j77
3713e0k81L47j84L2l31K55L70j30Q5j50R0J48m3k53K03l01J32q8R7J05k32J66
3735a3j20N0J76j69J73J14j3j17J8j47N4j69l1M57l27j4J70j89R0j61K79pj07
3758ck07K63j72Q4k13L75J8P0r4j02k80J42k9KJ44L5O6j7l1k94J07J60K8j91Q
3783a31J11j7J53l36JL27j99L1j64m9K19M8J1O2Rj00K9k5qR2J6K8k18P2J91q8
3809F5k55J91n9J84k16j87P15m48j4o1j07r5J27K66q9K33k05k79L46l8l70N23
$$ plain form
3831 227 -190 41 60 67 -114 -63 -89 135 -46 47 112 63 188 180 -121 65 39 -91 75 -3 99 -67 29 92 160
3856 160 -65 9 40 -112 -439 124 251 -172 75 52 -44 -211 41 -9 -32 148 -8 121 -149 90 -289 -21
3878 -21 -134 -182 173 122 -16 -102 -94 136 -202 -222 -158 -65 83 176 -167 198 197 -72 170 132 130 -11 30 53 10 58
3904 58 207 -284 51 -150 41 -115 11 -7 89 63 154 174 353 -169 -137 12 -66 -167 -123 -256 -125 -72 -336
3927 -336 163 -96 60 -124 101 -38 -21 -21 257 193 195 101 28 329 -171 -79 -15 70 -178 -183 83 -45 259 -247
3951 -247 -173 -75 -104 -118 -134 165 -191 -70 -106 -258 -388 -133 -3 -180 -298 -68 -25 199 47 -120 -376 103
3973 103 6 41 34 7 145 -136 48 -275 -31 31 -49 -39 176 156 68 28 10 -39 26 -32 0 -253 174 -21 -357
3998 -357 259 -66 46 -118 114 -3 -270 -136 -245 1 121 -154 99 -5 278 155 31 -18 -112 -47 -37
$$ packed form
3831B27m17K31J9Pj81N1k6K24j81R3O5m9J25ql01J86k6j30J66p8J02j66R6O3O8
3856A60k25P4L1j52l27N63J27m23K47k3r6j67K52n0k3J80j56J29k70K39l79K68
3878b1j13m8L55n1j38q6QK30l38k0O4R3J48R3l43L65jk69K42l8kj41M1K3m3M8
3904E8J49m91L35k01J91j56J26j8R6k6R1K0J79n22L2J49p8j01M4j33J31N3k64
3927c36M99k59J56j84K25j39J7%K78o4Kr4p3L01n00R2O4Q5k48nK66j28L04n06
3951b47P4R8k9j4j6K99l56J21l6j52j30K55J30j77j18K30M3K24j52j67k56M79
3973A03r7L5pk7J38k81J84l23K44O2q0J0K15k0q8m0j8m9O5n8L2k53M27j95l36
3998c57O16l25J12j64K32j17k67J34j09K46J20k75K53j04K83j23j24m9r4O5J0
$$ plain form
4019 -37 -95 -180 321 -14 66 43 91 64 75 19 -17 232 198 118 -364 53 -143 127 108 81 -89 -114 382 216 150
4044 150 -135 -169 154 328 -116 13 26 147 -60 168 208 -12 -120 223 -29 152 -25 -135 254 -167 -26
4065 -26 32 -14 -76 50 174 -219 -121 173 3 -77 11 -29 -41 -177 219 -141 219 64 81 214 7 -73 213 176
4089 176 243 97 -44 172 -195 144 -12 52 81 -112 57 45 96 132 84 11 -121 196 102 -256 -20 63 -190
4112 -190 24 -125 51 -161 179 -287 98 -116 18 26 132 -142 60 17 43 5 -72 45 -65 -64 -100 57 48 152
4136 152 92 85 6 141 -120 118 241 -72 72 -60 -9 63 327 -21 202 -271 117 -71 185 97 -45 -36 -232
4159 -232 145 98 36 59 -121 -108 -11 93 -93 -1 -194 -63 -385 -140 -164 -78 30 -134 -240 -55 41 -266 -26
4182 -26 -145 43 -72 179 152 117 -9 -236 233 3 150 -18 103 -36 15 -28 114 -128 -57 -58 -73 248 -70
$$ packed form
4019c7n8q5N01l35Q0k3M8k7J1n6l6K49l4q0m82M17j96K70j9k7j70k5M96j66o6
4044A50k85l4L23J74m44J29J3J21k07K28M0k20j08L43k52J81j77j10L89m21J41
4065b6N8m6o2J26J24l93R8K94j70q0Q8m0j2j36L96l60L60j55J7J33k07q0K86l7
4089A76O7j46j41K16l67L39j56O4K9j93J69j2N1L6m8p3j32L17r4l58K36Q3k53
4112a90K14j49J76k12L40m66L85k14J34QJ06k74K02m3K6l8p7J17j10Jl6J57rJ04
4136A52o0pp9J35k61K38J23l13J44j32N1P2K64l48K23m73L88j88K56q8j42Rj96
4159b32L77m7o2K3j80J3R7J04j86R2j93J31l22K45k4Q6J08j64j06J85R6l07K40
4182b6j19J88j15K51k7l5j26k27M69k30J47j68J21j39N1m3J42k42P1jj5L21l18
$$ plain form
4205 -70 46 44 31 177 130 14 -65 -99 199 0 -28 90 -155 -149 228 279 124 -116 -7 -97 -38 38 147 242 173
4230 173 -143 68 -56 44 -36 36 71 75 -51 153 23 -217 173 -2 5 -44 41 67 177 43 -54 -78 4 247
4254 247 135 -109 -151 -357 -48 98 -134 167 197 36 310 10 217 -99 239 41 15 29 227 101 31 81
4276 81 51 35 -25 43 80 83 -27 -377 -198 -75 -101 50 -80 -45 242 170 -164 80 61 125 147 -102 -177 139 66
4301 66 -243 -97 -189 62 -179 245 -9 60 266 202 -117 96 -98 -115 158 -175 -274 -229 54 -139 -231 -36 236
4324 236 -257 -148 100 -94 9 226 15 -152 -57 -240 98 72 -219 -197 96 285 125 42 154 30 414
4345 414 -240 -57 -45 -39 -21 -59 145 -9 49 -113 234 -113 203 178 -15 -113 -139 180 150 60 242 70 -137 40
4369 40 -31 42 -153 -40 66 -69 101 -122 -97 -50 46 -89 -99 -143 -88 144 300 -62 -266 -93 -148 179 129 -387
$$ packed form
4205g0J16kj3J46m7j16p9l4K98j99k8J18k45OL77N1j55k40J09r0N9P6J09R5o9
4230A73l16K11j24J00q0P2L5Mj26K04j30k40L90j75Pm9Q5K6J10j34r7k4Q2K43
4254B47j12k44m2k06L09J46k32L01L0j61K74l00K07l16L38j98k6J4J98j26p0N0
4276H1l0j6o0O8L7Lj10l50J79J23k6J51j30L5K87p2l34K44j9O4K2k49p5L16p3
4301F6l09J46r2K51k41M24k54O9K06o4l19K13j94j7K73l33r9M5K83j93r2J95K72
4324B36m93J09K48j94J03K17k11j67R5j83L38k6k91K2K93J89j60q3J12j24L84
4345D14o54J83J2OJ8l8K04j54N8j62L47l47L16k5j93r8k6L19l0r0J82j72k07J77
4369D0p1P3j95J13J06j35J70k23K5M7R6j35j0m4N5K32J56l62k04J73n5L27n0n16
$$ plain form
4393 -387 -59 306 27 99 -49 -5 -153 -116 -41 135 137 -29 33 -226 -23 122 15 144 273 65 -37 86
4415 86 198 -209 82 -2 -185 -152 30 -34 -124 -123 -2 148 155 32 -88 283 159 -4 -206 -67 43 363 53
4438 53 -283 283 140 -208 31 -227 199 -62 104 117 120 36 -179 -206 -198 -3 189 -106 1 -264 -164 299 -154
4461 -154 266 39 204 -58 168 -74 17 -78 53 165 -25 -28 -7 -135 -31 -106 68 -57 222 -186 -17 207
4483 207 -309 244 42 47 -22 -145 -12 -3 -151 -230 192 -49 -52 -57 164 -115 -62 272 88 70 54 -205 -48 31 149
4508 149 250 207 113 196 -42 -158 174 38 -53 298 41 -11 64 -5 45 106 -6 -14 102 98 -272 -29 -85 247 -9
4533 -9 -138 -27 120 54 -276 171 31 31 -149 186 63 -285 -207 11 -137 182 -193 -37 -117 -16 -42 75 148
4556 148 29 207 -52 64 -134 69 81 106 0 -11 -40 76 10 179 -150 -92 103 106 10 79 -61 -222 164
$$ packed form
4393c87L28L65k79P2j48M4j48L7P5J76Kj66O2k59K03J45j07J29J29k08j02J23
4415H6J12m07K91q4j83L3J82o4r0JJ21J50Pj23j20L71j24j63k02J39J10L20l10
4438E3l36N66j43l48K39k58M26k61J66J3Lq4k15k7QJ95J92k95J07k65J00M63m53
4461a54M20k27J65k62K26k42R1r5J31J12j90lK1j28J04p5J74j25K79m08J69K24
4483B07n16N53k02No9j23J33Rj48p9M22k41lnK21k79N3L34j84j8j6k59J57P9J18
4508A49J01m3r4Q3k38j16L32j36r1L51k57n2P5o9N0O1j12qJ16ml70K43n6L32k56
4533ij29J11J47o6l30M47j40%j80L35j23l48P8K18j48L19l75J56q0J01k6J17P3
4556A48j19J78k59J16j98K03J2K5j06j1k9J16o6J69l29N8J95Lr6O9j40j61L86
$$ plain form
4579 164 119 1 137 -97 198 248 -96 93 -196 -42 -86 21 52 20 239 -99 -39 -129 -20 -352 -142 23
4601 23 110 -224 20 28 -1 38 183 178 21 15 -193 -254 -8 -289 96 450 141 37 -122 -225 30 281 -202 -89
4625 -89 -52 40 -10 34 -154 395 72 -98 -109 68 37 -26 -33 -160 -104 -140 -17 -177 -29 -19 -103 103 66 138 70 15
4651 15 -68 -195 100 132 58 199 218 69 27 92 -55 -141 12 28 230 -10 -28 -241 16 -177 -11 134 -27
4674 -27 -4 84 62 122 -84 47 2 -101 -110 139 -51 48 69 -32 283 -8 -54 -219 -126 39 -35 64 28 46 125 -175
4700 -175 -176 -25 31 -168 -36 127 257 26 -272 22 -30 8 118 51 -18 -29 -122 172 132 114 -248 296 -49 -133
4724 -133 245 -215 143 46 48 -328 -98 33 97 -195 -224 144 18 51 91 122 532 -4 -100 153 -16 -136 -65
4747 -65 -62 160 -36 25 318 57 -59 37 -165 15 257 126 -228 -72 38 346 -214 114 34 -46 26 -166 90
$$ packed form
4579A64m5j18J36k34K95N0l44J89k89J54m4J07L1l2K19l38O0r0J09l32K10J65
4601B3Q7l34K44Qk9L9J45nj57ok08o1K46k81L85L54l09j04j59j03K55K51m83J13
4625h9L7R2n0M4j88N49l23j70j1J77l1o3pj27N6l6J23j60J48J0q4K06l7P2o8n5
4651A5q3j27K95L2p4J41J9j49m2O5j47q6J53J6K02k40j8k13K57j93J66J45j61
4674b7K3Q8k2O0k06J31m5j03rK49j90R9K1j01L15k91m6j65R3J65p4R9l6J8P9l00
4700a75jJ51N6j99J32J63J30k31k98K94n2L8J10o7o9j1r3K94m0j8l62N44l45q4
4724a33L78m60L58r7Kl76K30J31O4k92k9L68j26L3M0L1M10n36r6K53j69j20P1
4747f5LK22j96O1K93k61j16R6k02J80K42j31l54J56J10L08n60L28q0q0P2j92K56
$$ plain form
4770 90 -63 10 -285 115 88 312 -206 -216 -142 14 -63 88 121 -127 116 -11 -147 50 -66 -69 -116 90 -63
4793 -63 27 213 -68 -79 -199 -145 45 -172 52 -80 -265 86 40 -84 -117 156 -151 180 -123 -44 -21 78 211
4816 211 194 140 56 -93 -110 146 308 -219 41 5 -287 -62 -95 81 -174 -28 -185 -173 160 -102 -128 -47 246
4839 246 -13 11 -95 -27 103 77 144 -129 213 22 -28 70 -228 137 -186 87 -65 -32 211 -54 -105 53 117
4862 117 -201 -34 -148 -69 202 -46 158 68 -69 83 -202 -220 384 -503 113 -201 -224 -17 -34 -102 155 -100
4884 -100 87 289 -132 -85 -65 124 80 132 235 -35 -129 -101 -98 63 -75 -134 -62 196 -125 20 142 55 118 2
4908 2 -7 -191 -51 24 -23 265 177 -98 -56 -111 -128 -26 327 -16 -37 101 -20 269 -132 -164 -184 -170 -169 -190 122 197
4934 197 209 3 -74 -187 45 -115 -253 30 139 111 -38 -191 -5 380 38 -48 -25 -47 256 -43 -60 -97 76
$$ packed form
4770I0j53P3k95M00k7K24n18j0P4J56p7J51L3k48K43j27j36J97j16lm7K06j53
4793f3R0J86k81j1j20N4J90k17K24j32j85L51m6j24l3K73l07L31l03P9K3R9J33
4816B11j7n4q4j49j7K56J62n27K60l6k92K25l3J76k55J46j57J2L33k62k6Q1K93
4839B46k59K4j06O8J30k6O7k73L42j91n0R8k98L65l23K73j52L3K43k65n1J58O4
4862A17l18J67j14P9K71k48K04r0j37J52k85j8O04q87O16l14k3K07j7o8K57k55
4884a00J87K02m21M7K0J89m4N2J03k70r4K8LJ61j38n9P2K58l21J45J22q7O3j16
4908Brj84J40P5m7K88q8k75M2n5j7J02L53l43k1J38j21K89m01l2k0J4Jk1L12P5
4934A97J2k06p7j13K32j60j38K83J09k8j49j53J86L85l42q6K3k2L03k99j7l7J73
$$ plain form
4957 76 -203 138 42 -88 -238 160 -2 -182 86 -112 -96 103 -177 -167 -65 -187 -42 191 52 113 -42 -91
4979 -91 48 176 32 102 161 -65 -95 16 240 217 -63 112 153 121 -196 -231 24 187 99 42 -19 -105 54 -179
5003 -179 -78 -210 42 -90 -205 -46 -72 99 -25 -1 36 -6 345 -30 -156 34 -22 -235 -53 41 -174 200
5025 200 -88 -77 -75 71 161 -157 236 116 208 52 -60 376 2 67 1 -290 72 -49 -16 -104 -58 116 120 45
5049 45 106 -38 17 -159 -84 106 220 -74 -67 -257 -119 99 51 193 15 -224 -121 118 -27 167 -103 124
5071 124 -30 -39 76 -261 178 -175 -18 28 27 -113 -55 -82 -119 -136 -43 130 77 328 83 97 34 -106 -22 -220 44
5096 44 -183 216 171 -165 -119 28 201 -156 103 89 -17 -16 -232 -77 -256 -49 -72 -142 -17 193 248 -87 173
5119 173 -87 84 62 212 -43 242 21 201 -41 -190 60 31 21 119 33 12 71 -20 116 -31 100 -121 -47
$$ packed form
4957G6k79L41r6j30j50L98j62j80K68j98J6J99k80J0J02j22J45K33j39O1j55m9
4979i1J39J28j44P0N9k26l0J11K24k3k80J75M1l2l17l5K55J63q8n7o1q6J59k33
5003a79J01j32K52j32j15J59k6J71j24K4L7m2L51l75j26J90n6k13J82R4k15L74
5025B00k88J1KJ46R0l18L93j20R2j56j12M36l74O5o6k91L62j21L3q8M6J74Mp5
5049D5O1j44N5j76P5J90J14k94Pj90J38K18m8J42j78k39J03K39j45J94k70K27
5071A24j54rJ15l37M39l53J57M6jj40N8k7l7j7R3J73n3K51k45J4o3j40Q4j98K64
5096D4k27L99m5l36M6J47J73l57K59j4j06Jk16J55j79K07k3p0J25K10N5l35K60
5119A73k60J71k2J50k55K85k21J80k42j49K50k9j0R8q6k1N9r1J36j47J31k21P4
$$ plain form
5142 -47 22 -44 -287 267 38 -50 28 -88 -172 91 -370 202 -313 -23 159 -102 -131 110 -181 137 192 -184 -35
5165 -35 4 51 17 62 -84 -179 64 29 -19 2 93 67 -146 -201 77 -102 61 144 175 -268 -401 -221 153 114 29
5190 29 -159 -84 126 148 -225 -15 87 -179 26 -30 73 48 -134 55 -131 -206 191 2 27 -117 144 -166
5212 -166 206 79 115 124 205 460 82 -359 -54 126 172 10 -44 -78 -116 166 -76 21 90 81 -230 92 12 101 -4
5237 -4 -287 -5 130 165 -120 -186 -17 -31 -110 185 -142 -241 195 138 -166 92 -109 -91 -209 144 81 135 38 -148
5261 -148 -285 97 22 63 -143 205 259 189 -97 -202 -60 -32 -230 -89 220 -127 196 102 -53 35 180 120 3
5284 3 -24 -131 -76 -11 -336 -95 238 151 92 -37 -58 30 70 -2 -83 153 141 79 -81 78 -127 32 241 199 162
5309 162 128 -63 -61 268 -81 -125 -171 61 18 -239 53 -137 -60 98 -13 103 92 -11 -45 85 238 26 279
$$ packed form
5142d7O9o6k43N54k29q8P8j16q4K63m61N72n15K90J82k61k9K41k91L18N5l76J49
5165c5L9M7l4M5j46r5K43l5m8K1R1k6k13n5K78j79J63Q3L1m43j33J80L74l9q5
5190B9j88P5K10K2l73K10J02k66K05n6J03k5j82J89j86p5L97j89K5j44K61l10
5212a66L72j27L6RQ1K55l78m41L05J80M6j62n4l4l8K82k42R7O9rl11L22q0Q9j05
5237dk83K82J35L5k85o6J69j4p9K95l27r9M36n7l04K58k01J8j18L53o3N4r7j86
5261a48j37L82p5M1k06L48N4p0k86j05J42K8j98J41L09l47L23r4j55Q8J45o0j17
5284Ck7j07N5O5l25K41L33q7n9j29k1Q8M0p2q1K36j2o2j60J59k05J59K09m2l7
5309A62l4j91KL29l49m4m6K32m3k57K92j90P7J58j11J16j1j03l4J30J53k12K53
$$ plain form
5332 279 63 51 7 56 78 26 327 -192 -250 20 101 -168 -16 0 -45 95 -4 56 23 189 -296 86 97 -33
5356 -33 -120 -102 42 83 -59 -175 -86 -216 320 -116 -26 -140 -113 192 94 -109 -180 -51 58 63 -92 -4 -24 -34 -108
5381 -108 17 50 114 118 -135 14 112 -40 83 118 -141 80 124 -8 479 -39 1 88 -13 -15 17 -155 99 113
5405 113 72 -34 -10 -229 -90 118 169 -169 174 123 92 -198 -54 58 61 176 -53 95 -200 79 45 -16 223
5428 223 182 -37 -57 72 184 -177 225 49 -157 257 356 -273 14 -111 12 -114 41 88 -81 235 71
5449 71 -120 -57 53 63 253 268 -65 62 245 -250 -131 265 136 -202 -442 128 46 -110 193 89 -139 132
5471 132 48 65 -11 -81 255 -144 -40 133 -32 -166 168 77 96 -43 70 -54 -93 326 -93 302 73 128 47
5494 47 43 -21 -17 -60 -80 106 171 -172 222 146 -65 164 144 92 5 -305 -143 -130 -202 -114 -170 -109 79 -121 43 -142
$$ packed form
5332B79k16j2m4M9K2n2L01n19n8K70Q1k69J52J6m5J40r9O0l3J66m85L82J1j30
5356c3q7J8J44M1j42j16Q9j30N36m36R0j14K7L05r8k03p1J29J09Nj55Q8k0j0p4
5381a08J25L3O4Mk53J49R8j52J23L5k59K21M4j32M87n18M0Q7j01kL2j72K54J4
5405A13m1j06K4k19J39K08N1l38L43n1l1k90J44J12LJ15k29J48k95K79l4o1K39
5428B23m1k19k0J29J12l61M02j76k06M14R9o29K87j25J23j26J55M7j69L16j64
5449G1j91O3J10J0J90J5l33J27J83m95J19L96j29l38k40N70q2j56L03j04k28K71
5471A32q4J7p6p0L36l99J04J73j65j34L34r1J9j39J13j24l9M19m19L95k29N5q1
5494D7mo4Mm3k0J86O5l43L94p6k11K29k0n2q7l10J62J3p2Q8n6O1J88k00J64j85
$$ plain form
5520 -142 4 -204 115 225 -218 269 -49 -101 -9 -52 -46 56 33 72 19 -41 27 39 88 290 24 -62 101 112 -193
5545 -193 177 21 -41 -126 6 -9 85 -14 143 -9 -68 -18 -288 -327 -2 197 -88 4 58 -81 107 15 24 184
5569 184 202 -20 -148 155 -60 -174 -24 148 -104 104 163 43 1 181 -176 13 -27 -157 42 103 279 128
5591 128 -27 -180 -33 307 -38 202 8 191 49 76 -55 253 -36 -58 161 150 -195 16 262 -100 -213
5612 -213 -123 -204 -92 -200 -70 -140 68 97 -147 -132 244 -103 -60 -58 39 54 369 286 -215 -13 102 20 -255 -145
5636 -145 -61 -129 -368 -137 -113 275 -322 5 -165 -56 78 -236 -112 -14 204 -151 47 -155 -25 188 57
5657 57 61 -9 -87 12 -16 -446 -120 -33 58 124 7 73 19 -289 127 -219 102 100 45 -184 17 -179 -96 -16 -184 444
5683 444 -332 -116 67 20 54 132 -13 -90 280 -197 87 12 -91 -26 -158 -42 68 77 -185 265 27 -134 163
$$ packed form
5520a42J46k08L19J10m43M87l18n2R2m3OJ02k3L9n3o0O8J2M9K02k66q6J63J1l05
5545a93L70j56o2q5J32j5R4r9J57j52n9N0k70l9L25J99k85R2N4j39J88r2RJ60
5569A84J8k22j28L03k15j14J50J72k52K08N9j20m2J80l57J89m0j30J99O1J76j51
5591A28j55j53J47L40l45K40j94J83j42K7j31L08k89k2K19j1l45K11K46l62j13
5612b13R0q1J12j08J30p0K08K9k44J5L76l47M3KR7J5L15q3n01K02J15q2k75J10
5636a45Q4o8k39K31K4L88n97L27j70J09J34l14J24R8K18l55J98k02J30K13j31
5657E7Mp0p8R9k8m30L26Q7R1O6j17O6n4l08M16l46L21kn5k29K01j96Q3Q0j68O28
5683D44p76K16J83m7L4P8j45p7L70m77K84p5j03O5j32J16J10Rk62M50k38j61K97
$$ plain form
5706 163 -53 134 103 -183 -130 40 37 111 -68 165 -114 255 -5 -326 61 36 -5 285 -113 -69 63 -85 -46
5729 -46 -19 119 -41 -307 -192 19 -107 -25 -160 49 136 -104 233 -284 218 -25 -50 168 102 -152 13 84
5751 84 -100 135 11 -82 283 68 -238 -36 -12 73 -225 -1 -51 -93 16 181 -74 -131 154 -142 346 -110
5773 -110 -109 62 142 -10 -215 -87 -188 -59 -5 -117 76 -53 -147 -112 -10 174 -27 -52 -123 128 16 -79 18
5796 18 -98 -128 8 -269 4 158 -38 20 -211 -19 -26 10 -111 62 -177 -133 174 -168 -44 -33 -61 -231 -35
5819 -35 84 -98 -109 137 115 97 162 166 -103 128 78 90 -119 15 182 323 -308 -36 175 -234 1 6 -134 -218
5843 -218 -158 59 133 -58 -182 21 -42 298 126 -92 91 115 122 -166 10 -122 151 151 91 -128 -23 -119 12
5866 12 19 159 167 95 -163 22 193 189 -133 117 58 3 -95 -256 91 59 -109 -132 165 123 245 -77 -78 23 190
$$ packed form
5706A63k16J87l1k86N3J70lP4j79K33k79L69k60l21L87k5m1K90l98M4J32j48L9
5729d6K7J38j60k66J15K11j26Q2j35K09Q7k40L37n17N02k43k5K18o6k54J65P1
5751H4j84K35j24r3L65k15l06K02K4Q5k98K24n0m2J09J65k55n7K85k96M88m56
5773a10JJ71Q0j52k05J28j01J29N4j12J93j29r4L5J02J84k01k5p1K51j12r5R7
5796A8j16l0J36k77K73J54j96N8k31J92pL6j21J73k39M4L07l42J24J1k8j70J96
5819c5J19j82j1K46k2j8O5Mk69K31n0J2k09J34J67J41o31K72K11m09K35Nj40q4
5843b18O0K17P4j91j24K03o3L40j72k18J83K4Pk88J76j32K73%o0k19J05r6J31
5866A2PJ40Qp2k58J85J71ml22K50n9n5r8j61L47l2j68k3K97m2J22l22jJ01J67
$$ plain form
5891 190 78 -29 120 24 19 116 -79 121 18 170 68 50 255 -137 -97 266 -228 173 101 -77 10 143 407
5914 407 -15 -31 -65 -323 -93 253 -184 -31 -62 -132 -184 -49 -77 200 108 -192 -72 166 -189 76 50 -58 -191
5937 -191 66 -8 -15 2 64 -70 -158 -80 -20 -155 35 -46 -3 -4 43 158 -96 216 17 54 37 122 -121 -266 216
5962 216 254 -200 -65 23 -154 94 215 -318 48 -91 78 244 -117 -80 56 -12 50 -167 -73 -42 96 -171
5984 -171 225 143 -121 23 112 -192 -152 -131 171 -82 8 47 35 85 -35 361 -37 91 105 37 89 -70 117 198
6008 198 65 263 5 124 74 66 -63 181 -68 44 -302 -46 55 -4 79 99 157 -17 108 -72 -4 -20 112
6031 112 -61 -201 -218 110 -87 -52 224 -133 123 -35 -86 65 -29 224 153 -47 -101 241 148 155 126 284 -143
6054 -143 -45 85 -343 298 84 -32 215 269 -163 185 255 255 59 -406 -376 -66 214 144 -185 -75 -72 -162 -16
$$ packed form
5891A90j12j07J49r6nR7j95K00j03J52j02j8K05l92M0L63m94M01p2j78Q7J33K64
5914D07m22j6l4k58K30L46m37J53l1p0n2J35k8K77r2l00J20K38l55K65k6j08j33
5937a91K57p4pJ7O2j34q8P8O0j35J90q1M3jM7J15k54L12j99L7j7Q5k43j45M82
5962B16L8m54J35Q8j77K48J21n33L66j39J69J66l61L7J36o8O2k17R4L1J38k67
5984a71L96q2k64J44Q9l04M0K1L02k53R0L9j2N0j20L96l98J28J4o8N2j59J87Q1
6008A98j33J98k58J19n0qj29K44k49J12l46K56J01n9Q3K0N8j74J25j80O8j6J32
6031A12j73j40j7L28j97L5K76l57K56j58n1J51r4K53p1k00n4L42r3Pk9J58m27
6054a43R8J30m28O41k14j16K47N4m32L48P0%j96m65L0L10K80p0l29J10Lr0J46
$$ plain form
6077 -16 -66 124 281 114 193 91 -126 -145 -97 -106 84 -144 47 167 -33 -323 121 -150 -45 -7 76 -18 -186
6100 -186 -170 32 -85 88 -152 90 -242 -336 103 -72 -113 189 -132 19 51 173 -31 -21 261 378 1 -44
6122 -44 15 -234 -250 -57 2 112 -202 -93 -313 19 4 2 130 45 -11 243 71 104 -155 135 -149 119 169 149
6146 149 89 -154 -15 -176 -115 80 322 -141 -221 -132 94 -110 100 -191 2 3 178 187 105 -14 56 336 -26
6169 -26 -101 -355 -203 61 -167 -10 219 -11 -140 -100 71 12 -51 40 -17 12 -44 -106 -4 -217 -50 -29 86 2
6193 2 241 -25 -38 147 26 -11 261 81 -40 77 -61 -29 9 187 147 187 -40 -99 -86 -89 -314 73 -145 24
6217 24 -211 49 98 51 -254 -50 -121 -233 119 126 -15 -40 -147 -42 -22 123 -5 57 142 -29 45 76 123 -90
6241 -90 225 158 12 -170 -143 -149 -40 82 -4 -220 50 -42 63 -34 -76 12 99 208 -60 -91 -61 119 -82 -229
$$ packed form
6077a6n0J90J57j67P9j02k17j9M8rJ90k28J91J20k00k90M44k71J05L8Q3r4j68
6100a86J6K02j17J73k40K42l32r4M39j75m1L02l21J51L2J22k04J0K82J17l77m5
6122d4N9k49j6J93N9J10l14J09k20L32j5kJ28q5n6K54j72L3k59K90k84K68N0k0
6146A49o0k43J39j61O1J95K42m63q0Q9K26k04K10k91J93JJ75Rq2j19P0K80l62
6169b6p5k54J52K64k28J57K29k30j29M0J71n9o3R1n7K9n6o2J02k13J67K1J15q4
6193BK39k66j3J85j21l7K72j80j21J17j38L2L8J78m0M0k27n9J3lk25L87k18J69
6217B4k35K60M9m7l05K04p1j12L52Pj41k5j07J05K0J45j28O2Q5j71P4L1M7k13
6241i0L15o7j46j82K7oJ09J22q6k16K70r2J05r7m2Q8Q7J09k68l1L0J80k01j47
$$ plain form
6265 -229 81 -8 -277 -90 -299 190 63 -1 107 46 164 34 -10 273 12 -11 -68 -36 211 -68 -121 287 -169
6288 -169 19 53 -261 56 -295 204 147 50 -146 -6 232 -180 111 87 176 263 -20 217 -125 -80 130 -20
6310 -20 -190 -300 -42 -181 130 150 106 212 -59 -57 46 -27 -203 -94 -105 252 14 -209 -258 -78 -104 61 28
6333 28 -193 -63 232 -207 -66 227 -78 307 44 -152 8 -78 -209 4 171 48 265 155 54 3 31
6354 31 -131 -66 -56 87 5 -134 130 16 -95 41 36 42 97 123 236 116 -26 11 -69 239 -136 39 -120 -31
6378 -31 224 37 295 -64 64 -254 -124 91 -1 -356 -87 -112 -55 -192 135 28 44 193 72 -132 2 199
6400 199 -256 41 64 24 175 -62 166 -24 -25 -51 268 -2 -79 -256 17 -44 349 -270 59 50 205 -160 -164 -39
6424 -39 -208 -99 -86 143 189 -131 -99 -148 -243 79 98 173 72 -70 17 121 144 -247 -175 -73 -69 -229 -116 -189 67
$$ packed form
6265b29L10q9k69J87k09M89j27o4J08o1J18j30m4K83k61k3n7L2K47k79n3M08m56
6288a69J88L4l14L17l51M99n7r7j96J40K38m12K91k4Q9Q7k83K37l42M5K10j50
6310b0j70j10K58j39L11K0m4J06k71KJ03p3j76J09j1L57k38k23m9J80k6J65l3
6333B8k21J30K95m39J41K93l05L85k63j96J60q6j31K13J67j23K17j10j01n1K8
6354C1j62O5J0J43q2j39K64j14j11J36nON5K6J13j20j42L7q0L08l75J75j59Q9
6378c1K55j87K58l59J28l18J30K15r2l55K69k5N7j37L27j07J6J49j21k04J34J97
6400A99m55K97K3m0J51k37K28j90jk6L19k70p7j77K73o1L93o19L29rJ55l65mJ25
6424c9j69J09J3K29M6l20L2m9r5L22J9P5j01j42Q7J04K3l91P2J02Mj60J13p3K56
$$ plain form
6449 67 83 -77 140 -93 37 105 -153 -99 101 54 4 56 199 94 311 116 -177 113 403 -2 -231 134
6471 134 38 57 232 -193 32 -175 275 314 15 -220 185 58 -18 108 308 -170 -86 -187 -122 -107 -9 108 61
6494 61 80 108 -218 -41 172 -214 -139 -200 298 -186 15 184 -57 -211 11 70 -114 -65 -143 165 -23 -190 -181
6517 -181 3 176 96 -109 26 -303 -2 -134 8 -120 -167 171 186 -182 17 -31 45 2 -8 -23 -167 -40 9
6540 9 -204 167 -34 -231 93 -151 61 -153 189 -121 361 41 -68 -82 -37 -379 10 -47 -287 144 92 -179
6562 -179 -270 52 208 -66 50 -285 133 -68 -76 93 -101 264 199 10 111 -105 69 -242 -181 -19 -5 91
6584 91 162 -16 -292 -128 -80 -60 136 90 -225 63 -110 -67 -68 123 -151 -268 -216 119 248 -67 164 -179 175
6607 175 -52 -132 -307 28 -366 -127 -182 -10 152 -27 3 -137 245 -15 119 -51 137 -5 35 14 -165 137
$$ packed form
6449F7J6j60K17k33J30O8k58N4K00m7n0N2J43j05K17j95k93K90K90m05k29L65
6471A34r6J9J75m25K25k07M50L9k99k35M05j27p6J26K00m78Q4j01O5J5R8J17m7
6494F1J9K8l26J77K13l86P5o1M98m84K01J69k41j54K22N9j84M9p8L08j88j67R
6517a81J84J73q0k05J35l29L01j32J42j28m7L38J5l68J99m8P6m3j0j5j44J27M9
6540Ik13L71k01j97L24k44K12k14L42l10M82l20j09j4M5l42L89n7k40M31n2k71
6562a79r1L22J56k74J16l35M18k01qJ69j94L65o5j89J01k16J74l11O1J62J4R6
6584I1P1j78k76J64M8K0J96m6l15K88j73M3jJ91k74j17N2L35J29l15K31l43L54
6607A75k27q0j75L35l94K39n5J72J62j79L0j40L82k60J34j70J88j42M0k1j79L02
$$ plain form
6629 137 25 -228 356 85 -7 161 107 -210 332 -43 -91 30 -118 -46 8 256 65 -48 -107 -31 -78 -75 65
6652 65 14 -4 -67 -76 -61 205 -2 -258 -6 -141 -70 108 182 -74 -87 30 -128 -231 73 -177 -216 13 174 47
6676 47 28 80 -5 109 -60 16 110 103 -115 139 86 -58 -55 300 -153 51 -135 125 43 -203 -80 154 118 -65
6700 -65 39 150 97 99 1 71 -23 138 110 0 60 -135 -11 5 -7 17 -66 -233 -82 -204 192 271 -233 -40 -258
6725 -258 -93 74 -88 -10 59 -266 -207 55 -161 133 31 22 -68 -66 230 -26 226 100 147 -64 -148 4 155
6748 155 206 -111 31 -132 -86 31 -124 134 32 70 5 -335 -33 -28 -47 18 75 -2 -171 -423 -112 -2 116
6771 116 -93 -79 121 9 -109 -494 -76 -114 -246 -160 -135 -40 123 -78 22 -153 119 -126 248 112 -79 82
6793 82 -79 158 197 133 -138 -94 106 -304 -26 194 109 26 -237 140 -63 -38 -96 177 23 -216 -124 -3 19
$$ packed form
6629A37j12k53N84k71r2J68n4l17N42l75m8J21j48P2N4K48j91j13n9P6m7LJ40
6652F5n1j8o3rJ5K66k07k56K52j35P1J78P4k56j3J17j58j03L04k50l9K29J61j27
6676D7j9N2q5J14j69P6R4pk18K54n3j44LL55m53K04j86K60q2k46J23K34l6j83
6700f5J04J11n3Kr8P0r4J61k8j10O0j95J24J6j2K4q3j67J51j22L96P9n04J93k18
6725b58J65J67j62P8O9l25N9K62k16K94j02rr0KK96k56K52j26M7k11q4J52J51
6748A55N1l17J42j63M6J17j55K58j02L8o5l40L02Nj9O5N7p7j69k52L11J10J18
6771A16k09J4K00j12j18l85M18l8j32Q6K5R5J63k01J00j75K72k45L74j36j91J61
6793H2j61K37L9o4k71M4K00m10K78K20q5q3k63L77k03K5n8K73j54k39R2J21K2
$$ plain form
6816 19 276 111 -258 39 -71 336 -3 -35 -6 -10 -38 -217 -33 41 -73 25 -166 165 60 -156 -391 -24 -105
6839 -105 -178 -101 -50 -60 -164 304 156 -69 -17 256 -137 22 68 232 147 -188 -7 -195 164 -48 -99 20 64
6862 64 -275 -11 127 40 271 121 42 101 245 139 -47 88 -99 89 -202 -159 124 -39 -144 -174 195 -237
6884 -237 84 -210 -7 101 -62 -29 -93 -19 64 -40 223 248 73 -56 10 -181 -160 159 64 237 142 123 -157
6907 -157 -175 100 -105 58 -124 45 -15 47 182 -193 62 106 -18 132 -168 -37 -30 -52 -7 -115 -134 70 97
6930 97 117 -133 19 -90 -226 30 72 78 299 47 -387 171 -193 269 46 -180 -23 84 151 71 -39 -128 200
6953 200 84 190 159 50 -39 -236 109 -99 -30 -38 -45 -136 198 -132 128 51 -33 -56 338 173 -56 360 101 32
6977 32 -251 237 126 -37 12 88 103 -157 -51 -22 -38 18 -66 282 -17 -126 -226 -189 144 161 -317 61 -426
$$ packed form
6816A9K57j65l69K97j10M07l39l2K9mk8j79J84P4j14R8j91L31j05k16k35L67q1
6839a05p3P7N1j0j04M68j48k25N2K73l93J59M6J64q5l35J81j88L59k12n1J19M4
6862F4l39K64J38q7K31j50p9N9J44j06j86J35j87J88k91M3K83j63j05l0L69m32
6884b37L21k94K03J08j63L3o4P4Q3j04K63K5j75j29O6j91K1L19r5J73r5j9k80
6907a57j8K75k05J63j82J69o0O2J35l75K55M4j24J50l00J31Pk2M5j08j9K04K7
6930I7K0k50J52j09j36K56M2OK21k52m34N58l64M62k23k26J57J07O7q0j10q9L28
6953B00j16J06l1j09q9j97L45k08O9qpr1L34l30K60p7q4k3L94j65k29M16k59o9
6977C2k83M88j11j63M9P6J5k60J06K9j6N6q4L48k99j09j00L7L33J7m78L78m87
$$ plain form
7000 -426 -149 -37 -113 -142 -127 365 -29 -103 -198 48 135 -249 96 -13 -26 95 -10 190 -27 -102 -64 49 -74
7023 -74 -116 -97 -162 139 4 -17 -215 -29 220 28 54 -36 -132 -87 -20 -66 139 34 15 51 404 49 -36 -196 166
7048 166 23 -424 -135 -81 -235 16 254 -7 -344 -87 -15 150 -59 -19 189 107 -43 -197 -175 17 -311 -164
7070 -164 393 -345 61 -45 37 -209 77 -178 163 292 -143 -14 -74 -18 2 -14 57 95 46 89 -218 -177 -6
7093 -6 -43 -11 28 2 60 59 10 -162 -28 -99 132 -316 -19 -84 -79 -182 -139 49 -15 -181 -10 10 90 58 -104 41
7119 41 328 104 -42 13 17 276 -95 -144 44 132 27 18 -44 78 -486 -2 26 -125 -71 30 -150 -73 6 21 -92
7144 -92 76 -37 -54 65 -202 239 47 71 196 -286 -292 2 -199 31 -126 -130 -254 129 202 215 162 59 -193
7167 -193 45 80 66 153 -69 35 11 58 -283 -253 -89 103 -167 248 11 206 -50 -47 -102 -122 74 52 128 3
$$ packed form
7000d26K77J12p6k9J5M92l94p4r5K46Q7l84L45j09j3J21j05K00k17p5L8J13j23
7023g4m2J9o5L01j35k1j98J86K49j92K6r0r6M5O7m6K05j05j9L6L53l55q5j60L62
7048A66j43m47K89N4j54K51K38k61l37K57P2J65k09M0K08q2j50j54K2J92l28J47
7070a64N57p38M06j06Q2k46K86k55L41J29m35J29o0N6K0j6P1L8m9M3l07M1J71
7093fl7L2L9k6N8jm9j72J34p1K31m48K97o5Nj03M3J88o4j66J71K0Q0l2j62J45
7119D1K87k24j46N5MK59l71m9J88Q8j05ro2J22n64M84K8j51N4J01j80P7P9J5j13
7144i2J68j13j7J19k67M41j92K4J25m82oK94k01K30j57mj24L83P3J3n3j03k52
7167a93K38L5j4Q7k22J04k4M7l41L0J64J92k70M15k37J95k56Ln5k0J96k2P6j25
$$ plain form
7191 3 68 22 -145 -208 208 186 15 14 39 -113 271 -5 -191 252 216 206 58 -60 -131 -227 180 126 -45 -4 -77
7216 -77 -99 52 33 -127 33 104 -152 139 -31 1 361 187 -89 46 146 -135 92 150 -37 212 -228 -123
7238 -123 -43 72 -249 119 -23 -225 177 106 32 259 -250 11 232 77 122 116 342 -51 198 18 41 -70
7260 -70 214 105 -284 -9 154 -263 95 55 -47 99 35 70 16 -34 -308 -81 -127 37 74 3 17 -211 332
7283 332 21 282 36 127 79 133 38 134 -42 -20 -110 245 -278 -12 -44 -258 74 -58 228 -160 -200 68 -205
7306 -205 -44 143 -250 -233 55 55 11 127 69 -112 -2 180 162 174 248 -156 -55 -49 21 73 -10 -57 17 53 -180
7331 -180 238 107 158 42 27 32 -19 140 -362 -92 40 9 -29 230 -116 -444 -154 32 -272 -10 -114 15
7353 15 45 -2 157 103 -86 135 -148 -20 111 162 -234 -107 -100 153 350 258 -131 -141 -161 160 202 -10 -69 7
$$ packed form
7191CO5m6j67o3M16k2j71jK5j52L84k76j86M43l6j0j48j18p1r6M07n4j71M1p3
7216g7k2J51j9j60J60P1k56K91j70L2L60j74k76J35J00k81K27N8j87K49m40J05
7238a23Q0J15l21L68j42k02M02p1p4K27n09K61K21j55M5oK26l93K49j80K3j11
7260g0K84j09l89K75J63m17L58m0j02J46o4L5n4n0k74K27m6J64L7p1J4k28N43
7283C32l11K61k46R1m8N4r5R6j76K2r0L55n23K66l2k14L32j32K86l88m0K68k73
7306b05J61J87l93J7K88%m4J16n8j81J10J82j8J2P4m04J01OP0N2q3m7P4L6k33
7331a80M18j31N1j16j5Nn1J59n02K70J32l1l8K59l46l28K90J86l04K62j04J29
7353A5L0m7J59n4j89K21k83J28J31N1l96J27PK53J97r2l89j0k0L21M2k12n9P6
$$ plain form
7377 7 79 167 2 93 -167 -65 111 18 230 -337 -87 -32 175 85 -155 30 -24 -1 51 36 -85 -215 64 127
7401 127 -122 -32 -234 185 450 -116 45 -283 -249 65 -62 -14 -194 -102 -112 -155 178 29 -109 169 107 164 34
7424 34 243 -46 -223 -183 49 45 70 1 -114 -108 52 188 299 -123 -162 13 -13 -23 -21 157 -112 19 -197 -110 219
7449 219 -78 221 175 -72 99 -98 148 153 -55 211 116 235 -110 73 -73 38 -21 175 81 168 -15 288
7471 288 81 -166 82 -67 -122 -66 -17 214 242 275 -85 -165 88 -63 -231 40 284 125 -37 143 32 172
7493 172 133 52 48 -185 27 -28 -32 -57 22 -65 -128 90 19 -48 192 78 -76 97 -189 53 200 224 39 36 153
7518 153 1 -118 -29 -272 -254 -24 219 51 22 201 -38 -98 91 23 -40 40 -34 225 85 -11 1 119 -64
7541 -64 -284 118 219 -274 63 303 -52 -158 -227 214 13 85 -166 179 45 139 265 163 -190 -182 -96 -99 -2
$$ packed form
7377GP2Q8j65R1k60J02J76r3K12n67K50N5K07r0k40J85n4K3N2j5j21j30K79O3
7401A27k49R0k02M19K65n66J61l28L4L14j27M8j80R2j0m3L33j49j38K78o2N7j30
7424C4K09k89j77M0K32mK5o9j15OJ60J36J11m22l9J75k6j0KJ78k69J31k16Q7L29
7449B19k97K99m6k47J71j97K46Nk08K66r5J19l45J83j46J11n9J96r4Q7j83L03
7471B88k07k47K48j49n5N6M9K31K8L3l60q0K53j51j68K71K44j59j62J80j11J40
7493A72l9q1mk33K12n5mk5P9q7o3K18p1o7K40j14j54J73k86K42J47K4j85lJ17
7518A53j52j19Q9k43J8K30K43j68k9J79k39o0J89o8o3Q0p4K59j40r6J2J18j83
7541f4k20M02J01m93L37K40l55j06o9M41k01P2k51L45j34R4J26j02l53QQ6lR7
$$ plain form
7564 -2 -109 95 43 63 -209 -182 97 118 -175 20 -267 -114 -93 129 -104 58 -55 -97 275 222 -246 -155 292
7587 292 260 -52 190 37 127 -6 -140 -60 187 -116 -118 -149 -87 -417 -23 267 -271 -140 -56 1 -98 114 97 -228
7611 -228 9 204 193 -98 -57 70 -31 148 -30 173 58 101 28 -145 27 169 -438 -205 -248 -51 -154 24
7633 24 92 74 -320 145 -78 -129 -9 62 111 -81 185 78 -55 232 79 -10 59 -24 3 308 -300 9 -40 -80
7657 -80 52 -177 117 19 127 -229 -123 241 -234 -42 -49 -100 272 -103 -115 164 29 -45 -123 172 103 181 64
7680 64 40 163 -121 -188 314 -207 77 201 -111 -74 62 -156 -5 -438 60 -121 67 -31 378 335 82 298
7702 298 35 37 128 -202 -203 177 -92 63 144 -26 -199 236 24 98 -17 42 -259 75 -33 -64 138 120 -105
7725 -105 111 116 -59 185 17 17 -192 -258 -227 121 17 -1 91 96 41 461 -78 106 -266 50 141 -205 -157 29
$$ packed form
7564bj07K04n2K0k72K7K79K1k93J95k87J53K1K22k33J62j13m2L72n3m68R1M47
7587B92l2l12K42j53R0j33j34Q0K47l03kl1O2l30L94K90n38J31Q4N7r9K12j7l25
7611b28K37J95j1k91M1J27j01J79j78K03j15M3p3j73J72J42o07K33m3J97j03J78
7633B4O8j8l94M65k23n1J20P1M9j92K66j07j33K87j53q9O9q3K7L05o08L09m9m0
7657h0J32k29K94r8J08l56J06L64m75J92pn1L72l75j2K79j35p4p8K95o9P8j17
7680F4k4J23k84o7N02n21K84J24l12L7J36k18J51m33M98j81J88r8M09m3k53K16
7702B98k63KR1l30jL80k69J55Q1j70j73M35k12P4j15N9l01L34j08l1K02j8k25
7725a05K16Nj75K44j68%k09o6L1L48j04j8R2Nn5M20n39J84l72L16R1l46M8J86
$$ plain form
7749 29 60 -7 49 21 38 -97 -73 -126 125 14 174 302 208 -97 281 -293 -122 177 139 -123 -147 18 -55 -285
7773 -285 -25 83 -27 -96 -70 -210 -75 3 -3 109 -131 110 -238 -136 -60 -151 -6 73 -38 -167 -237 -89 -100
7796 -100 167 -64 -89 190 106 123 -123 223 202 -95 202 -314 -266 42 22 -269 173 164 51 169 273 -9 -48
7819 -48 -23 -113 171 193 79 11 -104 103 -15 58 -94 -44 -39 -188 -62 228 198 -163 48 -165 -356 199 214 -65
7843 -65 153 132 -14 31 -104 83 -65 -35 -212 -11 -90 -128 284 146 109 7 203 -45 23 -174 209 -259 -58
7866 -58 170 77 82 -66 -91 135 33 -175 84 61 77 298 212 -70 0 -42 -62 -69 -15 147 180 -145 232 58 -51
7891 -51 -18 -27 91 40 -25 -70 150 46 73 -71 -214 -116 63 140 290 -10 -116 144 141 -59 142 71 108 -64 -74
7916 -74 52 -60 164 -88 30 149 91 257 115 -10 250 -30 -275 -38 -55 -31 239 245 46 -44 298 -178
$$ packed form
7749B9L1o7N6k8J7j35K4n3K51j11J60J28r4l05L78n74J71K99l8k62k4J65p3k30
7773b85K60J08j10o9K6j40J35P8oJ12k40K41l48J02P6r1J45P9j11j29p0J48j1
7796a00K67k31k5K79q4J7k46L46k1k97K97n16M8L08k0k91M42rj13J18J04k82l9
7819d8K5r0K84K2j14o8j15K07j18P3j52N0Nj49J26K90l0l61K11k13j91N55J5k79
7843f5K18k1j46M5j35J87j48L0j77K01p9l8M12j38l7j02J96k48O8j97L83m68K01
7866e8K28r3Nj48k5K26j02k08K59k3J6K21q6k82P0m2k0pN4J62L3l25L77j74j09
7891e1L3rJ18n1o5m5K20j04K7j44j43R8J79P7J50l00j06K60lk00K01p1L7j72j0
7916g4J26j12K24k52J18J19n8J66j42j25K60k80k45K37j7K4K70Oj99r0L42m76
$$ plain form
7938 -178 27 -148 95 39 -26 -275 9 0 306 -135 -52 209 -164 16 -104 -93 -81 110 -60 -28 11 265 103
7961 103 149 -46 47 -27 -249 -237 -178 59 202 -92 -146 56 47 -132 335 43 -206 57 -133 -65 49 69 262
7984 262 -124 50 -49 -248 34 -2 196 -80 -2 -75 -324 -36 -188 -154 -163 187 169 -149 116 -30 119 26 -256
8007 -256 -141 -71 -78 134 -17 201 -146 39 -140 172 31 160 24 97 -198 -440 -55 40 -100 253 -10 247
8029 247 -52 -25 -20 102 -215 105 -41 -222 73 86 -28 -1 9 135 -30 58 51 173 181 23 142 68 86 194
8053 194 -102 -84 -225 -86 254 -206 9 101 -150 -43 159 -124 -12 -275 80 191 39 175 103 270 -67
8074 -67 66 -274 -117 128 11 -154 179 -314 -168 120 85 102 -318 95 50 -1 -113 120 282 2 158 -263
8096 -263 100 34 -251 -253 37 -13 148 211 -30 6 88 -14 -191 -20 102 244 156 15 -86 -104 33 61 71 -164
$$ packed form
7938a78K05j75K43n6o5k49K84rL06m41Q3K61l73J80j20J1J2J91j70L2L9K54j62
7961A03M6j95R3p4k22J2N9K37J43k94n4K02rj79M67k92k49K63j90O8J14K0J93
7984B62l86J74r9j99K82l6J98k76P8p3k49K88j52L4rL50j8l18K65j46J49r3k82
8007b56J15P0pK12j51K18l47J85j79L12j41J29j36P3k95k42L85R5j40L53k63K57
8029B47k99K7NJ22l17L20j46j81K95J3j14K7J0J26j65Q8pJ22Qj58J19p4J8J08
8053A94k96J8j41J39L40m60K15R2k51J07K02k83J12k63L55J11j52J36p2J67l37
8074f7J33l40J57K45j17j65L33m93J46K88l5J7m20M13m5n1j12K33J62k80J56m21
8096b63L63o6k85kK90n0J61O3k41L6Q2j02j77J71J22J42q8j41j01j8J37K8J0k35
$$ plain form
8120 -164 -61 27 49 23 35 54 -56 39 28 -300 135 117 -147 6 -270 104 -120 -51 -97 38 87 -203 -76 45
8144 45 -306 54 1 109 -216 -298 215 -71 139 52 -149 -56 -49 -268 -18 134 188 101 -132 46 47 86 -211 -83
8168 -83 -253 -22 -30 -232 44 -73 -47 34 121 -125 -168 -240 -91 -67 -3 59 245 240 -145 252 302 -85 -103
$$ packed form
8120a64J03Q8K2k6J2J9j10R5j1l28M35j8k64J53k76L74k24O9m6J35M9k90J27J21
8144D5l51L60n3J08l25q2N13k86K10q7k01R3Pk19K50J52N4q7k33J78JL9k97J28
8168h3j70K31qk02K76j17K6Q1Q7k46m3p2J49K4O4O2J86nl85L97N0l87j8
8191a03
$$ Imaginary data points
##PAGE= N=2
##DATA TABLE= (X++(I..I)), XYDATA
$$ plain form
0 0 0 0 0 0 0 0 0 0 8 0 8 -8 8 -16 16 -24 32 -39 46 -56 64 -80 88 -110 128 -150 169 -200 230 -264 302 -344
32 -344 391 -440 500 -562 631 -708 790 -883 982 -1091 1211 -1341 1485 -1640 1809 -1994
48 -1994 2199 -2423 2669 -2940 3242 -3577 3952 -4375 4856 -5409 6047 -6803 7706 -8815
62 -8815 10211 -12030 14504 -18097 23797 -34304 60202 -266993 -288755 10383 -363536 -307214
74 -307214 -91351 -86199 -136212 -59863 -71051 56307 94135 1836 54678 227803 162733 90717
86 90717 195872 222272 113754 163983 190752 95430 81307 106215 41826 50942 48506 -40479
98 -40479 -18552 12966 -98494 -102049 -33556 -108056 -151931 -67794 -80010 -123071 -60396 -45363
110 -45363 -96594 -58434 -10761 -42972 -31680 6253 -12427 15642 63042 17948 14864 94670
$$ packed form
0@%%%%%%%%QqQj6J6k4L2m0N6p1Q5j02J20j44J68j98K38k78L19l69M30m94N66o46
32c44P35q31R40j062J193j339J498j673J865k073K302k552K826l125L449l803
48a994M193m622N092n609O182o819P529q327R231j0265J1456j2850J4509j6521
62h815J9026k2241K6534l2601M1894n8101R4506l27195k1762K99138l73919N6322
74c07214K15863N152n0013P6349j1188J27358L7828r2299N2842J73125o5070p2016
86I0717J05155K6400j08518N0229K6769r5322j4123K4908o4389R116k436q8985
98d0479K1927L1518j11460l555O8493p4500m3875Q4137j2216m3061O2675J5033
110d5363n1231L8160M7673l2211J1292L7933j8680K8069M7400m5094l084P9806
$$ plain form
122 94670 70282 4591 53154 92844 31129 -1791 55574 68936 5252 8586 55469 15370
134 15370 -24114 11476 4090 -34469 -29028 -17068 -7914 -19389 -43751 -18600 5143 -33790 -48000
147 -48000 -1861 -1657 -44795 -32117 18454 6123 -26389 6247 20489 419 14093 11387 -234
160 -234 20158 6593 -10974 33873 34506 -9418 14154 31246 448 6990 14607 -15664 -7149
173 -7149 21689 -11039 -20801 29586 7139 -43926 1078 24492 -26625 -17828 5055 -26120 -10739
186 -10739 14295 -15494 -10270 10325 -7179 -3385 5004 -11711 -1050 6707 -18764 -4149 29732
199 29732 8090 -17122 9248 21437 -6949 -6201 17411 -2060 -14732 14858 14699 -6624 3289
212 3289 9129 -1418 539 -1531 -1246 3788 -11719 -12382 8311 1862 -9569 1843 963 -10159
$$ packed form
122I4670k4388o5691M8563L9690o1715l2920N7365J3362o3684L334M6883m0099
134A5370l9484L5590p386l8559N441J1960R154j1475k4362K5151K3743l8933j4210
147d8000M6139K04m3138J2678N0571j2331l2512L2636J4242k0070J3674k706j1621
160b34K0392j3565j7567M4847O33m3924K3572J7092l0798O542P617l0271Q515
173g149K8838l2728r762N0387k2447n1065M5004K3414n1117Q797K2883l1175J5381
186a0739K5034k9789N224K0595j7504L794Q389j6715J0661P757k5471J4615L3881
199B9732k1642k5212K6370J2189k8386P48K3612j9471j2672K9590j59k1323R913
212C289N840j0547J957k070K85N034j5507o63K0693o449j1431J1412q80j1122
$$ plain form
226 -10159 -629 4371 -12237 -15087 2801 7909 -6098 -3885 12226 4905 -9832 674 13339
239 13339 -1254 -8887 6937 7038 -1543 6356 9232 -721 -1358 5369 5200 295 -6495 -4474 3402
254 3402 -2181 -4911 5524 2272 -10324 -912 8477 -9239 -11868 6652 -2138 -13205 7607 12577
268 12577 -8236 -4599 7310 76 -547 1886 -1651 2719 506 -2882 9328 7004 -10607 -210
282 -210 13923 -3551 -8642 6780 70 -11882 1173 8265 -3576 -1946 3858 -4213 -3983 4146
296 4146 -962 -6895 -2523 1074 3577 3160 -4391 -330 5640 -4603 -3326 8954 333 -10463 2996
311 2996 8373 -4015 -1386 6190 -836 -4960 3092 4872 -3679 -5249 266 1190 -334 1071 3059
326 3059 -911 -4168 -47 4206 -1582 -6810 2162 3980 -4273 990 7025 -2745 -6574 3612 5802
$$ packed form
226a0159R530N000j6608k850J7888N108j4007K213J6111p321j4737J0506J2665
239A3339j4593p633J5824J01q581P899K876r953o37O727j69m905o790K021P876
254C402n583k730J0435l252j2596R412R389j7716k629J8520q790j1067K0812M970
268A2577k0813L637J1909p234o23K433l537M370k213l388J2210k324j7611J0397
282b10J4133j7474n091J5422o710j1952J3055P092j1841J630N804q071K30Q129
296D146n108n933M372L597K503m17p551M061N970j0243J277J2280q621j0796J3459
311B996N377j2388K629P576p026m124Q052J780q551j570N515R24j524J405J988
326C059l970l257M121M253n788n228Q972J818q253N263O035r770l829J0186K190
$$ plain form
341 5802 -2792 -3601 2379 1340 -5245 182 7735 -1027 -6323 2924 4142 -2481 -1989 1370 -1997 -2565
357 -2565 2110 4754 496 -5023 114 4383 -2423 -2836 3640 -106 -5010 2005 5407 -1920 -3107
372 -3107 1840 1130 -3156 1814 5082 -3752 -5558 2962 3636 -1454 -1249 1240 912 -937 -1777 2521
388 2521 990 -6300 140 5673 -1033 -1205 3193 -1519 -3750 2669 2380 -2089 -1756 1424 1115 -2012
404 -2012 1002 3456 -3661 -3570 3708 3199 -2467 -3383 817 2387 -1759 -2157 4443 702 -5201 1255
420 1255 2898 -1594 -1487 225 -95 -820 1930 2917 -1889 -3858 1307 2227 -1175 -446 -152 17 486
437 486 -1366 2598 1202 -4169 1098 2624 -1589 628 605 -4004 -561 2299 1475 853 -2826 -63
453 -63 2204 -3640 1352 4048 -4915 -2696 4954 1280 -1451 -381 315 -50 -2430 607 5761 -2294
$$ packed form
341E802q594q09N980j039o585N427P553q762n296R247J218o623M92L359l367n68
357b565M675K644m258n519N137M269o806m13O476l746m904P015L402p327j187
372c107M947p10m286M970L268q834j806Q520O74n090K05K489l28j849q40M298
388B521j531p290O440N533o706j72M398m712k231O419k89m469L33L180l09l127
404b012L014K454p117R1P278n09n666r16M200J570m146l98O600l741n903O456
420A255J643m492J07J712l20p25K750R87m806j969N165R20l402P29K94J69M69
437D86j852L964j396n371N267J526m213K217k3m609L443K860q24o22l679K763
453f3K267n844M992K696q963K219P650l674k731J070O96l65k380L037N154q055
$$ plain form
469 -2294 -5352 2529 2363 -65 -414 239 214 -1517 -186 2608 -483 -2215 -7 -843 943 3140 -147
486 -147 -969 -2101 -1224 3991 -18 -2730 1248 -211 281 1356 -823 1763 642 -4761 2709 2705 -4170
503 -4170 3726 -588 -6627 5347 3081 -3890 714 -833 412 2336 -5017 437 4923 -5697 1072
518 1072 4727 -5517 2091 3455 -5711 1237 2058 -1748 1937 -1407 -18 5310 -3166 -2132 4764
533 4764 -2983 721 3971 -5679 -1533 3683 -281 25 -1528 -606 3583 -1273 -3215 1698 300 -1069
549 -1069 -2041 -2202 5819 2911 -5270 -1795 876 1837 1409 -3107 -573 1695 -486 1609 -253 -1740
565 -1740 5830 -1938 -8264 5654 5028 -3650 -1756 -3060 1839 5327 -3894 -888 2745 -3221 1009
580 1009 701 -4197 5272 640 -7683 3566 3411 -373 2409 -5285 -2052 6100 -1588 -1370 2155 -3652
$$ packed form
469b294l058P881j66k428l49O53k5j731J331K794l091j732K208q36J786K197l287
486a47q22j132Q77N215m009k712L978j459M92J075k179K586j121n403P470mo875
503d170P896m314o039J1974k266o971M604j547J245J924p353N454M486j0620O769
518A072L655j0244P608J364r166O948Q21l806L685l344J389N328q476J034O896
533D764p747L704L250r650M146N216l964L06j553R22M189m856j942M913j398j369
549a069r72j61Q021k908q181L475K671R61m28m516K534K268k181K095j862j487
565a740P570p768o326J3918o26q678J894j304M899L488r221L006L633n966M230
580A009l08m898R469m632q323J1249j55l784K782p694L233Q152p688K18L525n807
$$ plain form
596 -3652 1273 2743 -3858 2739 2800 -3973 -126 315 -52 2815 -1720 -2495 1369 1740 2049 -550 -2828
613 -2828 906 66 -1594 1821 -1088 -497 2810 -1627 -724 1586 209 1244 -2885 -2624 4628 826
629 826 -3512 1178 -383 1093 3093 -4363 -641 5242 -2375 -2184 -422 -1149 4351 -491 -4933 4208
645 4208 2110 -4824 636 18 -144 2200 -4029 -270 4987 -2210 -298 1763 -3262 1209 2245 -2535
661 -2535 971 131 -2560 2655 382 -1230 2905 -859 -2461 908 159 610 -548 -2647 772 1735
677 1735 588 630 -746 -800 285 -1181 440 1329 -1348 129 286 378 1691 145 -968 -624 -919 1346
695 1346 1307 -2142 -236 1029 -1092 1604 853 -1123 1183 -1435 -1778 2051 -154 -1307 1002 -311
711 -311 203 2082 -536 -912 -19 -1260 792 933 -919 342 271 -320 1034 61 39 147 -1362 -673
$$ packed form
596c652M925J470o601O597O1o773L847M41l67K867m535p75L864L71L09k599k278
613b828L734q40j660L415k909N91L307m437R03K310j377J035m129K61P252l802
629H26m338M690j561J476K000p456L722N883p617J91J762p27N500m842m442R141
645D208k098o934N460o18j62K344o229L759N257p197J912K061n025M471J036m780
661b535L506q40k691N215k273j612M135l764j602L369p49M51j158k099L419R63
677A735j147M2j376n4J085j466J621Q89k677J477J57R2J313j546j113L44k95K265
695A346l9l449J906J265k121K696p51j976K306k618l43L829k205j153K309j313
711c11N14J879k618l76Q93j241K052J41j852J261p1n91J354r73k2J08j509O89
$$ plain form
729 -673 1336 -322 -616 423 -332 1181 584 -367 -210 -393 -435 -96 -282 180 252 40 388 517 -38 323
749 323 -768 -692 1358 104 -505 -71 -478 695 805 -244 537 -214 -1036 157 88 -515 426 -405 -223
768 -223 1548 -147 81 355 -1311 -269 806 18 -483 36 -1 714 727 -421 -143 -181 -661 73 -22 373
788 373 -48 -468 364 629 368 -70 -50 -858 38 336 -675 -244 96 -183 459 455 39 -392 -140 -810 -24
809 -24 757 -197 67 -114 -239 434 315 24 -487 101 271 -115 -22 -300 84 -69 363 714 -217 -139 -467
830 -467 -322 -172 120 107 -165 140 178 280 480 -547 -233 -196 -1 479 -81 -34 -97 187 117 347 -178 -22
852 -22 119 -214 -8 305 -409 -128 -306 158 623 338 -243 -507 14 -165 100 141 -123 104 173 613 210
873 210 -8 122 -271 -79 694 -42 -126 99 89 -232 760 -79 -425 47 -970 -314 782 -348 -216 251
$$ packed form
729f73K009j658k94J039p55J513n97r51J57j83m2L39j86M62P2k12L48J29n55L61
749C23j091P6K050j254o09M34m07J173J10j049P81p51q22J193o9o03R41q31J82
768b23J771j695K28K74j666J042J075p88n01N19l7P15J3j148K78l8m80P34r5L95
788C73m21m20Q32K65k61m38K0q08Q96K98j011M31L40k79O42mm16m31K52o70P86
809b4P81r54K64j81j25O73j19k91n11N88J70l86R3k78L84j53M32L51r31P8l28
830d67J45J50K92j3k72L05L8J02K00j027L14L7J95M80n60M7o3K84p0K30n25J56
852b2J41l33K06L13p14K81j78M64M65k85n81k64N21j79K65M1k64K27O9M40m03
873B10k18J30l93J92P73p36q4K25j0l21R92q39l46M72j017O56J096j130J32M67
$$ plain form
893 251 -93 103 495 -310 -248 -442 -420 294 -24 -52 569 -568 86 536 -292 -210 36 -266 167 555 -384
914 -384 218 -176 -364 707 9 -426 235 -37 -337 158 398 -358 -355 121 736 -12 -241 -16 -94 236 190
935 190 -328 569 453 -557 413 22 -222 99 -666 -134 717 -61 -81 296 -1017 721 1302 -1434 493
954 493 189 -1156 987 -39 -758 951 -787 -439 1582 -916 -126 1157 -2217 -100 1670 -849
970 -849 321 -26 -1671 1433 566 -1303 851 -20 -1037 1069 -484 -348 1686 -1391 -556 1135 -194
987 -194 560 35 -1410 400 170 10 500 -822 -120 546 -869 229 436 -751 971 -626 -1388 2145
1005 2145 138 -1777 383 -632 642 1379 -1700 388 1154 -1491 700 221 -1263 2122 -585 -1798
1021 -1798 1847 -288 -240 1183 -2313 45 2782 -2273 -61 1812 -1893 1132 474 -2391 2314 1008
$$ packed form
893B51l44J96L92q05O2j94K2P14l18k8O21j137O54M50q28Q2K46l02M33L88r39
914c84O02l94j88J071o98m35O61k72l00M95K40p56LM76O15p48k29K25p8L30m6
935A90n18Q97j16j010R70l91k44L21p65N32Q51p78k0L77j313J738N81k736J927
954D93l04j345K143j026p19J709j738L48K021k498P90J283l374K117J770k519
970h49J170l47j645L104q67j869K154q71j017K106j553J36K034l077Q35J691j329
987a94P54n25j445J810k30j60M90j322P02O66j415J098K07j187J722j597p62L533
1005B145k007j915K160j015J274P37l079K088P66k645K191m79j484L385k707j213
1021a798L645k135M8J423l496K358K737n055K212J873l705L025o58k865M705j306
$$ plain form
1037 1008 -2013 1080 -602 -213 2462 -1515 -1562 2316 -165 -520 369 -861 1339 65 -2461 1007
1053 1007 861 -187 340 -1682 -352 2056 -350 -491 327 -389 1139 -285 -1323 1443 200 -1409
1069 -1409 -303 -589 1944 1496 -2385 -434 889 -116 1878 -882 -2080 2451 -238 -1834 1571
1084 1571 -475 252 629 -3175 1194 2959 -2014 -487 218 -1402 2662 362 -2909 1758 476 -1677
1100 -1677 1508 -1212 190 2064 -2499 -1219 1916 -307 344 -280 -1875 1848 1186 -1966 686 -172
1116 -172 -336 788 -1719 -313 2052 -714 -989 -175 -45 1740 -114 -1946 449 1061 83 174 -972
1133 -972 710 1160 -1394 -335 329 261 1303 -1460 -1049 1886 456 -786 437 -1020 919 1006 -2495
1150 -2495 569 1779 -1247 465 -163 -949 1897 -73 -2006 777 736 -187 867 -1430 -33 1771
$$ packed form
1037A008l021L093j682L89K675l977m7L878k481l55Q89j230K200j274k526L468
1053A007j46j048N27k022J330K408k406j41Q18p16J528j424j038K766j243j609
1069a409J106k86K533m48l881J951J323j005J994k760j198M531k689j596L405
1084A571k046P27L77l804M369J765m973J527P05j620M064k300l271M667j282k153
1100a677L185k720J402J874m563J280L135k223O51o24j595L723o62l152K652q58
1116a72j64J124k507J406K365k766k75Q14J30J785j854j832K395O12r78R1j146
1133i72J682M50k554J059O64o8J042k763M11K935j430j242J223j457J939Q7l501
1150b495L064J210l026J712o28p86K846j970j933K783m1r23J054k297J397J804
$$ plain form
1166 1771 -1155 -237 910 -385 430 -756 -1278 1147 557 -911 -15 -482 90 1387 -1059 -552 678
1183 678 -122 55 -148 -75 1026 -361 -921 171 547 418 -187 -1258 -116 543 -197 500 -551 -287
1201 -287 1263 -403 -211 999 -603 -57 201 -710 731 874 -1295 279 365 -433 373 -225 -1308 875
1219 875 -75 -40 559 -445 226 194 -1093 264 681 -394 138 73 -394 1016 -90 -607 386 -125 -112
1238 -112 292 -438 175 549 -281 -212 359 72 217 29 -503 519 38 -393 65 -235 265 147 -235 56
1258 56 -69 -176 71 -558 -355 423 -166 1 73 -240 106 299 -456 280 -69 -6 160 -145 39 209 -134
1279 -134 -86 180 -103 -14 89 -438 -132 190 -15 217 -33 94 75 52 96 224 390 -304 3 89 -5 28 11
1302 11 206 103 11 -36 -178 -55 -414 -20 -33 10 320 124 -90 -257 384 -330 -178 143 -488 121 271 110
$$ packed form
1166A771k926R18J147j295Q15j186n22K425n90j468Q96m67N72J297k446N07J230
1183F78q00J77k03P3J101j387n60J092L76j29o05j071J142O59p40O97j051K64
1201b87J550j666J92J210j602N46K58r11J441J43k169J574Q6p98Q06n98j083K183
1219H75r50L5N99j004O71l2j287J357M17j075N32o5m67J410j106n17R93n11J3
1238a12M04p30O13L74q30O9N71k87J45j88n32J022m81m31M58l00N00j18l82K91
1258E6j25j07K47o29K03P78n89J67P2l13L46J93p55P36l49O3J66l05J84J70l43
1279a34M8K66k83Q9J03n27L06L22k05K32k50J27j9k3M4J28J66o94L07Q6r4L3j7
1302A1J95j03r2m7j42J23l59L94j3M3L10j96k14j67O41p14J52L21o31O09J50j61
$$ plain form
1324 110 -17 -136 -215 -99 109 -119 154 -107 -549 64 77 -63 -28 -259 23 166 -189 22 -2 -41 21 276
1346 276 79 25 -189 -371 96 28 176 109 -21 -91 10 224 182 -79 -84 98 71 -125 150 14 -111 201 69
1369 69 117 -8 -39 -80 -386 231 -55 166 -45 -21 -62 156 171 -35 -178 -94 -141 -128 -449 -78 133 -324 -17
1392 -17 49 -59 247 95 -120 42 216 -5 98 92 -254 224 145 -38 146 -155 -239 210 -157 -234 177 -154
1414 -154 -236 554 -296 -178 333 -176 110 322 -188 138 -98 -227 145 77 -488 221 1 -113 159 -160 81
1435 81 60 -124 92 2 175 137 128 418 23 69 -273 149 -353 252 17 -589 41 -250 -332 722 -538 -152
1457 -152 491 15 52 189 -428 -55 456 -830 380 152 -757 301 -96 -474 840 -18 -668 621 -200
1476 -200 -104 815 -615 -81 727 -697 211 531 -557 262 -75 -1341 756 37 -549 190 -213 -321 535
$$ packed form
1324A10j27j19p9J16K08k28K73k61m42O13J3j40L5k31K82J43l55K11k4l9O2K55
1346B76j97n4k14j82M67o8J48o7j30p0J01K14m2k61nJ82k7j96K75j36j25L12j32
1369F9M8j25l1m1l06O17k86K21k11K4m1K18J5k06j43Q4m7J3l21L71K11m57L07
1392a7O6j08L06j52k15J62J74k21J03ol46M78p9j83J84l01q4M49l67p7M11l31
1414a54q2P90q50J18N11n09K86K12n10L26k36j29L72o8n65P09k20j14K72l19K41
1435H1k1j84K16r0J73l8rK90l95M6l42M22n02O05k35o06O30k91q2J054j260L86
1457a52O43m76L7J37o17L73N11j286J210k28r09J058l97l78J314q58o50J289q21
1476b00R6R19j430N34Q08j424R08L20j088Q19l37j266K097p19n86P39m03j08Q56
$$ plain form
1495 535 -384 -56 421 -471 204 229 -557 190 -23 -795 275 137 122 238 -578 86 646 -678 542 29
1515 29 -343 615 -195 -375 677 -325 -59 42 -869 573 479 -912 214 317 -419 772 66 -695 1242
1534 1242 -462 -574 869 -532 80 653 -1340 156 1104 -735 256 101 -972 1258 206 -1106
1550 -1106 1114 -241 -654 615 -767 326 1052 -891 -571 294 -275 1050 -66 -1233 640 105
1566 105 -931 98 -181 178 327 -732 97 254 -315 258 -591 -714 1304 228 -898 318 -242 411
1584 411 46 -1031 723 724 -837 75 -19 -189 820 -404 -952 791 -33 -20 224 -942 628 1109 -1466
1603 -1466 340 911 -61 152 -488 -317 1333 -155 -1188 738 169 32 910 -1082 -209 1122 -398
1620 -398 -150 243 14 778 -487 -1151 1032 302 -365 -59 -515 194 546 -511 23 200 6 638 -394
$$ packed form
1495E35r19L28M77q92O75K5p86P47k13p72J070j38j5J16q16O64N60j324J220n13
1515B9l72R58q10j80J052j002K66J01r11J442r4j391J126J03p36J191p06p61J937
1534A242j704j12J443j401O12N73j993J496R48j839R91j55j073K230j052j312
1550a106K220j355m13J269j382J093P26j943L20Q65n69J325j116j167J873n35
1566A05j036J029k79L59J49j059Q29J57n69N73q49j23K018j076j126J216n60O53
1584D11l65j077J754Jj561R12r4j70J009j224n48J743q24J3K44j166J570M81k575
1603a466J806N71r72K13o40J71J650j488j033J926n69j37Q78j992Q73J331j520
1620c98K48L93k29P64j265o64K183p30o67L06m56P09L52j057N34J77j94O32j032
$$ plain form
1639 -394 -318 827 28 -687 -249 276 897 -11 -1110 358 558 -328 317 -172 130 943 -573 -471 568
1658 568 265 279 8 -1267 730 957 -1130 -98 362 -265 664 -207 -446 922 -194 -497 45 -382
1676 -382 560 763 -906 -478 1023 25 -234 -353 -41 872 -514 -306 579 234 -217 -244 -408 -97 243
1695 243 -91 138 -455 126 523 -563 -469 669 110 -194 -109 79 516 -81 -397 608 -421 -324 672 -585
1715 -585 -512 494 -63 -188 80 -193 612 -102 -786 1009 35 -564 169 -161 -457 392 -93 -32 -33 -217 609
1736 609 300 -495 220 342 -366 83 331 -103 82 -169 -67 374 -412 86 491 -514 41 279 -193 -250
1756 -250 145 7 -158 -280 180 220 -365 -49 255 -84 -338 240 -257 -42 -496 -29 344 -371 -112 416
1776 416 -84 -184 420 150 -409 -143 -298 382 -179 -391 657 -172 -213 222 41 -336 33 166 -180 -475
$$ packed form
1639c94P6J145p99p15M38N25O21r08j099J468K00q86O45m89L02Q13j516J02J039
1658E68l03J4k71j275J997K27k087J032M60o27R29q71k39J368j116l03N42m27
1676c82R42K03j669M28J501r98k59j19L12R13j386K08Q85l45m51k7j64L11L40
1695B43l34K29n93N81L97j086R4J138n59l04Q5J88M37n97l16J005j029R7R96j257
1715e85P3J006n57j25K68k73Q05p14o84J795r74n99P33l30k96Q49m85O1jj84Q26
1736F09l09p95P15J22p08M49K48m34J85k51J02M41p86M98M05j005N55K38m72n7
1756b50L95j38j65j22M60M0n85L16L04l39k54N78m97K15m54M67L73p15K59N28
1776D16n00j00O04k70n59K66j55O80n61k12J048q29m1M35j81l77L69J33l46k95
$$ plain form
1796 -475 -137 47 13 -638 178 254 -376 23 359 -116 20 360 162 -23 -226 101 52 -457 -141 699 -195
1817 -195 -390 42 262 42 -190 70 153 -451 -78 465 -324 -337 71 74 -53 -18 309 183 -190 -103 536 -353
1839 -353 -33 361 201 -31 83 356 270 -16 66 480 -193 -224 445 77 -331 30 467 9 -196 277 291
1860 291 -69 -118 481 123 -257 298 318 -304 -118 203 206 -249 88 287 -83 -518 -33 406 -228 -270 79 248
1882 248 -57 199 245 -104 -320 165 119 -185 -313 229 441 -504 -99 194 -302 -240 401 304 -358 81 491
1903 491 45 -612 -296 207 -177 -144 25 440 -194 -138 499 105 -278 2 63 -60 -33 244 97 -234 -68
1924 -68 406 53 -470 104 322 -304 90 123 128 -303 -185 482 8 -478 335 161 -307 -58 305 -63 -462
1945 -462 89 364 299 -397 525 338 -448 -87 200 61 -281 -135 195 -324 -3 193 273 -166 22 255 -205
$$ packed form
1796d75L38J84l4o51Q16P6o30L99L36m75J36L40j98j85k03L27m9n09L16Q40q94
1817a95j95M32K20k20k32K60Q3o04L73N43p89j3M08Lj27L5L27j26l73Q7O39q89
1839c53L20L94j60k32J14K73q6k86Q2M14o73l1O69l68m08L61M37m58k05M73J4
1860B91l60m9N99l58l80N55K0o22J86L21Lm55L37J99l70m35M85M39o34m2L49J69
1882B48l05K56M6l49k16M85m6l04j28N42K12r45M05K93m96O2O41r7o62M39M10
1903D91m46o57L16N03l84L3J69M15o34N6O37l94l83K80O1j23K7K77j47l31J66
1924f8M74l53n23N74K18o26L94L3Nm31J18O67m74m86Q13j74m68K49L63l68l99
1945d62N51K75o5o96R22j87p86L61K87j39l42J46L30n19L21J96Q0m39J88K33m60
$$ plain form
1966 -205 -269 -41 479 -186 -200 377 207 -425 228 557 -253 -404 450 126 20 -135 35 276 -120 30 651
1987 651 -96 -271 374 52 -84 219 -138 -129 -126 -127 370 246 -552 681 224 -641 676 296 -375 -398 -165 269
2009 269 164 -298 277 169 -454 485 155 -386 -25 206 293 -120 -666 561 287 -476 53 279 -163 86
2029 86 -176 -311 85 -489 207 392 -481 182 257 -436 -156 537 -311 -273 28 -300 358 -462 -253 668 -563
2050 -563 -316 644 -455 -214 362 114 -129 47 392 508 -465 -515 987 204 -390 142 80 -106 425 -372
2070 -372 267 74 -500 423 -43 -680 527 527 -759 -30 382 115 -312 -262 473 122 -797 418 304 36
2090 36 203 -106 -76 291 275 45 -545 -591 413 669 -857 -79 207 -195 -88 -433 -21 672 -581 -139
2110 -139 375 -89 275 302 -676 174 804 -244 -394 -536 75 718 -665 -374 933 138 -271 -43 -137 290
$$ packed form
1966b05o4K28N20o65j4N77j70o32O53L29q10j51Q54l24j06j55J70K41l96J50O21
1987F51p47j75O45l22j36L03l57RLjM97j24p98J233m57q65J317l80o71k3K33M34
2009B69j05m62N75j08o23R39l30n41L61K31Q7m13n46J227k74p63N29K26m42K49
2029H6k62j35L96n74O96J85q73O63P5o93K80O93q48L8L01l28O58q20K09R21j231
2050e63K47R60j099K41N76k48k43J76L45J16r73n0J502p83n94N32o2j86N31p97
2070c72O39j93n74R23m66o37J207%j286P29M12k67m27N0P35l51r19J215j14k68
2090C6J67l09L0L67j6k30n90m6J004K56j526P78K86m02J07l45M12O93j253M42
2110a39N14m64L64K7r78Q50O30j048j50j42O11O43j383K91J307p95m09K28r4M27
$$ plain form
2130 290 380 -616 -155 120 -297 739 -567 -505 473 302 -371 -457 361 279 -128 -347 397 233 -227 22 -234
2151 -234 -9 539 -72 46 343 119 283 -298 -473 548 272 -636 141 264 61 146 -572 24 209 249
2171 249 182 46 -470 354 348 -810 54 150 -338 -107 -348 -67 794 -428 -72 51 -310 177 624 -240 187
2192 187 420 -282 89 -469 104 465 -285 -281 483 43 9 -104 91 40 -26 -397 140 -15 -89 195 -191 -97
2214 -97 448 8 -167 -163 -106 351 -200 -259 260 -251 -284 228 263 63 256 -181 -126 173 -259 395 -42 -506 421
2237 421 293 -646 118 102 -85 126 -77 237 330 -182 63 363 -277 304 -42 -391 -211 24 -109 231 -196
2258 -196 159 472 -333 -82 162 29 -127 -115 -66 253 -115 222 5 -423 -37 290 -276 -103 382 -52 -34
2279 -34 -217 114 204 -134 -269 55 -167 -147 -32 -62 -29 -174 -38 -16 -52 -222 275 -148 -222 245 -11 -451 104
$$ packed form
2130B90R0r96M61K75m17J036j306O2R78j71o73q6Q18q2m07k19P44j64m60K49k56
2151b34K25N48o11J18K97k24J64n81j75J021k76r08P77J23k03Q5p18N96J85M0
2171B49o7j36n16Q24oj158Q64R6m88K31k41K81Q61j222L56J23l61M87M47q64M27
2192A87K33p02L71n58N73L61p50MP64m40l4j13J95n1o6l71N37j55p4K84l86R4
2214i7N45m40j75MN7M57n51n9N19n11l3N12L5k00J93m37N5K99m32O54m37m64R27
2237D21j28r39P64j6j87K11k03L14R3n12K45L00o40N81l46l49J80K35j33L40m27
2258a96L55L13q05K51K44j33j56J2M9L19l68L37k17m28L86L27n66J73M85m34J8
2279c4j83L31R0l38j35L24k22K0J15l0L3j45J36K2l6j70M97m23p4M67k56m40N55
$$ plain form
2302 104 188 -139 233 -181 286 21 -170 307 294 -435 -253 280 -275 -209 104 -33 -74 -271 191 28 -156
2323 -156 -85 79 -222 -158 101 -11 39 144 239 6 112 77 348 76 27 193 170 -132 31 -124 151 -310
2345 -310 -42 115 -53 -56 91 -132 -22 118 121 -59 -184 -32 57 -21 -214 13 16 -328 252 -157 -111 -178 162
2368 162 140 -95 -264 248 -133 -173 262 38 -165 101 -77 -34 -201 -299 277 93 160 375 305 -256 67 156
2390 156 -245 -116 -270 -72 -343 -108 -15 -1 44 51 135 -165 -78 -92 188 4 -16 -92 -167 5 14 17 98 -26 143
2415 143 -168 117 184 164 162 -3 -52 184 -57 -247 -44 48 74 16 171 -119 -23 80 28 66 -147 121 -50 -13
2439 -13 90 63 -149 137 -101 -28 -176 207 -5 70 -181 12 -72 141 -14 52 47 34 11 -146 75 -316 -119
2462 -119 19 -335 20 138 -263 -42 -92 -111 -203 -61 11 -40 -12 38 23 197 -49 127 -116 0 -131 103 158
$$ packed form
2302A04Q4l27L72m14M67k65j91M77j3p29J82N33n55O6L13j37m1j97M62j63j84
2323a56P1J64l01O4K59j12N0J05R5k33J06l5K71k72m9J66k3l02J63j55K75m61
2345c10K68J57j68lJ47k23J10J40Lj80j25J52Q9p8j93K27Ll44N80m09M6o7L40
2368A62k2k35j69N12l81m0M35k24k03K66j78M3j67r8N76j84O7K15p0n61L23Q9
2390A56m01J29j54J98k71K35R3J4M5PQ4l00Q7j4K80j84k0p6p5J72RLQ1j24J69
2415A43l11K85O7k0kj65m9K36k41j90K03R2K6n8J55k90R6J03n2L8k13K68j71L7
2439a3J03k7k12K86k38P3j48L83k12P5k51J93q4K13j55O6nj3k3j57K21l91J97
2462a19J38l54L55J18m01K21n0j9r2J42P2n1K8N0j5J74k46J76k43J16j31K34N5
$$ plain form
2485 158 103 216 -17 36 195 74 -25 62 106 14 163 100 215 384 -30 -75 104 -225 238 47 9 -32 -81 -439
2509 -439 82 75 -242 436 -255 -462 -104 -70 40 247 14 185 -78 -292 -62 117 190 -48 -168 -57 178
2530 178 -119 -114 142 -164 28 -117 -256 -75 25 -71 -67 -145 28 155 -396 87 -173 -113 138 -198 -183 108 -24
2553 -24 -213 147 -189 -52 114 -77 -84 273 -157 -204 293 -239 333 235 -417 24 -12 -114 -254 -218 160 33
2575 33 -104 -221 299 8 186 -149 -153 194 246 9 -51 241 -121 73 44 -198 268 -63 -124 -15 -40 55 41
2598 41 -107 -80 -14 -28 -10 -135 58 166 -278 -404 80 -140 -46 -119 -152 157 -168 -134 -33 -155 -12 539 -283
2621 -283 -23 60 -76 138 -105 67 311 209 -595 163 307 -114 95 -111 49 577 74 -475 -313 33
2641 33 393 -12 -384 230 50 -290 -142 -287 363 381 -290 -19 -15 88 145 -325 -177 299 -1 -266 -1 94
$$ packed form
2485A58n5J13k33N3J59j21r9Q7M4r2J49o3J15J69m14m5J79l29M63j91l8m1m9l58
2509d39N21pl17O78o91k07L58L4J10K07k33J71k63k14K30J79P3k38j20J11K35
2530A78k97NK56l06J92j45j39J81J00r6Mp8J73J27n51M83k60O0K51l36J5K91j32
2553b4j89L60l36J37J66j91pL57m30m7M97n32N72r8o52M41l6j02j40L6L78j27
2575C3j37j17N20k91J78l35mL47N2k37o0K92l62J94k9k42M66l31o1J09k5R5j4
2598D1j48K7O6j4J8j25J93J08m44j26M84k20R4p3l3L09l25L4J01j22J43N51q22
2621b83K60Q3j36K14k43J72K44j02q04P58J44m21K09k06J60N28n03n49J62L46
2641C3L60m05l72O14j80l40J48j45O50J8o71K71MJ03N7m70J48M76l00k65K65R5
$$ plain form
2663 94 99 115 -364 125 307 -414 -63 -110 -222 -64 -350 -236 -40 -26 -252 39 -317 251 355 -261 -171 57
2685 57 104 -89 -126 -195 331 -61 -211 21 -175 -12 416 74 -161 345 -18 -11 159 -103 112 -269 -190 15
2707 15 17 -160 -63 -365 81 40 36 -42 -57 -164 276 -69 -237 220 -42 -286 -32 -164 35 -108 -221 41 102
2730 102 -95 29 45 -161 314 -162 -228 102 -434 27 69 -91 249 94 -135 -122 -1 180 245 -16 -209 145
2752 145 -34 -65 -30 93 321 319 -95 -105 250 -169 156 -90 26 362 -142 -188 122 -106 -243 38 -141 125
2774 125 29 21 38 -108 -91 142 344 -243 -107 -42 17 312 10 -78 179 -271 -181 88 88 182 -51 -296 -32 -106
2798 -106 -312 11 -269 82 -89 137 -32 121 65 -76 185 259 146 -380 -152 153 175 -251 -158 190 -149
2819 -149 -68 -5 -37 46 -98 30 154 -129 99 -161 32 -86 47 49 -69 -296 -178 -188 120 286 47 -50 -66
$$ packed form
2663I4NJ6m79M89J82p21L51m7j12J58k86J14J96J4k26K91l56N68J04o16R0K28
2685E7M7j93l7o9N26l92j50K32j96J63M28l42k35N06l63PJ70k62K15l81P9K05
2707A5Kj77R7l02M46m1mp8j5j07M40l45j68M57k62k44K54j32J99j43j13K62O1
2730A02j97J24J6k06M75m76o6L30n36M61M2j60L40j55k29J3J21J81O5k61j93L54
2752A45j79l1L5J23K28km14j0L55m19L25k46J16L36n04m6L10k28j37K81j79K66
2774A25r6qJ7j46J7K33K02n87J36O5N9K95l02q8K57m50R0K69%R4k33k45K64p4
2798a06k06L23k80L51j71K26j69J53n6j41K61P4j13n26K28L05K2m26R3L48l39
2819a49Q1O3l2Q3j44J28J24k83K28k60J93j18J33Kj18k27J18j0L08J66k39r7j6
$$ plain form
2842 -66 5 90 -153 50 -6 -187 41 90 -301 48 246 22 172 -190 167 -61 -48 29 34 142 39 -160 -183
2865 -183 92 -93 -71 183 116 -22 -482 -98 -149 -52 -60 -31 -273 76 -89 166 -96 27 238 390 187 -189
2887 -189 311 -25 -36 -141 -231 -251 -76 88 178 90 -87 -156 21 -147 237 115 -126 -138 47 -97 1 -380 -93
2910 -93 73 -133 -38 19 -232 -89 -128 -60 -39 -25 20 60 152 -142 79 -14 -211 -25 -253 -19 -77 63 -38 72
2934 72 160 -269 -186 204 122 36 110 -47 -193 109 138 -42 -95 -54 24 102 -87 275 89 -166 -105 -179 -341 67
2958 67 -115 179 -112 36 251 -125 136 -37 209 63 33 7 39 -226 98 94 346 194 102 76 76 160 -119 -335
2982 -335 41 -98 90 291 -1 204 254 -43 23 55 123 203 24 145 12 -147 -198 369 255 -37 211 106
3004 106 -90 -2 243 214 78 -71 114 82 -138 12 -34 199 149 92 -99 140 234 6 -124 90 -238 316
$$ packed form
2842f6P1Q5k43K03n6j81K28M9l91L49J98k24J50l62L57k28J3P7NJ08j03j99k3
2865a83K75j85K2K54o7j38m60L84n1R7qK9k42L49j65K55k62J23K11J52k03l76
2887a89N00l36j1j05r0k0J75J64R0q8j77o9J77j68L84j22k41j2J85j44R8l81K87
2910i3J66k06R5N7k51J43l9O8K1J4M5M0R2k94K21r3j97J86k28K34n8J40j01J10
2934G2Q8m29Q3L90q2q6P4j57j46L02K9j80n3M1P8P8j89L62j86k55O1p4j62M08
2958F7j82K94k91J48K15l76K61j73K46j46l0k6L2k65L24mK52j52r2k6%Q4k79k16
2982c35L76j39J88K01k92K05N0k97O6L2O8Q0j79J21j33j59n1N67j14k92K48j05
3004A06j96Q8K45k9j36j49J85l2k20J50m6K33n0n7j91K39R4k28j30K14l28N54
$$ plain form
3026 316 75 -168 138 17 -219 -210 -185 -22 127 84 53 -42 69 250 97 -157 -150 -146 3 6 -185 -195 -156 -239 -4
3051 -4 -121 -78 200 -358 -244 149 -24 -142 -122 138 7 38 186 -59 120 -64 -74 -29 213 -118 -181 -16 203
3074 203 -62 -63 -287 5 292 52 148 -8 -78 -102 -25 1 83 -124 -72 84 20 -37 187 -3 135 -73 212 181
3098 181 169 -61 313 110 166 291 -14 42 87 214 -100 138 -89 -103 -100 8 -64 -267 94 123 2 79 -132
3121 -132 -175 51 92 -82 126 -194 188 -180 -33 -32 -95 145 29 212 19 60 -15 -55 40 -3 -203 -72 480
3144 480 -303 148 187 28 198 -398 -101 107 -30 541 89 -84 276 -120 -161 76 -71 -308 27 -220 228
3165 228 119 -185 72 25 186 236 -41 -242 76 -6 -177 230 -39 195 25 -319 -3 206 63 -279 -256
3186 -256 -73 33 64 3 59 138 168 48 -56 -194 200 -4 123 94 31 -38 -74 15 235 1 -55 253 -122 298
$$ packed form
3026C16k41k43L06j21k36RK5J63J49m3l1r5J11J81j53k54PMJ49Lj91j0L9q3K35
3051dj17M3K78n58J14L93j73j18K0K60j31L1J48k45J79j84j0M5K42l31o3J65K19
3074B03k65jk24K92K87k40R6j56p0k4P7K6Q2k07N2J56o4n7K24j90J38k08K85l1
3098A81j2k30L74k03N6J25l05N6M5J27l14K38k27j4LJ08p2k03L61K9j21P7k11
3121a32m3K26M1j74K08l20L82l68J47Jo3K40j16J83j93M1p5m0R5m3k00J31N52
3144D80p83M51L9j59J70n96K97K08j37N71m52j73L60l96m1K37j47k37L35k47M48
3165B28j09l04K57m7J61N0k77k01L18q2j71M07k69K34j70l44L16K09j43l42K3
3186b56J83J06L1o1N6P9L0j20j04j38L94k04J27k9o3o9l6Q9K20k34n6L08l75M20
$$ plain form
3210 298 -68 -178 223 184 -262 42 94 141 -67 -21 -88 -45 -46 5 112 -108 130 -14 79 35 -321 -187 -23 113
3234 113 0 -126 203 151 -250 -116 -46 32 -49 139 -69 -128 -165 229 61 166 -39 -40 -88 -102 241 60 -175
3257 -175 -224 98 -54 69 -103 -31 71 -62 10 437 -52 196 244 -271 254 38 -26 117 74 176 -65 -11
3279 -11 -65 319 142 -56 -143 -16 -190 15 -23 -29 98 -46 159 30 -147 112 51 -221 83 171 -230 -58 -212
3302 -212 99 -161 -14 -115 67 78 213 -55 117 7 -120 63 -131 116 14 172 -10 34 69 12 -32 93
3324 93 132 -139 -52 174 -62 -154 -20 247 108 49 -290 139 -54 257 61 128 48 72 114 -21 -255 29 187
3347 187 -11 409 -60 32 20 -34 63 143 -19 56 43 -103 -210 17 -113 -230 71 103 -174 97 -68 7 -190
3370 -190 103 37 -125 -105 -13 -8 -15 -191 206 60 112 96 -180 208 -210 104 -71 -66 -138 22 7 -98 348 -373
$$ packed form
3210B98l66j10M01l9m46L04N2M7k08M6o7M3jN1J07k20K38j44R3m4l56J34J64J36
3234A13j13j26L29n2m01J34P0P8q1J88k08n9l7L94j68J05k05jm8j4L43j81k35
3257a75m9L22j52J23j72P2J02j33P2M27m89K48M8n15N25k16o4J43m3J02k41N4
3279a1n4L84j77j98q7J27j74K05l8oJ27j44K05j29j77K59o1k72L04Q8m01J72j54
3302b12L11k60J47j01J82J1J35k68J72j10j27J83j94K47j02J58j82M4L5n7m4J25
3324I3L9k71Q7K26k36r2J34K67j39n9l39M29j93L11j96O7q0K4M2j35k34K84J58
3347A87j98M20m69R2j2n4R7Q0j62P5j3j46j07K27j30j17L01L2k77K71j65P5j97
3370a90K93o6j62K0R2Npj76L97j46N2j6k76L88m18L14j75Np2J60j5j05M46p21
$$ plain form
3394 -373 203 -77 145 -61 4 -85 -20 17 160 129 199 -208 -149 202 -105 79 46 -63 -49 140 22 15 -33 -170
3418 -170 -23 -117 -4 -53 27 159 -198 58 -160 35 128 -104 -10 142 112 55 135 15 10 -292 100 226 8
3441 8 -110 -197 -116 397 -222 -139 123 307 -49 84 23 210 77 -169 68 139 -48 36 -92 -130 99 -186 57
3464 57 -288 -229 97 89 -4 123 -160 39 97 89 244 69 -69 198 -29 -150 -53 -36 378 288 259 19 304 -84
3488 -84 -82 58 -165 48 8 -133 105 -162 -40 101 169 45 -81 -144 78 24 31 -97 -86 16 86 -170 -95 108
3512 108 -162 -82 -363 -5 -238 -128 -14 -82 -110 122 268 0 258 -55 -37 -87 -142 -265 194 180 -391 -25
3534 -25 -7 245 -205 65 165 230 -139 -170 -151 189 -57 298 123 189 4 126 141 -51 52 113 -25 -69 -123
3557 -123 23 36 30 330 -151 20 4 221 -161 -128 -41 -173 42 84 62 -31 179 28 154 195 -52 8 54 -129
$$ packed form
3394c73N76k80K22k06O5q9O5L7J43l1P0m07N9L51l07J84l3j09J4J89j18pm8j37
3418a70J47r4J13m9Q0J32l57K56k18J95R3k32R4J52l0n7Q0j20nl02L92J26k18
3441Hj18q7Q1N13o19Q3K62J84l56J33o1J87j33k46K37P1j87Q4j28l8K29k85K43
3464E7l45N9L26qr3J27k83J99N8qJ55j75j38K67k27j21R7J7M14r0k9k40K85l88
3488h4KJ40k23K13m0j41K38k67J22J41O8j24j26o3K22n4Pj28J1J02P0k56P5K03
3512A08k70Q0k81L58k33J10J14o8k8K32J46k68K58l13J8n0n5j23M59j4n71L66
3534b5J8K52m50K70J00O5l69l1J9L40k46L55j75O6j85J22J5j92J03O1j38m4n4
3557a23J46J3oL00m81J71j6K17l82L3Q7j32K15M2k2r3K10j51J26M1k47O0M6j83
$$ plain form
3581 -129 -7 256 17 14 167 -175 -46 5 111 114 133 -89 -106 -73 -48 5 137 59 88 -61 205 53 -51 237
3605 237 67 264 -141 143 102 -417 -46 -240 57 -48 88 -265 83 164 153 -83 26 -65 -262 -200 -22 -439
3627 -439 120 10 94 -20 -174 59 -205 278 85 187 168 -79 -125 -191 -49 -109 -13 52 150 16 -30 -56 -1 -96
3651 -96 9 77 -210 114 -153 128 358 41 313 -242 -39 -92 288 24 -293 -139 -19 -6 -4 49 -246 18
3673 18 84 200 34 177 -124 52 -40 67 103 -120 11 286 212 79 -183 -144 -106 -28 -21 321 -188 -158 -173 31
3697 31 172 -79 -166 110 52 -16 267 -134 -172 80 -79 -77 -154 -65 364 67 123 -136 70 18 136 -37 -86 96
3721 96 -57 44 -402 47 -12 -73 -79 -184 105 -142 19 -211 159 -96 -60 -231 113 2 -94 -150 -10 -243 -20
3744 -20 115 -117 7 -87 191 126 -74 156 109 -112 72 -88 30 237 -30 200 214 14 49 105 -85 -262
$$ packed form
3581a29J22K63k39lJ53l42J29N1J06LJ9k22j7L3K5N3J32p8K9j49K66j52j04K88
3605B37j70J97m05K84m1n19L71j94K97j05J36l53L48Q1j1k36J09r1j97O2J78m17
3627d39N59j10Q4j14j54K33k64M83j93J02j9k47m6o6J42o0R6O5R8j34m6k6N5r5
3651i6J05O8k87L24k67K81K30l17K72n55K03n3L80k64l17J54J20J3KN3k95K64
3673A8O6J16j66J43l01J76r2J07L6k23J31K75p4j33k62L9L8P8PL42n09L0j5K04
3697C1J41k51q7K76n8o8K83m01l8K52j59Kp7Q9M29k97N6k59K06n2J18j73m9J82
3721I6j53J01m46M49n9o1oj05K89k47J61k30L70k55L6j71L44j11r6n6J40k33K23
3744b0J35k32J24r4K78o5k00K30m7k21J84j60J18K07k67K30J4k00L5N6j90j77
$$ plain form
3766 -262 -270 6 208 -204 293 57 47 84 -34 -161 -205 -85 58 353 -216 72 -75 -131 7 -56 249 -16
3788 -16 -35 -203 20 6 -102 -26 -246 -155 -35 177 -245 -67 -6 -164 36 222 90 -179 -93 -4 295 305 38
3811 38 293 8 -48 160 -115 25 -228 -9 103 -85 -70 9 141 -204 75 -111 -120 27 -130 143 -25 107
3833 107 -120 182 106 -128 91 -286 -229 169 71 -11 53 -348 139 274 106 -54 -67 -144 -164 64 3 45 92 62
3857 62 169 -55 -2 112 87 -104 -157 144 44 68 245 15 168 18 102 -7 -40 22 -197 166 -253 237 34
3880 34 -9 -3 55 -40 161 210 -47 70 0 78 257 88 191 53 -16 90 -57 67 -303 258 36 81 104 -28
3904 -28 183 -359 -156 -219 12 12 -181 -497 139 243 -22 -6 116 361 66 -52 88 197 14 -4 -65 91
3926 91 62 -59 104 -339 -188 38 -94 392 -161 -128 -21 -146 47 214 47 -44 -111 -57 216 -84 -151 -128 -26
$$ packed form
3766b62qK76K02m12M97k36j0L7j18j27m4J20J43K95n69K88j47n6J38o3L05k65
3788a6j9j68K23j4j08P6k20R1J20K12m22J78O1j58K00J86j32k69Q6Q9K99J0k67
3811C8K55k85n6K08k75J40k53K19J12j88J5P9J32l45K79j86rJ47j57K73j68J32
3833A07k27L02p6k34K19l77N7L98r8q2O4m01M87J35j68j60j3p7k0K28o1M2M7l0
3857F2J07k24N3J14k5j91n3L01j00K4J77k30J53j50Q4j09l3O2k19L63m19M90k03
3880C4m3ON8r5K01M9k57J17p0P8J79j69J03j38o9J06j47J24l70N61k22M5K3j32
3904b8K11n42K03o3K31%j93l16O36J04k65J6J22K45k95j18J40J09j83j8o1J56
3926I1k9j21J63m43J51K26j32M86n53L3J07j25J93J67j67r1o7N4K73l00o7K3J02
$$ plain form
3949 -26 36 -351 -72 -95 -7 172 -145 169 164 414 124 33 -83 291 213 -62 170 280 59 118 -63 96 -271
3972 -271 -179 268 -116 102 -229 153 99 -170 -52 281 338 -23 207 -18 55 107 157 131 39 203 172 -38 -15
3995 -15 -42 52 -319 14 13 42 -12 67 65 -57 -13 -264 99 22 157 52 185 -161 -9 -27 44 -90 67 -160 -122
4020 -122 62 172 78 -65 168 -187 64 -208 110 -138 -11 -228 -10 30 42 -145 -54 -190 129 16 -153
4041 -153 -108 -74 -52 -21 26 -127 -231 -216 162 -28 -23 28 271 292 327 68 227 -117 -25 -61 -51 93 -110 170 -62
4066 -62 -303 -217 21 46 49 -168 4 61 32 365 -165 -310 51 -249 55 -145 221 -40 53 -114 66 11 -127
4089 -127 160 157 -60 93 151 212 210 -125 126 -111 12 43 -121 185 -12 -252 70 -318 -147 -104 182 -32 -26
4112 -26 74 -21 0 -225 -192 -80 77 -20 -92 318 -160 -160 -79 -120 -125 45 172 376 67 -165 -45 133 11 150
$$ packed form
3949b6O2l87K79k3Q8J79l17L14nK50k90r1j16L74p8k75K32J10k21N9j81J59l67
3972b71R2M47l84K18l31L82n4k69J18L33N7l61K30k25P3N2N0k6r2J64l1k10K3
3995a5k7R4l71L33jK9n4P9kj22M4k51L63p7J35j05J33l46J52j8P1j34J57k27L8
4020a22J84J10r4j43K33l55K51k72L18k48J27k17K18M0J2j87R1j36L19j13j69
4041a53M5L4K2L1M7j53j04J5L78j90NN1K43K1L5k59J59l44R2l6J0J44k03K80k32
4066f2k41Q6K38K5Lk17J72N7k9L33n30j45L61l00L04k00L66k61R3j67J80n5j38
4089a27K87lk17J53N8O1kl35K51k37J23L1j64L06j97k40L22l88J71M3K86k14O
4112b6J00r5K1k25L3J12J57r7p2M10m78%Q1m1nJ70J27K04l09k32J20J78j22J39
$$ plain form
4136 150 -256 119 65 84 80 81 111 -180 -86 -114 115 -73 256 11 7 -19 76 -1 -26 -120 90 -79 158 158 37 164
4162 164 -55 204 96 11 -129 -99 277 179 -19 304 -24 -172 -233 -63 296 11 191 78 -111 0 72 -250
4184 -250 50 22 118 55 -69 136 -24 140 190 22 -77 -216 -224 45 -175 -93 106 31 67 79 -46 -83 -41 -258
4208 -258 71 338 119 -117 158 -17 31 44 -11 -66 -79 82 -90 -48 16 -123 3 75 38 -97 -184 -46 -1 -80
4232 -80 207 4 -168 74 63 -25 161 -31 169 -268 25 128 53 -146 -30 8 37 16 -173 -132 -43 101 -10
4255 -10 181 6 80 -2 161 -22 -93 -26 66 294 156 34 -224 -12 247 -110 147 215 78 72 -12 -55 -80 212
4279 212 45 3 -42 -47 -123 -162 44 17 13 -75 -246 -148 -260 148 -50 -141 -215 -75 -296 14 95 254 -154 -173 104
4304 104 71 47 13 35 -199 65 -151 -111 -137 170 -257 -30 -142 3 41 -177 -65 -106 1 -27 -244 -101 -129
$$ packed form
4136A50m06L75n4J9mJL0k91R4k8K29j88L29k45mk6R5p7k5r4K10j69K37%j21J27
4162A64k19K59j08q5j40L0L76r8j98L23l28j48o1J70L59k85J80j13j89J11P2l22
4184b50L00k8R6o3j24K05j60J64N0j68r9j39qK69k20Q2J99p5L6J2j25l7M2k17
4208b58L29K67k19k36K75j75M8J3n5n5j3J61j72M2O4j39J26P2l7j35q7J38M5p9
4232h0K87k03j72K42j1q8J86j92K00m37K93J03p5j99J16L8K9k1j89M1Q9J44j11
4255a0J91j75P4q2J63j83p1O7R2K28j38j22k58K12K59l57K57O8j37oq4m3k5K92
4279B12j67m2m5np6l9K06k7mq8j71R8j12M08j98r1p4J40k21L10Q1J59m08j9K77
4304A04l3k4l4K2k34K64k16M0k6L07m27K27j12J45L8k18J12m1J07k8k17J43k8
$$ plain form
4327 -129 -28 206 20 43 -206 24 -261 193 113 -16 29 -125 99 197 74 230 -58 -246 209 -257 184
4348 184 -130 -7 64 -113 43 -264 121 -169 29 -78 -41 -172 -191 222 -107 -95 -63 32 -56 58 174 -35
4370 -35 -98 205 -30 -51 33 -66 253 -143 -251 54 96 216 -87 132 139 260 -127 82 238 -229 -79 -43 -210
4393 -210 -27 72 42 127 148 -65 -48 -62 -333 127 -92 17 -47 -38 -35 53 52 -15 -207 -62 97 15 -213 -4 87 80
4419 80 8 -51 -50 -34 105 -23 97 -243 111 -311 -50 -3 113 -203 198 32 -22 216 141 160 -185 9 105 129
4443 129 14 145 -84 87 34 -238 3 62 25 213 191 -23 -121 104 -78 -45 -55 101 -93 -58 -156 265 72
4466 72 215 100 201 34 -6 115 376 257 -280 118 -101 -60 138 -226 -51 203 120 34 109 -42 -67 116
4488 116 -62 259 180 506 -147 0 -21 -4 51 -92 12 -198 137 218 180 -83 -91 50 -122 9 142 -31 78
$$ packed form
4327a29J01K34j86K3k49K30k85M54q0j29M5j54K24R8j23J56k88j88M55m66M41
4348A84l14J23P1j77J56l07L85k90J98j07L7j31j9M13l29J2L2R5q8J14J16k09
4370c5o3L03k35k1Q4r9L19l96j08L05M2J20l03K19PJ21l87K09J56m67J50L6j67
4393b10J83R9l0Q5K1k13J7j4k71M60k19J09o4RLQ8jo7j92J45J59q2k28K09R1p
4419H0p2n9JJ6J39j28J20l40L54m22K61M7J16l16M01j66n4K38p5J9l45J94R6K4
4443A29j15J31k29J71n3k72K41N9l7J88k2k14r8K25j82L3j0J56j94L5r8M21j93
4466G2J43j15J01j67m0J21K61j19n37L98k19M1J98l64J75K54q3q6P5j51k5J83
4488A16j78L21p9L26o53J47k1J7N5j43J04k10L35Q1l8k63qJ41j72J31J33j73J09
$$ plain form
4511 78 -39 -111 -66 -95 58 -240 -62 -164 -119 -23 161 11 69 68 156 -255 -103 61 -43 63 -136 -195 -144 197
4535 197 -112 207 -95 11 -62 -135 86 27 114 51 57 223 66 -148 27 261 126 -213 -257 -102 159 -219 179
4558 179 -149 -9 -125 81 -137 52 24 -107 236 -202 217 487 159 39 130 -234 82 169 18 -165 53
4579 53 -10 103 -316 46 -89 -57 66 1 -352 141 177 -214 -266 23 158 -257 -133 -13 204 -177 132 127 49
4602 49 -420 89 164 -14 -136 -104 287 -132 8 2 64 -319 210 100 -6 -337 151 2 61 -104 -136 51 -79
4625 -79 -1 136 -136 -109 39 265 -132 -27 -173 23 -29 -62 63 -146 47 42 -141 236 -332 0 226 -123
4647 -123 25 -122 17 66 -10 -162 -17 91 131 174 220 -104 -87 43 85 -25 100 213 58 -129 -240 -104
4669 -104 177 39 28 -30 101 -134 -12 50 259 -511 -103 36 204 146 111 -162 -123 150 183 36 -74 -248
$$ packed form
4511G8j17p2M5k9J53k98J78j02M5R6J84j50N8jQ8m11J52J64j04J06j99n9N1L41
4535A97l09L19l02J06p3p3K21n9Q7o3OJ66j57k14J75K34j35l39m4J55K61l78L98
4558A79l28J40j16K06k18J89k8j31L43m38M19K70l28j20R1l64L16Q7j51j83K18
4579E3o3J13m19L62j35L2J23o5l53M93L6l91n2K89J35m15J24J20K17l81L09np8
4602D9m69N09P5j78j22L2L91m19J40oO2l83N29j10j06l31M88j49N9j65l2J87j30
4625g9P8J37k72K7J48K26l97J05j46J96n2l3J25k09J93nj83L77n68L32K26l49
4647a23J48j47J39M9p6j52J45J08M0M3M6l24J7J30M2j10J25J13j55j87j11J36
4669a04K81j38j1n8J31k35J22O2K09p70M08J39J68n8l5k73L9K73L3j47j10j74
$$ plain form
4691 -248 167 96 -32 -47 -69 99 -93 221 -113 128 17 109 -22 78 -24 -112 -165 -380 55 -43 -248 -145
4713 -145 -50 62 80 -56 -4 279 -130 60 -80 329 -95 -23 -124 -21 -59 209 -95 -275 275 116 -132 -11
4735 -11 -163 -182 -85 -343 110 -19 -77 -157 220 -290 -182 -50 -163 -209 -179 -142 232 -45 29 -43 -31 -65 164 -55
4759 -55 112 -33 101 102 40 -41 -62 -47 161 82 86 224 61 -87 184 -175 -66 21 -114 111 217 81 -18 200
4783 200 -32 308 -80 -17 -64 -100 116 -29 -173 197 -63 221 -48 -168 -93 -199 86 6 -131 -210 -46 -120
4805 -120 -49 -354 -71 -24 74 138 86 24 -209 109 2 -115 133 -32 37 -266 55 -228 -24 -37 -5 239 -125
4828 -125 408 -21 107 44 -132 -214 55 215 140 -123 134 42 230 -168 90 -5 -108 -206 23 38 50 92 -109
4851 -109 206 -146 -195 -35 8 -45 249 -187 -156 40 -216 52 -57 92 166 -70 -242 -24 240 129 272 4
$$ packed form
4691b48M15p1j28j5k2J68j92L14l34K41j11R2j31J00j02q8n3k15M35r8k05J03
4713a45R5J12J8j36N2K83m09J90j40M09m24P2j01J03l8K68l04j80N50j59k48J21
4735a1j52j9R7k58M53j29n8q0L77n10J08J32j13m6L0L7L74k77P4p2J2l4K29k19
4759e5J67j45J34Jo2q1k1J5K08p9MJ38j63j48K71l59J09Q7j35K25J06j36r9K18
4783B00k32L40l88O3m7l6K16j45j44L70k60K84k69j20P5j06K85q0j37p9J64p4
4805a20P1l05K83M7R8O4n2o2k33L18j07j17K48j65O9l03L21k83K04j3L2K44l64
4828a25N33m29J28o3j76q2K69J60p5k63K57r2J88l98K58r5j03r8K29J5J2M2k01
4851a09L15l52m9J60M3n3K94m36L1J96k56K68j09J49P4k36j72K18K64j11J43k68
$$ plain form
4873 4 -103 104 -107 -85 191 -55 236 131 160 55 105 340 178 28 -106 -28 -111 -26 163 -12 -152 -181 88
4896 88 106 -68 86 174 405 129 -45 76 11 157 -84 72 135 -20 116 -133 122 -158 -246 24 106 -303
4918 -303 42 75 48 -106 130 -133 174 264 53 -12 -7 299 -184 146 14 117 303 106 32 -9 -5 353 163
4941 163 -22 154 220 137 115 -420 74 55 156 -101 70 -141 35 23 27 38 -42 -15 165 87 124 65 -18 74 75 36
4967 36 -13 169 -96 -4 37 8 -33 228 11 -99 154 -256 86 -375 131 -91 197 -190 81 135 95 -208 16
4990 16 98 4 13 -153 3 53 176 -42 -295 -80 41 -129 -238 -72 -108 21 -39 19 37 30 23 77 -59 -127 126
5015 126 -141 62 -158 -111 146 253 -71 -115 12 242 -9 98 55 -221 -30 101 6 216 2 -17 -49 -49 -47
5038 -47 -148 -171 -158 8 82 61 -12 103 148 2 -26 -241 137 -21 -19 185 -422 135 -40 -24 -64 34 -22 -16 44 40
$$ packed form
4873Dj07K07k11K2K76k46K91j05K9j05N0K35j62j50j34P8q3Q5J89j75j40k9K69
4896H8J8j74J54Q8K31k76j74J21o5J46k41J56O3j55J36k49K55k80q8K70Q2m09
4918c03L45L3k7j54K36k63L07R0k11o5NL06m83L30j32J03J86j97p4m1ML58j90
4941A63j85J76O6q3k2n35M94j9J01k57J71k11J76j2MJ1q0K7J80p8L7n9q3R2Jl9
4967C6m9J82k65R2M1k9m1K61k17j10K53m10L42m61N06k22K88l87K71N4m0l03K24
4990A6Q2r4Rj66J56N0J23k18k53K15J21j70j09J66l6J29o0N8J8ppN4j36o8K53
5015A26k67K03k20M7K57J07l24m4J27K30k51J07m3k76J91J31r5K10k14j9l2%K
5038d7j01k3J3J66P4k1p3J15M5j46k8k15L78j58KK04o07N57j75J6m0R8n6OO0m
$$ plain form
5064 40 -33 -38 -45 -319 -221 37 -108 142 59 255 62 -117 -19 284 15 -181 89 -347 -56 253 -132 -47 -57 89
5088 89 34 67 91 -106 -115 -16 78 -147 -71 -146 -18 -51 86 153 40 30 118 65 -39 98 -132 3 89 59 -132 -187
5114 -187 6 -67 -72 130 216 -7 -122 -130 55 41 -39 -117 -74 -155 151 -109 -208 -109 -105 -68 87 58 335 266 126 -247
5140 -247 -320 -69 -38 148 92 104 -501 83 -8 -133 184 94 -80 -155 322 174 -45 170 41 39 -213 -59 -54 178
5164 178 96 93 -150 89 66 -147 -200 85 36 -25 108 -178 -129 97 260 -103 68 -271 -72 7 -2 -59 -179 139
5188 139 -61 -39 92 50 14 158 -5 -142 215 -50 -95 -17 139 106 31 14 146 -103 -132 -26 -18 41 -271 161
5212 161 107 -60 224 97 -288 -83 90 -81 101 -80 139 37 -280 168 -103 82 -105 -196 -26 -272 91
5233 91 -76 4 50 6 -95 -119 -89 -79 -171 -77 -84 150 -11 6 -326 292 -37 -9 263 -98 57 -56 68 -270
$$ packed form
5064D0p3npk74R8K58j45K50q3J96j93j79R8L03k69j96K70m36K91L09l85Q5j0J46
5088H9n5L3K4j97rR9R4k25P6p5J28l3J37O7j13j0Q8n3j04J37k30J35Q6l0j91n5
5114a87J93p3nK02Q6k23j15qJ85j4q0p8M3q1L06k60r9R9ML7J55k9K77o9j40l73
5140b47p3K51L1J86n6J2o05N84r1j25L17r0j74p5M77j48k19K15j29kk52J54NK32
5164A78q2lk43K39k3k13n3K85m9o1J33k86M9K26J63l63J71l39J99P9rn7j20L18
5188A39k00K2J31m2l6J44j63j37L57k65m5P8J56l3p5j7J32k49k9J06QN9l12M32
5212A61n4j67K84j27l85K05J73j71J82j81K19j02l17M48k71J85j87r1J70k46L63
5233I1j67Q0M6m4j01k4L0J0r2R4pK34j61J7l32O18l29K8K72l61J55j13J24l38
$$ plain form
5257 -270 38 113 242 62 -289 -101 -47 -51 -130 124 49 -53 -288 61 156 -191 71 190 -134 -23 304 -156
5279 -156 -147 -128 -252 -31 43 51 68 77 178 82 -162 118 -69 -250 -75 -119 -199 -139 -91 125 96 13 -63 -46 -89 -56 204
5306 204 231 -277 51 13 4 -144 57 65 -55 -11 -77 190 38 -42 85 -8 154 -66 -318 133 49 63 -100 84
5330 84 50 109 108 75 -18 31 235 140 -2 -216 -238 155 213 -73 -6 -35 -68 139 -79 -131 -69 286 100 -144 206
5355 206 -94 -168 -85 -56 -229 233 137 -109 11 -243 22 -82 280 -12 -83 -129 -133 185 42 42 94 150 89 -15
5379 -15 -81 -204 153 154 -7 -31 -139 -62 -122 107 184 73 -16 -257 97 -14 -191 -203 -82 119 -334 -260 -64 -113
5403 -113 182 -230 -49 -1 13 126 192 105 126 336 -154 -112 -257 -189 -28 -157 -122 -53 68 -88 -184 -99 -96 -58 -141
5428 -141 11 -145 3 239 275 5 159 238 37 80 194 218 -211 -164 120 168 -10 -59 65 -121 162 109 170
$$ packed form
5257b70L08P5J29j80l51J88N4mp9K54p5j02k35L49R5l47K62J19l24J11L27m60
5279a56RJ9j24K21P4QJ7RJ01r6k44K80j87j81J75m4q0O0M8K16k9q3p6J7m3L3K60
5306B04K7n08L28l8rj48K01Qj20M4o6K67j52q0J27r3J62k20k52M51q4J4j63J84
5330H4l4N9jl3r3M9K04r5j42k14k2L93N8k86O7k9l3K07k18n2O2L55j86k44L50
5355B06l00p4Q3K9j73M62r6k46J20k54K65j04L62k92p1m6mL18j43%N2N6o1j04
5379a5o6j23L57Jj61k4j08P7o0K29P7j11q9k41L54j11j77j2J21K01m53P4J96m9
5403a13K95m12J81M8J4J13O6q7K1K10m90M2j45O8J61j29L5O9J21j56r6Q5LL8q3
5428a41J52j56J48K36L6k70J54P9k01M3J14K4m29M7K84M8j78m9J24j86K83n3O1
$$ plain form
5451 170 -160 -29 481 239 89 36 435 117 291 218 -164 12 70 -279 195 -75 127 66 93 35 33 45 -119
5474 -119 -59 61 -121 301 69 -220 233 31 208 -97 -72 180 -148 9 88 -110 84 117 -144 103 -93
5495 -93 -35 -276 128 42 195 -402 -161 57 128 8 41 181 -204 -147 85 214 142 51 -106 -4 230 -30 -58
5518 -58 -136 42 -4 -70 -64 -225 -12 -279 -25 -41 147 -190 -28 -115 165 -114 66 -193 -355 -65 95 -38 -90
5541 -90 -95 -38 -27 -42 217 -3 -141 -119 -6 -33 -27 -5 -24 -66 -68 -205 -348 92 155 -111 53 -223 -42 108 -104
5566 -104 2 -156 122 79 70 25 115 132 -27 -27 -126 14 -254 4 25 -100 -162 -67 65 236 -10 156 21 -456
5590 -456 -306 169 86 7 91 246 -102 100 -9 -144 -408 27 111 -77 128 -44 -74 18 103 20 -94 -13 64
5613 64 -207 -165 199 100 151 -42 -104 -96 192 -2 389 86 -152 -114 -91 107 -110 117 24 -195 -253 -265 -103 -47
$$ packed form
5451A70l30J31N10k42j50n3L99l18J74p3l82J76N8l49M74k70K02o1K7n8kJ2j64
5474a19O0J20j82M22k32k89M53k02J77l05K5K52l28J57P9j98J94L3k61K47j96
5495i3N8k41M04q6J53n97K41K18P1j20L3J40l85N7K32J29p2r1j57J02K34k60k8
5518e8p8J78m6o6Oj61K13k67K54j6J88l37J62q7K80k79J80k59j62K90J60j33n2
5541i0nN7J1j5K59k20j38K2J13k7OK2j9m2kj37j43M40O3k66J64k76J81J50k12
5566a04J06j58K78m3rm5R0J7j59%r9J40k68K58K1j25o2R5J32J71k46J66j35m77
5590d56J50M75q3p9Q4J55l48K02j09j35k64M35Q4j88K05j72l0R2Q5q3j14Q1P7
5613F4k71M2L64r9N1j93o2QK88j94L91l03k38L8K3J98k17K27r3k19n8j2J62N6
$$ plain form
5637 -47 148 -138 -145 -101 -264 -124 53 42 220 -32 -212 -109 82 -43 11 -282 -123 38 190 -422 266 -43
5659 -43 199 291 -90 -8 -8 41 153 150 -10 192 -29 113 -185 102 -25 162 248 31 96 -187 56 38 9 -137
5683 -137 -126 25 -56 150 47 -15 -205 184 89 -267 108 -115 129 -42 170 -235 257 -175 -82 211 -117 15
5705 15 46 143 5 -7 -228 -34 -17 -171 -46 -50 -164 -61 252 -194 -155 187 -73 -86 -98 -37 249 -356 30 5
5729 5 -8 59 44 142 163 -115 -30 -34 -144 21 -194 70 -6 145 46 -237 168 -175 -296 128 22 -248 -130 -38
5753 -38 -18 222 -52 -12 -26 173 -184 -34 69 -271 -211 -68 34 38 -33 15 -52 21 39 154 -28 82 76 98 67
5778 67 -127 -59 160 -70 67 15 131 -238 227 54 -137 127 144 -97 -109 -288 -7 -114 -301 176 360 -98
5800 -98 260 93 -403 147 67 320 294 -222 118 63 -21 -16 281 14 -55 -2 107 36 -125 -17 180 35 -112
$$ packed form
5637d7J95k86pM4j63J40J77j1J78k52j80J03J91j25N4k93J59J61J52o12O88l09
5659d3K42R2l81Q2%M9J12lj60K02k21J42k98K87j27J87Q6k17O5k83K43j8k9j46
5683a37J1J51q1K06j03o2j90L89r5l56L75k23K44j71K12m05M92m32R3K93l28J32
5705A5L1R7j38j2k21J94J7j54J25mj14J03L13m46L9L42k60j3j2O1K86o05L86k5
5729Ej3O7j5R8K1k78Q5mj10J65k15K64p6J51r9k83M05l43j21M24j06k70J18R2
5753c8K0K40k74M0j4J99l57J50J03l40O0J43J02Mp1M8o7P3J8J15j82J10oK2l1
5778F7j94O8K19k30J37n2J16l69M65j73j91K64J7k41j2j79K81j07j87M77J84m58
5800i8L58j67m96N50q0K53k6n16L40n5q4NK97k67o9N3J09p1j61J08J97j45j47
$$ plain form
5823 -112 46 150 320 -9 103 21 -159 -101 -158 -48 -141 -58 128 -162 53 -237 -52 -241 -273 -268 -173 97 59
5846 59 -363 216 19 -64 8 95 190 222 21 -149 -217 -162 157 112 54 304 70 20 -36 -214 -17 -147 -43 26
5870 26 -234 -185 70 -207 127 -108 -79 20 27 102 94 3 -182 205 -41 -253 -134 -168 -110 177 109 215 327 -6
5894 -6 234 116 110 -116 142 17 116 -60 182 -25 138 77 -74 -8 -234 108 152 -74 429 86 161 4 171
5917 171 175 121 -181 -148 0 53 -147 -219 -56 -182 80 117 -161 -59 191 -201 -72 -51 -2 -101 160 -96 -200
5940 -200 0 78 60 105 -182 -51 -218 124 -216 231 -119 -34 52 -34 257 122 59 10 205 256 54 105 -21
5963 -21 48 -86 -131 77 102 36 -37 -20 17 119 -184 -126 -55 32 -62 -157 -112 130 -4 -116 209 22 22 -54 125 285
5989 285 -27 216 20 23 5 -185 46 32 73 11 24 61 -134 70 36 -43 79 104 168 187 -203 98 129 22 -231
$$ packed form
5823a12J58J04J70l29J12q2j80N8n7J10r3Q3J86k90K15k90J85j89l2NR5K70l8
5846E9m22N79j97q3P2Q7R5L2k01j70o8N5L19m5n8K50k34n0n6j78J97j30J04O9
5870B6k60M9K55k77L34k35K9R9PP5qr1j85L87k46k12J19l4N8K87o8J06J12l33
5894fK40j18ok26K58j25R9j76K42k07J63o1j51O6k26L42M4k26N03l43P5j57J67
5917A71Mn4l02L3J48N3k00p2J63j26K62L7k78J02K50l92J29K1M9r9K61k56j04
5940b00K00P8j8M5k87J31j67L42l40M47l50Q5Q6q6K91j35o3m9J95N1k02N1j26
5963b1O9j34m5K08K5o6p3J7L7J02l03N8P1Q7r4r5M5K42j34j12L25j87%p6J79J60
5989B85l12K43j96Lj8j90K31j4M1o2J3L7j95K04l4p9J22K5O4J9l90L01L1j07k53
$$ [...]
8191b1
##END NTUPLES=NMR FID
##END=
