##TITLE=1H_Ser OL-epox
 200.13MHz, CDCl3,
 8 sc
 
 11.3.2025
##JCAMPDX= 6.0         $$ Bruker NMR JCAMP-DX V2.0
##DATA TYPE= NMR FID
##DATA CLASS= NTUPLES
##ORIGIN= UXNMR, Bruker Analytische Messtechnik GmbH
##OWNER= pz
$$ XWIN-NMR		Version 3.5
$$ Tue Mar 11 14:34:24 2025 Russian Standard Time (UT+4h)  she@DPX200
##.OBSERVE FREQUENCY= 200.1313
##.OBSERVE NUCLEUS= ^1H
##.DELAY= (6, 6)
##.ACQUISITION MODE= SIMULTANEOUS
##.ACQUISITION SCHEME= undefined
##.AVERAGES= 8
##.DIGITISER RES= 18
##SPECTROMETER/DATA SYSTEM= spect
##.PULSE SEQUENCE= zg30
##.SOLVENT NAME= CDCl3
##.SHIFT REFERENCE= (INTERNAL, CDCl3, 0, 14.3821)
##AUDIT TRAIL= $$ (NUMBER, WHEN, WHO, WHERE, WHAT)
$$ ##TITLE= Audit trail, XWIN-NMR		Version 3.5
$$ ##JCAMPDX= 5.01
$$ ##ORIGIN= Bruker BioSpin GmbH
$$ ##OWNER= she
$$ F:/spectra/data/she/nmr/H-C/1/audita.txt
$$ ##AUDIT TRAIL=  $$ (NUMBER, WHEN, WHO, WHERE, WHAT)
(   1,<2025-03-11 14:32:48.42 +0400>,<she>,<DPX200>,
      <created by zg, POWCHK disabled, PULCHK disabled
       configuration hash MD5:
       00 E9 B6 7A A2 85 ED C7 34 08 36 98 17 FE 4E 26
       data hash MD5: 16K
       95 99 E0 E4 BF 97 CB 6D 44 E0 80 91 CD 38 05 9A>)
$$ ##END=
$$ 
$$ hash MD5
$$ 98 F7 F9 9D C5 B4 EC B8 AD 05 42 55 98 D2 9A 21
##$RELAX= 
##$RELAX= 
##$RELAX= 
##$RELAX= 
##$RELAX= 
##$RELAX= 
$$ Bruker specific parameters
$$ --------------------------
##$DU= <F:/spectra>
##$EXPNO= 1
##$NAME= <H-C>
##$PROCNO= 1
##$TYPE= <nmr>
##$USER= <she>
##$AMP= (0..31)
100 100 100 100 100 100 100 100 100 100 100 100 100 100 100 100 100 100 
100 100 100 100 100 100 100 100 100 100 100 100 100 100 
##$AQSEQ= 0
##$AQ_mod= 1
##$AUNM= <au_zg>
##$AUTOPOS= <>
##$BF1= 200.13
##$BF2= 200.13
##$BF3= 200.13
##$BF4= 200.13
##$BF5= 200.13
##$BF6= 200.13
##$BF7= 200.13
##$BF8= 200.13
##$BYTORDA= 1
##$CFDGTYP= 0
##$CFRGTYP= 5
##$CHEMSTR= <none>
##$CNST= (0..31)
1 1 145 1 1 1 1 1 1 1 1 1 1 1 1 1 1 1 1 1 1 1 1 1 1 1 1 1 1 1 1 1 
##$CPDPRG= <>
##$CPDPRG1= <>
##$CPDPRG2= <>
##$CPDPRG3= <>
##$CPDPRG4= <mlev>
##$CPDPRG5= <mlev>
##$CPDPRG6= <mlev>
##$CPDPRG7= <mlev>
##$CPDPRG8= <mlev>
##$CPDPRGB= <>
##$CPDPRGT= <>
##$D= (0..31)
0 0.7 0 0 0 0 0 0 0 0 0 0.03 0 0 0 0 0 0 0 0 0 0 0 0 0 0 0 0 0 0 0 0 
##$DATE= 1741689167
##$DBL= (0..7)
120 120 120 120 120 120 120 120 
##$DBP= (0..7)
150 150 150 150 150 150 150 150 
##$DBP07= 0
##$DBPNAM0= <>
##$DBPNAM1= <>
##$DBPNAM2= <>
##$DBPNAM3= <>
##$DBPNAM4= <>
##$DBPNAM5= <>
##$DBPNAM6= <>
##$DBPNAM7= <>
##$DBPOAL= (0..7)
0.5 0.5 0.5 0.5 0.5 0.5 0.5 0.5 
##$DBPOFFS= (0..7)
0 0 0 0 0 0 0 0 
##$DE= 6
##$DECBNUC= <off>
##$DECIM= 32
##$DECNUC= <off>
##$DECSTAT= 4
##$DIGMOD= 1
##$DIGTYP= 9
##$DL= (0..7)
0 120 120 120 120 120 120 120 
##$DP= (0..7)
150 150 150 150 150 150 150 150 
##$DP07= 0
##$DPNAME0= <>
##$DPNAME1= <>
##$DPNAME2= <>
##$DPNAME3= <>
##$DPNAME4= <>
##$DPNAME5= <>
##$DPNAME6= <>
##$DPNAME7= <>
##$DPOAL= (0..7)
0.5 0.5 0.5 0.5 0.5 0.5 0.5 0.5 
##$DPOFFS= (0..7)
0 0 0 0 0 0 0 0 
##$DQDMODE= 0
##$DR= 18
##$DS= 0
##$DSLIST= <SSSSSSSSSSSSSSS>
$$ [...]
##$SUBNAM0= <"">
##$SUBNAM1= <"">
##$SUBNAM2= <"">
##$SUBNAM3= <"">
##$SUBNAM4= <"">
##$SUBNAM5= <"">
##$SUBNAM6= <"">
##$SUBNAM7= <"">
##$SUBNAM8= <"">
##$SUBNAM9= <"">
##$SW= 18.0517328524113
##$SWIBOX= (0..15)
0 0 2 0 0 0 0 0 0 0 0 0 0 0 0 0 
##$SW_h= 3612.71676300578
##$TD= 16384
##$TD0= 1
##$TE= 0
##$TE2= 300
##$TE3= 300
##$TEG= 300
##$TL= (0..7)
0 120 120 120 120 120 120 120 
##$TP= (0..7)
150 150 150 150 150 150 150 150 
##$TP07= 0
##$TPNAME0= <>
##$TPNAME1= <>
##$TPNAME2= <>
##$TPNAME3= <>
##$TPNAME4= <>
##$TPNAME5= <>
##$TPNAME6= <>
##$TPNAME7= <>
##$TPOAL= (0..7)
0.5 0.5 0.5 0.5 0.5 0.5 0.5 0.5 
##$TPOFFS= (0..7)
0 0 0 0 0 0 0 0 
##$TUNHIN= 0
##$TUNHOUT= 0
##$TUNXOUT= 0
##$USERA1= <user>
##$USERA2= <user>
##$USERA3= <user>
##$USERA4= <user>
##$USERA5= <user>
##$V9= 5
##$VALIST= <valist>
##$VCLIST= <CCCCCCCCCCCCCCC>
##$VD= 0
##$VDLIST= <DDDDDDDDDDDDDDD>
##$VPLIST= <PPPPPPPPPPPPPPP>
##$VTLIST= <TTTTTTTTTTTTTTT>
##$WBST= 1024
##$WBSW= 4
##$XGAIN= (0..3)
0 0 0 0 
##$XL= 0
##$YL= 0
##$YMAX_a= 609706
##$YMIN_a= -722477
##$ZGOPTNS= <>
##$ZL1= 120
##$ZL2= 120
##$ZL3= 120
##$ZL4= 120
##$ABSF1= 10
##$ABSF2= 0
##$ABSG= 5
##$ABSL= 3
##$ALPHA= 0
##$AQORDER= 0
##$ASSFAC= 0
##$ASSFACI= 0
##$ASSFACX= 0
##$ASSWID= 0
##$AUNMP= <proc_1d>
##$AZFE= 0.1
##$AZFW= 0.1
##$BCFW= 1
##$BC_mod= 2
##$BYTORDP= 1
##$COROFFS= 0
##$CY= -3
##$DATMOD= 1
##$DC= 2
##$DFILT= <>
##$DTYPP= 0
##$F1P= 0
##$F2P= 0
##$FCOR= 0.5
##$FTSIZE= 0
##$FT_mod= 4
##$GAMMA= 1
##$GB= 0.15
##$INTBC= 1
##$INTSCL= 1
##$ISEN= 128
##$LB= 0.25
##$LEV0= 0
##$LPBIN= 0
##$MAXI= 10000
##$MC2= 0
##$MEAN= 0
##$ME_mod= 0
##$MI= 1.114404
##$NCOEF= 0
##$NC_proc= 0
##$NLEV= 6
##$NOISF1= 3.799351
##$NOISF2= 2.8
##$NSP= 1
##$NTH_PI= 0
##$NZP= 0
##$OFFSET= 14.38212
##$PC= 1
##$PHC0= -475.6787
##$PHC1= 21.19221
##$PH_mod= 1
##$PKNL= yes
##$PPARMOD= 0
##$PSCAL= 0
##$PSIGN= 0
##$REVERSE= no
##$SF= 200.129724274929
##$SI= 16384
##$SIGF1= 3
##$SIGF2= 2
##$SINO= 400
##$SIOLD= 16384
##$SREGLST= <1H.CDCl3>
##$SSB= 0
##$STSI= 0
##$STSR= 0
##$SW_p= 3205.1282051282
##$SYMM= 0
##$S_DEV= 0
##$TDeff= 0
##$TDoff= 0
##$TI= <>
##$TILT= no
##$TM1= 0
##$TM2= 0
##$TOPLEV= 0
##$USERP1= <user>
##$USERP2= <user>
##$USERP3= <user>
##$USERP4= <user>
##$USERP5= <user>
##$WDW= 1
##$XDIM= 8192
##$YMAX_p= 0
##$YMIN_p= 0
$$ End of Bruker specific parameters
$$ ---------------------------------
##NTUPLES= NMR FID
##VAR_NAME=  TIME,          FID/REAL,        FID/IMAG
##SYMBOL=    X,             R,               I
##VAR_TYPE=  INDEPENDENT,   DEPENDENT,       DEPENDENT
##VAR_FORM=  AFFN,          ASDF,            ASDF
##VAR_DIM=   8192,          8192,            8192
##UNITS=     SECONDS,       ARBITRARY UNITS, ARBITRARY UNITS
##FACTOR=    0.0002768,     1,               1
##FIRST=     0,             0,               0
##LAST=      2.2672688,     0,               0
##MIN=       0,             -722477,         0
##MAX=       2.2672688,     609706,          0
$$ Real data points
##PAGE= N=1
##DATA TABLE= (X++(R..R)), XYDATA
0 0 0 0 0 0 0 0 0 0 0 0 0 -3 0 0 8 -8 8 -8 8 -16 16 -20 24 -25 32 -36 42 -45 52 -60 68 -76 88 -100 112 -124
36 -124 136 -153 172 -189 209 -231 254 -283 311 -340 373 -412 454 -500 550 -605 671 -744 825
55 825 -918 1030 -1160 1318 -1509 1752 -2065 2486 -3073 3951 -5362 7917 -13427 29907 -173293
70 -173293 -722477 79376 392965 -342719 -214591 415369 25016 -368624 112634 205495
80 205495 -208513 44626 382069 -51808 -258608 173982 131059 -300117 -109785 205890
90 205890 -108482 -247305 203565 230651 -248501 -152401 272599 68735 -178077 192727
100 192727 266585 -227560 -206166 170730 -60425 -262027 169180 204141 -272082 -117087
110 -117087 248820 -65412 -158467 313261 148071 -338517 45240 383577 -193477 -361364
120 -361364 240200 172661 -364229 -99613 323810 615 -214935 97356 104958 -128609
130 -128609 54595 218970 -53451 -140948 98886 17291 -222460 -20612 195100 -64927
140 -64927 -189472 115455 138576 -148009 -31767 214841 -8145 -157642 131772 145338
150 145338 -165662 -77289 119572 -108690 -176007 141396 115777 -139510 4308 125834
160 125834 -112631 -79152 204028 73543 -133704 66087 105262 -186035 -121078 163677
170 163677 24006 -175640 33679 152465 -68799 -106319 88634 63966 -67313 20158
180 20158 99061 -16878 -48752 31588 -48639 -132745 32500 132513 -37367 -80153 80243
191 80243 27878 -122394 14714 147601 -1971 -52198 72916 -10482 -138935 4534 85518
202 85518 -64514 -53700 85563 7921 -78000 40097 53286 -63197 4636 105793 2103
213 2103 -53576 38663 2644 -102921 -27602 65457 -2755 -32382 43266 16706 -75391 -24136
225 -24136 76092 41664 -19841 13302 25703 -33955 -36393 11711 -9151 -30236 25885 27559
237 27559 -42125 -12241 56896 -2962 -53799 27878 57801 -12347 -5202 27903 -40121 -65309
249 -65309 17305 26406 -25381 10173 39157 -23933 -36281 22679 21565 -22 30070 24137 -28267
262 -28267 -21437 12319 -11937 -32657 -1423 11885 -4706 2024 14332 -3296 -16060 2320
274 2320 18923 14272 11497 16431 197 -29956 -31044 -4189 10217 10329 9240 -3058 -16789 -6238
288 -6238 7864 2765 6448 20533 9116 -11326 -6796 -2325 -11286 -8391 -174 -2668 4133 15333
302 15333 5572 -8801 -7677 -3820 4839 21674 17952 -5311 -10382 -9473 -22656 -14220 14677 14426
316 14426 -1096 1131 -3942 -15818 2612 22414 5679 -3737 12938 6070 -15176 -5575 4668
329 4668 -13147 -12303 11678 6876 -8777 3989 8331 -14626 -14229 14571 18136 1703 4760 3741
343 3741 -19510 -18272 10483 11404 -6100 4941 12967 -13486 -19649 11202 13076 -8599 4746
356 4746 16366 -12469 -16058 14825 2621 -24701 2681 22996 -8983 -12120 20114 4014 -25011
369 -25011 3287 21564 -7244 -3213 22229 -4325 -29366 2125 13929 -14549 -3757 24774
381 24774 -2512 -28548 3545 18423 -10412 -5570 23278 5002 -18922 3305 12185 -13825
393 -13825 -5890 20361 -2485 -22900 11799 18632 -23342 -15824 24592 4448 -21854 10726 20092
406 20092 -17862 -11820 17732 -4939 -15737 21716 15667 -27461 -7837 24936 -6376 -21591
418 -21591 19063 19841 -19680 -11637 14214 -3516 -13046 12525 7592 -17421 -454 18238 -9460
431 -9460 -18750 17156 18030 -18791 -8528 24288 3120 -22410 2743 12444 -12240 -753 18676
444 18676 -10829 -20867 16631 8634 -27687 3019 35674 -8134 -29972 13218 15278 -18176
456 -18176 -109 19845 -7247 -9701 14662 -3587 -20783 12790 20217 -18397 -14392 23113 8658
469 8658 -25017 -8412 16243 664 -10107 6871 8723 -6664 -3679 4476 -6522 -2909 21454
482 21454 9985 -22793 -7249 18990 -6473 -21925 12469 18358 -12901 -8289 8510 -7940
494 -7940 -6049 17817 -82 -18489 15283 22810 -22075 -20576 19860 8843 -18803 1693 17773
507 17773 -1709 -8177 -1056 -8637 -3830 18156 9165 -15384 -4197 14001 -6478 -23921 3261
520 3261 25462 1590 -16627 3984 12341 -8113 -8583 8850 5030 -75 8758 -1627 -16449
533 -16449 428 9105 -15148 -11335 22142 13635 -17216 -8612 6985 -2226 -1120 9851 3225
546 3225 826 9732 -5146 -23347 -3336 19579 3739 -12750 850 11110 -2508 -12798 -4362
559 -4362 6476 7916 5301 625 -5516 -1894 3317 -9051 -14686 11219 23224 -5017 -15577 8130
573 8130 5845 -17666 -3124 20752 7510 -6026 -367 -7028 -11800 2953 3470 -8503 5070
586 5070 17249 -3745 -16410 842 9466 461 -829 4977 7308 4630 -5309 -15364 -9481 4633
600 4633 8707 2252 -2776 1244 4430 -7662 -15003 5091 20524 5837 -5599 27 -3061 -8596
614 -8596 -1761 -813 -2383 11202 10746 -12560 -8874 11968 -985 -15565 7685 19748 -747 -8152
628 -8152 -626 -7209 -10182 568 3219 3261 10881 5645 -11544 -10288 3891 6961 3564 4669 5876
643 5876 1521 -8530 -14151 -6207 2736 2937 4342 4807 -2252 -3225 741 -5628 -4538 14674 15810
658 15810 -3582 -5524 1954 -9287 -13693 1348 6175 3052 7510 1032 -12397 -4546 6929 -1833
672 -1833 -2027 14667 11643 -7912 -10779 -4606 -6346 -3502 5652 8138 4803 1086 -4844 -7625 -2508
687 -2508 6090 10192 6356 88 -2334 -6727 -12385 -6236 4345 2626 -573 5326 3923 -5547 -2418
702 -2418 3504 -1202 2487 13074 5789 -6543 -3507 -4289 -13760 -7144 8439 8354 2298 301 -5281
717 -5281 -8536 1089 7821 4825 5469 5999 -2338 -9558 -6600 -1139 -94 -569 1449 3866 2588 -372
733 -372 -769 -1899 -4262 1328 10127 7232 -810 -4279 -8746 -12742 -3463 7323 6896 5827 4943 -5477
749 -5477 -10405 732 8228 4813 5226 4959 -4260 -8316 -4256 -4358 -5891 194 4985 3338 3021 2062
765 2062 -3007 -4868 -1125 3841 8946 9595 2778 -6737 -11880 -10806 -2490 6531 8398 4475 -388
780 -388 -5692 -7093 -1015 5053 5305 5764 4385 -3568 -7018 -3556 -2738 -4242 152 5198 5768 4245
796 4245 -218 -6293 -5509 948 4546 6646 7767 1312 -8829 -11697 -7927 -857 6826 7967 2467
811 2467 -1813 -3527 -3982 -125 5535 5133 2499 2594 -52 -4733 -4610 -3713 -4470 -1465 4385 4743 2568
828 2568 721 -4421 -6971 -927 6670 8267 5531 316 -6260 -8903 -4774 817 4350 5211 2994
843 2994 -1036 -3723 -3419 79 3365 1699 1003 2716 1470 -2984 -3862 -4005 -4943 -682 5937 5742 2587
860 2587 1019 -3494 -6974 -1025 6531 5255 3400 2750 -5024 -11265 -5145 1964 2350 2702 3541 -35
876 -35 -2873 -861 -204 -1104 2779 5863 2258 -731 271 -1821 -6628 -5745 1300 5515 4096 1686
892 1686 -975 -5010 -5079 147 3614 4213 5449 1898 -6171 -7387 -483 1230 -453 3269 5596 385
908 385 -2832 -570 -1689 -1990 2577 3513 241 1718 2106 -6237 -9245 -894 4749 2229 2315 4313 -135
925 -135 -5532 -3530 955 3750 5877 3766 -2950 -4993 -906 -920 -5110 -1155 5984 2750 -3310 -664
941 -664 2016 -2515 -3105 1216 3006 3857 4904 -990 -7986 -3454 2417 -753 -25 6870 4288 -5768
957 -5768 -6133 -674 1147 2519 3707 278 -2071 88 -1283 -4943 -1229 4685 2148 -2317 732
972 732 4828 594 -5294 -2973 2396 3088 2269 1626 -1613 -4106 -2461 -3183 -2790 5402 8538 -1543
988 -1543 -7955 -195 3116 -1953 250 5504 2102 -1156 -688 -3443 -2842 3524 1996 -5107 -271 7190
1004 7190 630 -6372 -1757 1702 -624 512 2796 1358 829 -1402 -5331 -3466 4223 5723 74
1019 74 -2429 574 985 -3096 -2967 2861 5010 -246 -3319 -1124 -124 -928 -830 -1233 -290 4107 3497
1036 3497 -3872 -2935 4165 1324 -4340 678 5866 757 -2857 -2347 -2685 -517 3162 -55 -2378 3037
1052 3037 3095 -4787 -4537 3226 4182 -636 -862 1350 584 -736 -2025 -1582 1446 3458 434 -2628 -260
1069 -260 2197 -732 -3478 -209 4187 1796 -2908 -1669 1036 95 -1411 89 975 1863 2231 -1201
1085 -1201 -3190 871 3205 -786 -1681 2467 1770 -2686 -2968 -710 616 1379 364 -1613 152 1647
1101 1647 -468 -2028 893 3181 1189 -1755 -914 1261 843 -1937 -2024 967 1931 120 -1063 -907
1117 -907 139 500 -792 -1200 2171 2980 -1984 -3544 461 1472 39 441 1078 104 0 -376 -1487
1134 -1487 758 2919 -165 -2764 -44 628 -1101 -1252 -572 -392 808 1073 -469 491 1763 -835
1150 -835 -1881 1154 2717 1268 121 -1425 -2590 -553 532 -585 645 1725 -1148 -2684 -497
1165 -497 1478 1225 1212 -136 -933 130 213 -1220 -165 1200 -382 -822 1068 586 -142 -1 -1240 -1172
1183 -1172 1697 1982 -438 -584 -573 -2858 -1621 1550 1666 910 1259 -924 -2685 749 2505 386 620
1200 620 1653 -795 -2113 30 -295 -1175 104 137 -757 450 1477 -580 -1505 -100 510 1453 2442
1217 2442 1130 -1063 -1991 -2118 -687 1394 1581 910 173 -1897 -2539 151 1725 848 903 941 -1545 -1162
1235 -1162 739 -479 -1382 734 1263 -647 1013 2409 -1350 -2481 374 915 739 2638 1445 -2470
1251 -2470 -3115 -1360 -871 968 3069 1127 -2121 -1638 -434 441 1469 1957 1222 -171 -617 -432 -266
1268 -266 -1125 -1212 -468 -137 392 2213 877 -2490 -2217 364 1128 1836 3663 1212 -3247 -2920 -1298 -743
1286 -743 2008 3924 -53 -3041 -753 8 -1038 1240 2823 173 -1492 476 -14 -1359 -880 -827
1302 -827 -1684 417 2936 1860 -468 -1340 -1418 -1032 1180 4016 3222 -526 -3240 -3023 -1850 -239 2165
1319 2165 2526 -438 -1804 -776 -846 -141 2364 2171 -967 75 1900 -10 -1928 -549 -1293 -2077 1392
1336 1392 3344 412 -1276 -833 -2571 -1586 2879 4096 1070 -406 -1462 -3308 -2309 1391 2571 1138
1352 1138 -88 -523 -720 -402 291 679 261 893 1187 697 -1047 -1629 -1535 -2365 -1441 2416 3512 354
1370 354 -1367 -1504 -2054 -351 3415 3512 1325 25 -1622 -4307 -1539 2210 1035 -623 651 111
1386 111 -1794 -705 609 -176 392 1649 1016 513 746 -1107 -3518 -2186 1376 2584 1691 678 -1030
1403 -1030 -2267 -1959 -519 2191 3199 1743 -887 -2767 -2387 -646 730 391 851 1647 286 -1823
1419 -1823 -442 1347 -287 -390 1441 1593 970 -53 -2449 -3469 -660 1087 576 1111 2234 -563
1435 -563 -3820 -1971 880 2312 2576 1569 -565 -1325 -1041 -1920 -986 1715 2135 12 -1259 -374 -101
1452 -101 -801 -1074 17 1704 1997 555 -806 -1527 -1510 -946 -175 1720 3224 1813 -1794 -2913 -831
1469 -831 700 649 1271 1892 634 -1516 -2766 -2412 358 1789 416 -470 822 1041 -1632 -1870 -123
1486 -123 1673 1673 855 255 251 -909 -2489 -2051 796 2622 1659 -188 -1313 -1164 -962 -1161 421 2720
1504 2720 2479 -237 -1686 -1313 -577 32 215 523 1625 1607 -1119 -2824 -847 806 -248 246 1827
1521 1827 1258 -638 -2109 -2396 -707 1906 1583 17 872 558 -2023 -2406 331 1600 1691 931 -908
1538 -908 -1097 2 -1073 -2030 179 2303 815 -427 -25 -499 -964 -772 -369 1409 2945 1313 -1500
1555 -1500 -1834 -753 -711 199 1174 1495 930 -600 -2662 -1745 1219 1448 148 712 786 -885 -1210 -692
1573 -692 -515 907 1839 58 -197 1409 30 -2565 -1121 1067 1003 1090 808 -815 -1493 -1164 -1701 -353
1591 -353 2742 2452 -388 -1423 -804 -644 -76 1017 1254 1016 588 -1278 -1464 -38 246 -156 236 674
1609 674 702 287 -935 -1551 -641 658 372 1148 1990 483 -1773 -1624 -853 377 2235 1571 -520 -734
1627 -734 -698 -1940 -938 1678 1535 -99 -229 -610 -1095 -216 227 -69 334 1219 482 -453 -192 -349 -1038
1646 -1038 -174 721 1258 1199 -68 -1486 -1688 -879 417 1449 1265 258 -776 -1084 -1253 32 1697
1663 1697 1041 -15 313 -154 -977 -124 390 -322 16 1235 281 -399 144 -870 -1713 -146 1321 1110
1681 1110 585 144 -1168 -1758 -122 869 1022 1348 242 -1010 -1143 -329 121 669 720 7 -266 -459 -580
1700 -580 -225 -63 -265 -202 791 397 24 57 -801 -1204 192 1368 852 503 197 -1428 -1790 123 758
1719 758 200 741 123 -1402 -1343 284 94 237 727 107 -116 511 155 -650 -164 250 -205 327 926 324
1739 324 -430 -1050 -988 156 1237 965 96 -282 -850 -1104 -196 948 722 465 -164 -1001 -270 759 559
1758 559 -181 424 110 -426 -74 44 -575 -621 -89 -166 445 1046 21 -1062 -480 25 88 828 921 -54 -503
1779 -503 -800 -736 21 985 641 -470 -164 -259 -355 178 440 77 21 179 -314 -176 137 -489 -764 -51 515
1800 515 257 140 40 -612 -360 326 257 529 786 -380 -1045 -541 15 -78 550 163 -551 63 -187 -215 195
1821 195 696 119 -210 395 360 -433 -200 -147 -716 324 494 -17 22 -121 -615 -472 372 903 456 381 -212
1842 -212 -900 -403 406 307 294 192 -57 -481 -8 282 39 -231 -35 -135 146 -124 -235 -377 -81 -493 256
1863 256 600 534 36 -587 -652 -106 1043 890 159 10 -404 -1122 -573 109 511 149 157 -490 -329 402 223
1884 223 -141 152 444 -30 -7 351 116 -509 -236 -228 481 699 189 -652 -792 -344 69 610 621 281 -75
1905 -75 -717 -817 195 840 515 -401 152 215 -302 114 186 -8 345 387 -380 -14 227 -705 -1325 -268 907
1926 907 287 273 65 -709 -597 121 103 643 1222 76 -1113 -556 118 99 180 -128 56 -94 -224 -417 -212
1947 -212 439 -75 -271 420 842 281 -420 -875 -783 644 936 482 237 19 -771 -921 -23 1060 920 207
1967 207 -340 -970 -86 73 -524 -258 588 358 -580 191 430 -272 -225 -19 253 914 1266 -388 -1342 -808
1987 -808 -353 -248 359 712 185 -625 -1094 -647 512 1239 361 39 -38 158 -311 -213 -86 64 222 30
2007 30 53 512 353 -901 -733 29 1061 550 345 -620 -1044 -434 -309 226 1117 1323 -362 -1266 -582 291
2027 291 453 473 371 179 -493 -337 -625 -247 77 -226 -393 330 768 195 -488 -874 -353 478 1178 885
2047 885 521 -352 -875 -1247 -267 658 1029 253 -608 -820 -280 0 256 811 705 -10 -452 40 170 -89
2067 -89 -464 -384 388 831 542 -216 -417 -539 -416 276 754 879 537 -663 -1197 -898 -28 665 712 297 -331
2088 -331 -367 -610 52 491 856 423 -175 -5 40 -188 -576 -642 -377 344 716 614 -236 -330 -467 -678 250
2109 250 1405 919 231 -530 -954 -418 204 669 488 268 19 -568 -471 161 85 253 363 26 109 9 -391
2130 -391 -848 -325 72 271 520 517 -104 -667 -476 -215 330 1000 448 -140 -604 -917 -919 -24 396 481 130 63
2152 63 -560 -369 152 246 -9 158 250 228 -112 -274 -804 -684 182 208 621 358 -215 -630 -520 -168 539 895
2174 895 627 -8 -522 -428 -397 35 408 562 70 167 -198 -193 -3 113 -39 180 383 203 -149 -473 -388 -320
2196 -320 50 365 607 444 -168 -858 -597 224 493 1013 563 -118 -654 -704 -73 -116 469 178 -134 10 56
2217 56 -505 -294 -23 263 228 687 364 -103 -98 -373 -585 -27 625 580 190 -282 -796 -725 -12 389 525 458
2239 458 73 -623 -688 -48 186 389 314 75 182 52 -237 -204 45 99 200 534 274 154 -353 -411 -463 33
2261 33 688 350 -89 -171 -427 -450 -62 84 484 397 76 -519 -329 85 253 -41 586 279 -198 -375 -124
2282 -124 -131 -234 86 163 442 314 34 -588 -259 -191 194 578 507 326 -262 -279 -433 2 268 418 363 -133
2304 -133 -499 -453 -215 -70 236 613 10 -29 194 17 -149 -225 101 373 186 237 -144 -462 -395 -263 -48 251
2326 251 734 27 -288 -605 -251 -26 261 381 102 32 -281 -446 36 289 -9 174 232 -78 -193 -128 -339
2347 -339 -183 -23 216 162 433 16 -527 -322 -21 42 426 466 175 -281 -192 -562 -137 500 726 74 -310
2368 -310 -221 -206 -34 157 -141 100 86 -96 -62 53 16 -195 -10 181 391 288 -61 -222 -293 -18 224 249
2390 249 265 150 -477 -686 -371 61 381 304 0 -111 -152 -234 10 256 351 78 -173 -233 -97 27 -283 -171
2412 -171 2 12 160 -228 -195 -261 -546 -406 181 570 331 86 -329 -301 -134 52 111 39 214 -58 -339 -312
2434 -312 99 98 85 -206 -159 176 -35 -243 156 -103 -85 -160 177 412 111 -221 -265 -36 120 321 422 -130
2456 -130 -219 -275 -180 64 153 290 3 -332 -250 42 132 58 -43 94 -52 -18 89 0 2 182 -171 360 241 6
2480 6 -186 -455 -342 -36 77 278 256 -59 -392 -389 -151 114 324 119 -43 -243 -6 -261 18 9 119 153 -146
2503 -146 -28 29 222 45 -165 31 126 358 5 -52 13 -346 -61 157 363 273 -157 -346 -250 -72 288 260
2525 260 -28 -2 -244 -311 89 17 142 -98 -285 37 82 216 -94 -237 168 218 99 204 300 -160 -288 -146
2547 -146 54 193 332 164 -268 -370 -98 -67 93 194 -196 25 -206 -147 -99 161 -80 -205 91 171 2
2568 2 -100 50 -125 28 -22 -61 154 -150 -259 -192 95 259 322 189 103 -197 -607 -29 271 275 351 106 -404
2591 -404 -145 -13 242 188 -157 -270 106 11 55 -15 -164 -389 38 95 105 483 241 -162 -312 -223 76 298
2613 298 -111 -26 -251 -291 -132 -52 173 243 -85 -190 -88 79 111 219 -23 59 41 -29 -41 -72 -8 93 170 36
2637 36 177 -295 -261 -196 -318 88 232 315 64 -104 -345 -230 14 93 417 -48 -109 -85 74 -47 -247 -40
2659 -40 187 -69 -25 -47 -81 -286 -96 106 143 111 133 87 -240 117 -25 248 183 251 -296 55 -120 -133 32 194
2683 194 225 60 244 150 26 -199 25 131 19 56 108 198 -93 -131 59 158 103 219 231 -202 -151 -148 -329 -39
2707 -39 146 77 -126 -105 -151 -134 182 249 -21 164 219 -49 -142 -220 -45 22 131 75 11 -116 -11 -173 -47 331
2731 331 53 209 -2 -52 -64 -41 -3 95 148 -4 -58 56 -74 128 53 198 129 207 196 85 -41 105 -228 -120
2755 -120 183 243 153 -91 -57 -219 273 166 98 317 60 -147 -216 -207 -32 126 -93 -39 -155 -196 -181 -111 -81 45
2779 45 83 303 150 -29 13 -127 -212 153 274 117 41 -183 -81 -103 46 50 4 -4 135 -80 -122 -57 -67 -138 221
2804 221 86 142 -134 41 -78 146 -11 21 174 -168 -249 -17 -71 -80 66 132 -14 77 -110 -80 -47 159 -19
2827 -19 57 167 -4 77 -132 -273 -27 156 -96 125 72 -75 -118 -96 -143 -84 122 165 78 -300 -230 7 -151 195
2851 195 155 14 50 -275 -81 94 137 -1 -142 -29 36 285 -36 -305 -326 -159 61 -43 216 -15 -193 -126
2873 -126 100 349 327 278 25 -173 -194 36 227 123 18 -336 -163 -133 -18 -53 135 -232 36 103 34 72 362
2896 362 48 -144 -88 65 322 126 -239 -292 -287 75 265 221 151 -147 -519 -368 -66 218 263 152 73 -96 55
2919 55 164 43 17 1 -60 57 111 401 107 -225 -248 -30 86 192 84 210 -174 -131 60 215 265 94 -138
2942 -138 -288 -160 184 128 139 82 -222 -190 76 45 165 -59 -197 11 81 149 93 -16 -263 -163 125 192 5
2965 5 159 62 -184 -348 168 156 119 39 -180 -305 12 -6 54 -32 -123 -197 -201 196 119 147 -111 -19 32 104 68 -28 82
2992 82 -177 -74 -66 62 226 -93 -205 -256 -65 10 138 86 220 -81 -96 -23 182 105 33 -52 -149 -49 193 -36
3016 -36 5 -235 6 -55 144 185 -134 0 -87 -98 -139 331 115 24 -191 -123 -231 246 136 -4 13 -104 -240
3039 -240 114 7 41 -2 36 -147 -1 117 -159 -5 -386 -86 160 258 115 126 -36 -331 -93 -4 89 -6 -32
3062 -32 -101 -27 -47 142 -155 87 -69 -136 -79 1 -97 -126 -135 -61 49 194 125 -15 30 166 91 -88 202 -43 74
3087 74 -82 -40 168 210 159 -114 135 -195 -26 -241 108 122 286 -43 213 -99 55 -271 -145 82 -13 119
3109 119 39 -143 -32 -88 -238 328 214 116 63 169 -90 -188 211 136 125 -57 -36 -259 -13 -33 29 -77 -82 -248
3133 -248 67 64 27 74 -374 -180 64 -84 -48 13 -162 -5 -102 64 92 238 -140 -208 -257 -63 135 -12 -24 -126
3157 -126 -253 -52 20 37 22 80 -4 119 229 -148 -223 -185 13 -11 343 -25 -77 -19 59 -193 120 19 99 200
3181 200 -112 -146 -37 -164 23 -182 -42 44 -102 26 257 161 136 -22 -19 151 180 5 -161 -77 -218 188 237
3204 237 86 180 41 -156 77 145 234 389 -59 -21 -140 2 63 -174 33 -144 -37 -97 -147 -246 -84 79 -61
3227 -61 71 231 67 163 -182 -72 -175 -10 166 127 35 -37 6 65 -3 101 214 62 42 29 17 10 -91 -5 -93
3252 -93 -80 -34 181 36 -13 114 22 154 317 -89 -127 -138 -46 35 184 74 -3 44 -14 60 -75 -92 12 31 240
3277 240 -5 189 -48 -10 -248 -36 129 11 64 105 58 -76 29 35 339 -41 -71 -241 -169 250 19 84 29
3300 29 67 276 -68 -124 206 84 -223 -100 81 145 162 -30 -232 -60 150 207 69 37 -147 -37 43 167 62
3323 62 79 91 -140 62 -21 373 -7 101 -127 -236 -133 62 15 -88 -52 -188 30 -44 109 -161 131 -215
3345 -215 132 125 234 315 -155 -116 -90 -36 76 212 20 36 -168 3 147 -31 55 -54 54 -189 -110 128 -85
3368 -85 -78 -338 -120 96 89 174 122 -362 -4 60 -86 258 -28 186 -152 -211 -21 33 183 162 107 -117 79 218
3392 218 52 138 -118 -176 -64 -68 22 123 4 -74 -117 -12 150 -89 77 -181 -281 -225 -78 -21 52 156 299
3415 299 -90 -38 101 -62 -154 -65 -96 -146 111 58 7 18 -169 115 -30 58 34 -56 -196 -111 116 178 -188 -98 -105
3440 -105 -127 37 314 41 98 -138 -47 -108 11 17 -140 -108 77 -36 99 73 157 -47 -16 87 90 -11 293 -50
3464 -50 -99 39 -264 -24 60 90 -91 47 -65 87 154 77 103 38 77 -203 -155 -89 105 -109 -246 174 -201 -69
3488 -69 -41 242 -89 -253 36 -3 -197 178 -25 -130 -163 -11 145 14 107 -3 -30 20 364 213 81 -102
3510 -102 -150 -76 -74 195 174 -263 10 -54 -24 120 69 15 0 71 100 -23 224 45 58 -41 103 213 149 -22 -43
3535 -43 124 42 -55 116 262 -78 -429 -54 -125 -97 100 121 -86 138 89 -5 -64 18 60 39 220 -35 -125 78
3559 78 -97 75 -33 -7 123 169 20 -59 -195 -107 227 20 61 54 35 -43 -121 -51 278 120 -86 -95 -347 34 -2
3584 -2 -54 82 -152 -180 112 76 269 -163 29 -65 -21 -62 63 191 -58 72 -82 55 99 52 181 -284 -170
3607 -170 48 -171 196 -46 85 -90 -73 -3 35 326 19 -63 -65 175 14 11 140 -177 33 -43 308 157 -126
3630 -126 -17 -44 -275 -92 259 134 106 -172 -114 -65 122 128 55 71 -95 -69 41 345 171 21 -283 -227 -153 234
3654 234 6 37 134 -305 -73 129 236 -146 56 -169 -112 214 77 229 17 -31 81 -60 161 123 -50 -126
3676 -126 -339 7 131 29 -2 -153 -250 -52 290 175 81 99 115 -117 -184 263 -83 37 -25 -305 -4 -24 339
3699 339 79 -25 -133 -123 149 183 55 52 -268 -213 80 261 93 185 -256 -69 87 104 148 115 -32 -217 -170
3722 -170 9 76 218 -121 -481 -340 -100 -16 237 95 -25 -37 -236 -61 246 184 -61 -209 -50 -18 10 127
3744 127 22 -77 -293 50 150 171 250 -154 101 -9 130 170 72 -191 -114 -110 118 140 213 123 -166 42 283 182
3768 182 38 -54 -146 -97 -109 4 4 -17 -102 -185 -210 127 23 65 -19 -11 -150 11 209 222 -174 -195 -315 -177 166
3793 166 -2 102 109 -130 -99 172 58 56 162 -191 47 65 -75 0 -179 0 -219 -17 271 165 -67 138
3815 138 32 -48 45 248 25 215 49 -98 -172 59 407 -83 37 -69 56 172 136 92 103 -148 -151 111 409
3838 409 -42 46 -206 -178 20 269 134 112 -36 -169 -210 169 225 129 -93 -155 -87 -58 114 316 19 -132 -308
3861 -308 78 220 160 -60 45 -64 -26 -2 121 170 -26 -266 127 187 236 313 -104 -81 -151 291 82 75 80 -51
3885 -51 -17 130 103 126 85 -160 -207 -60 58 110 164 -58 -64 -25 -15 167 132 129 -87 -313 99 -116 322 205 -68
3910 -68 -249 -96 12 -79 43 119 167 -89 89 -91 132 -91 38 -197 -72 78 -49 -81 -222 -98 4 -209
3932 -209 -24 -116 -76 -205 35 -51 216 150 25 -107 190 -28 -9 354 218 -235 -172 -86 -249 99 73 -116 -289
3955 -289 -30 132 0 231 -65 29 -179 247 180 227 197 208 34 -15 47 138 235 16 -94 -104 4 -59 -306 66
3979 66 -101 -28 -12 -51 -54 8 -88 123 -79 104 34 -8 -137 -223 -43 -206 130 13 -67 -85 -345 -40 -84 -129 72
4004 72 58 -46 81 -115 -63 132 -184 195 124 10 -16 -123 -63 98 321 10 -17 -40 -43 43 -60 -34 232 165
4028 165 13 -58 -35 -57 -5 78 -189 -93 16 125 -47 -167 17 -55 -15 -54 63 185 -82 251 -131 73 -79
4051 -79 -43 6 32 123 -53 -140 152 47 42 -41 76 -98 -126 27 59 69 -51 -9 -243 163 -25 78 194 175 -171
4076 -171 -82 83 -166 -181 -212 -45 49 30 -45 -144 -105 -54 -29 -136 -131 -117 -18 236 -197 83 65 -36 -44 -91 -104 -29 198
4103 198 -43 -151 -133 -5 82 42 4 -149 83 -49 17 50 -125 26 -131 59 -88 62 91 74 -75 28 21
4126 21 -188 77 -286 132 100 49 -102 -64 27 58 104 109 -131 -68 98 6 -159 57 -39 -13 83 -28 -2 44 -18 -2
4152 -2 200 -36 39 -74 -179 35 -6 -72 -57 -200 105 152 87 -106 -38 16 69 -128 51 -75 -92 13 -121 -98
4176 -98 -122 30 167 143 -101 -162 122 218 -46 27 18 -94 99 -151 -341 -128 -49 199 153 -54 -201 182 106 96
4200 96 -5 20 49 55 -114 80 141 108 109 -67 45 -98 135 -44 -62 119 71 51 11 128 -129 -133 -43 -178 -245 181
4226 181 108 -146 -25 213 -61 78 -80 -73 -27 34 22 -11 24 118 116 -67 -15 -62 -158 -80 -248 -6 -38 30 -138 29
4252 29 -77 -190 -49 34 93 -150 85 151 -212 -11 13 145 112 -74 -138 141 170 45 -208 14 56 2 22 -182
4276 -182 133 168 73 -129 -32 -117 -53 3 49 -39 -40 123 32 -113 -149 153 136 -135 109 -60 -3 122 140 27 -74
4301 -74 -212 116 -112 126 -156 -113 43 -74 -72 76 -53 214 -1 201 102 -295 -11 95 -151 -85 -141 -212 -54
4324 -54 -43 -231 1 64 -72 76 128 74 -123 -43 100 180 15 -10 118 197 237 -41 -78 69 -48 18 175 -25
4348 -25 -28 267 -144 -43 -64 7 19 -193 38 -81 29 47 -26 -178 -91 159 -121 106 -136 -121 -264 58 -57
4371 -57 222 -59 -118 -4 24 -20 84 -57 -202 -237 7 30 106 101 -187 -51 -209 135 -30 -173 -119 32 -9 84
4395 84 -75 -133 0 -17 100 -45 333 180 -45 -34 166 136 101 -105 176 -82 -171 -21 -82 -45 -50 1 -197 4
4419 4 81 169 89 -44 88 71 4 5 51 -43 -68 117 -31 170 168 -108 -88 -103 -180 -61 15 91 -336 62 35 22 132
4446 132 32 -112 76 71 -169 110 -198 -66 -52 -202 156 -117 48 38 -36 -170 86 2 122 122 54 -26 171
4469 171 -181 -37 64 -112 59 19 23 -149 -80 -51 -17 86 -114 126 -77 1 -63 -162 51 -47 -95 107 220 -41
4493 -41 -165 -99 118 136 -83 81 88 -97 176 21 -76 -200 -130 -50 173 137 124 171 -109 -50 117 32 -108 -23 163
4518 163 56 67 6 11 -130 103 -40 -125 32 -153 70 90 155 -29 -67 1 -147 -102 -72 -128 -3 9 55 183 48
4543 48 27 -75 -134 83 -169 -100 27 -128 21 67 121 -34 61 139 35 28 85 110 138 154 -10 -10 -55 24 -41 209
4569 209 140 38 26 6 -37 -105 46 17 39 63 44 186 -115 -120 -25 -106 -42 101 -78 -37 31 -16 -10 -39 90 -96 -47
4596 -47 -40 187 -88 -112 -240 -129 163 121 148 288 57 9 -26 122 234 10 -28 -79 8 54 -168 -90 -18 -78 -83 85
4622 85 115 -170 -168 99 120 -252 217 -103 108 -155 63 -21 305 -161 -60 -78 -108 70 119 204 191 113 67 120 37
4647 37 -26 103 257 -55 40 76 104 -112 -81 91 9 96 -2 -93 -14 -154 -31 70 114 78 105 110 -1 -98 55 114
4673 114 16 -131 -70 108 -12 -242 8 -135 84 76 -42 -119 116 45 43 -33 -119 0 -122 -63 -135 188 -16 4
4697 4 -11 -41 145 -22 -300 -82 7 -100 -70 107 107 -45 101 45 -134 101 2 -122 -105 -81 234 -101 148 -222
4721 -222 -178 -44 52 12 1 -155 -56 79 174 156 30 -137 -142 -109 -47 -52 -25 80 -268 -4 -23 23 28 95 46 -101 -97
4748 -97 292 47 155 30 -65 45 25 -80 104 -159 -99 87 -14 -65 25 128 61 163 129 -23 60 49 -63
4771 -63 117 88 -76 80 200 187 -55 26 16 37 10 32 -68 -81 145 14 91 44 -104 -138 41 120 -102 -107 -136
4796 -136 -13 -183 33 294 -65 -177 -104 -139 0 163 -99 111 -95 160 -145 10 103 -113 108 143 -83
4817 -83 169 194 -9 25 -24 209 -65 141 78 -32 -141 -72 -74 46 92 53 53 -149 205 128 111 -131 -40 -131 -24
4842 -24 3 -117 -11 97 -59 149 93 -202 -184 54 72 -94 -81 64 94 -69 37 32 -148 144 40 -108 12
4865 12 26 -22 95 -7 -53 131 -38 -72 -54 -74 135 -169 68 277 -29 -120 50 -102 174 -37 -258 5 54
4888 54 48 -100 112 -67 46 68 -47 6 -160 -32 95 -222 290 -98 -9 -59 -65 72 152 -116 -32 13 210 -107
4912 -107 -32 56 90 58 162 68 36 156 -86 -67 -84 156 -98 43 -8 -18 -1 66 3 95 -79 160 -183 -87 3
4937 3 -141 -85 26 -154 -38 44 44 77 -287 -29 165 -102 -68 -22 131 -33 -89 -68 60 -20 -188 302 20 -82
4961 -82 136 -19 29 109 22 0 -111 -33 -145 10 79 50 23 52 -58 -66 -168 55 -80 120 92 -26 -107 47 84
4986 84 -122 -111 59 138 81 95 83 226 -187 149 -18 76 106 -68 -93 117 41 173 -88 -149 -10 46 128 18
5010 18 108 65 81 96 -10 120 -5 61 129 -34 214 -71 88 -80 79 -124 -102 36 25 30 172 -7 -88 225
5034 225 -231 1 186 54 -81 -24 120 145 -42 58 -152 0 -77 35 -245 70 -73 -134 -71 70 -96 147
5056 147 -58 117 -178 -142 45 -224 53 6 23 47 62 112 -45 -220 29 -7 -128 -195 87 -31 -93 8 214
5079 214 124 -151 27 171 3 -151 -109 150 59 150 -31 31 92 50 216 51 121 18 208 -15 -86 103 -135
5102 -135 -5 -26 15 130 122 -71 -9 -236 -67 50 41 36 46 50 -14 110 -7 -5 101 -130 25 252 -28 -148 48
5127 48 -34 -146 -64 -149 -169 96 -226 -193 33 61 294 -21 30 -238 -199 40 -57 95 19 -108 269 10 102 1
5151 1 53 19 -98 -69 -16 -60 79 -137 1 44 -100 -33 -2 -5 -151 88 155 31 -28 114 62 67 40 -95 92 91 -165
5178 -165 -78 -64 70 12 27 -125 35 -60 -115 21 310 154 317 2 -92 11 153 20 -107 -178 -118 127 -133
5201 -133 44 95 74 -148 157 35 180 -128 97 104 -14 -37 13 264 -3 78 155 85 29 -183 -7 105 -18
5224 -18 37 129 56 46 -27 -212 167 111 199 110 -156 -25 -197 -153 -34 -104 71 82 -119 80 76 30 129 -83 82
5249 82 -59 231 49 169 -48 142 125 -73 51 -285 107 37 -70 35 86 66 174 142 16 40 8 145 -36
5272 -36 -161 -8 -61 -28 -101 103 -86 -71 -185 -6 254 -159 141 11 215 81 -128 59 -36 -4 -21 -196 -114
5295 -114 -2 14 -134 83 -24 129 72 66 113 -180 195 -139 77 118 -114 -72 -83 26 -147 -63 -192 41 109
5318 109 -69 79 -52 -21 77 -70 112 175 221 -99 -132 35 118 -42 119 -31 -72 134 -81 41 -20 -34 11
5341 11 -68 77 4 -92 200 95 -87 -101 32 196 -76 -191 -1 -285 8 -57 49 -178 -265 -4 157 -110
5363 -110 99 -334 -27 -85 -34 109 48 306 -170 -274 -139 190 -203 19 188 15 149 -113 -76 -126 -29 95
5385 95 -23 77 -19 -54 45 25 -100 -105 79 155 -168 68 141 121 -63 129 178 68 -61 -47 -85 -133 -100 9 14 93
5411 93 -144 16 232 156 -70 197 211 -72 7 -172 59 -80 -12 -18 173 -101 -42 -163 73 -93 117 86 34
5434 34 0 -5 -170 73 243 -13 -23 21 196 128 -237 -124 -45 -5 163 87 -283 -108 107 178 -116 -93 192 166
5458 166 -146 82 25 144 36 136 150 -115 -113 315 40 214 62 60 144 110 87 -53 79 -35 22 92 -75 170
5482 170 132 -111 -60 17 190 87 -125 32 60 184 194 54 93 -121 313 -88 190 111 -246 83 87 2 95 -13
5506 -13 106 -89 155 -253 -12 65 97 18 -125 60 115 86 -21 83 50 -152 42 35 31 150 -103 -146 -94 332
5530 332 113 -90 -132 -103 -34 -39 55 -12 285 0 48 -104 -51 -18 -106 -69 -58 -7 -5 -49 -125 -8 47 -25 -64 -68 -55 163
5558 163 19 -53 16 -24 74 -210 14 -65 11 -19 172 132 18 -3 -26 -18 -73 -38 85 -34 -96 162 -42 -191 55
5583 55 90 183 162 -65 -145 -54 99 56 80 35 -20 191 -23 24 -40 74 62 -139 -112 60 -32 141 -96 -117 24
5608 24 -122 -39 35 -96 143 159 -150 51 152 21 -35 -55 -126 88 -2 -40 -72 109 16 56 -87 -107 2 -26 -23
5633 -23 -180 -98 84 -26 -107 22 23 145 -167 109 -3 -44 170 -98 195 -5 70 139 -133 12 -8 -3 -116 11
5657 11 -87 -225 71 -38 55 -234 115 7 88 226 -30 -63 -88 -45 70 30 16 3 136 20 -83 165 125 -10
5681 -10 -152 113 -37 -149 67 -23 -89 -26 -31 12 -182 -62 -36 -194 -10 -27 159 -52 158 -87 -18 -73 -69 205
5705 205 139 -86 -93 84 75 11 -40 -186 0 34 -210 -150 166 32 -58 -77 -32 110 132 134 73 193 58 67 143 112 -159
5732 -159 -69 -119 -141 13 66 -70 -9 133 -111 -113 39 -201 82 -115 -68 33 70 -48 -181 166 78 -62 -119 63
5756 63 -127 -43 27 98 -154 -179 100 -5 -119 59 -146 -19 98 -37 -128 252 180 -169 1 -58 104 10 40
5779 40 -32 -4 77 26 -81 141 -234 -26 -119 50 -103 195 -68 -43 -12 85 91 -22 -108 -49 -102 -27 -161 -35 -81
5804 -81 5 -49 -36 -48 82 97 14 211 72 -59 126 10 -97 -57 -166 135 109 -200 21 224 132 75 154 48
5828 48 -23 -38 56 -40 -76 -40 -82 14 108 91 10 164 -219 -17 51 -43 -52 -27 -29 104 96 78 43 58 -72 164 121 -62
5856 -62 84 115 -150 -270 107 -314 133 91 127 201 -115 -90 179 80 1 126 -103 -38 3 -103 232 -10 38 -41
5880 -41 -7 122 10 79 -38 21 120 109 15 22 -174 121 -46 -262 40 85 78 -231 -105 -32 49 -21 -6 53 98 75
5906 75 -313 170 17 23 -180 -122 12 37 -76 -110 17 193 139 40 12 58 -77 -175 -102 -4 -1 184 16 13 130 51
5932 51 145 -22 132 -212 -124 -49 -52 183 -2 -237 -115 -174 -5 -79 -29 -94 58 -67 -91 -132 -82 87 -36 -173
5956 -173 -19 -26 134 79 57 100 38 -155 -10 -53 34 -99 -165 -52 244 -19 -68 -131 -206 30 -129 133 44 20 41
5981 41 109 114 192 106 27 -186 85 203 144 69 78 98 -7 -163 -80 -6 126 76 105 -24 -13 139 7 77 -122 -113 -88
6008 -88 30 -11 159 -193 11 157 -3 236 -11 10 60 -170 -110 231 -16 -228 28 5 -209 -147 -73 27 96
6031 96 39 148 4 -31 -133 2 -41 125 170 -126 -18 -148 6 62 126 207 167 -164 -33 -120 94 94 -29 46
6055 46 -101 113 5 -183 -134 85 137 -157 129 -149 -111 13 76 24 -106 22 -29 -30 26 -224 143 191 -179 37
6079 37 -93 -36 98 236 39 150 6 65 160 60 0 14 -65 -73 64 145 -199 -116 -18 -75 56 107 117 68 33 -149
6105 -149 -151 102 -50 117 175 -199 148 -25 115 -174 -207 -50 -204 65 -27 39 -194 -89 120 59 154 47 13
6128 13 254 24 -190 -11 -134 -148 -40 171 2 82 -81 112 88 137 12 99 66 -190 42 152 -18 -9 -127
6151 -127 135 55 56 -76 158 107 63 -103 -114 132 -64 148 -178 -9 -155 -85 229 69 -106 -39 1 -48 20 37
6175 37 110 52 69 -84 -248 -5 127 -93 -47 -64 -54 -22 -183 278 163 -37 82 -11 154 26 45 77 -92 23
6199 23 -41 10 127 193 -34 234 184 54 50 -16 49 83 170 -5 -3 -54 45 186 -29 -207 -142 -119 60 -81 273 -213
6225 -213 87 5 -109 165 38 -61 -62 119 31 184 -170 -189 -136 61 -257 -21 -126 73 91 107 -123 277 -9
6248 -9 -72 -101 -227 43 -72 38 -104 68 65 -95 -54 10 19 11 -154 151 -107 195 45 -15 -104 -60 -67 -285 -59 -96
6274 -96 7 -1 58 76 -110 96 103 15 -52 225 -84 287 -126 -184 11 7 191 107 113 -46 -10 -36 -76 16 -229 120
6300 120 80 0 126 30 -16 -137 16 -24 110 219 185 -75 -200 35 -162 33 56 53 -100 -136 116 76 -93 160
6324 160 92 9 87 112 208 96 35 125 -142 60 8 -75 -102 100 24 -11 137 -19 -46 86 -175 42 -24 -29 -54 -171
6350 -171 115 -189 -39 -8 59 -16 -117 -78 -186 -132 157 -37 204 -87 69 60 -8 -44 -1 197 -37 -119 92 -135
6374 -135 67 105 -94 -77 -80 223 -54 77 24 123 -106 -167 8 12 41 -114 -247 -30 -91 104 -30 104 46 103
6398 103 120 -184 -20 80 -9 -170 -10 -100 -29 -95 55 257 6 158 -98 179 -14 20 30 -67 176 224 90
6421 90 262 35 -23 -203 27 -47 -82 -127 -15 -82 -100 -56 -4 -1 214 -151 -122 -93 102 -64 225 174 -5 -37 123
6446 123 -121 -8 -97 152 239 -316 31 51 17 -139 -75 -17 13 -86 -80 -48 51 212 19 71 56 -96 21 6 60
6471 60 18 155 335 33 -39 19 -150 44 -102 -112 66 22 -162 72 102 154 189 -88 -90 2 82 37 51 -134 -156
6496 -156 125 -46 110 -62 113 -51 132 -30 60 86 71 29 28 90 -324 4 -6 91 90 -152 -393 11 -21 31
6520 31 -13 80 90 -166 -105 39 -82 70 -121 29 -77 -86 218 -55 231 6 156 -214 201 -47 42 -44 -150
6543 -150 105 -75 -71 -97 -29 57 -177 -155 46 83 -57 54 -164 -175 155 123 -122 -34 39 -173 -59 97 -259 -150
6567 -150 96 -119 -16 7 -2 43 -87 -127 146 19 -79 178 -158 -230 23 -88 -18 80 60 87 43 3 -52 -7 -111
6592 -111 94 -54 102 100 -136 -72 -122 8 -157 100 154 140 169 -87 115 -15 167 39 -25 -277 51 152 -95
6615 -95 17 53 -52 -81 265 -51 43 -149 -30 -134 -141 -94 -82 -77 -143 -23 332 -249 41 117 37 77 41 -6 69 78
6641 78 124 -7 -219 19 4 62 17 -229 65 109 -211 128 89 -106 -94 -44 -168 56 -79 -87 50 100 221 -4
6665 -4 265 -269 -3 -269 -26 75 -51 -59 -93 -10 -126 63 -137 77 138 52 -98 134 -220 -218 144 173 -69 -105
6689 -105 223 50 195 152 -6 0 -89 -80 -5 154 194 62 66 201 70 130 162 3 105 -131 72 -23 -127 -101 -18
6714 -18 29 -140 22 -10 -2 -98 67 -120 92 13 6 28 -26 -66 -83 -27 -49 91 -69 -29 -150 173 -230 51 -35 143
6740 143 55 164 -133 82 -200 -8 -52 36 74 76 163 242 143 -44 109 230 -4 -10 -5 -112 -88 235 193 231 -62
6765 -62 -66 -61 5 4 119 -23 -131 -141 -46 -112 140 -34 -12 -115 79 -141 -65 53 48 108 -18 8 174 -66 11 -5
6791 -5 -181 -168 -52 -84 -266 129 -95 55 -36 84 -216 46 -140 -100 101 -11 34 173 -26 -34 -181 -4 -69
6814 -69 75 -133 59 -138 4 -126 -101 135 -96 99 -44 163 -100 -64 -145 -37 47 -52 92 64 -54 -72 -61
6837 -61 144 74 -77 -106 -75 -143 -85 169 56 23 -4 -74 -35 128 34 -75 -125 -65 50 -97 27 0 220 -33 -215
6862 -215 -127 -65 163 -9 -17 -27 9 136 32 -215 -103 155 5 -57 -129 51 -203 144 6 -111 56 -65 73
6885 73 -173 -72 103 -51 88 -90 11 -222 -35 -139 -68 -147 -80 -85 -46 -34 -183 -49 -36 -1 84 112 52 -78
6909 -78 -250 -127 -30 26 3 -128 -52 65 236 202 -197 59 -82 76 -34 61 37 -235 -145 129 151 67 -21 88
6933 88 58 -129 -15 181 107 -31 -23 31 -86 28 -169 -132 159 68 103 258 -136 -116 15 107 147 106 -68 1 246
6958 246 69 11 -101 91 -68 -4 -105 31 119 -22 -121 -174 135 -169 71 -202 -69 -12 -46 175 19 191
6980 191 -101 -52 -39 138 -6 166 54 174 262 -136 47 39 106 101 95 -85 98 56 -39 -102 190 30 20 10 168
7005 168 -34 -4 -1 202 22 188 -109 -114 38 -19 148 -22 -50 58 76 74 -38 -317 61 110 -31 45 14 -131
7029 -131 -40 -115 34 199 84 0 -90 -169 -235 -266 35 -14 -71 40 -24 -15 99 -87 -116 116 -7 -14 145 -6 -220
7054 -220 52 26 -43 29 1 58 83 -53 -105 8 -60 -203 -159 25 -53 90 -142 28 134 -194 222 24 -2 -263
7078 -263 72 83 116 149 59 -87 131 81 53 26 213 5 -113 -56 59 -89 54 -24 -86 -95 -155 -16 -73 204 99
7103 99 68 -51 67 8 -96 -214 76 -91 100 147 -114 -248 -78 314 -57 73 -115 140 83 -115 178 283
7125 283 -76 24 -112 159 21 115 -196 10 102 -93 191 -20 250 13 -129 100 -158 71 181 -93 -125
7146 -125 -33 71 -76 -27 52 -4 -107 60 33 -35 69 151 -179 235 52 -77 -22 48 -4 -51 51 -107 -283 -14
7170 -14 -103 9 3 117 50 83 35 82 -44 -164 115 -163 74 -65 22 54 3 -155 -14 -7 248 154 -119 -2 53
7195 53 166 51 26 -43 42 1 95 41 -42 138 -121 -55 36 145 -71 -363 119 -53 -45 53 198 -36 -23 -83 118
7220 118 -19 79 182 30 118 -106 -149 86 171 -11 -97 -90 179 -116 -24 103 99 33 166 -232 -114 -8 60 111
7244 111 123 24 96 -241 -19 177 -55 -127 104 -82 80 -215 9 142 51 219 34 -207 -168 62 -17 96
7266 96 -152 -92 160 89 114 -57 -13 -107 -81 -7 -81 237 -9 76 179 77 64 -66 -139 -58 45 18 -383 -13 11
7291 11 213 -22 -57 167 -113 -83 230 24 -172 -139 -72 -175 207 256 -30 186 92 -67 16 -104 -150 50 14
7314 14 18 36 240 -116 124 113 -67 14 74 42 116 89 272 25 -153 -40 155 -64 14 -66 145 154 35 -62 30
7339 30 37 3 -63 -71 -17 -111 -10 19 -144 151 44 -142 67 -26 387 -91 -67 152 -70 -47 -152 -85 20 -88 61
7364 61 69 29 42 27 -77 -22 5 38 145 83 23 -109 -78 -81 -186 138 -126 -161 -36 59 -113 -86 -96 -120 113 176 -138
7391 -138 -215 11 -14 102 -232 -94 -44 55 -45 10 -129 -10 53 83 -38 59 140 26 64 -22 -23 -21 -172 -98 100
7416 100 -63 -124 105 16 -300 284 105 -25 -22 -57 77 103 -132 -24 -33 74 18 27 66 39 -55 34 161 -63 122
7441 122 6 -11 248 73 82 -43 -209 7 -42 129 100 145 -32 76 -221 70 -61 21 22 141 17 -29 61 -129
7465 -129 42 -12 -63 38 254 78 -149 94 75 -116 83 3 -265 26 -126 -6 -22 117 16 174 140 -85
7487 -85 -76 80 -12 40 -64 59 -9 53 27 222 14 -178 -16 -66 62 17 -103 -14 16 -135 -37 -15 73 140 68 -51
7513 -51 -105 0 -43 -165 -32 76 20 10 -168 -76 57 -114 -180 -30 83 92 108 -126 -8 -71 5 124 -39 -55
7537 -55 76 53 -169 198 127 86 47 143 -28 -34 -100 -271 171 54 108 -203 31 -5 46 -110 -127 86 -59 -26 -76
7562 -76 -45 -54 -38 -38 -47 101 -173 183 -65 109 110 58 75 -83 -130 -169 53 -68 -97 69 -39 106 -361 -249 -32
7587 -32 126 -68 -83 -24 145 -111 97 75 -85 170 -157 132 71 79 -118 56 64 24 -166 -14 52 51 128 -112 -86
7612 -86 -44 120 50 74 131 42 -17 7 29 -93 45 36 -57 -19 -49 -221 152 184 29 -101 -82 -28 59 -1 28 24 -103
7639 -103 130 134 -182 39 -20 -74 -135 -112 45 -41 29 140 50 -61 -95 47 -135 4 6 34 16 -12 -51 -35 -174 -104
7665 -104 -73 -21 -197 -14 31 -37 -96 25 -31 -30 152 95 -106 65 71 -23 64 -21 10 -99 61 122 -64 226 -160
7690 -160 112 -18 -84 -67 -97 157 128 166 -86 259 -1 -81 -20 -8 -67 54 -20 175 -104 -67 -22 56 61 123 -48
7715 -48 -259 -33 107 -40 94 29 -30 14 -58 -22 71 88 -180 -27 187 50 -11 -2 -23 -25 -35 32 193 155 -40 74
7741 74 -46 32 34 -43 -30 25 -4 -150 60 88 161 -51 102 119 66 -9 26 67 71 22 -187 -45 -32 0 -53 -50 -58 34 258
7770 258 -299 42 -57 -41 -31 8 -114 129 -67 -21 216 -35 39 -61 133 -66 -98 -113 -63 -4 -173 -37 -36 157
7794 157 -75 -125 68 158 48 -24 -48 84 41 2 -9 -24 -94 -26 31 87 -112 120 87 45 166 97 142 -90 -96 152
7820 152 80 37 91 145 142 39 -17 131 -37 -231 -94 -229 -4 -220 38 -338 -290 96 -95 -98 -132 -7 -126 -124
7844 -124 32 19 64 -42 -15 -33 170 -68 -66 -4 4 0 -272 8 -123 -17 47 170 -17 218 45 69 41 36 201
7869 201 37 2 -256 19 19 101 -12 73 124 -159 86 17 29 -87 148 71 195 -127 207 -81 -102 42 6 -79
7893 -79 -87 -87 75 42 -13 -49 -199 -103 -97 -221 -101 -79 -24 -117 -34 -130 -119 23 -90 -146 173 -82 138 -39 -15 159
7919 159 -150 -106 58 141 -100 74 -152 123 -56 -46 21 43 47 68 142 -94 166 100 -77 -44 385 -158 -20 293
7943 293 67 126 4 -10 -179 -213 -31 111 -115 339 41 -256 -40 11 24 45 125 -151 178 78 32 34 -73
7966 -73 202 -89 61 153 16 96 -3 133 -234 146 -146 -262 72 133 128 55 45 125 24 -7 165 180 40 -124
7990 -124 -160 -129 109 -40 -106 17 111 -66 -145 37 56 100 161 -115 87 107 -109 -100 -117 348 -161 27 -205 -12
8014 -12 28 -4 386 -18 -40 -106 9 48 87 21 7 36 58 -19 197 -53 19 -112 97 35 176 70 -138 -87 -39
8039 -39 -35 55 -21 151 -123 -140 -14 131 25 -94 -78 89 128 -2 104 13 -42 222 -58 112 149 74 164 61
8063 61 33 8 -16 267 90 59 -140 76 102 -3 68 -120 -166 -122 -3 -241 -179 13 -340 -7 104 -155 -68 -111
8087 -111 107 1 -114 -77 -161 100 -52 121 146 214 71 -170 66 147 -145 99 125 -186 64 54 88 59 81
8110 81 111 -245 122 -55 -182 -231 17 31 139 345 -92 -129 -177 -1 -11 -174 -160 8 21 38 -156 174 38
8133 38 -43 40 -33 34 115 9 37 49 155 160 -47 111 -20 -109 1 -117 97 16 118 157 14 229 93 71 -53
8158 -53 1 -123 -149 -54 59 14 26 4 3 186 -22 104 -103 38 169 -62 -261 84 -144 45 183 69 -40
8181 -40 191 -108 37 107 111 -65 -20 -47 -55 -63
8191f3
$$ Imaginary data points
##PAGE= N=2
##DATA TABLE= (X++(I..I)), XYDATA
0 0 0 0 0 0 0 0 0 -8 8 -8 8 -16 16 -24 24 -32 40 -56 64 -78 95 -112 131 -153 183 -214 248 -287 329 -377
30 -377 433 -495 560 -632 716 -808 906 -1015 1135 -1267 1409 -1567 1737 -1923 2129 -2353
46 -2353 2595 -2860 3153 -3474 3826 -4214 4646 -5127 5664 -6270 6959 -7749 8669 -9752
60 -9752 11048 -12637 14637 -17238 20774 -25886 33956 -48630 83801 -347239 -49718 609706
72 609706 -245792 -259117 391235 149960 -405749 81594 309426 -128799 -64029 322695
82 322695 -69597 -349696 77012 169114 -276294 -134978 250044 12858 -214519 182896
92 182896 257337 -214862 -185814 282870 129777 -216804 57549 206238 -253201 -280577 177995
103 177995 69764 -215444 133725 255385 -216081 -155179 288810 50926 -190571 205909
113 205909 158772 -349382 -77047 344114 -149405 -405237 206865 265929 -304372 -119679
123 -119679 373564 67316 -258535 66798 175001 -104666 -14165 177388 -72658 -210250
133 -210250 49299 57126 -176235 -21281 217638 -13507 -185751 103245 181173 -120204
143 -120204 -75478 193565 15946 -192969 64495 142436 -171911 -134308 133135 -20823
153 -20823 -145876 144839 166272 -135732 -52720 140259 -56300 -98589 171559 79590 -184489
164 -184489 -22770 100811 -147542 -123764 181809 82163 -161716 18077 176646 -45829
174 -45829 -123485 88072 91866 -75490 -21180 78527 -33721 -95306 5168 -12645 -85931
185 -85931 48852 148403 -24491 -103749 61751 59218 -95907 4068 148703 -5610 -109630
196 -109630 24786 4885 -122412 2720 117221 -31596 -66535 82732 34889 -82054
206 -82054 20406 71946 -49234 -20949 89127 -5685 -91945 6768 17273 -78963 -12949
217 -12949 94540 22359 -42121 26857 24919 -59297 -15355 83434 37592 -50254 -22330 10524
229 10524 -37215 -41199 19089 14833 -17507 23298 36521 -28919 -15368 55903 9812 -52618
241 -52618 19506 58975 -23333 -40036 9457 -29331 -55383 28727 50828 -17358 -4071 35226
253 35226 -17502 -37340 28747 35600 -7119 6190 9509 -36777 -30561 15520 1930 -22653 8327
266 8327 26668 2147 -1819 10815 -3012 -15004 4110 19714 6935 -5498 -4850 -14302 -31070
279 -31070 -19477 15120 26744 14093 4425 -4560 -12118 396 15722 8267 1413 8489 -2533
292 -2533 -23194 -15646 -1497 -6609 -4508 7534 5929 5841 12574 2622 -11506 -5017 5887 10285
306 10285 16166 7005 -17475 -20537 -7776 -9472 -2299 21851 17310 -7590 -8086 -2914 -9323 4686
320 4686 22310 3710 -13104 2270 2969 -16994 -8004 9681 -3082 -6484 16010 12620 -9013
333 -9013 -1351 8003 -10239 -11251 15944 17031 -8046 -10604 -3871 -16726 -12951 16326 18088 -5375
347 -5375 -1513 10442 -8808 -15624 14760 19899 -7832 -4040 11871 -11473 -19852 11260 7749
360 7749 -21522 -313 24781 -5815 -18180 14713 8055 -22884 1208 26294 -3206 -11619 14868
373 14868 -1867 -27958 3052 23111 -7120 -8017 19729 -930 -29115 2056 23909 -6716
385 -6716 -11924 17184 4455 -23107 -1954 15705 -8181 -8130 18820 3059 -20933 7996 21921
398 21921 -17250 -17139 25164 10655 -24098 2397 19754 -16918 -18464 17025 3282 -17334 13780
411 13780 16223 -25613 -12102 27783 2656 -21305 15153 21966 -19765 -16453 16918 3808 -13856
424 -13856 7998 9935 -16371 -5712 17002 -5328 -19052 13526 19169 -17709 -13228 22243 6166
437 6166 -23856 387 19022 -6187 -5762 16884 -4942 -21164 13462 15354 -22334 -2858 31960
450 31960 -7190 -35600 9193 22448 -16441 -7250 20592 -3573 -15395 12100 3953 -17108
462 -17108 9996 22286 -15069 -17248 21171 10673 -25683 -9445 20479 4449 -13225 2713
474 2713 8596 -8242 -7666 5590 -373 -2437 15488 7010 -23056 -9636 21328 1292 -19170
487 -19170 11235 21749 -12969 -14406 10332 -686 -8248 13203 3149 -19667 6634 19325
499 19325 -21135 -23668 21345 15923 -17859 -1166 20187 -1535 -13077 985 692 -95 15148
512 15148 6983 -18398 -9430 12164 -3323 -19718 5394 25624 -135 -21690 362 14347
524 14347 -5696 -9363 10727 8624 -4037 1724 -1544 -14156 -192 13251 -6956 -9256 20198
537 20198 12612 -21840 -12834 11716 2803 -3446 7253 2034 -5865 1335 -4792 -17704 1977 24290
551 24290 6133 -14326 -469 11994 -2281 -12282 -454 10613 6912 -1208 -5475 -8380 -4308
564 -4308 1996 -3919 -8077 11994 21313 -7232 -20002 6140 11150 -11623 -1964 21669 5767
577 5767 -14843 -6190 -3085 -7880 4941 9054 -4876 1543 12718 -5548 -18338 2262 13625
590 13625 868 -3970 3080 3788 -1688 -8306 -11543 -1658 12051 11620 770 -5194 -1276 2120 -5154
605 -5154 -9654 7495 19057 23 -15308 -5755 -1872 -6249 1061 6255 1801 8185 8104 -11771
619 -11771 -10099 12839 5031 -12674 5776 18441 -5782 -17038 -3087 -2690 -6341 5096 9017
632 9017 2839 4690 945 -12721 -8563 9377 10808 2000 -112 399 -3968 -10131 -10023 1023 10258
647 10258 7151 2609 1505 -3943 -5778 356 -859 -1643 11433 10749 -10706 -13854 48 -3657 -7850
662 -7850 7692 13576 3376 2331 -579 -11036 -3212 10583 2615 -3611 7992 4942 -15331 -15323
676 -15323 -927 1386 1991 9137 8430 669 -3351 -4938 -4239 2817 9333 8334 665 -6595 -7617 -6901
692 -6901 -7210 -286 9508 6077 -1491 1899 2039 -6447 -3509 5378 1837 609 7713 641 -12413
707 -12413 -7446 -607 -5348 315 14500 10505 -2137 -4009 -4793 -5160 3506 9505 2510 -2343 -1778
722 -1778 -7226 -10955 -3962 4094 4758 2756 3325 4163 2200 -1523 -1446 -509 -968 2918 7822 1835 -8481
739 -8481 -9637 -7430 -5990 3563 12748 8052 725 -1055 -6381 -8074 4391 11630 3913 -856 -976
754 -976 -7038 -9276 -1821 1724 75 4291 7532 2383 -752 -1490 -4410 -4398 1477 5444 5778 2698
770 2698 -5355 -11496 -9892 -2433 7079 12506 8986 212 -4638 -5947 -3998 2911 7368 4139 4
785 4 -2354 -8030 -9123 -2276 1567 256 3627 7178 4747 233 -3063 -5728 -2607 5025 7108 4230
801 4230 976 -5152 -11760 -9033 -71 6954 9582 6176 -2164 -6009 -3884 -1722 2166 6198 3717
816 3717 -1523 -1981 -2558 -5157 -3634 699 1148 3024 6789 4609 -767 -2976 -4480 -4544 1964 7996
832 7996 5253 -1531 -6383 -8729 -6395 786 6493 7059 4441 307 -3126 -3455 -1072 2781 4330 1567
848 1567 -1199 -291 -1394 -4723 -4423 -1606 -583 2737 7287 4438 -1523 -2918 -3824 -4307 2293 8816
864 8816 4527 -1481 -2317 -6265 -8534 -423 7671 5153 1490 989 -2064 -4257 -1275 811 74 2068
880 2068 3873 -691 -4208 -2382 -1722 -3756 -1186 5932 7937 3020 -1576 -3410 -4600 -2696 3239
895 3239 5368 2477 386 -2940 -8111 -6680 2175 5381 1537 2318 3968 -1547 -4300 -314 1166
910 1166 222 3093 3569 -1238 -1882 -533 -5682 -6700 2662 8160 2678 -666 658 -2435 -6116 -1782
926 -1782 4031 4748 3148 140 -5231 -5350 649 2164 -1156 1148 6603 2277 -5088 -2277 1977 -1459
942 -1459 -2906 1927 3340 892 180 -3714 -8159 -1882 6034 3155 436 5076 2071 -7122 -5549
957 -5549 2691 4460 2547 1540 -1803 -4182 -1656 -659 -3205 87 5412 2142 -3098 -576 3475
972 3475 -505 -5206 -1420 4746 4179 483 -1088 -2938 -3859 -774 861 713 4916 5875 -3933 -9669
988 -9669 -330 5462 -425 -866 4061 384 -4002 -2065 -1305 -1193 4275 3547 -3442 -473 6603 188
1004 188 -7354 -1466 3990 381 -709 1666 -237 -2380 -2592 -3750 -945 5543 5716 -1414 -4233 33
1020 33 1537 -1310 -1182 3631 4377 -1383 -4993 -1391 957 -354 -387 213 250 2448 1563 -4218 -3629 3849
1038 3849 2423 -3807 597 5555 53 -4727 -1837 90 1191 3839 942 -2715 1249 2298 -4484
1053 -4484 -4342 4151 4292 -2307 -2745 451 281 -1481 -1310 -34 2440 3358 -106 -2935 -183 2487
1069 2487 -7 -2691 380 4059 924 -4357 -2540 1356 377 -1355 276 1269 1133 370 -1736 -2748
1085 -2748 1290 3598 -483 -1992 1956 1624 -2688 -2785 1019 1765 1471 13 -1546 -437 1035 -370
1101 -370 -2052 417 2733 52 -2559 -1257 1261 712 -1131 -922 2233 2605 -14 -1408 -537 503
1117 503 663 -420 -1311 1118 1575 -3093 -4128 676 2504 14 -437 904 -71 -519 387 -572 1032
1134 1032 3006 -45 -2859 -318 1705 -729 -1089 -21 338 757 721 -806 -598 963 -506 -1624
1150 -1624 1061 2351 -130 -1350 -1408 -1261 790 2213 562 298 1481 -845 -2581 -123 1970 930
1166 930 -201 -1135 -1829 -615 218 -899 -460 1309 156 -679 1216 961 -342 -122 -151 -186 1856 1611
1184 1611 -1464 -2016 -1003 -1685 -1027 2418 1913 -467 -418 -1054 -1981 898 3165 489 -564 567 -1159
1201 -1159 -2012 604 873 -531 333 1174 -470 47 930 -787 -1576 191 895 937 707 -529 -2154 -1952
1219 -1952 -893 1066 2545 1930 27 -929 -1449 -1109 1464 2582 401 -638 -477 -1863 -1842 530 56
1236 56 -1369 646 1480 -267 301 1676 -1218 -2147 1472 2482 827 1029 110 -3307 -3267 513 1559
1253 1559 1544 2157 44 -3036 -1891 674 1159 1244 1154 130 -1214 -1191 -295 58 -457 -395 627 1162 981
1272 981 1425 -11 -2524 -2056 1526 1947 670 845 -895 -4472 -2951 1110 1912 2373 2778 -725 -3568
1289 -3568 -306 1769 525 1212 2250 -612 -2477 -296 313 -1777 -750 -126 -362 815 2438 628
1305 628 -1944 -1713 -743 544 2526 3373 1080 -2734 -3816 -1785 748 1953 2606 1723 -1628 -2428 -451
1322 -451 540 374 1853 1435 -1780 -1384 699 -557 -2420 -360 630 159 1942 3376 -40 -2182 -778
1339 -778 -671 90 3256 3337 -1446 -3249 -2597 -2203 -606 2461 2733 368 -1147 -1060 -545 558 1150 1108
1357 1108 228 424 446 -110 -1834 -1595 -724 -763 128 2924 2705 -1231 -2941 -1348 -461 990 3335 2331
1375 2331 -1194 -2355 -1968 -2727 97 3946 1880 -974 9 153 -1388 -572 1171 223 -113 943 202
1392 202 -1356 -789 -1378 -2987 -435 3187 3020 861 -592 -1682 -1679 -373 1671 2836 2323 -498 -3033
1409 -3033 -3310 -1327 973 1665 565 234 426 -525 -2143 -557 1790 331 -293 1099 1359 -357 -1166
1426 -1166 -2170 -2164 1270 3090 1096 96 577 -1400 -3708 -1037 2740 2502 1040 -483 -2482 -2217
1442 -2217 -699 -64 593 2386 1994 -335 -1689 -102 471 -141 -224 715 1677 873 -1278 -2370 -1819 -590
1460 -590 155 962 1846 1910 233 -2699 -2676 710 2223 1298 924 693 -862 -2412 -2356 -347 1893 2137
1478 2137 493 -882 -234 76 -1779 -1432 1071 2283 1135 -126 -933 -895 -851 -1563 -384 2207 3175
1495 3175 868 -1650 -1950 -871 -187 119 884 2204 1131 -2228 -3011 -1051 401 686 1043 781 824
1512 824 589 -1483 -2431 356 2035 647 120 1196 168 -1872 -2351 -1557 736 2761 1463 -701
1528 -701 -700 -389 -1962 -1559 1337 2704 1389 -170 -1350 -1657 -206 81 -877 1034 2418 518 -1490
1545 -1490 -957 -779 -647 -62 300 1072 1881 -400 -2948 -1765 228 648 1292 1837 1037 -404 -1239 -2071
1563 -2071 -684 2164 1780 -457 -383 -124 -1337 -1337 -349 420 1031 1547 -252 -796 454 -284 -1990 -324
1581 -324 2339 1572 523 -74 -1242 -1718 -500 59 699 2546 1497 -1900 -2417 -631 110 376 1269
1598 1269 1163 3 -548 -1217 -1220 495 1059 189 318 707 243 -312 -992 -1306 -126 1112 699 353 623
1617 623 -935 -2327 -1157 460 1386 1957 882 -1502 -1563 -305 -369 187 2101 1508 -872 -1153 -608 -923
1635 -923 -42 852 150 -25 795 20 -1052 -530 -181 -329 422 1364 1104 189 -885 -1600 -788 675 1197
1654 1197 1302 535 -1024 -1434 -1122 -677 798 1593 788 -956 -616 -364 -761 20 925 228 263 941 209
1673 209 -893 -125 -363 -709 289 1561 517 -576 -828 -1526 -1462 587 1450 595 276 -678 -1264 -792 584
1692 584 1152 983 534 -301 -474 -257 -212 -162 99 -5 -72 538 285 -580 -684 -505 -822 364 1623 681
1712 681 -391 -570 -1165 -981 1191 1629 260 292 -283 -1156 -761 1010 835 21 377 -356 -782 -201 293
1731 293 -594 -484 490 140 274 541 232 -756 -609 24 774 1287 826 -897 -932 -776 -693 329 1263 482
1751 482 -136 -731 -1023 -366 919 534 -82 199 182 -348 -403 243 -315 -487 280 122 230 792 -441 -1179
1771 -1179 -448 501 310 649 413 -712 -1114 -420 28 581 1289 628 -577 -282 40 -206 297 624 -32
1790 -32 -303 -161 -553 -411 -30 -324 -524 331 708 304 -52 -302 -358 78 627 536 327 274 -797 -1128 -252
1811 -252 312 155 366 135 -469 -241 79 -69 159 584 -5 -405 94 199 -394 -135 -47 78 452 906
1831 906 -14 -256 -209 -372 -455 656 912 -148 -664 -618 -525 -69 561 508 222 96 -248 -311 584 428 163
1852 163 -63 30 -237 -60 -133 -570 -552 11 -55 262 646 73 -364 -373 -340 397 1053 545 -256 -417 -334 -502 113
1875 113 934 617 -134 -278 -517 -394 356 392 -260 -88 421 -214 -427 -81 -97 -305 -185 284 678 629 -129
1896 -129 -620 -39 369 556 654 288 -281 -727 -693 -538 403 1257 382 -640 -182 -43 -1 72 260 172 129 436
1918 436 -485 2 393 -484 -810 554 862 274 -267 -371 -589 -398 235 385 399 524 -410 -1295 -402 880
1938 880 518 229 124 29 110 -105 -190 -142 401 308 -441 288 448 -147 -762 -786 -229 872 956 -80 -190 248
1960 248 -359 -870 631 1276 407 -338 -804 -968 -144 436 -247 -511 533 199 -558 -159 251 -162 -82 222
1980 222 397 339 359 -905 -1225 -189 698 375 195 820 -265 -940 -788 -87 869 1144 -38 -776 -559
1999 -559 -82 -236 -141 403 380 364 23 -69 304 300 -559 -609 621 1007 230 -369 -961 -973 -464 267 415 782
2021 782 605 -800 -1101 -158 854 654 328 327 -81 -499 -378 -240 30 671 20 -320 200 555 -27 -927
2041 -927 -807 94 756 679 193 -81 -650 -937 -424 475 1271 859 103 -906 -648 164 720 190 589 162
2061 162 -706 -584 -288 -105 -60 -274 -400 373 955 325 -545 -469 -227 91 585 1079 481 -317 -1272 -1263 -140
2082 -140 869 1013 382 -197 -649 -646 76 321 699 646 83 -325 -429 17 -84 -440 68 172 453 444 329
2103 329 -484 -396 -254 10 586 1028 223 -617 -955 -801 -4 638 1019 346 18 -155 -610 -106 532 465 -27
2124 -27 140 -272 -360 -354 -194 -526 -153 412 384 243 119 -323 -528 -299 418 691 894 121 -887 -646 -403
2145 -403 97 525 656 413 25 -308 -669 -348 64 442 -16 108 67 -228 -410 -345 -332 -194 643 603 363
2166 363 48 -549 -529 -278 385 493 556 18 -828 -728 -586 159 255 593 421 -186 -161 -42 68 193 361
2187 361 360 234 389 -473 -585 -550 -190 101 400 810 406 -383 -610 -891 -242 646 927 364 145 -513 -650
2208 -650 -309 105 513 350 429 -340 -254 -93 -125 86 98 229 280 330 -254 -479 -271 -361 -122 507 865 735
2230 735 -320 -733 -492 -147 446 712 106 -39 -593 -703 -591 330 415 334 -15 -49 -348 17 -182 33 356
2251 356 251 29 195 201 -133 -404 -501 -98 529 815 75 -526 -487 -385 -364 304 760 316 130 -513 -720 -71
2273 -71 350 345 413 458 30 -71 -179 -77 -70 -61 311 102 201 109 -179 -565 -288 100 280 309 145 -117 -422 -510
2297 -510 -43 510 572 117 -243 -336 -474 -312 71 418 271 214 -465 -274 -146 -120 -294 -122 480 224 -44
2318 -44 82 -183 -336 -218 130 399 778 545 -579 -629 -200 -30 26 297 261 -116 -485 -529 -429 366 490
2339 490 94 252 327 132 -167 130 27 36 317 180 -12 197 30 -458 -403 181 232 149 369 -73 -418 -256
2361 -256 36 252 619 461 -116 -548 -287 50 188 320 -37 75 17 91 -80 -206 121 -5 -98 267 368
2382 368 -140 -245 -319 -75 260 386 433 220 -262 -528 -413 36 689 451 327 -257 -366 -269 -55 30 97 397
2404 397 -18 -277 -215 276 112 56 -153 192 76 238 37 -272 -277 -393 3 131 427 132 -112 -545 -268
2425 -268 226 487 181 -104 -75 -190 -205 64 336 432 157 65 -52 25 -122 59 -91 -102 77 -49 -62 138
2447 138 72 -186 -375 38 358 351 58 -173 -62 -85 -111 324 233 229 -262 -398 -183 149 31 -114 5 7 88 -359
2471 -359 -103 -67 261 -118 145 103 294 -190 -448 -200 -210 349 321 135 -21 -167 -290 -221 147 443 337 -233
2493 -233 -224 -185 186 352 -75 13 246 -94 -244 45 30 -157 29 24 21 124 -38 -39 -598 -157 105 72 312 144
2517 144 -137 -69 -412 -64 219 327 121 -272 -275 -100 -146 141 41 128 90 -73 -31 -134 280 -144 -429 -108
2539 -108 130 207 104 -61 -38 -98 -45 250 532 310 -131 -241 131 -30 377 97 161 -76 -320 -179 -37 19
2561 19 377 49 -51 23 251 142 24 102 -28 140 258 275 6 130 -160 -366 104 43 260 212 -372 -178
2583 -178 -219 -224 227 123 199 -115 -98 -117 132 148 -94 223 -134 44 72 -57 -170 -8 -25 26 108 -32 58 -291
2607 -291 -308 -54 437 245 39 -1 -81 -134 -30 213 180 199 -12 -436 -223 -122 81 -148 -104 73 -76 168
2629 168 -45 70 98 135 124 -30 155 239 -29 -406 -78 42 257 326 -269 44 -174 -242 -274 239 277 114 -19
2652 -19 -500 -96 28 28 58 29 -63 77 134 -134 -33 -33 184 61 -19 356 120 -91 -187 -209 -46 3 97 222 125
2677 125 -9 -293 111 102 214 61 166 156 -93 12 -188 101 91 44 124 247 -27 82 -157 123 108 166 101
2700 101 -26 -46 -113 -136 -43 26 16 174 -413 -166 124 122 196 95 18 -190 142 -82 -175 -61 71 100 88 12 -85
2725 -85 -121 -76 31 250 188 187 -15 -19 -59 28 -67 -73 72 -183 131 123 -124 -99 -37 84 88 449 -16 -215 -116 113 -59
2752 -59 -8 199 77 144 -316 -347 -115 49 211 153 201 -23 -115 -257 -324 -13 57 6 49 68 95 -101 -142 8 -94
2777 -94 75 73 -229 -199 -40 -314 -126 44 235 -13 195 84 96 -13 259 105 27 99 -80 -34 57 -200 -56
2800 -56 195 95 -44 -33 51 -271 -24 -46 -27 208 236 36 -90 -64 -169 181 291 171 151 -224 -112 -126 88
2823 88 -23 31 -59 -22 -37 -55 -43 -132 -380 62 -166 96 145 -70 -229 -69 43 111 136 229 49 89 -391 39
2847 39 25 -110 -67 32 35 -297 -58 203 161 -39 25 -156 36 155 86 -153 -39 -210 -67 42 35 92 -191 -209
2871 -209 -183 45 249 228 -12 -84 -150 -62 -110 281 275 47 -197 -40 153 103 313 134 -66 -169 146 -101 -60
2894 -60 40 -240 -249 -77 107 151 124 -176 -12 -32 26 131 182 -14 -302 -409 -116 184 80 -2 -176 -189 -126 65
2918 65 111 -12 -110 -43 -65 -59 25 35 2 -317 -206 177 325 350 -353 8 -67 -221 77 268 195 -108 -370 -279 6
2943 6 92 245 14 161 -263 177 232 377 139 -125 -55 32 165 199 58 -319 -245 71 1 371 114 39 -173
2966 -173 -171 -22 198 255 181 35 -309 -149 130 257 -41 34 -97 -217 105 156 45 -101 -244 -21 92 160
2988 160 279 128 -308 -45 -11 110 277 149 7 -282 -94 -59 231 228 -88 -83 -131 -226 44 26 -42 -38 -224 119
3012 119 50 285 200 -2 -125 -16 242 272 54 -135 -209 -229 102 187 100 54 -211 -118 -82 -116 230 131 15 -129
3036 -129 -373 -74 150 167 119 -94 -69 -54 -113 -55 142 -240 -30 -97 -29 51 9 -284 -83 301 -38 -56 -9 328
3060 328 -66 -234 17 95 362 223 58 -194 -195 -79 -41 -66 112 5 108 -80 -24 218 55 -318 54 54 146
3083 146 -93 -130 -66 -208 -123 242 367 -41 -133 -163 -1 25 -19 15 164 -61 -155 -4 160 -28 -170 -194 149
3106 149 68 106 91 31 -285 -184 122 66 -147 219 -207 -87 -36 104 271 281 112 -33 69 -75 7 83 96
3129 96 116 -116 -163 10 -170 174 -84 -21 -73 77 260 -23 -165 -127 -43 -44 -117 29 47 -289 -96 -88 7 71 170
3154 170 114 -296 -22 104 -135 -46 -7 -149 -67 -55 -32 -64 -80 -139 -95 57 253 112 251 -105 -118 -133 269 102
3178 102 186 -203 -273 -241 86 -32 43 -63 -56 71 -78 85 -23 64 79 3 152 250 30 -193 -290 33 19 26 -28
3203 -28 104 35 -5 -75 -100 146 -50 -84 -153 -120 -156 -125 29 170 59 -292 68 6 120 -8 -27 -303 23 166
3227 166 310 -150 -240 -158 -24 200 -52 187 83 -184 12 2 -54 171 -109 59 -109 -80 14 -53 -15 -94 -70
3250 -70 -185 94 -23 32 -29 -193 -10 159 53 80 14 -203 -227 -103 86 10 -160 35 75 -47 -74 -93 94
3273 94 -108 -261 -76 -14 28 24 -102 -91 -2 132 61 116 -61 -235 57 29 284 123 -80 -254 -357 -184 155
3296 155 196 -207 -34 -39 -71 -36 30 96 -183 -190 85 -69 -7 -104 -148 -186 104 32 142 198 -83 -121 -89 -68 380 216
3322 216 72 -185 -185 -115 76 180 172 15 -157 111 34 211 91 15 -238 -83 101 176 31 -67 -148 -149 -132 70
3346 70 215 125 -163 -113 -82 -63 179 44 -10 -73 -313 -106 124 158 -250 16 77 -42 -17 122 41 -125 -17 124
3370 124 111 -74 66 15 -106 -69 89 -46 151 81 -44 -251 -9 -4 114 14 -19 -182 -169 -100 172 80 -220
3393 -220 -20 -183 -48 198 117 19 43 -117 119 124 128 129 -213 -276 -74 -18 79 -17 5 49 132 -4 66 173 -43 -41
3419 -41 -112 -207 158 164 -98 -173 16 161 89 157 -58 -23 15 -21 -29 127 118 44 -118 -375 -51 -41 150 63 -93 -212
3445 -212 -178 -356 -1 26 108 72 -5 -196 134 157 59 -19 -31 80 -148 219 74 -24 -174 -24 -52 77 -47 -33
3469 -33 43 -104 66 -80 163 171 -50 66 -138 123 172 47 64 -11 33 -309 57 -73 29 19 79 -93 -78 260
3493 260 -24 115 -139 54 46 80 339 83 -102 -153 121 114 218 -7 85 -161 9 150 85 187 62 -97 93
3516 93 -67 -125 85 23 123 119 -21 -27 -68 -2 -61 -201 56 -21 5 -65 -28 -152 -122 -27 137 258 153 158 89 -264
3542 -264 -86 -39 49 77 -176 -47 57 -288 203 158 -100 -241 -47 90 -16 -19 -71 -130 -80 1 -32 -7 -2 -67 78
3567 78 74 46 210 128 -68 -265 -167 -104 -48 121 -105 26 -166 -143 40 100 22 -189 -112 3 79 22 -190 -4 -274
3592 -274 -135 -248 103 226 101 2 -234 -42 407 220 61 -133 -255 -306 -128 183 45 -11 -90 -91 -22 -71 161
3615 161 6 52 -137 25 -11 240 -7 -211 2 -75 93 201 -81 53 -48 -268 -33 -29 178 15 -28 -251
3637 -251 -138 84 410 311 17 -237 -139 -106 238 170 10 33 -195 60 11 149 -88 202 -69 60 197 308
3659 308 66 -275 -138 -67 158 315 204 9 -191 -87 -84 95 258 82 -272 -214 -21 -88 105 49 -187 -186 -111
3682 -111 87 267 268 161 -286 -110 -46 174 149 220 102 -185 -125 137 -19 108 -129 -58 1 5 115 331 206
3705 206 73 -349 -52 43 -51 99 -6 21 87 149 336 94 109 -89 -437 -197 -192 103 97 -288 -237 2 42 230
3729 230 132 -60 -182 56 -28 288 5 -24 -99 -95 6 82 -97 133 -123 -345 -169 166 117 32 -108 -237 -152
3752 -152 -18 -65 72 -87 -186 -46 108 139 198 200 -71 -94 -298 201 224 30 -237 -65 -215 -14 -11 195 89
3775 89 -5 -145 40 157 73 16 -97 -69 53 0 223 117 -79 -22 -133 -129 119 9 -28 -82 -227 14 167 106
3799 106 -94 -41 -323 7 48 -12 -50 25 -145 -69 110 193 199 -247 -123 -2 -125 200 119 93 -173 -439 75 211
3823 211 142 53 61 -208 -211 31 166 4 58 -229 -202 136 -5 247 7 -46 -271 10 125 311 191 -110 -105 -1
3847 -1 -71 95 184 4 -299 -446 107 67 207 -2 -107 -151 -19 96 219 99 210 -264 45 195 234 175 -147
3870 -147 -231 -145 138 102 296 49 -78 -29 -240 87 204 152 18 -306 -136 -76 26 177 -4 -134 -67 29 -133
3893 -133 25 -76 -161 -29 -161 155 112 52 58 -334 -143 143 206 157 -125 7 -336 18 -58 263 -6 -69 -55
3916 -55 -132 148 133 136 76 -141 31 -51 384 -198 -34 22 -11 -45 -36 203 -7 186 97 57 -69 242 28 -45 -144
3941 -144 36 -200 22 13 44 -78 -281 41 -125 -131 -105 -110 -17 -120 -57 43 24 -106 -77 -72 -11 33 70 -68 -172 85
3967 85 -117 134 128 37 -194 -59 -1 -13 137 -18 159 -93 -235 153 36 3 -158 -11 29 114 105 140 16 85
3991 85 142 10 -45 -48 19 -418 -151 100 68 -33 165 -101 -58 20 -64 179 163 -70 -20 182 108 -32 -151 -4
4015 -4 -38 63 -81 109 104 39 -210 -64 68 -152 70 -31 -6 175 3 -171 -6 -14 -89 -34 7 -69 186 -164
4039 -164 -244 -59 -112 -165 -82 -65 -68 143 26 24 17 -24 250 3 182 200 191 12 100 -82 -125 69 -21 128 11 81
4065 81 47 -35 -26 -170 -12 -225 -46 190 -114 9 -54 170 22 -87 65 40 179 -227 4 57 -169 -23 -142
4088 -142 88 20 54 71 -51 -97 -51 -122 30 13 -22 183 -29 124 17 -140 87 91 -57 -91 40 -70 58 -104
4112 -104 27 -71 -204 -55 -109 -84 121 -130 -65 -57 -76 -30 -166 -9 99 89 36 -22 54 212 14 -211 -29 56
4136 56 39 -50 -76 48 199 -80 5 108 -111 161 39 -70 -287 88 -54 137 -141 -49 86 -11 29 -138 -45
4159 -45 55 192 -39 -41 3 -49 -61 198 -133 -116 58 -37 -144 177 -253 171 21 -20 -69 -49 201 -92 -63 147
4183 147 -122 22 -182 22 -12 1 42 -166 -58 33 21 55 -120 85 -24 -195 59 296 -88 18 -213 65
4205 65 -36 -44 299 154 -16 69 -55 80 -98 -167 -154 63 70 -71 134 9 -101 -18 -51 114 -27 -21 50 234
4229 234 -189 -3 -8 166 26 -40 200 -167 -63 122 -53 -115 47 -218 -39 -117 53 105 42 -12 35 128 82 76
4253 76 204 -270 -11 -41 66 -4 -129 78 -121 -57 -110 151 -43 -22 95 27 172 -112 11 -36 -50 119 134
4276 134 -3 -45 -7 -47 20 11 133 15 58 -5 -31 74 -107 5 -224 5 -29 104 34 -6 -6 -268 118 -57 67
4301 67 55 -62 108 -8 -34 -35 -50 7 -209 48 -8 -384 -19 139 99 16 61 -57 98 0 14 -117 -118 -43 -181
4326 -181 -131 65 8 103 117 -137 4 -103 69 -67 69 174 267 -163 -45 9 153 72 147 -59 100 62 -244
4349 -244 48 47 105 -164 -56 13 -151 97 60 -207 -8 -193 164 -65 112 -23 197 10 -89 -72 61 -182
4371 -182 -74 128 127 -40 53 63 -199 -250 -25 -45 -44 -142 32 17 94 113 -96 -63 14 247 -56 140 47 -91 12
4396 12 61 205 -20 127 63 -52 -255 -115 -35 27 -111 65 93 -48 -132 34 -20 17 60 -1 67 -5 -30 -146 112
4421 112 -146 -14 -280 -101 -190 137 206 -22 -20 88 -46 -19 126 111 111 169 -54 -37 76 42 144 -58 -67 106
4445 106 100 45 -5 49 -4 191 -112 22 106 -176 26 -48 156 117 -121 19 47 19 16 -80 -181 6 -123 17 -170
4470 -170 -224 -133 251 -42 87 91 6 117 97 105 -24 137 -43 -49 -103 -71 49 199 -43 3 -6 -15 -141 -205 146 -29
4496 -29 33 -17 -189 -12 -42 20 19 90 -60 235 39 41 134 -104 45 -32 125 -62 134 -114 -14 -19 -53 283 24
4521 24 -151 98 75 49 21 14 -140 20 -9 -128 193 -49 141 -55 -19 -14 -71 38 -146 -69 -37 -16 -62 168 205
4546 205 22 -249 -199 -100 81 17 -122 -34 -42 32 -240 14 43 97 -172 -23 125 177 22 32 43 6 -42 -125 -172
4571 -172 -33 -8 -180 -132 -71 16 -42 143 -152 -2 -107 90 56 148 -72 -177 -73 74 233 -167 38 143
4593 143 -18 -45 -16 -136 -26 -91 -59 110 67 338 -55 -167 -84 117 -73 264 116 -140 -35 11 -182 212
4615 212 -112 -81 128 32 -4 42 168 -41 -234 49 -228 96 -8 -50 -124 135 -91 -2 71 -119 89 36 269
4638 269 -51 80 -46 55 -2 45 39 86 38 -27 -123 69 -4 -202 8 63 125 80 19 12 84 -104 156 -45 138
4663 138 49 88 88 -147 -132 217 -45 -61 148 2 211 178 116 -13 -147 133 -195 128 72 -87 -108 -237 100
4686 100 132 -100 -33 156 -68 113 28 -31 31 -30 -80 -108 -98 85 -120 -297 10 129 -147 23 135 182 -97
4709 -97 -90 -68 47 74 -65 -58 186 -23 -103 -25 17 -71 192 6 -197 -127 175 -89 -88 157 20 47 -52 -62 52 -66
4735 -66 13 -98 89 100 5 63 83 24 -41 68 -58 42 -92 82 86 -73 -92 -39 -2 -213 0 43 79 21 11 -122
4761 -122 -157 -46 34 132 -63 -2 130 -85 -113 -97 22 -131 -69 -106 -101 -41 228 299 27 67 -198 16 -91 -204
4785 -204 4 63 86 -201 -69 131 -164 -9 53 -56 86 107 -126 72 -96 -75 209 137 23 40 -116 133
4807 133 171 -30 176 11 -236 -114 -113 -25 91 91 256 122 190 -118 -202 24 5 55 42 -24 5 49 80 90 54 47
4833 47 -154 -241 -37 -32 -120 -51 -21 13 -60 10 -198 -16 -75 -212 -177 -132 153 -51 -3 -46 -27 102 -18 -35 -152 111
4859 111 202 57 35 188 134 -74 -16 -143 -147 142 -41 61 44 -101 -269 104 -42 39 104 -73 -41 33 -106 136
4883 136 -41 -156 54 225 154 1 72 26 255 -123 66 269 -6 -22 -199 -14 -31 112 -100 17 3 -137
4905 -137 -100 -286 -146 -57 5 91 -18 110 73 -1 -126 -176 -235 -31 -87 -70 83 -80 112 -26 40 -69 138 165
4929 165 -199 79 147 -74 96 -178 200 101 35 114 125 -85 -84 91 -31 -121 -88 -63 -96 -25 -28 -94 -36 32 24 52 -15
4956 -15 -169 -56 61 -70 1 40 73 -215 76 32 158 -131 -57 -58 -66 -27 27 -108 43 150 -77 47 192 62
4980 62 -9 -19 -43 108 -87 -56 62 -16 -141 156 -50 46 -74 -10 -50 -27 52 278 -3 -179 -259 115 74 14 -70
5005 -70 -116 -151 172 -85 -35 -36 151 125 -6 45 -2 15 -9 124 66 145 106 24 -36 -120 -40 -57 113 -88 58 -85
5031 -85 -81 282 -13 57 -12 34 -165 53 -200 -2 109 25 -147 -19 188 -129 96 44 64 -40 13 89 222 -4
5055 -4 -106 213 -41 25 73 -131 -2 -101 89 -1 19 -37 -94 -116 99 -57 21 -5 186 131 -180 -71 294 222 107
5080 107 -79 -119 110 122 -26 223 158 -215 113 -49 -86 109 56 77 -50 -124 -12 27 -35 -136 -1 48 33 -168
5104 -168 -133 145 -51 -396 -1 119 123 76 -61 55 39 181 86 -10 -99 -90 -54 131 83 192 -117 49 162 7
5128 7 -26 1 45 16 -36 190 163 292 -17 109 -82 -9 104 70 -144 -168 -235 -12 -54 226 131 -166 -56 -99 116
5153 116 84 -4 63 -65 166 -116 56 29 -56 10 -126 77 -51 -162 123 76 10 149 42 177 207 -120 10
5176 10 -39 -152 77 -20 -26 13 -241 -211 -70 181 -22 80 -113 50 -5 254 -15 12 -22 -112 -168 -55 78 168
5200 168 -233 -126 -148 5 34 -106 86 -169 -203 20 37 -96 66 -71 -104 86 173 38 76 11 27 -19 287
5223 287 96 -163 -31 -105 96 -115 230 -78 -39 -60 -56 63 5 -77 -15 159 23 -21 251 59 -80 -68 -105 -139
5247 -139 35 90 -182 187 -304 154 -63 -71 67 41 -148 -310 -141 166 -126 91 -123 -64 -197 39 -40 37
5269 37 -3 141 25 197 -256 58 99 -89 -1 19 35 -62 170 57 86 28 19 12 -83 -91 29 118 -19 260 -240 -123
5295 -123 -71 51 -92 -2 -169 67 55 -19 8 -102 198 98 -132 56 -366 -155 -168 -71 26 41 -137 -5 -49
5318 -49 16 154 -83 -79 -8 130 -52 -47 -214 78 73 -52 104 129 240 -202 -142 -186 -64 -74 45 48 -301 99 -119
5343 -119 28 169 168 9 -109 -64 -78 61 188 -34 180 5 -166 88 33 -24 -69 98 15 -9 15 -8 -214 156
5367 156 268 -97 -73 -52 81 189 122 67 44 40 -12 -41 144 300 -201 -155 -104 -114 -254 -221 3 0 199 17 -208
5392 -208 -122 -205 -187 -6 33 120 156 179 -115 178 -47 -4 15 -4 -20 -95 1 -60 68 112 185 3 13 66 -138 -137 132
5419 132 -28 -29 -146 -81 -126 -147 18 27 197 110 52 -118 73 87 44 -106 42 77 106 -1 -170 -155 -87 115 -7
5444 -7 121 -137 114 106 87 -185 -221 19 -169 -8 -150 -303 272 -34 45 -10 17 56 42 -36 51 40 80 -100 66
5469 66 -75 -147 -279 -122 229 161 82 78 -22 146 -133 -130 22 -207 -13 84 134 -6 9 48 -127 -152 -97 138 97
5494 97 -103 30 87 -145 -14 -14 127 -164 -125 -60 101 -23 -99 139 135 290 -97 -51 11 12 119 22 -83 15 -49
5519 -49 -12 -38 -228 209 145 53 -281 -107 242 -21 -134 -240 -7 -89 157 -6 -178 -146 -162 -47 -43 90 -19
5542 -19 104 85 165 29 93 36 12 -102 75 128 -155 26 61 -7 -98 -109 5 60 -85 -207 -42 -1 37 79 -43
5567 -43 228 -101 -59 -271 -17 -76 1 120 25 -153 -51 -31 121 -105 166 -17 35 277 -76 -146 -47 -161 -240
5590 -240 112 -250 -9 61 -59 28 149 142 47 -37 -165 -251 -72 78 48 107 98 -121 104 -59 -140 -115 99 262
5614 262 139 202 -26 -55 16 91 -79 233 -164 22 25 38 -21 163 -169 -126 45 2 81 -153 69 -55 -95 184
5638 184 63 -106 70 -246 156 9 -92 25 -48 120 104 -170 106 -155 -165 107 97 -48 -1 -102 -165 196
5660 196 -137 -131 -241 -74 -229 -28 -4 -146 -47 -29 -165 23 -98 6 -44 204 -250 -55 169 -92 150 -193
5682 -193 44 -134 -22 131 47 -72 -329 -168 20 -28 106 49 133 99 37 249 -199 -75 61 30 129 -164 1
5705 1 -25 -58 180 285 178 -135 -16 -79 48 -3 -161 -128 -156 274 -173 -147 -56 114 -58 -50 103 122 -2 65 -39
5730 -39 111 163 -73 70 66 103 -15 60 -13 -143 -148 -45 -79 66 28 48 35 30 53 61 123 182 107 -36 -119 32 -8 -154
5758 -154 37 107 134 281 18 -27 -117 -18 -47 54 107 21 -42 -8 232 218 55 118 -89 222 -98 12 -11 14 159
5783 159 -198 57 -26 -53 16 139 245 139 -30 -149 18 -5 121 58 143 -120 76 10 60 103 -255 6 234
5806 234 187 161 -331 57 166 -9 168 73 -222 -34 -88 -195 182 5 -83 16 -81 173 -3 -106 -122 -94 59
5829 59 101 -107 20 -182 -30 -240 33 -96 20 -103 -101 -54 21 123 -73 215 71 66 262 180 -182 41 -213
5852 -213 169 -41 105 57 32 56 -76 11 -178 -28 23 -29 93 26 13 -55 53 146 226 36 -61 36 98 14 -45
5877 -45 -135 -61 93 41 52 125 -37 -161 -57 36 143 114 99 -2 -223 -69 -150 -182 54 -137 111 -116 -3 -175
5901 -175 124 52 114 9 77 119 78 -127 -30 -16 73 67 -198 159 -155 -224 67 -112 53 -64 -215 -2 -124 -78
5925 -78 16 -20 -162 -46 102 -87 74 168 185 154 -145 38 -38 16 -52 62 -95 -75 -188 -195 106 -26 -182 213
5949 213 -213 -51 126 -65 -5 -206 57 51 96 -14 -30 40 252 -49 2 -86 39 -57 -50 -83 132 -66 273 -68
5973 -68 2 -110 -116 146 -125 178 173 119 86 121 62 -52 114 96 -5 230 -23 72 64 0 -7 -37 39 -81 -186 243
5999 243 117 50 40 60 -128 -46 -161 -230 -103 -89 -35 12 57 203 4 -22 2 -9 -89 -41 -245 -99 125 -69 25
6024 25 19 33 197 -103 -23 52 -40 -93 206 -42 140 -44 -15 80 -123 -189 40 -2 9 -100 245 -178 56 126 -170
6049 -170 -91 -43 -11 -100 3 -121 -5 224 -1 -78 -4 -235 -127 28 -49 -206 -16 120 -119 -111 19 -106 -34
6072 -34 137 95 140 -34 -91 122 7 133 103 42 -130 6 -86 24 45 182 -91 38 86 -56 -160 -30 -27 -248
6096 -248 -110 -16 -73 -72 145 -42 -81 -19 12 152 48 60 100 -6 67 -9 -66 75 13 -129 -327 -35 28 3 -245
6121 -245 -73 -79 -72 -84 146 188 59 82 97 124 -212 -107 -48 -101 -22 27 10 49 -239 117 -100 171 110 -62 193
6146 193 1 77 -108 61 -114 27 0 -13 80 -92 83 -44 -79 -38 -60 272 145 56 -86 90 -47 -136 202
6169 202 -48 -28 48 -188 -58 176 120 155 -21 143 11 113 -53 158 106 -141 352 152 41 122 34 -256
6191 -256 -63 94 -66 75 89 64 -41 149 72 76 -123 -8 -217 57 38 81 135 -104 69 -69 -71 -121 -57 111
6215 111 -37 72 -8 307 -122 -30 185 181 55 -257 114 128 -88 56 -7 126 -49 3 171 -69 14 67 261
6238 261 195 -164 10 -106 -8 -139 124 -20 -61 73 11 -150 -57 89 -219 147 -185 146 53 -34 187 207 48
6261 48 34 17 -67 29 -113 318 61 29 136 -138 224 80 -8 -41 -71 103 156 -77 -8 -92 23 -1 68 -69 -124
6286 -124 -51 -95 -186 -2 126 348 -78 30 -74 -208 8 -35 165 -211 -103 -132 -92 76 54 11 -22 18 -80 -276
6310 -276 44 -101 -72 207 -140 -107 -141 -97 148 119 167 54 -109 196 -83 -233 29 -25 -120 -163 318 -3 136
6333 136 -100 31 -34 -160 183 -75 -104 49 -138 -94 -83 -25 -9 -37 -97 -30 34 -180 103 26 -27 -105 -178 137 12
6358 12 26 193 -134 36 2 -19 -47 -113 -105 21 -33 122 -276 27 -164 23 -219 136 120 39 114 -92 -76 -139 257
6383 257 186 236 191 -71 -77 -103 12 -51 116 -107 -1 -196 19 64 11 96 74 15 8 -120 -7 -22 29 -64 185 104
6409 104 -127 143 -115 -7 190 89 -66 36 -96 68 -1 -22 63 -90 -82 -98 52 196 -54 -228 67 -122
6431 -122 68 -28 143 109 -66 126 131 -33 17 20 154 111 -48 203 -135 66 129 -53 -55 138 161 -111 -157 -67 109
6456 109 -166 58 223 -2 -11 -27 60 21 -39 60 -55 -120 -13 -76 135 -154 92 144 120 -112 -61 -8 138 161 -188
6481 -188 48 2 -11 -76 46 -105 67 -63 33 -7 -150 -17 -182 85 70 239 -118 -21 102 45 70 -132 15
6504 15 -223 103 63 136 -25 -18 38 -112 126 -10 11 120 238 -103 -141 30 -66 30 303 -195 130 -100 -125 4
6528 4 36 63 -59 58 110 -2 73 116 31 -98 -20 45 -39 86 11 -62 -170 -28 124 -142 -114 -115 192 -106 -38 50
6554 50 110 -22 306 81 -55 -25 -155 -133 -183 59 -31 79 113 122 -149 50 -149 -59 -44 47 -179 -78 115 -47
6578 -47 44 -94 -100 -125 152 -87 45 91 -107 182 -291 -106 -26 -123 -320 -6 95 -106 -74 -7 39 48 -9 -43 92
6603 92 -51 13 0 -63 22 69 53 73 -4 -55 -16 67 -35 35 -97 -9 -109 182 -75 154 169 19 60 -59 75
6628 75 -128 -99 -82 -132 -48 18 140 203 -60 218 -13 130 110 -200 397 -181 -58 -172 -18 107 -92 212 -117
6651 -117 -118 80 84 188 -221 74 66 -5 169 102 100 35 -55 53 47 100 -143 -11 -25 -151 -14 -59 -21 -173 2 142
6677 142 224 -12 -58 -39 -85 -108 -87 48 21 -101 203 -23 -151 -71 172 -11 77 102 -64 -45 67 -25 -2 46 29
6702 29 19 98 -26 -26 130 67 -8 -29 -3 0 9 21 52 164 27 16 -26 -210 174 -66 118 56 -111 44 9 -64 -74
6729 -74 12 -158 -201 -288 28 209 43 -108 156 89 -184 -76 -174 -105 22 96 129 9 -76 -230 -21 85 91 -111
6753 -111 269 37 -133 90 27 23 -69 160 -101 -223 73 86 95 290 -3 -154 146 153 -116 117 111 -1 31 -62
6777 -62 6 147 -17 -36 -109 -101 53 -128 -14 -4 -89 123 -49 -1 227 136 -6 28 77 144 79 -47 25 -61 88
6802 88 9 50 49 4 -97 -349 85 -311 -78 -23 -102 -34 -90 -9 93 -5 -180 -165 -192 -9 139 22 -244 115 81
6827 81 -59 50 47 85 -20 -82 22 73 109 -42 -115 -81 -108 12 -12 -1 -39 22 -7 -166 -20 98 76 -56 64
6852 64 70 -128 95 -43 13 144 -83 -61 -59 146 22 54 -87 -40 -88 -37 94 -32 76 28 29 119 -186 -11 -55
6877 -55 40 77 71 -213 -39 88 90 -42 126 -12 -121 -169 -49 47 -23 15 66 -97 -126 59 -101 55 39 250 12
6902 12 -67 -57 -7 -76 -153 -340 -110 38 92 64 66 19 64 91 79 -6 -104 40 -131 -122 104 108 69 -24 202 202 103 -207
6930 -207 -52 18 110 -88 -128 -69 11 51 -80 276 148 -57 -89 -311 132 53 173 53 -13 100 125 105 89 -112
6954 -112 165 26 -46 50 253 -102 31 17 -157 26 14 55 1 -88 -262 10 6 100 34 72 60 -11 36 73 -107
6979 -107 105 -99 -107 -159 -241 -150 -67 101 134 109 114 4 -252 -52 -96 64 9 14 -19 -114 -81 13 -3 -41 8 226 -240
7006 -240 -42 -192 -132 88 -28 115 -272 12 -3 11 58 -172 -23 2 157 -20 84 99 -23 173 191 -24
7028 -24 8 80 -58 -23 -48 68 60 -129 -115 90 139 65 -72 -26 -118 -50 56 -122 123 81 98 -140 -84 -113 -21 -9
7054 -9 -86 -115 161 -269 137 -14 -51 155 -9 86 33 78 -170 158 79 151 36 -211 82 272 28 202 8
7077 8 104 42 54 231 4 -73 261 56 117 225 -41 78 -42 92 54 108 -193 39 12 -6 44 -25 -54 -129 -108
7102 -108 180 51 -27 -51 -39 22 -114 110 -184 -213 46 99 13 -12 61 -97 65 187 -204 1 -77 62 61 159
7126 159 -60 -232 170 49 26 208 157 -6 -150 -48 273 -88 -27 49 124 -202 37 11 147 -38 -256 265
7148 265 175 -104 34 -228 -15 -75 -88 -42 -20 40 237 179 -24 -60 227 -166 45 -81 -7 -75 -77 -38 -88 38 -162
7173 -162 -47 50 131 80 -96 -178 -9 -139 175 -35 -69 121 -46 175 -186 37 170 -37 -169 152 -77 -20
7195 -20 30 -119 -42 86 82 92 -22 136 -147 -150 -126 -6 67 -15 117 96 -120 10 27 72 53 -42 120 -50 69
7220 69 -30 -10 -104 -37 -54 -142 17 -274 -93 178 10 -2 -33 87 84 67 -11 -237 -112 123 7 -17 -114 -182 19
7245 19 -147 64 -30 17 296 99 12 -3 -147 153 -29 137 44 60 -143 1 -163 -14 -43 -112 272 -151 -19
7268 -19 -38 34 69 155 -30 138 -213 -88 72 -91 58 -167 -14 -26 9 -116 41 -29 52 -126 -147 20 79 -139
7292 -139 -115 -6 56 -107 -78 -26 72 115 170 129 -341 32 -14 -114 -1 -38 25 -56 -129 -51 -50 -48 143 -6 14 50 141
7319 141 -100 1 147 91 111 31 -3 -14 -44 -13 100 -153 107 -24 -31 122 -82 68 97 233 -17 0 218 85
7343 85 -69 -228 -56 13 4 -20 75 -30 -102 -18 -119 180 91 48 -72 -39 -96 169 155 -248 75 103 95 -259 30
7368 30 35 68 9 -13 -7 -46 21 -173 151 13 -171 -146 74 -35 -138 -87 -152 109 53 -61 68 -52 -57 103 -238
7393 -238 264 9 82 -180 216 39 -58 -45 148 181 84 225 -59 11 4 56 84 48 -19 135 -121 -36 194 28
7417 28 147 -60 -48 -65 -134 23 45 -56 29 157 -4 93 52 -93 11 56 3 68 -30 -133 265 -83 -69 -55 22
7442 22 -16 52 8 103 -20 -231 -17 -183 123 -188 -46 37 -101 -45 4 -185 -275 40 -101 32 63 -274 -95
7465 -95 -169 -54 -76 -69 136 -122 -32 146 44 0 -58 -68 -22 -7 228 -114 109 170 0 -101 -36 -177 -71 -259
7489 -259 164 49 33 10 37 52 -100 -20 -132 204 -92 20 130 -8 -200 -89 -47 103 -46 -34 121 -122
7511 -122 27 44 -92 -76 -154 207 94 -236 97 85 92 -34 130 75 14 -243 -39 -3 75 82 60 55 -8 -156 164
7536 164 21 135 138 29 -13 -192 114 -32 -42 210 -72 113 -154 20 119 7 -46 -82 42 -218 88 -57
7558 -57 58 75 -93 -79 39 -48 285 -120 168 -108 73 -16 -68 8 -40 -56 -105 -87 -218 50 -59 -270 246 50
7582 50 145 -94 67 2 187 77 38 71 121 -161 7 201 61 126 226 -109 -178 -45 1 -22 -1 169 -112 102
7606 102 -95 54 -127 -65 -35 -23 124 22 19 49 -94 179 312 -81 107 -124 90 71 144 106 67 -86 270
7629 270 -229 33 171 -10 106 -18 14 243 -29 -94 -46 -190 -87 55 3 -39 -342 133 -184 -8 12 49
7651 49 32 46 13 -161 132 6 -56 -18 150 54 34 3 94 -108 239 -35 -57 82 119 -49 85 -63 -98 -121 38
7676 38 125 36 -29 88 70 -133 31 48 -95 166 -87 29 41 -48 -27 79 50 47 51 116 -107 19 10 -55 -85 -75 -89
7703 -89 69 85 -110 33 -149 136 111 -16 -217 -246 -18 46 305 -21 -86 97 -176 -58 -269 46 -49 -172
7725 -172 82 -29 -42 57 44 135 -15 119 -112 67 30 -17 -14 -16 286 14 -65 283 -28 -9 28 48 -61 -28 240
7750 240 109 -63 -118 117 308 -143 166 21 123 56 -44 -291 157 -36 6 -33 93 -51 360 -15 -199
7771 -199 177 -42 33 57 -9 67 199 10 76 -241 79 51 80 94 -22 56 285 313 -79 97 88 90 -179 -92 73
7796 73 -96 -100 158 -100 -113 129 -18 113 -53 48 137 119 59 -60 51 164 125 -117 48 -109 -205 -14 -83
7819 -83 -257 143 199 -66 82 -39 -171 -129 94 -93 95 -28 -32 -93 -180 -96 -41 -141 162 8 -106 -157 11
7842 11 -235 -11 -43 -172 210 -21 43 -37 -128 123 186 -174 177 -110 165 -136 -190 32 -97 -121 -124 -74 -59 -51 125
7867 125 -130 185 143 -186 -117 -89 -30 87 -7 51 107 -6 -121 -29 -163 4 33 -70 46 -48 97 -72 -6 -16
7891 -16 16 3 184 -114 -151 -32 33 144 -147 -296 -190 -113 6 -120 -56 -10 -96 -45 -61 53 -59 140 -33 -11
7915 -11 123 -134 184 91 79 34 -17 -39 -79 201 -63 278 -138 -65 111 -110 163 -2 -145 -72 189 114 119 -125
7939 -125 69 69 53 -66 200 19 -14 -72 -64 149 -5 -190 -30 -143 -50 192 -63 39 111 -16 102 -10 -1 -141
7963 -141 -53 125 -8 164 63 128 -42 60 68 65 111 -6 35 -104 32 77 110 119 -30 52 63 -151 -53 69 127
7988 127 96 166 65 77 275 119 -143 96 142 -7 -160 -37 -188 94 -105 13 85 -127 -119 167 60 -90
8010 -90 3 -124 59 141 35 -66 -17 -227 164 -2 -2 -34 -73 152 -61 -56 -8 -6 41 -6 146 111 3 -16 -25 130
8036 130 229 0 -89 82 -181 14 93 35 -100 28 22 -100 9 84 -234 -96 -38 -2 88 133 208 143 -17 -27 59
8061 59 -55 108 -10 -131 55 -70 -254 187 -75 28 -99 -130 -21 -98 34 130 -139 91 -105 10 -251
8082 -251 52 -115 53 97 288 -69 45 -63 -64 -42 -145 28 90 -40 187 104 -20 59 2 61 -186 79 -45
8105 -45 83 142 73 69 -168 -19 -31 -11 -20 79 21 61 -14 61 -100 -211 142 75 -225 -204 152 61 121 -84 -68 149
8131 149 33 -68 -27 -57 -51 -61 128 104 165 -94 71 -18 31 -31 -66 26 14 -23 11 -111 -82 -38 136 71 -14 -107 216
8158 216 134 132 -5 -106 94 1 -157 -113 -162 77 93 -47 96 -22 33 92 -3 -155 -62 104 130 -121 173 61
8182 61 84 164 157 -21 -121 40 100 -11 -110
8191a10
##END NTUPLES=NMR FID
##END=
