##TITLE=1H_Ser NSPA-CO-DNG
 CDCl3, 8 sc, 
 2.4.2019
##JCAMPDX= 6.0         $$ Bruker NMR JCAMP-DX V2.0
##DATA TYPE= NMR FID
##DATA CLASS= NTUPLES
##ORIGIN= UXNMR, Bruker Analytische Messtechnik GmbH
##OWNER= root
$$ XWIN-NMR		Version 3.5
$$ Tue Apr  2 15:46:06 2019 Russian Standard Time (UT+4h)  she@DPX200
##.OBSERVE FREQUENCY= 200.1316
##.OBSERVE NUCLEUS= ^1H
##.DELAY= (6, 6)
##.ACQUISITION MODE= SIMULTANEOUS
##.ACQUISITION SCHEME= undefined
##.AVERAGES= 8
##.DIGITISER RES= 18
##SPECTROMETER/DATA SYSTEM= spect
##.PULSE SEQUENCE= zg30
##.SOLVENT NAME= CDCl3
##.SHIFT REFERENCE= (INTERNAL, CDCl3, 0, 15.7039)
##AUDIT TRAIL= $$ (NUMBER, WHEN, WHO, WHERE, WHAT)
$$ ##TITLE= Audit trail, XWIN-NMR		Version 3.5
$$ ##JCAMPDX= 5.01
$$ ##ORIGIN= Bruker BioSpin GmbH
$$ ##OWNER= she
$$ F:/spectra/data/she/nmr/H-F/1/audita.txt
$$ ##AUDIT TRAIL=  $$ (NUMBER, WHEN, WHO, WHERE, WHAT)
(   1,<2019-04-02 15:44:13.75 +0400>,<she>,<DPX200>,
      <created by zg, POWCHK disabled, PULCHK disabled
       configuration hash MD5:
       00 E9 B6 7A A2 85 ED C7 34 08 36 98 17 FE 4E 26
       data hash MD5: 16K
       B4 3B 57 4A 71 56 E7 3C 65 FF 72 EC 4C 39 CD 8A>)
$$ ##END=
$$ 
$$ hash MD5
$$ 40 0C 73 67 3C 5A 63 3A 46 65 03 41 9F 15 BE 1C
##$RELAX= 
##$RELAX= 
##$RELAX= 
##$RELAX= 
##$RELAX= 
##$RELAX= 
$$ Bruker specific parameters
$$ --------------------------
##$DU= <F:/spectra>
##$EXPNO= 1
##$NAME= <H-F>
##$PROCNO= 1
##$TYPE= <nmr>
##$USER= <she>
##$AMP= (0..31)
100 100 100 100 100 100 100 100 100 100 100 100 100 100 100 100 100 100 
100 100 100 100 100 100 100 100 100 100 100 100 100 100 
##$AQSEQ= 0
##$AQ_mod= 1
##$AUNM= <au_zg>
##$AUTOPOS= <>
##$BF1= 200.13
##$BF2= 200.13
##$BF3= 200.13
##$BF4= 200.13
##$BF5= 200.13
##$BF6= 200.13
##$BF7= 200.13
##$BF8= 200.13
##$BYTORDA= 1
##$CFDGTYP= 0
##$CFRGTYP= 5
##$CHEMSTR= <none>
##$CNST= (0..31)
1 1 145 1 1 1 1 1 1 1 1 1 1 1 1 1 1 1 1 1 1 1 1 1 1 1 1 1 1 1 1 1 
##$CPDPRG= <>
##$CPDPRG1= <>
##$CPDPRG2= <>
##$CPDPRG3= <>
##$CPDPRG4= <mlev>
##$CPDPRG5= <mlev>
##$CPDPRG6= <mlev>
##$CPDPRG7= <mlev>
##$CPDPRG8= <mlev>
##$CPDPRGB= <>
##$CPDPRGT= <>
##$D= (0..31)
0 1.2 0 0 0 0 0 0 0 0 0 0.03 0 0 0 0 0 0 0 0 0 0 0 0 0 0 0 0 0 0 0 0 
##$DATE= 1554205453
##$DBL= (0..7)
120 120 120 120 120 120 120 120 
##$DBP= (0..7)
150 150 150 150 150 150 150 150 
##$DBP07= 0
##$DBPNAM0= <>
##$DBPNAM1= <>
##$DBPNAM2= <>
##$DBPNAM3= <>
##$DBPNAM4= <>
##$DBPNAM5= <>
##$DBPNAM6= <>
##$DBPNAM7= <>
##$DBPOAL= (0..7)
0.5 0.5 0.5 0.5 0.5 0.5 0.5 0.5 
##$DBPOFFS= (0..7)
0 0 0 0 0 0 0 0 
##$DE= 6
##$DECBNUC= <off>
##$DECIM= 24
##$DECNUC= <off>
##$DECSTAT= 4
##$DIGMOD= 1
##$DIGTYP= 9
##$DL= (0..7)
0 120 120 120 120 120 120 120 
##$DP= (0..7)
150 150 150 150 150 150 150 150 
##$DP07= 0
##$DPNAME0= <>
##$DPNAME1= <>
##$DPNAME2= <>
##$DPNAME3= <>
##$DPNAME4= <>
##$DPNAME5= <>
##$DPNAME6= <>
##$DPNAME7= <>
##$DPOAL= (0..7)
0.5 0.5 0.5 0.5 0.5 0.5 0.5 0.5 
##$DPOFFS= (0..7)
0 0 0 0 0 0 0 0 
##$DQDMODE= 0
##$DR= 18
##$DS= 0
##$DSLIST= <SSSSSSSSSSSSSSS>
$$ [...]
##$SUBNAM2= <"">
##$SUBNAM3= <"">
##$SUBNAM4= <"">
##$SUBNAM5= <"">
##$SUBNAM6= <"">
##$SUBNAM7= <"">
##$SUBNAM8= <"">
##$SUBNAM9= <"">
##$SW= 24.9336934301222
##$SWIBOX= (0..15)
0 0 2 0 0 0 0 0 0 0 0 0 0 0 0 0 
##$SW_h= 4990.01996007984
##$TD= 16384
##$TD0= 1
##$TE= 0
##$TE2= 300
##$TE3= 300
##$TEG= 300
##$TL= (0..7)
0 120 120 120 120 120 120 120 
##$TP= (0..7)
150 150 150 150 150 150 150 150 
##$TP07= 0
##$TPNAME0= <>
##$TPNAME1= <>
##$TPNAME2= <>
##$TPNAME3= <>
##$TPNAME4= <>
##$TPNAME5= <>
##$TPNAME6= <>
##$TPNAME7= <>
##$TPOAL= (0..7)
0.5 0.5 0.5 0.5 0.5 0.5 0.5 0.5 
##$TPOFFS= (0..7)
0 0 0 0 0 0 0 0 
##$TUNHIN= 0
##$TUNHOUT= 0
##$TUNXOUT= 0
##$USERA1= <user>
##$USERA2= <user>
##$USERA3= <user>
##$USERA4= <user>
##$USERA5= <user>
##$V9= 5
##$VALIST= <valist>
##$VCLIST= <CCCCCCCCCCCCCCC>
##$VD= 0
##$VDLIST= <DDDDDDDDDDDDDDD>
##$VPLIST= <PPPPPPPPPPPPPPP>
##$VTLIST= <TTTTTTTTTTTTTTT>
##$WBST= 1024
##$WBSW= 4
##$XGAIN= (0..3)
0 0 0 0 
##$XL= 0
##$YL= 0
##$YMAX_a= 107992
##$YMIN_a= -210650
##$ZGOPTNS= <>
##$ZL1= 120
##$ZL2= 120
##$ZL3= 120
##$ZL4= 120
##$ABSF1= 10
##$ABSF2= 0
##$ABSG= 5
##$ABSL= 3
##$ALPHA= 0
##$AQORDER= 0
##$ASSFAC= 0
##$ASSFACI= 0
##$ASSFACX= 0
##$ASSWID= 0
##$AUNMP= <proc_1d>
##$AZFE= 0.1
##$AZFW= 0.1
##$BCFW= 1
##$BC_mod= 2
##$BYTORDP= 1
##$COROFFS= 0
##$CY= 11.3945322036743
##$DATMOD= 1
##$DC= 2
##$DFILT= <>
##$DTYPP= 0
##$F1P= 18.9103706918063
##$F2P= -1.10871071338519
##$FCOR= 0.5
##$FTSIZE= 0
##$FT_mod= 4
##$GAMMA= 1
##$GB= 0.15
##$INTBC= 1
##$INTSCL= 1
##$ISEN= 128
##$LB= 0.24
##$LEV0= 0
##$LPBIN= 0
##$MAXI= 10000
##$MC2= 0
##$MEAN= 0
##$ME_mod= 0
##$MI= 1.114404
##$NCOEF= 0
##$NC_proc= 0
##$NLEV= 6
##$NOISF1= 3.799351
##$NOISF2= 2.8
##$NSP= 1
##$NTH_PI= 0
##$NZP= 0
##$OFFSET= 15.70392
##$PC= 1
##$PHC0= -9222.313
##$PHC1= 27.40025
##$PH_mod= 1
##$PKNL= yes
##$PPARMOD= 0
##$PSCAL= 0
##$PSIGN= 0
##$REVERSE= no
##$SF= 200.130013532006
##$SI= 16384
##$SIGF1= 3
##$SIGF2= 2
##$SINO= 400
##$SIOLD= 16384
##$SREGLST= <1H.CDCl3>
##$SSB= 0
##$STSI= 0
##$STSR= 0
##$SW_p= 3612.71676300578
##$SYMM= 0
##$S_DEV= 0
##$TDeff= 0
##$TDoff= 0
##$TI= <>
##$TILT= no
##$TM1= 0
##$TM2= 0
##$TOPLEV= 0
##$USERP1= <user>
##$USERP2= <user>
##$USERP3= <user>
##$USERP4= <user>
##$USERP5= <user>
##$WDW= 1
##$XDIM= 8192
##$YMAX_p= 0
##$YMIN_p= 0
$$ End of Bruker specific parameters
$$ ---------------------------------
##NTUPLES= NMR FID
##VAR_NAME=  TIME,          FID/REAL,        FID/IMAG
##SYMBOL=    X,             R,               I
##VAR_TYPE=  INDEPENDENT,   DEPENDENT,       DEPENDENT
##VAR_FORM=  AFFN,          ASDF,            ASDF
##VAR_DIM=   8192,          8192,            8192
##UNITS=     SECONDS,       ARBITRARY UNITS, ARBITRARY UNITS
##FACTOR=    0.0002004,     1,               1
##FIRST=     0,             0,               0
##LAST=      1.6414764,     0,               0
##MIN=       0,             -210650,         0
##MAX=       1.6414764,     107992,          0
$$ Real data points
##PAGE= N=1
##DATA TABLE= (X++(R..R)), XYDATA
0 0 0 0 0 0 0 0 0 -8 8 -8 13 -16 16 -24 25 -32 40 -48 56 -65 80 -94 107 -123 142 -162 185 -211 239 -271
30 -271 305 -342 384 -430 480 -534 596 -663 735 -814 901 -998 1105 -1223 1353 -1503 1669
47 1669 -1858 2077 -2327 2623 -2979 3415 -3960 4669 -5635 7026 -9229 13254 -23010 96864
61 96864 40601 -147098 -4237 37057 -16385 8051 86533 -687 -110142 -78130 37358
72 37358 16514 -62844 -18134 60003 -35792 -99816 24492 88807 -19002 -38488 29974 2895
84 2895 -40500 20102 60547 2488 -64900 -41169 40507 52868 -16858 -23595 14564 -20032 -36440
97 -36440 49145 78736 6706 -26398 -6587 1182 8328 14235 18752 22694 -20760 -63303 -11076
110 -11076 30883 -25622 -42217 12062 -4194 -51162 -15090 32778 17704 -13636 -14978 10979
122 10979 16585 -9809 14087 62503 6977 -57978 9800 57018 -16653 -34695 29842 20308
134 20308 -26919 -6983 22067 2317 -22188 -2095 38968 18455 -42501 -15411 48243 6962
146 6962 -37816 15445 23030 -40203 -25673 20236 -8679 -31667 1657 16000 -8074 -32320
158 -32320 -21937 19112 19895 -17204 -65 31223 -2511 -12968 29646 17715 -20244 4906
170 4906 27271 8379 3882 2454 -6986 3604 2541 -12042 3924 10148 -16501 -10262 5355
183 5355 -16339 -15812 8487 -5856 -20861 -7307 -8022 -7068 6597 -6414 -11215 12598 1221 -16942
197 -16942 15363 25735 -4166 4964 23074 4034 2350 19316 11837 4372 3584 -5490 6708
210 6708 18008 -3866 -6172 7235 -17342 -24224 10030 3807 -18302 4673 4817 -30426 -22451
223 -22451 3450 -772 -621 1741 -9989 -8140 -4800 -8547 11267 19293 -7325 -1772 19358 -2029
237 -2029 -4521 28963 17707 -7762 10573 13382 -9058 437 11128 -1641 -2918 -2034 -7363 -907
251 -907 -9638 -25371 -3373 9460 -14314 -7702 12217 -11829 -21941 6476 4960 -6143 9373
264 9373 6649 -8814 -2615 -983 -2327 13284 8236 -8620 3625 5386 -8880 9711 21988
277 21988 -1964 -1734 15079 1562 -2540 11892 5151 2233 11215 -4537 -12074 5221 -3999 -16567
291 -16567 2918 1390 -17031 -6367 -705 -13943 -5548 1240 -9816 -164 6026 -10429 -2517
304 -2517 12351 -3764 -3076 13212 -2021 -7937 14339 9440 -4029 9207 8166 -3483 6339
317 6339 7511 831 11696 5231 -12048 3350 8891 -12753 -5404 9230 -11163 -16713 -2251
330 -2251 -9702 -11976 687 -6320 -10232 970 -7122 -10954 8251 5608 -2976 13784 11517 -6605
344 -6605 5897 13753 -879 7950 19314 4468 1168 6200 -4554 790 12383 -1024 -1230 10309
358 10309 -6836 -16013 3810 1297 -10701 1163 -1491 -16013 -7265 -5191 -13888 -529 3924
371 3924 -11438 -4345 3121 -9695 -1016 13739 1507 2194 15769 1893 -3290 13779 8374 81
385 81 10753 4729 -5499 4317 180 -9339 4805 3908 -13607 -4222 3128 -10576 -3479 6585
399 6585 -7302 -5830 4159 -7956 -7355 8304 -546 -6819 4838 -3826 -11056 2969 1096 -5170
413 -5170 9260 6137 -9079 2793 8748 -2413 7588 16269 2017 3710 8622 -4452 -89
426 -89 13644 1991 -2163 7017 -5443 -12819 641 -2720 -6836 6448 -362 -14572 -3410 -1478
440 -1478 -12078 1099 8029 -5188 -1802 1328 -12056 -4952 8198 -2004 -1177 9575 -2381
453 -2381 -7041 6359 2216 757 14193 6981 -3162 8668 5620 -5602 7146 10571 -3913
466 -3913 176 2671 -10437 -5058 1496 -10341 -6688 2721 -10053 -11173 777 -7327 -7673 6441
480 6441 -1651 -8607 6149 3028 -6385 6990 7958 -2922 4603 7566 -1124 7788 10392 -2047
494 -2047 4955 11174 -3830 363 14472 2603 -2651 6241 -2506 -8299 3494 -1815 -9643 -358
508 -358 -5178 -14052 -4494 -5277 -12498 836 2847 -10806 -1437 6760 -5885 -539 13150 3848 1260
523 1260 10253 2915 -842 5987 36 1487 12118 550 -9452 2276 -532 -8706 5755 7323
537 7323 -7237 -223 4858 -8480 -3659 7136 -925 -2025 1464 -8389 -7159 784 -6851 -4932
551 -4932 4843 -8081 -12824 4977 1813 -8224 5170 8386 -2002 5753 8933 -163 6559 11525
565 11525 2129 4592 7952 -2543 140 5462 -6395 -3732 7822 -5524 -10989 3491 -1145 -8731
579 -8731 3458 3442 -5919 1040 842 -5955 3201 3291 -7958 -501 3066 -10657 -6502 3511 -4256
594 -4256 -3370 3480 -5778 -4508 8911 3118 -736 9945 5180 1331 13247 6557 -5295 7463
608 7463 10431 -3916 -823 3184 -8000 -7169 -935 -5691 -4970 -4671 -11608 -3172 3053 -11660 -6952
623 -6952 12755 1946 -8986 4650 4082 -5998 6791 12289 -516 -2820 235 1162 7110 4228
637 4228 -2383 6195 4516 -9106 3206 15656 -1980 -4699 11307 1039 -11061 2419 6785
650 6785 -1601 -2618 -6700 -8755 -1597 -5028 -8159 3758 -2172 -16364 -2069 8777 -3262 -952
664 -952 7491 -2770 -2120 10277 6948 3615 5364 -3244 -915 10875 2638 -3807 7101 419 -12601
679 -12601 -147 7675 -1936 -945 799 -6446 -6015 -3697 -1834 11171 6336 -17880 -12343 6439
693 6439 -1736 -3921 10940 533 -16254 -4204 6453 2476 2874 3141 2019 2236 -5446 -1983 15667
708 15667 9610 -7783 3353 8767 -11007 -2739 20028 5112 -14318 -4480 3236 2074 2667 -1108
722 -1108 -2755 -2175 -9301 -2834 12667 742 -14501 -1581 603 -11542 -97 11182 -3623
735 -3623 -8745 -1911 -3775 -171 7480 3717 2254 3473 -6843 -2068 15119 8812 -1666 4656
749 4656 930 -7179 2886 7993 2343 769 -6682 -12074 3135 7331 -8300 -3880 3275 -10940
763 -10940 -9971 7578 3206 -6945 -1940 -497 -3389 -1330 -928 4086 7426 -6198 -7782 9766
777 9766 5072 -6479 9576 13016 -9496 -5031 14913 7544 -3211 2458 4188 793 -1431 -2376
791 -2376 5155 3620 -11677 -6787 8077 -5066 -13908 4536 3074 -14295 -4281 6962 -3562
804 -3562 -5284 1518 674 1304 2554 -384 4048 3287 -5930 3666 13645 -1641 -6448 8333 2914
819 2914 -6746 2898 5594 -1118 1851 -502 -5834 1621 1365 -5711 2956 4517 -8589 -4728 4254
834 4254 -3671 -5654 1936 -1806 -2602 2698 -2891 -4675 773 -3717 -352 12072 2817 -8348 3691
849 3691 4432 -7192 3382 14391 3459 -2633 745 -1840 -361 2480 1619 7150 5519 -10428
863 -10428 -7256 5575 -2682 -5440 8302 1512 -11884 -2490 1870 -6451 -1938 3579 -675 -674 -1550
878 -1550 -4819 1872 1750 -4524 5097 9522 -5821 -4947 8075 127 -4473 6802 5119 -1601 3175
893 3175 888 -4259 1985 2278 -855 5206 2336 -7193 -936 1646 -6138 46 4346 -6163 -5173
908 -5173 914 -6436 -6547 2914 -1406 -3076 3201 -3173 -5965 5029 5113 -641 5788 4589 -3808 2705
924 2705 7008 2166 5588 4921 -4307 220 4459 -4522 -1176 6433 -3190 -6248 1825 -3270 -5439
939 -5439 3771 727 -5888 59 -985 -5282 2338 2528 -3730 1296 533 -6202 1453 4260 -5663 -588
955 -588 7633 -867 -1765 5374 -247 -2034 6341 2720 819 7086 2271 -4397 2173 446 -4598 3359
971 3359 2294 -6356 -1457 -1217 -9672 -2736 4490 -4344 -4296 1951 -3757 -3368 3954 -57 -460 6153
987 6153 -522 -3952 4512 1895 -3072 5093 3206 -3831 2525 2436 -4877 1665 4855 -2860 1128 6451
1003 6451 -1104 -867 3771 -2876 -2079 5327 -1191 -3023 3411 -2624 -8577 -791 -1391 -5548 971 -29
1019 -29 -6135 239 1722 -5369 1345 5711 -1557 1174 5763 -978 558 6881 224 -926 5969
1034 5969 -377 -3885 3792 443 -3611 3608 1434 -4181 1920 802 -6426 809 4115 -3711 -174
1049 -174 3093 -4865 -3426 932 -5350 -2575 4563 -2797 -4640 2637 -1899 -4543 3901 2549 -1164
1064 -1164 5478 3344 -2481 4937 5637 -1923 3835 6073 -2697 -85 3390 -3158 -633 4509 -3738
1079 -3738 -4705 2334 -4089 -5817 2051 -381 -3057 3206 -830 -5746 1944 536 -5419 2407 4185
1094 4185 -3952 -26 2593 -4125 -341 4310 -1818 921 6564 -474 -1409 5414 713 -1175 5730
1109 5730 1320 -2660 4228 706 -5691 1562 1639 -5745 -1072 332 -6340 -2360 431 -5102 -706
1124 -706 3750 -3572 -2978 3652 -1938 -2551 4887 1323 -971 5657 455 -4218 3365 2167 -3057 3605
1140 3605 4531 -2203 1606 2482 -3997 984 4873 -2480 326 5427 -2536 -3269 2854 -1988 -3450 2912
1156 2912 -2290 -5315 1746 -1971 -7005 1582 1166 -5275 805 1650 -4084 1616 4489 -2092 2321
1171 2321 6381 -1523 129 5632 -449 -628 5435 28 -1778 4417 -729 -4714 3107 409 -5312
1186 -5312 1334 1673 -3758 625 770 -5460 -446 2092 -5510 -1635 3980 -2815 -2926 2540 -3587 -3710
1202 -3710 3210 -748 -1702 5689 1436 -3478 2982 1883 -1772 5434 5467 -1138 3285 3279 -4338 512
1218 512 5779 -1450 -875 2993 -3504 -3814 440 -3716 -1847 4405 -2801 -6055 1273 -2253 -5854 2897
1234 2897 2983 -3254 2160 2397 -4860 -881 3015 -1236 3387 6000 -814 106 2173 -4049 220 7709
1250 7709 841 -1286 5549 -380 -7006 824 2458 -756 3166 914 -5540 -1539 -952 -5112 1638
1265 1638 2881 -5367 -1838 1396 -5654 -2715 4598 -1670 -2033 4606 -160 -3062 3049 1294 -705
1280 -705 4796 2348 -868 5234 1994 -4432 2288 4364 -2623 1579 4689 -3114 -2297 745 -3896
1295 -3896 -1480 3648 -2541 -3350 2200 -3849 -5353 2976 -620 -4322 2665 1162 -4995 1091 2471
1310 2471 -3260 664 2903 -1544 1893 3187 -2529 2258 4921 -3834 -351 7678 995 -2509 4265
1325 4265 178 -4046 2233 2271 -1837 1652 -1323 -5098 -149 -1247 -4607 2184 1644 -6544 -1364 2276
1341 2276 -5914 -2291 6606 -107 -3457 2694 841 -1058 2593 729 296 4998 552 -2100 5296
1356 5296 2294 -4247 2660 4195 -3011 1165 4556 -3183 -2224 1634 -2998 -1479 2629 -1905 -2744
1371 -2744 886 -4959 -4033 3312 -1144 -4928 2459 785 -5457 239 2717 -722 2588 2198 -2549
1386 -2549 3018 3616 -3182 1812 7066 -2251 -1840 6017 930 -2579 2408 846 -2576 1326 -88
1401 -88 -1184 2185 -2741 -4790 2613 -298 -5929 3742 4123 -8192 -4510 4042 -2135 -3923 2938
1416 2938 1315 -1819 -1486 -1695 3089 5183 -1819 -275 7567 -830 -4769 7238 5805 -4949 568
1431 568 5712 -2086 -1954 2243 -377 -1555 -1658 -2786 2009 1461 -6483 -2004 3967 -5193 -4946 6188
1447 6188 1721 -7213 -781 2170 -2156 -261 1114 -703 1886 -643 -2751 4929 4358 -4175 1305
1462 1305 6855 -1290 -1410 6158 1486 -2213 2540 934 -430 1636 -1528 -1971 1948 -3683 -5875
1477 -5875 4167 1235 -9013 -2130 3120 -4173 -2733 3756 -334 -3050 -1023 36 4305 3563 -4527
1492 -4527 -468 6405 -1466 -2467 7506 2321 -6374 1189 4679 -1240 723 3607 -415 -879 -1328
1507 -1328 -1029 4648 2275 -5751 -604 2532 -7191 -3273 7542 -516 -8749 -2891 -614 -2430 998
1522 998 1011 -1298 109 -2957 -2149 7196 3708 -4061 2545 5121 -2996 1105 8143 580 -2832 1267
1538 1267 179 726 3402 383 -646 -238 -5449 -2775 7207 1455 -5946 610 -77 -7603 -715 5668
1554 5668 -450 -3138 -2701 -3871 154 1556 -1895 1781 2956 -5692 -2347 7324 843 -2219 5806
1569 5806 2458 -3646 2984 5719 680 982 74 -1368 2390 1280 -1634 3103 -349 -9121 -1722
1584 -1722 5601 -2635 -3831 2947 -2970 -7064 -318 1028 -555 1454 -1470 -3197 809 -1124 -1150
1599 -1150 5419 2179 -4376 2437 4358 -2679 1975 7050 -501 -1960 4457 1704 93 1756 -1046
1614 -1046 -586 2300 -2656 -1649 3755 -2375 -7154 211 340 -5215 474 2190 -3953 -2262 433
1629 433 -2508 63 2649 -1253 453 2195 -2880 458 5789 -600 -1973 5059 1436 -3256 3135
1644 3135 4094 -1152 1014 1201 -1014 2443 940 -3005 1873 1912 -5082 -1198 2865 -3937 -3378 2132
1660 2132 -2367 -4737 212 -1244 -2516 1058 -425 -1595 2104 -1419 -2278 4713 2920 -2647 3486
1675 3486 5043 -3304 -636 4788 786 -58 3186 -44 280 1352 -2543 -526 4077 -1863 -2766 3761
1691 3761 -606 -5761 772 842 -4547 -102 1507 -3297 -2087 -759 -3225 -104 1179 -2315 1080
1706 1080 2477 -4552 -1350 5732 1161 -1070 5146 2487 -2350 1578 2407 1063 3663 1719 -1627
1721 -1627 2072 -168 -4659 861 2305 -4047 -1464 2099 -4555 -3844 1271 -2141 -3017 1142 -936
1736 -936 -2215 965 -2048 -2052 3351 285 -2538 3807 2305 -3539 1377 4276 -642 1162 3529 -565
1752 -565 716 2597 -921 1113 4095 -1316 -1168 2591 -1423 -3091 2358 -741 -3846 1045 -693
1767 -693 -4818 -743 -323 -3986 -481 229 -3420 85 1652 -3366 309 4090 -1045 -314 4277 881
1783 881 -315 3887 1222 358 3806 832 -1579 2936 1396 -2875 1905 1716 -3182 39 1011 -3539
1799 -3539 -830 1831 -2979 -2103 1561 -2556 -2393 1235 -2039 -2116 2167 -1336 -2993 2333 -80 -2700
1815 -2700 2162 2102 -1758 2002 2524 -878 2440 3487 -853 2101 4420 -682 269 3645 -885 -816
1831 -816 2650 -993 -2478 1401 -1647 -4310 607 -935 -3911 -104 -431 -3560 279 487 -3507 596
1847 596 3060 -2314 -601 3254 -836 -583 3174 -269 62 3381 -108 -1248 3663 1186 -1420 3037
1863 3037 1723 -1798 2116 1457 -2390 1186 1852 -3243 -873 1445 -3538 -2329 -168 -3237 -2364 1140
1879 1140 -3040 -3419 1432 -1463 -3095 2408 1003 -1382 2448 1520 -927 2801 3167 -754 2650 3586
1895 3586 -1215 738 3137 -1165 204 2489 -1863 -1345 2477 -1510 -2981 1916 -578 -3169 654
1910 654 -988 -3412 596 -550 -3569 402 675 -3497 -753 1085 -3025 118 2749 -948 627
1925 627 3669 -669 -581 4222 1811 42 3764 1362 -930 2515 778 -1575 2587 728 -3437 179
1941 179 723 -3664 -1170 1157 -2666 -1429 849 -3078 -1845 1617 -2140 -1935 2062 -656 -2293 1806
1957 1806 -233 -2633 2468 1365 -1848 1945 2552 -1203 1208 2917 152 2336 3245 -1359 1173
1972 1173 3608 -1902 -1024 3194 -649 -2952 954 -965 -3114 238 -1230 -3258 22 -1325 -3584
1987 -3584 704 205 -3371 884 2229 -2951 -402 3083 -1446 -855 3885 1207 -176 1378 88
2002 88 339 3278 284 365 4375 313 -3797 2528 3139 -2102 979 2086 -2453 -1985 181 -2137 -495
2019 -495 -11 -3626 -1802 -74 -3890 -2188 2556 -2024 -2962 2630 1291 -2994 841 2467 83 1448
2035 1448 2307 1546 3014 512 -2539 2841 4368 -1910 845 4595 -1872 -4266 1775 1493 -1143 659
2051 659 -791 -1970 -928 -2555 -1475 2864 -1577 -4144 1438 28 -5462 -199 4038 -2008 -2361
2066 -2361 2681 1029 -877 221 441 2527 2463 -744 2417 5474 -1573 -3286 4241 2542 -3131 1696
2082 1696 2815 -2731 -2298 0 -525 -44 -1136 -2523 368 -499 -4479 -189 2662 -3811 -3015 2913
2098 2913 -925 -3853 1038 1869 -1426 -537 874 1243 2150 -672 -1104 3931 2422 -2239 2668 4545
2114 4545 -2143 -1548 3490 900 -823 887 -419 -679 252 -1795 -704 1226 -3000 -4011 1808 -364
2130 -364 -4138 1234 1707 -4455 -2749 1731 94 -119 810 -517 660 320 -1770 3027 5178 -1337
2146 -1337 -1670 4530 1785 -1315 3450 3046 -1828 -308 1243 -49 1119 -18 -2266 -204 -1027 -3655
2162 -3655 982 1557 -5011 -3058 1165 -2768 -2715 2667 488 -3340 -1215 -1037 593 3314 1316 -613
2178 -613 1743 -408 -1787 4053 4763 -773 459 2238 -1214 953 3521 2 -428 753 -2030 -596
2194 -596 2219 -690 -2273 -338 -2757 -3252 1679 470 -3242 -1182 -1285 -3433 340 2600 -503 -180
2210 -180 140 -2800 752 4172 1195 550 2568 -687 -776 3447 1814 433 2241 -558 -2318 2103
2226 2103 1807 -1719 376 -91 -2613 -21 1021 -1657 -188 -538 -4206 -1448 1859 -1650 -1547 987
2242 987 -2593 -2928 1774 836 -764 1741 91 -1790 1116 2012 896 2980 1082 -1808 2236 2935
2258 2935 -1141 1141 3574 -1513 -1726 2014 299 -1026 13 -1570 -1387 703 -1549 -2027 1434 -1763
2274 -1763 -4094 697 568 -3010 87 1172 -2612 -621 1955 -194 422 1355 -874 730 2793 -449
2290 -449 1085 3838 -263 -1585 3511 1808 -1309 1343 1266 -1320 193 -317 -1222 765 -625 -3572
2306 -3572 -151 1215 -3334 -1540 1029 -2805 -3203 1175 -445 -1589 601 -367 -1136 997 175 -36
2322 -36 2893 578 -1182 3056 2748 -1657 1805 3916 -656 -21 2381 419 -272 111 -1627 -176
2338 -176 1619 -2217 -1516 1284 -2620 -3646 1231 137 -2601 390 379 -3118 -718 559 -623 701
2354 701 750 -1099 945 1553 -1516 928 3569 -630 -568 3573 984 -1082 1693 1464 -409 1574 648
2371 648 -276 1944 -521 -2912 668 919 -3028 -559 1085 -3251 -2704 -44 -1686 -1408 1271 -933
2387 -933 -1432 901 -1085 -314 2337 381 -662 3100 1349 -1940 1914 3028 -827 970 2514 -184
2403 -184 667 878 -1417 451 1861 -1276 -93 2357 -1773 -2545 1110 -808 -2352 694 -638 -2689
2419 -2689 -477 -519 -2724 -48 217 -1801 806 834 -2242 716 2341 -1192 402 3475 826 -239
2435 -239 2576 1036 253 2403 644 -124 2436 -348 -2413 944 241 -2405 69 794 -2249 -742
2451 -742 72 -2820 -1274 559 -1585 -1111 1033 -1376 -1090 1232 -1537 -1209 2320 618 -1250 2075
2467 2075 1178 -1507 1167 1916 235 2140 2308 -745 1539 1663 -1564 542 2728 -578 -1107 898
2483 898 -1968 -2222 630 -1356 -2014 605 -969 -2918 -101 -507 -2243 757 795 -1587 1377 1242 -2525
2500 -2525 315 2316 -191 960 2908 -167 -388 1641 -592 -84 3085 791 -656 1618 84
2515 84 -2022 1110 492 -1143 916 156 -3044 -1048 129 -2944 -1370 823 -2221 -1083 334 -2345
2531 -2345 -1201 1532 -679 -866 2427 317 -1194 1694 788 -201 2122 1635 -511 1577 1615 -1287
2547 -1287 804 2490 -660 254 1397 -1403 -865 1175 -1481 -1116 1672 -1093 -2431 521 -1323 -2711
2563 -2711 231 -505 -2022 773 -74 -2473 421 1080 -1087 558 1783 -696 1016 2478 -322 329
2579 329 3243 55 -192 2745 454 -867 1813 302 -1193 1121 -305 -1968 691 484 -2745 -384
2595 -384 540 -2024 -407 653 -1979 -686 829 -1891 -1193 1246 -731 -1049 1675 -245 -898 1744
2611 1744 576 -567 2299 1751 -1089 1629 2116 -725 730 1843 -545 848 1809 -1377 -868 1363
2627 1363 -2018 -1657 902 -1111 -2141 571 -1153 -2178 442 -495 -2196 764 631 -1585 738 1146
2643 1146 -1256 1053 1834 -583 1068 2393 -403 499 2557 264 -341 1708 228 -297 2097 -334
2659 -334 -951 2111 284 -2475 283 -62 -2439 -280 89 -2192 -522 214 -2436 -1121 734 -1759
2675 -1759 -926 1051 -679 -493 1868 -393 -882 2340 1076 -890 2148 1504 -808 1536 1364 -519
2691 -519 1480 1566 -1457 606 1688 -1666 -379 1750 -1214 -1527 516 -1389 -1561 1021 -993 -1869
2707 -1869 399 -547 -2291 78 -313 -2033 700 1192 -1696 923 1686 -1195 30 2432 144 710
2723 710 2333 69 277 1872 -634 -619 2562 -5 -1586 1151 -7 -1856 615 484 -2044 -141
2739 -141 -201 -2838 -1030 317 -2199 -638 1080 -1712 -621 812 -1463 -725 2669 125 -974 1666
2755 1666 406 -1007 1724 1311 138 2260 1467 -761 804 1706 -937 473 1739 -956 -310 463
2771 463 -1422 -1025 632 -2191 -1755 1187 -810 -2323 499 -276 -2130 697 568 -1534 749 241
2787 241 -2006 626 1889 -199 1534 1721 -1346 -62 2399 -109 514 2959 345 -1496 743 163
2803 163 -766 1236 -80 -1401 588 -736 -2355 821 549 -2796 -876 607 -1987 -643 1379 -1663
2819 -1663 -1600 756 -769 -412 1442 -310 -692 1763 -75 -241 2984 1372 -1353 1457 1546 -507 1422
2836 1422 1734 -471 -79 278 -1361 730 1774 -2013 -1265 1242 -1987 -2009 1812 -354 -2370 153
2852 153 -1185 -2018 610 680 -1059 655 -237 -1804 1255 1372 -989 1265 2141 -1427 -257 2269 505
2869 505 -559 1988 503 158 1542 -259 -747 1320 -1024 -1812 1342 203 -2511 -502 37 -2426
2885 -2426 -799 605 -1151 -633 -14 -1969 -990 1122 -694 -166 2210 -1159 -1265 2025 697 -400
2901 -400 2359 1910 -1112 53 855 -164 1172 1135 -838 1363 831 -2039 -73 1839 -1699 -1271 1351
2918 1351 -635 -1843 -137 -1277 -1542 308 -714 -1577 987 -859 -2041 808 529 -1411 1552 1849
2934 1849 -1420 260 2375 443 383 1859 470 487 1394 -950 150 2228 -771 -1424 1675 -5
2950 -5 -2430 405 297 -1895 -279 451 -1575 -121 -171 -1752 -129 481 -1424 32 1006 -1569 -656
2967 -656 2159 -188 -748 1954 370 -851 1237 866 365 1482 428 -745 1760 832 -1395 1139
2983 1139 1777 -1368 -538 1185 -1181 -783 586 -1630 -1187 383 -1396 -1302 1088 -1010 -1593 1041 -311
3000 -311 -1348 1330 944 -1734 187 1387 -320 762 1384 -242 461 1098 -759 771 2538 -738
3016 -738 -950 1858 -303 -1272 1562 467 -1411 194 -450 -1528 482 -227 -1733 -63 65 -2287
3032 -2287 -499 573 -1967 -465 1310 -1217 -619 1276 76 -644 1561 185 -199 1693 228 -223
3048 -223 1797 769 -1153 1059 1517 -1006 656 1168 -1261 -202 465 -1355 -450 661 -1699 -1165
3064 -1165 266 -1124 -934 1150 -943 -1644 732 -265 -1773 1019 829 -1127 413 971 -943 987
3080 987 1313 -775 1265 1872 -645 371 1852 -34 -657 1412 -392 -657 1536 -545 -1555 900
3096 900 -183 -1904 144 163 -1567 -106 -95 -1678 -21 704 -1693 -548 960 -1567 -373 1594
3112 1594 -141 -496 1564 -141 -306 1934 505 -331 1930 625 -697 1409 938 -730 830 777
3128 777 -1504 160 887 -1678 -759 1115 -1504 -1163 85 -1389 -923 886 -837 -1501 886 -195
3144 -195 -1567 930 768 -1070 672 825 -1023 795 1258 -482 768 1400 -157 148 1646 -516
3160 -516 208 1433 -654 -701 1425 -297 -1470 608 -218 -1355 -148 -638 -1663 174 -619 -2548 40
3177 40 846 -1683 -181 1071 -1284 -689 1512 -300 -24 1672 100 -297 1826 981 -433 1696 615
3194 615 -956 1293 668 -1169 750 907 -1397 -377 702 -1184 -833 314 -1177 -694 721 -1143
3210 -1143 -1111 785 -1006 -1821 1074 -340 -1179 766 307 -1413 1020 580 -1053 588 1468 -107 804
3227 804 1335 -644 429 1767 -531 -106 1766 -429 -744 1091 -87 -950 173 -605 -1424 413 -470
3244 -470 -1781 127 109 -1838 30 538 -1273 -363 966 -891 -399 1571 -466 -342 1282 135 -120
3261 -120 1473 378 -308 1599 330 -795 1417 983 -1139 618 555 -997 467 788 -1344 -117
3277 -117 478 -1779 -597 964 -1522 -1291 584 -804 -1442 761 -228 -1008 790 133 -1143 860 1036
3294 1036 -697 1098 1512 -774 941 1280 -502 440 1885 -258 -295 1154 -467 -966 860 -441
3310 -441 -738 1093 -549 -1757 382 -528 -1761 171 321 -1377 -16 262 -1652 15 878 -789
3326 -789 104 1371 -206 -158 1188 -195 -199 1967 155 -340 1564 697 -955 1215 1056 -459 610
3343 610 771 -906 331 167 -1332 -293 583 -1529 -700 613 -1073 -1130 331 -698 -1264 955 -433
3360 -433 -1324 851 535 -935 891 963 -641 1304 1139 -1053 1094 1284 -540 503 1543 -304 153
3377 153 1132 -352 -379 1223 -789 -1345 758 -394 -1242 710 -449 -1821 252 -54 -1197 105 585
3394 585 -1565 -168 1226 -758 -3 1414 -377 92 1227 -92 434 1853 285 -771 1493 572
3410 572 -666 987 761 -627 745 300 -1226 -32 626 -1524 -5 341 -1370 -313 629 -1505
3426 -1505 -937 768 -1372 -1434 923 -374 -1601 651 146 -469 1310 286 -187 1259 1151 -379 1040
3443 1040 1828 -601 792 1512 -882 -79 1327 -518 -194 1051 -418 -1106 199 -695 -1195 815 -405
3460 -405 -1459 428 153 -1826 -311 484 -1303 -486 665 -818 28 828 -556 263 1344 -360 -171
3477 -171 1768 95 -265 1549 719 -813 1269 810 -615 45 612 -711 238 267 -969 55 -196
3494 -196 -2052 -330 1088 -1191 -1282 610 -607 -1590 347 -39 -440 801 -275 -249 1226 135 -858
3511 -858 1016 819 -1154 895 1591 -617 163 1391 -322 -416 1128 7 -143 529 -717 -502 858
3528 858 -642 -1189 1059 -603 -2176 -75 494 -1181 80 582 -1271 -504 20 -705 425 1326 -511
3545 -511 311 1590 -449 20 1705 286 -441 1504 945 -420 731 1059 -982 128 133 -426 972
3562 972 0 -1708 7 757 -1582 -823 1084 -1037 -1433 123 -455 -671 596 -258 -873 680 -351
3579 -351 -876 1212 637 -402 1315 1109 -917 995 1480 -668 494 1438 102 381 789 -425 -216
3596 -216 306 -1071 -758 1140 -757 -1445 280 -323 -1606 -122 120 -983 -71 -15 -1369 268 536
3613 536 -834 99 634 -541 269 1514 -126 80 1515 108 -213 1373 360 -603 922 363 -371
3630 -371 972 507 -1174 450 -59 -1709 -46 666 -1147 -583 158 -1121 -672 721 -825 -1204 569
3647 569 -251 -578 486 -178 -539 621 -184 -322 1583 1339 -511 800 1052 -702 598 1335 244
3664 244 70 736 -958 -36 832 -561 -444 650 -802 -1399 594 -319 -1121 314 -189 -1457 159
3681 159 35 -958 -68 354 -335 671 823 -700 367 717 -811 319 2005 643 71 705 -102 -838
3699 -838 1134 767 84 707 -261 -1278 279 285 -1055 595 583 -1786 -780 599 -1118 -818 450 -935
3717 -935 -719 295 -378 -531 582 -274 -318 1393 278 -606 1539 672 -691 416 1428 -11 861
3734 861 1222 -644 -208 414 -261 210 853 -882 -944 553 -1332 -967 783 -616 -1459 -55 -11 -1259
3752 -1259 34 240 -651 246 57 -850 845 756 -1013 344 1121 -474 -527 1116 -116 -311 1296 347
3770 347 -46 946 394 -716 645 211 -708 918 -238 -1320 155 328 -1198 -620 622 -1116 -822
3787 -822 345 -733 -440 185 -844 -510 894 -573 -739 1426 300 -634 646 608 -297 697 860 -236
3805 -236 766 971 -319 73 934 -439 -52 742 -604 -425 431 -852 -1082 453 -127 -1453 -259
3822 -259 -395 -1088 478 -119 -1087 488 308 -1146 201 855 -708 368 1262 -107 157 985 -404
3839 -404 89 1461 164 -168 957 263 -409 618 9 -850 553 -2 -1050 -96 274 -1285 -476 248
3857 248 -1206 -369 289 -1113 -632 791 -729 -571 1010 -210 -422 1095 313 -179 880 563 -441
3874 -441 1027 852 -393 678 859 -453 267 860 -728 -46 550 -851 -370 386 -847 -958 370
3891 370 -530 -959 333 -291 -890 810 -22 -1083 9 321 -686 83 558 -325 489 1226 -353 114
3909 114 1287 44 145 1521 264 -224 781 118 -551 808 245 -654 87 57 -1109 168 403 -1193
3927 -1193 -44 350 -1012 -556 602 -778 -319 373 -302 -560 605 -458 -443 938 162 -205 1072
3944 1072 474 -491 712 992 -290 569 756 -441 482 624 -640 -150 755 -584 -604 565 -721 -782
3962 -782 -156 -832 -823 269 -567 -1468 -84 129 -719 64 275 -698 413 522 -727 471 1181 -147 76
3981 76 1218 352 68 1022 68 -130 1386 -20 -711 659 141 -1075 150 -57 -848 299 -214 -1066
3999 -1066 -310 328 -1225 -720 635 -703 -719 521 -533 -270 788 -446 -525 1168 371 -561 656
4016 656 325 23 433 78 -93 926 448 -716 456 817 -760 -213 619 -678 -489 461 -619 -935
4034 -935 678 -553 -1158 201 -341 -1233 149 -315 -1228 553 486 -782 454 723 -458 179 968 -56
4052 -56 337 911 -104 197 1075 -215 -75 1045 -171 -516 625 127 -967 391 -82 -938 270 148
4070 148 -970 -264 446 -1014 -461 -16 -1243 -258 1004 -924 -199 940 -180 -568 1001 222 -376
4087 -376 866 308 -38 1007 754 -438 1001 556 -466 488 846 -566 -220 881 -537 -312 473
4104 473 -770 -989 404 -405 -764 228 -639 -795 337 -24 -973 389 266 -748 27 646 -282 255
4122 255 700 -249 453 988 -169 120 1139 148 -102 1099 129 -457 803 138 -665 282 -53 -936 -38
4141 -38 -86 -1039 -266 28 -988 -132 442 -1461 -616 458 -536 -629 491 28 196 719 -128 -157 847 176
4161 176 -231 944 514 -127 517 641 -617 360 764 -555 57 526 -493 -636 456 -583 -276 443
4179 443 -1051 -667 236 -387 -949 489 -202 -1373 44 301 -660 641 951 -561 559 682 -281 202
4197 202 1089 -419 19 1011 -4 32 659 -312 -571 970 -22 -768 375 -198 -1108 -106 -255 -1067 150
4216 150 27 -1063 160 375 -852 -339 706 -638 -383 534 -391 -438 813 -28 -488 1087 399 -61
4234 -61 1057 537 -344 519 197 -678 660 635 -687 -135 660 -724 -542 750 -434 -432 198 -666 -338
4253 -338 255 -587 -750 110 -317 -721 489 214 -1062 413 607 -470 333 960 -327 235 993 -90
4271 -90 473 840 -659 218 1262 -96 -481 1201 -310 -944 406 359 -1142 356 45 -723 -165 -7
4289 -7 -1000 109 84 -928 0 501 -862 -477 955 52 -816 840 292 -255 846 465 180 929 -41
4308 -41 -68 930 383 -345 562 689 -942 246 455 -827 -618 56 -876 -495 238 -791 -548 -329 -607
4327 -607 -646 646 -213 -1178 397 205 -1386 304 715 -440 340 412 -425 510 721 -283 587 1044 -515
4346 -515 21 933 36 -574 480 -194 -833 400 -4 -713 144 -407 -993 121 -181 -1187 178 156 -1456
4365 -1456 -274 767 -255 -557 752 -108 -503 390 432 184 812 -327 -334 936 429 -859 657 657 -702
4384 -702 420 657 -266 130 210 -787 -31 418 -323 -594 -43 -1040 -642 478 -606 -681 450 -476 -1143
4403 -1143 500 273 -465 518 115 -522 362 459 -370 595 625 -168 175 917 54 14 750 51 -52 886
4423 886 -62 -433 454 -347 -613 -79 -114 -999 350 -335 -1049 -99 174 -1072 -73 694 -662 -371 897
4442 897 -243 69 731 -4 -86 997 18 -562 826 217 -285 812 526 -256 960 741 -666 92
4460 92 487 -582 57 414 -916 -393 446 -1059 -750 272 -532 -529 551 -256 -756 -115 -292 -483 519
4479 519 600 -548 281 458 -385 571 1352 -134 410 630 -412 -157 848 -150 -228 598 -258 -702 162
4498 162 -157 -603 465 18 -885 274 -202 -750 27 415 -544 -254 312 -636 -145 382 -420 -94 515
4517 515 -145 -77 467 157 -344 837 157 -290 764 291 -564 590 599 -462 20 214 -760 -69 227 -1033
4537 -1033 -179 371 -831 -452 433 -428 -597 628 -96 -418 292 -119 -297 339 72 -436 695 521 -476
4556 -476 570 949 -81 312 785 -149 284 925 -43 -154 783 3 -205 302 -330 -782 480 -333 -860
4575 -860 122 -122 -832 -179 24 -702 -100 267 -711 -25 512 -410 -28 641 85 -135 799 -145 56 1215
4595 1215 589 -502 876 367 -569 30 303 -474 444 142 -713 -230 52 -843 -424 185 -690 -504 215
4614 215 -503 -748 350 -529 -888 516 -135 -588 290 233 -514 603 92 -464 793 798 -365 180 955
4633 955 45 -56 613 -132 -167 457 -496 130 490 -271 -580 560 -263 -731 34 -179 -537 -24 123 -597
4653 -597 -162 259 -799 -1 442 -273 27 768 162 27 833 -257 -235 619 85 72 677 212 -314 616
4673 616 -43 -463 203 467 -600 -296 665 -609 -311 67 -649 -515 72 -460 -701 440 -221 -706 200
4692 200 -173 -659 384 188 -381 571 449 -380 513 619 29 299 882 -152 465 596 -319 -359 884
4711 884 -393 -660 655 -416 -850 261 -239 -971 134 3 -797 -97 2 -870 13 156 -566 -85 192
4730 192 -329 -17 736 -195 -150 985 498 15 772 310 -231 582 153 -440 803 116 -688 323 438
4749 438 -449 52 189 -852 -551 116 -520 -303 126 -587 -504 89 -388 -682 474 17 -78 765 -58 -560
4769 -560 638 596 -370 631 526 -226 197 725 -212 179 1131 68 -283 598 -309 -325 373 -289 -383 523
4789 523 -538 -712 268 -202 -387 -127 88 -916 -105 179 -560 -54 358 -458 27 562 -69 97 597
4808 597 1 27 654 24 -135 896 155 -402 290 421 -374 240 203 -381 -35 317 -933 -65 354 -564
4828 -564 -410 190 -794 -458 147 -265 -428 355 -210 -387 527 106 -431 269 255 -297 662 847 -486 310
4848 310 651 -391 26 691 -57 -219 446 -437 -239 574 -534 -361 358 -426 -539 -143 -212 -829 93 114
4868 114 -791 234 65 -622 -42 507 -157 330 469 -27 -113 664 109 -123 890 123 -164 361 -113 -43
4888 -43 487 522 -134 491 664 -547 33 1 -583 -14 496 -620 -448 174 -569 -527 5 -132 -489 469 -328
4909 -328 -161 365 -288 -383 560 497 -256 588 401 -426 260 784 -106 462 486 -310 36 235 -442 -316 586
4930 586 -392 -486 320 -162 -492 85 -371 -650 233 -35 -570 98 -2 -758 -118 241 -813 323 675 -376
4950 -376 -231 662 155 109 522 142 -220 296 -99 4 642 298 -388 458 129 -734 -163 158 -630 -342
4970 -342 377 -340 -149 169 -671 -236 147 -271 -115 237 -350 -357 570 -135 -798 559 432 54 338 176
4990 176 82 394 204 -184 362 560 -336 -117 595 -278 -242 453 -85 -628 203 -176 -729 -24 -232 -268 -125
5011 -125 -248 -760 156 306 -757 269 376 -277 -20 648 -304 97 693 224 293 442 48 -93 785 -332
5031 -332 -57 1012 313 -482 245 295 -899 -216 10 -695 -177 190 -409 -117 174 -571 -343 -52 -490 -211
5051 -211 346 -288 -187 568 94 -328 386 518 -202 370 186 -181 325 85 -259 377 411 -644 -267 639
5071 639 -345 -309 565 -372 -485 105 -28 -371 111 -232 -521 303 -262 -437 -8 -21 -714 86 274 -319 246
5092 246 523 -53 -116 89 -219 299 473 78 -118 642 -103 -15 467 -81 -492 408 164 -420 392 -149 -668
5113 -668 -29 285 -521 -201 253 -297 4 178 -584 -115 386 -126 -318 421 -232 -404 205 270 -161 548
5133 548 199 -396 717 494 -225 232 335 -128 516 407 -134 72 184 -375 -692 579 -245 -524 27
5152 27 -343 -398 114 -342 -681 48 108 -419 139 218 -650 364 90 -422 252 496 -1 -221 582 303 -170
5173 -170 383 15 85 474 -22 -500 355 71 -678 -58 -63 -609 -303 7 -209 -234 -51 -641 -405 305 -312
5194 -312 -274 45 -374 -123 474 -57 -272 467 291 -45 423 693 -16 216 276 211 553 444 -258 -16 485
5215 485 -511 -225 68 -266 -170 117 -294 -836 169 -414 -577 216 7 -592 199 37 -360 -58 355 -225
5235 -225 108 420 -107 368 391 21 218 946 43 88 429 93 -21 553 152 -882 448 -103 -382 195
5255 195 -112 -392 81 401 -352 -328 458 -398 -455 256 -412 -234 552 -122 -9 356 -160 -18 420 81 -28
5276 -28 399 219 7 403 291 -196 550 129 -356 287 188 -212 31 44 59 -50 101 -582 -398 305 -517
5297 -517 -564 62 -78 -447 -43 1 -281 56 346 -105 47 483 -313 103 545 -345 132 472 -66 101 526
5318 526 -98 -291 650 -67 -185 205 74 -370 247 -111 -414 -307 80 -400 -359 -103 -435 -78 3 -537 -178
5339 -178 490 -732 33 566 76 -75 369 29 -135 226 163 -232 447 436 -209 201 403 -429 192 199 -289
5360 -289 280 -109 -311 -292 264 -445 -284 107 -107 -358 4 -279 -549 329 -190 -225 261 144 174 49 161
5381 161 -333 151 479 -213 106 546 -243 -92 551 275 -440 331 0 -88 224 5 -379 406 40 -570
5401 -570 -168 144 -583 -115 -41 -632 11 -42 -483 -149 337 -146 -466 258 248 -360 397 -8 -256 433 511
5422 511 -181 365 290 43 -36 290 -14 -208 313 -391 24 608 -400 -192 196 -200 -261 150 -328 -299 84
5443 84 -181 -465 94 -151 -239 156 -87 -445 39 278 -149 350 538 -7 313 310 34 237 369 -61 -71 584
5465 584 220 -406 163 -52 -354 155 183 -261 192 -12 -250 302 67 -471 21 -7 -532 -107 521 -190 -112
5486 -112 79 55 -347 413 324 21 534 396 -150 422 214 -58 307 -27 -436 225 181 -444 -101 72 -214
5507 -214 1 129 -415 -509 -23 -294 -277 101 -147 -515 372 73 -424 389 310 -448 323 202 75 139 481
5528 481 -104 -65 143 -74 344 528 -394 68 395 -44 -88 122 54 -257 -81 121 -571 468 249 -423 10
5549 10 99 -340 -55 77 -503 -289 399 -251 -96 302 145 -264 303 300 -142 381 323 -92 266 -52 -379 405
5571 405 445 -278 190 341 -583 -352 217 -679 -281 120 -370 -128 -126 -282 -533 -4 -233 -427 147 8 -364
5592 -364 155 -6 -116 -191 367 -450 295 387 26 349 717 -305 194 357 127 -1 364 -25 -178 254
5612 254 65 -168 122 -29 -162 -49 72 -511 26 -143 -409 -52 169 -622 -109 275 -403 87 428 -25
5632 -25 -191 135 -40 162 369 73 -211 155 281 -163 37 383 -280 336 252 84 -12 59 -225 -87 90
5653 90 -216 -569 160 -315 -309 313 -262 -351 -39 -65 -480 201 73 -462 -92 276 -82 55 81 -423 89 449
5675 449 184 142 188 -18 -275 80 -171 -272 365 14 -140 142 33 -509 366 -50 -185 235 99 -207 -294
5696 -294 201 -561 -113 265 -9 5 197 -38 60 553 -218 25 514 -126 -69 176 91 -225 313 197 -331
5717 -331 87 189 -274 -105 410 -275 32 86 -211 -10 -73 -352 -528 364 -274 -171 354 -66 -352 123 55
5738 55 -160 7 189 -155 540 262 -268 134 731 -225 -83 471 105 190 548 -87 -187 453 4 -94 232
5759 232 -161 -411 261 -228 -564 173 108 -311 -3 312 -324 -435 285 -113 -210 187 -186 304 349 151 -109
5780 -109 408 552 -355 352 289 -57 171 140 -368 185 150 -213 -110 189 -684 47 -75 -390 -258 123 -280
5801 -280 -247 104 -352 -325 46 -249 -497 487 78 -261 -146 52 -148 236 343 -265 94 539 -30 45 785
5822 785 -94 -39 532 41 -207 135 -323 -15 131 -174 -126 -169 -67 -292 121 -108 -246 -14 -303 -472 23
5843 23 183 -279 -8 51 63 -65 75 220 -39 666 189 7 335 519 -114 370 429 36 162 214 -314 -36
5865 -36 4 -264 -167 -265 -220 -255 110 -541 -465 346 -214 -252 371 10 -345 139 103 -100 325 412 34 242 329 -7
5889 -7 -68 399 -144 198 342 103 -1 148 2 -232 -108 -88 -325 50 -14 -318 67 -331 -531 -50 39 -512
5911 -512 -193 50 -544 -88 190 -22 18 -125 -112 74 371 129 13 661 187 -304 329 106 -57 202 266
5932 266 137 260 325 -382 24 5 -281 -69 235 -328 -272 12 -357 -366 35 -169 -469 456 35 -51 133 36
5954 36 -86 171 153 145 216 398 -93 220 511 -144 537 224 -370 137 381 -41 -150 133 -3 -420 337 -21
5976 -21 -346 33 -23 -264 90 146 -645 -245 372 -195 -54 81 -6 -140 -120 -87 -41 754 102 -132 416 169
5998 169 131 282 183 132 -198 79 325 46 34 -363 295 -113 -520 65 346 -149 -430 52 -289 -441 176
6019 176 -225 -294 -97 -521 -32 95 -76 67 224 -264 -21 238 332 19 102 555 -201 167 181 -53 -227
6040 -227 71 114 99 424 2 -421 -1 -137 -455 67 89 -492 -178 -112 0 317 7 19 15 212 -559 -101
6062 -101 355 -293 178 440 77 -220 298 94 115 231 18 -455 186 182 -358 268 199 -228 -200 95 -610 -111
6084 -111 303 -293 -234 255 -443 -269 65 -205 -322 -57 -188 -77 565 -137 -277 8 469 -227 -55 285
6104 285 205 222 49 -30 -1 427 -243 -267 21 -27 -236 232 -362 -100 -183 161 -189 312 74 -491 -181 -190 -391
6127 -391 -86 130 -65 3 43 -232 -217 66 -219 241 162 105 118 531 85 49 31 38 168 354 232 -108 337
6150 337 -118 0 66 -41 -314 -117 56 -243 -181 478 21 -86 -20 -198 -226 3 -214 -366 94 5 -383 339
6172 339 -113 -141 222 120 8 112 519 -264 35 184 102 87 124 -368 -136 150 -150 -74 448 -277 -283 -143
6194 -143 -222 -188 -4 120 -73 -59 -204 -170 -108 -57 -150 -177 427 -72 76 452 -142 34 298 507 -221 97 -59
6217 -59 -191 178 -268 -429 257 240 -341 -89 127 -345 -431 12 -101 -123 -163 -414 -211 128 -238 -262 329 -267
6239 -267 -225 -282 -120 -91 170 -127 -218 401 422 -348 390 135 -167 62 345 -205 -69 295 -60 -237 238 -138
6261 -138 -382 358 212 -229 116 -134 -317 110 14 -484 -75 -147 -208 204 -53 -110 173 102 -242 157 41 159
6283 159 21 170 -33 55 422 242 306 101 -157 28 133 -109 -87 -71 1 -383 -108 92 -31 -427 280 -115
6305 -115 -35 35 -57 -108 109 -48 -193 56 178 178 40 125 -310 123 194 81 383 -253 -106 248 515 -266 -11
6328 -11 87 -346 8 242 -106 164 307 -31 -369 -109 -38 -256 -20 -68 -291 -55 -2 -136 -47 371 -273 -10
6350 -10 132 -8 -134 -81 -89 202 373 42 189 104 151 -101 467 17 -272 253 -13 -289 307 -13 -169 6
6372 6 193 -381 -20 -81 -176 -70 -75 77 -180 318 -214 -117 97 388 37 -96 128 -304 27 -70 16 213 425
6395 425 -19 382 -52 123 -112 278 -129 184 96 -315 -127 -42 132 -153 -80 -42 -15 15 10 -496 33 -93 -70
6418 -70 -184 175 -152 240 97 -193 30 89 -281 -105 370 -90 155 232 29 -114 -227 232 82 185 -82
6439 -82 -187 35 150 -41 -7 93 82 -328 413 -385 -303 220 -37 -38 -165 187 -319 -179 43 92 287 196 43
6462 43 -281 64 36 423 153 172 -108 425 116 142 290 -305 78 100 -65 -93 14 -115 -57 -10 105 -334 -26
6485 -26 63 -393 -149 -59 -267 -144 -111 -22 -352 -192 -8 64 401 126 -71 5 -36 133 235 36 11 72 7 -296
6509 -296 324 -55 -120 185 325 110 -130 -300 -246 114 59 -52 -95 181 -255 -352 -86 -152 -14 95 136 -169
6531 -169 28 167 -134 204 -11 -249 118 -81 -61 162 -85 -442 293 167 -316 -104 -87 64 -79 44 136
6552 136 -286 80 -90 -240 -7 -366 -19 -37 165 -261 139 102 -350 121 18 -91 28 229 -128 -133 276
6573 276 109 197 62 -126 57 205 130 -93 78 -29 -108 -237 -132 196 -99 -287 -136 367 -5 -150 -327
6594 -327 105 -69 213 -136 11 -140 -54 107 -193 306 319 157 295 241 213 240 234 -187 -9 218 -174 -289
6616 -289 297 155 70 -36 39 187 147 -23 -204 4 75 -221 163 -184 -54 451 -122 -221 10 -109 -149 -157 -55
6639 -55 -228 268 -19 -109 -280 224 -37 -58 257 -112 81 157 340 -138 155 -38 71 -140 193 -282 -174
6660 -174 -82 -218 -12 -232 -204 -118 88 -2 -54 10 164 215 -63 -132 -103 467 40 -329 131 251 -318 208 399
6683 399 81 -64 149 130 -122 -18 -383 10 512 73 -39 376 -24 -12 -245 129 -32 -74 -317 -366 252
6704 252 161 -377 -138 10 -172 42 -91 -252 73 -7 -219 422 451 -98 -45 253 300 -99 -119 217 -247 73
6726 73 -44 -207 79 -80 -68 56 169 -91 9 85 -514 -250 181 214 -485 314 -66 203 -32 -91 -227 201
6748 201 11 -235 115 107 -156 236 213 214 123 -130 147 119 -5 168 -198 -19 287 266 -329 -2 161 42 -277
6771 -277 -264 46 -63 -156 -199 51 168 468 -215 -64 -124 453 -189 -26 147 146 -154 168 66 443 259 -16
6793 -16 -310 193 155 -10 359 233 -81 161 117 -172 39 16 -84 -326 -24 -329 -458 -117 -49 -285 51 -300
6815 -300 -238 233 -145 36 200 19 5 236 43 96 147 355 -80 95 -8 -328 48 23 104 -30 -43 -344
6837 -344 50 -8 -120 -242 133 -294 -429 -131 -42 -181 -89 -129 -371 -83 23 -163 -166 191 21 -81 -131 -57 108
6860 108 -110 -10 167 -47 75 -255 19 -140 -66 -270 -30 -346 13 -23 -212 -66 -111 -70 -302 91 -424
6881 -424 -59 248 -336 -170 188 -113 -196 179 84 108 268 53 -29 -18 -29 -39 -6 -11 365 -358 308 -133 120
6904 120 94 176 -157 31 -227 -3 168 -491 -281 -375 -74 -132 -67 -72 -409 -54 -94 -58 83 184 -16 149 -12
6927 -12 -144 -279 85 134 35 120 175 109 130 32 246 271 -97 71 200 -75 -82 330 -40 -200 -331 -8 -344 47
6951 47 18 41 124 225 -29 -396 134 -194 4 121 -48 -181 240 108 72 129 -121 -36 -53 244 247 191 217 266
6975 266 307 9 -5 123 -417 65 -355 195 -4 -84 216 -78 13 -254 279 170 88 -45 -172 26 3 -242
6997 -242 -47 -110 31 471 168 13 -17 209 17 45 150 -102 98 7 218 -231 -17 199 -230 -278 118 -306
7019 -306 21 76 54 286 -28 -136 19 166 34 -209 111 189 -144 77 -17 -310 129 14 -181 215 -188
7040 -188 -57 319 -256 -522 264 82 -138 123 91 -53 123 306 -68 -9 55 -62 -75 44 -127 -343 75
7061 75 143 -191 184 -142 -45 -64 -144 47 361 -17 -180 129 170 -206 164 389 75 335 190 -107 -146 482
7083 482 -107 -305 -37 -124 122 283 -244 262 327 296 52 -109 9 -182 -238 -44 -148 97 30 -231 -137 406
7105 406 -403 -71 415 -64 131 277 -185 133 33 7 -203 21 -49 138 319 47 88 -61 -211 -22 -106
7126 -106 221 35 -252 -33 89 -274 76 -78 -291 -74 -127 -244 47 -125 72 251 87 -76 339 174
7146 174 -109 306 177 61 -24 302 -74 61 -13 -98 74 4 109 -112 -65 216 -72 25 89 -40 320 384 -206
7169 -206 -140 56 -167 133 52 -77 122 -3 336 91 -30 91 -88 292 -14 -52 25 203 -5 150 378
7190 378 145 -181 62 -17 -192 358 -454 322 70 55 7 116 192 -169 -360 -244 -200 -269 -125 -54 -165 155
7212 155 -118 -88 51 296 24 -190 269 110 137 209 59 -86 218 189 321 -56 93 -9 73 -112 -87 4
7234 4 -171 148 200 -33 42 239 36 -180 130 70 -377 -165 -219 89 7 -239 -13 -98 283 334 299 279 -38 -83
7258 -83 164 7 54 -58 -333 169 28 -340 -478 -26 121 -57 -4 -47 -148 66 -201 -5 -48 -233 -114 -67
7280 -67 20 72 -76 66 -336 54 356 -114 108 248 -10 -188 -174 -59 -67 95 204 8 124 296 50 -6
7302 -6 299 113 201 129 222 85 115 -119 72 87 -220 -171 -91 -461 -138 -4 7 123 146 -91 -251 231 -144 119
7326 119 3 47 1 237 106 -54 -270 189 54 32 143 31 -33 10 -114 -87 24 -18 -360 169 74 -102 -201
7349 -201 -53 -248 16 -216 1 161 -142 -51 -110 -138 46 -154 -131 78 12 -199 -189 -261 -241 -185 -63 79 -65
7372 -65 -422 380 -3 -67 120 -20 -272 22 138 98 -55 233 -25 -76 -145 123 89 -59 -335 -145 358 134
7394 134 215 142 -10 -124 369 -4 -38 15 260 134 229 250 -351 335 91 60 -71 89 -220 13 276 -27
7416 -27 -339 -61 43 -25 9 -44 -245 -25 57 -242 -246 -315 -279 56 -173 163 115 -230 -119 -33 -238 218 52 108
7440 108 201 -124 261 46 -21 -238 -90 98 118 -155 -73 153 264 -66 -95 -49 -85 -64 -129 123 -44 45 263
7463 263 -255 45 206 87 -104 60 324 -60 -68 -193 -175 -144 50 73 307 64 322 99 -220 -191 -128 53
7485 53 -157 314 -57 -98 114 -60 -250 -101 -116 -249 -213 -71 -30 58 121 -21 -205 -99 191 75 -122 44
7507 44 79 341 75 -127 -88 -80 -25 2 -102 -116 69 66 -373 63 115 27 69 -64 -87 -30 239 130 -100 -95 -151 -243
7533 -243 35 -190 -121 24 38 -157 -19 9 71 -141 -130 104 35 -30 -214 88 0 -22 -136 -8 -18 33 194 -7
7557 -7 -3 118 -108 -240 -91 -139 3 63 -153 -273 -22 -66 -311 -183 -196 65 14 -32 89 -85 -2 -385 -151 80
7581 80 -29 254 89 115 -67 155 101 -46 -59 -90 8 189 -253 -10 -122 -50 -203 -231 -182 -159 -21 230 78
7604 78 133 61 -336 -286 -203 -63 -208 149 -159 -81 249 226 16 0 -9 -25 -101 60 42 236 393 57 -20 -141 -101
7629 -101 -239 308 177 -41 293 68 -139 -553 -123 257 -130 146 227 98 -137 -189 -113 99 -304 176 -127
7650 -127 -50 -20 123 49 44 133 13 -64 -170 503 222 -14 -42 132 -101 63 101 199 112 76 107 -81 142 2
7674 2 275 -424 18 -324 -102 -57 38 80 -54 426 -153 139 -21 67 -59 -143 71 -288 113 -207 -95 -48 128
7697 128 -175 -97 281 -257 -262 211 283 -42 -94 -210 5 -143 -220 138 -48 34 -131 -110 40 -79 15 254 -228
7720 -228 291 -20 72 -179 298 102 65 33 172 16 344 148 -168 -274 -152 129 -53 76 -41 8 8 -205
7742 -205 -12 -306 -334 -8 267 93 31 -477 -97 -7 94 166 -141 69 -4 -106 -4 -368 -233 236 230 -77
7764 -77 108 73 -246 76 83 -104 -215 120 172 -55 -68 -108 168 80 -99 -136 -134 23 -104 25 -240 -52 160 127
7788 127 -49 145 -171 -257 23 110 5 -55 -23 -189 54 -29 35 -250 561 57 79 4 35 200 -343 2 37
7811 37 -153 -58 -174 -123 85 -176 168 5 -243 122 -244 -65 -99 145 -226 -350 -110 -100 200 -114 137 -263
7833 -263 204 29 -66 -210 350 -107 -27 349 -10 145 173 -59 47 167 -63 -145 56 1 -80 130 -15 -308
7855 -308 75 510 167 -76 34 -191 100 -33 -222 191 58 -146 282 148 28 -148 -112 126 18 258
7875 258 469 -170 -94 126 -5 -82 50 46 -158 210 -63 103 -424 208 74 239 -7 93 -112 60 -5 -77
7897 -77 -4 -79 254 207 -44 125 -56 -129 131 -113 -166 -144 58 208 221 224 -38 92 363 -77 -19 144 -243 80
7921 80 461 -179 -14 100 -16 93 -218 -2 -37 -143 -210 167 -61 -41 89 17 -8 347 -32 371 159 65
7943 65 72 -65 -81 -357 205 350 259 240 -110 116 185 -86 181 -146 -254 -32 -295 -99 -68 136 205 -305 12
7966 12 -14 140 -2 -136 -79 -118 -26 -66 151 -24 -10 143 94 46 -309 -14 -120 189 -40 -233 73 390 -11
7989 -11 72 39 -147 133 305 -73 153 11 140 -193 -66 -152 -71 63 69 -203 -87 -64 -263 195 -165 -31 273
8012 273 350 -235 -167 49 120 -385 -40 219 -120 98 -110 -251 167 260 208 -110 -7 -168 15 239 28 -28
8034 -28 312 136 21 -126 -211 -70 79 -201 7 194 43 22 143 -91 -36 246 -167 -7 -4 363 -65 2
8056 2 -99 115 218 -22 -35 -119 -58 185 98 85 -255 -121 435 -23 138 27 299 130 -87 -348 -12 -51 194
8079 194 -245 82 231 -188 76 -98 -3 -114 262 86 -380 136 71 151 173 -76 23 -213 163 153 60 43 -73
8102 -73 -14 173 181 92 -72 -76 -18 -118 62 -186 -84 -74 96 120 -175 18 228 86 66 38 -298 -101 195 105
8126 105 -269 -16 265 72 -200 115 219 44 136 -9 -286 125 28 201 -59 88 -89 -137 213 -405 -21
8147 -21 -112 -37 94 -1 -16 235 53 -124 -235 108 -187 -177 -281 -248 49 142 -172 264 201 79 105 -113 253
8170 253 -95 -102 241 -202 64 -149 -161 -123 244 33 -234 -236 -348 -187 166 -234 -46 -135 -26 -317 93
8191I3
$$ Imaginary data points
##PAGE= N=2
##DATA TABLE= (X++(I..I)), XYDATA
0 0 0 0 0 0 0 0 0 0 0 1 -8 8 -8 8 -8 16 -16 16 -23 24 -32 33 -40 46 -50 57 -65 74 -85 96 -109 120 -135 151
34 151 -168 187 -207 230 -256 283 -313 346 -385 426 -473 524 -582 650 -730 823 -932 1066 -1235
53 -1235 1452 -1744 2155 -2782 3845 -5983 11914 -59403 -210650 -39233 59471 -13142 -21160
66 -21160 33630 -35757 -117814 -57273 59857 47154 -40508 -18741 60743 -1486 -71181 36376
78 36376 107992 -8927 -59698 23539 25785 -28896 11198 51220 -7863 -64839 -24464 59148
90 59148 58318 -26943 -40926 19500 7253 -21472 46956 68770 -25275 -62705 -12648 6541 -302
103 -302 4197 92 -11039 -36735 -55657 -4335 40962 -9578 -35573 19300 19165 -24619 7768
116 7768 52950 26188 -10700 -8027 16876 26290 1956 3513 38193 -1695 -64746 -4463 57074
129 57074 -13630 -49739 20056 26136 -30838 -16698 22591 4008 -22071 -3652 29832 9580
141 9580 -45846 -22189 44451 7921 -51189 -1195 25460 -36895 -30547 29854 7233 -27240
153 -27240 8403 26942 -4016 -21018 6 34121 30191 -8998 -2438 30325 3035 -18719
165 -18719 20605 16307 -25530 -4416 23547 -2596 -15147 -7645 -14084 -6515 1699 -13434 -5672
178 -5672 7136 -15271 -16810 6746 -5471 -12718 11637 4849 -14103 1840 10408 5086 14848
191 14848 7309 -3025 17376 14238 -7753 15910 30498 -4633 -5851 18335 769 -11131 7984
204 7984 1657 -13239 -8842 -10490 -5074 5486 -12427 -21300 -3110 -13821 -22372 10533 11535 -17792
218 -17792 -1942 8255 -22004 -14077 20524 14524 2206 6786 -1786 -2244 9304 7046 14998 22246
232 22246 -2984 -6745 17837 4248 -9201 18433 12147 -21044 -6995 5852 -16475 -12187 4743
245 4743 -7860 -13611 -5867 -9768 -6233 -4976 -15893 1380 19430 -3643 -8056 15737 -77
258 -77 -15454 13960 18603 -1741 7160 9597 -7402 -2019 7482 2854 11417 8933 -9742 -678
272 -678 10173 -3622 4908 19134 -5332 -12832 8394 -331 -11971 3058 949 -10367 -2275
285 -2275 -9959 -19668 -991 -989 -16077 -85 6539 -13250 -5769 8498 -3791 -693 11179 934
299 934 2786 12348 -1570 -708 16457 3579 -4711 12766 4302 -8463 11230 11522 -8485 856
313 856 6301 -7730 -1602 4637 -5539 -1289 -1627 -17603 -6383 6478 -13639 -12844 6881 -8143
327 -8143 -17761 2874 2560 -4916 8015 6000 -2846 8754 7158 -305 15463 16594 939 9980
341 9980 12411 -7434 242 13707 -1699 -1777 10553 -4233 -12731 -2180 -7477 -6910 5555 -4719
355 -4719 -12750 655 -8359 -19452 975 5292 -11101 -2779 1730 -12592 -4391 5947 -2450 4815
369 4815 13072 -2087 -581 12258 2390 3910 19125 6989 -1615 11289 2040 -8990 6892
382 6892 6055 -8857 -1221 -1147 -13842 -4902 -563 -11830 -1979 3874 -13092 -6978 7384 -4275
396 -4275 -3807 9639 -2190 -6766 6794 -517 -5384 10486 5194 -6638 4220 3277 -6937 6656
410 6656 10351 -780 7980 9369 -6918 923 13070 298 1933 11734 -3203 -8240 1503 -6462
424 -6462 -7601 6977 -2243 -12981 -2348 -7153 -15533 -348 3396 -6229 3053 2060 -13076 -3020
438 -3020 6952 -3554 3318 12477 -2041 -4418 4336 -4259 -1368 14114 4606 -1948 8888 1214
452 1214 -6592 7918 8105 -489 8498 4500 -9260 135 3299 -10350 -2156 5747 -10183 -10164 -1259
467 -1259 -10912 -8491 3043 -5512 -6283 6201 -2073 -7607 7674 4428 -1643 11189 7354 -3900
481 -3900 8239 10563 -2831 5492 11088 -2859 815 7947 -1158 722 7045 -5010 -3750 5756
495 5756 -6323 -8194 7010 -2298 -13601 -2851 -5647 -13363 -1374 -764 -11343 -2844 -606 -9858
509 -9858 -533 5576 -2752 6071 11833 -2020 2225 14040 2187 887 15298 5715 -4063 5319
523 5319 1091 -6584 1403 -69 -4172 4373 -2568 -14589 -1669 2758 -7397 2384 7557 -8506
537 -8506 -5836 5112 -5868 -5490 7687 -46 -6174 -452 -5173 -6207 4657 620 -2238 7562
551 7562 206 -7032 10257 12075 -2198 6982 13459 136 2162 9361 -1389 -274 6954 -3349
565 -3349 -5544 871 -7466 -7826 884 -7239 -8440 4493 -3147 -12219 2895 4183 -7261 2180 6248
580 6248 -5409 -979 4038 -4016 640 4677 -6223 -2980 5399 -5500 -4528 9159 2896 -1347
594 -1347 6923 1305 -750 11635 8044 -1713 6562 5100 -3501 4345 1912 -11992 -2594 4922 -10576
609 -10576 -10608 -1120 -9413 -9761 754 -1920 -3945 55 -3648 1367 9701 -1103 -2180 16672 8717
624 8717 -8088 4682 9598 -2704 4423 11855 -3150 -7224 1226 2011 4105 2934 -5182 399
638 399 3502 -8108 -1109 12549 -4436 -12790 4042 -186 -14710 -1902 6250 -5613 -7780 -5652
652 -5652 -5965 1521 1937 -3221 5139 4695 -8424 3173 16761 3236 -1479 9398 2109 -2065 10142
667 10142 6445 -3018 -515 -4244 -4349 6582 985 -9809 -228 -561 -13177 -1957 9370 -2181
681 -2181 -6204 -374 -5447 -4768 1851 2375 7169 4255 -15976 -10588 13122 7266 -3442 8315 3146
696 3146 -13853 -644 14523 6394 1260 2844 568 730 -1478 -833 12361 7465 -12869 -4543
710 -4543 7388 -8658 -6896 15023 2143 -20360 -7302 6984 1680 -1293 -3328 -5529 -2762
723 -2762 -4094 -870 11113 1609 -15662 -2047 8107 -4287 1128 13906 -731 -9202 3120
736 3120 4414 3598 9679 4400 -1153 1515 -3463 -2066 12668 6447 -9409 -3473 -568 -8539 -423
751 -423 6538 -3472 -7233 -7553 -9741 3380 9336 -6729 -7085 5252 -4275 -6727 11042 8169 -6693
766 -6693 -1401 4787 694 2290 4304 4724 6166 -2854 -6335 9943 9114 -6411 3432 10932 -9498
781 -9498 -9149 12601 5827 -10509 -3950 1128 -4011 -5103 -3984 154 385 -11340 -8563 8236 6
796 6 -12371 4589 9018 -9358 -2517 12768 2196 -3975 5478 5375 2189 4241 554 1593 3177
811 3177 -4204 654 10964 -2575 -11117 4147 3234 -8726 -5 5559 -3694 -3355 -1226 -5849 -122
826 -122 3007 -4990 -82 4736 -7334 -5880 6501 237 -5001 3994 2410 -1773 3698 319 -3330
841 -3330 3886 3386 1568 10131 3213 -9391 1157 7081 -4395 1414 12442 -496 -9545 -2342
855 -2342 -1302 -1678 2258 103 681 -36 -11883 -9190 6639 1795 -6297 5074 2452 -12570 -3414
870 -3414 7252 -1431 -777 6756 1225 -1443 569 -1502 3348 5828 -1038 3162 8600 -5001 -6964
885 -6964 7707 3493 -6215 4526 5259 -5335 -1379 39 -5295 -9 3277 -2820 159 301 -8936
900 -8936 -3886 3046 -3611 -2007 4531 -4037 -5981 3800 -333 -3762 6437 4516 -1611 4054 2147
915 2147 -2383 7460 8990 -1303 2490 4445 -4571 -499 6347 -490 -1406 277 -7286 -4981 2602
930 2602 -4357 -4596 3689 -3469 -8798 1543 579 -4350 3681 3052 -5583 -449 3029 -2216 2334 4948
946 4948 -3005 -488 3048 -3297 1292 6837 -2388 -1296 8334 1386 -4161 4181 1457 -3745 4312
961 4312 3061 -3186 1636 -462 -8279 -2040 594 -5552 -350 2015 -7337 -4292 1337 -5103 -729
976 -729 7848 -354 -3326 4874 1542 -944 6493 3881 -699 4889 834 -4583 3618 3949 -3520 1731
992 1731 3651 -4896 -900 3540 -3840 -927 5423 -1870 -2275 4496 -2181 -4890 1305 -2713 -4577
1007 -4577 3296 -741 -6161 866 -1226 -8291 250 3498 -2619 1998 4440 -2866 1388 5942 -1358
1022 -1358 1983 8091 550 -1228 5280 -621 -2420 4792 -295 -4868 2277 -710 -6426 1234 1363
1037 1363 -4710 721 2018 -5102 -815 1638 -5369 -454 5348 -2883 -2720 2970 -3567 -4483 3180
1052 3180 -805 -1414 6416 1433 -4044 4393 2752 -2120 5390 6565 -685 3258 3982 -3479 1358
1067 1358 4264 -3829 -1643 2839 -5234 -5145 1728 -3803 -4138 2586 -3420 -6354 1854 -667 -4833 3416
1083 3416 3168 -2812 2020 1603 -4358 2229 4093 -2668 1981 6084 -2389 -1661 4414 -1809 -597 5581
1099 5581 466 -1013 5272 -78 -3832 3192 809 -4183 1861 426 -5511 224 15 -7085 -1355
1114 -1355 2112 -5843 -2981 2740 -3398 -1812 4714 -926 3 5975 -363 -2635 5307 1936 -1847
1129 -1847 5664 3762 -2367 2768 909 -5547 1476 3591 -3562 1128 4261 -3676 -2093 2175 -3629
1144 -3629 -915 4936 -2398 -3306 3438 -2896 -6301 1385 -816 -4652 1344 -20 -4781 1808 1529
1159 1529 -4424 2734 5277 -2845 1063 5452 -1141 1640 6508 -511 283 5859 -1292 -3372 3788
1174 3788 -262 -3588 2833 -439 -4840 1206 -805 -6557 1068 1862 -5113 -285 3046 -3641 -1283
1189 -1283 2028 -4368 -692 4051 -2464 -1412 5621 -418 -3239 3487 494 -2515 5179 3099 -983
1204 -983 4764 2807 -3968 2185 3772 -2311 2603 4279 -3914 -2219 1444 -5529 -2760 4552 -2502
1219 -2502 -5457 525 -3738 -5145 1226 -521 -1907 3975 -838 -6103 2155 2535 -3054 4053 6360
1234 6360 -2626 701 4062 -2931 -598 5617 854 1013 4792 -2243 -3509 1512 -2374 -1104 6717
1249 6717 367 -5885 1423 -1117 -8291 303 4056 -2152 -792 -303 -6318 -2773 1761 -2260 1232
1264 1232 4432 -3952 -2721 4011 -1499 -1613 6911 2365 -2184 4580 2068 -3230 2815 3722 -642
1279 -642 3218 2343 -3007 1124 1106 -6308 -633 4192 -3408 -2495 2639 -4241 -5398 829 -1799 -2160
1295 -2160 3559 -1424 -4055 2143 -435 -3503 3987 3259 -2915 2855 3603 -3446 841 5216 -1277
1310 -1277 595 4496 -210 96 3348 -1667 -77 3998 -2913 -2585 5955 250 -6537 959 397 -5912
1326 -5912 -10 2446 -3756 -1747 -1174 -5253 -406 2151 -2621 1558 3833 -4380 -1266 5652 -1175
1341 -1175 -861 8135 2281 -4345 2940 3845 -1258 2099 2070 -710 3273 377 -4058 2410 1890 -5548
1357 -5548 -428 4159 -4133 -2425 2846 -3568 -4942 1396 -1500 -3007 2614 -1043 -3811 974 -1720
1372 -1720 -2727 4839 2263 -3890 2605 4104 -3327 1394 5754 840 1425 2688 -1862 922 3962
1387 3962 -2627 -488 5485 -2295 -5065 3787 348 -6005 174 681 -3773 -779 253 -2653 10
1402 10 -1784 -5043 2092 2150 -4592 1487 5052 -6343 -3837 6690 1668 -2972 4106 3659 -1454 449
1418 449 1346 3647 5095 -1231 -2036 5666 476 -6437 3839 5289 -7188 -3394 4402 -3269 -4976
1433 -4976 986 -1079 -3535 -1251 -1824 477 1851 -4577 -2386 5543 -1506 -4496 6644 3623 -6798
1448 -6798 -498 5912 202 186 2935 351 1457 1416 -1149 3691 5021 -4165 -1086 6298 -1033 -4399
1464 -4399 3629 779 -5409 -423 172 -3256 -860 -2067 -4049 471 -1987 -4884 3644 2841 -7200
1479 -7200 -1558 7034 -209 -1831 5496 1699 -2647 1117 2327 3846 3356 -3530 -1686 6154 -212
1494 -212 -4486 5155 2245 -7779 -696 5424 -1823 -2191 2189 -2226 -3466 -989 -1203 1920 1020 -6451
1510 -6451 -2861 2795 -3883 -3295 7605 1146 -9043 -911 4677 488 2495 3298 -431 1111 607
1525 607 190 6718 4454 -4723 -207 5390 -2439 -1410 5725 -1148 -6420 -80 662 -1513 1206 -1355
1541 -1355 -3574 -1406 -3435 -2292 6277 2000 -8073 -1554 2489 -4274 -108 7281 218 -4420 -926
1556 -926 -80 2241 4462 64 1521 3646 -3024 -1655 7784 2943 -3787 3060 2973 -4862 102 4640
1572 4640 -1836 -3812 -1312 -2363 -169 363 -3326 -619 -688 -7932 -2061 7142 -788 -4915 2868 113
1588 113 -5214 2126 5001 538 1235 535 -1756 2225 2391 304 4474 3241 -4299 713 5039 -1895
1604 -1895 -418 5540 -1464 -5212 2025 1219 -3319 -826 -1949 -3088 531 -2082 -3170 2240 -1541
1619 -1541 -6655 567 3621 -2966 218 4062 -2019 -1706 3804 808 883 4047 118 -126 3253 -511
1635 -511 -238 5550 114 -3476 3637 1937 -4285 1120 3362 -2740 -2264 289 -2151 -384 437 -3914
1651 -3914 -720 1364 -5248 -3135 3553 -1895 -3746 2676 379 -3450 2197 2255 -846 2316 2288 -179
1667 -179 2728 1828 -1248 4072 3763 -3186 844 4519 -3301 -3141 4127 417 -2889 796 -834 -2765
1683 -2765 -46 -2568 -1738 2566 -1557 -4441 2024 -117 -5638 127 2873 -3245 -427 3400 -2016
1698 -2016 -1562 1825 -196 1423 3603 -86 783 3836 -1677 -1112 6833 2263 -2914 3012 2288 -4190
1714 -4190 -422 2112 -856 173 -537 -4373 -1490 -915 -4864 -761 2400 -3698 -2960 2322 -2401 -3347
1730 -3347 3126 947 -1788 2794 1870 -1015 1946 1318 -255 4059 2582 -2143 2792 3890 -3310
1745 -3310 -6 4862 -379 -1241 2405 -1267 -2136 1498 -1875 -1141 2370 -2110 -4316 1071 -1536 -4487
1761 -4487 1305 294 -4381 -381 1257 -3496 -592 2491 -830 167 3096 -719 953 3764 -574
1776 -574 953 5319 597 -1371 3941 1446 -1754 1972 1067 -2196 957 -292 -3581 247 817 -4250
1792 -4250 -1012 840 -3797 -1938 1267 -2958 -2017 2281 -1453 -2251 2372 -696 -1857 2117 827
1807 827 -1561 2845 1297 -2383 2888 2929 -2115 2156 4016 -817 753 3115 -875 477 3035 -1690
1823 -1690 -949 2360 -2135 -3247 1230 -1879 -3534 465 -1490 -4589 109 -428 -3796 824 1382 -2554
1839 -2554 472 2147 -1741 1080 2871 -971 1128 4258 -552 -988 3954 568 -981 2879 615
1854 615 -1260 2425 410 -2501 1616 1268 -2971 636 1002 -3355 -763 675 -3599 -1383 687 -3522
1870 -3522 -2967 1015 -2603 -2632 1680 -910 -1401 2262 281 -1510 3445 2116 -809 3589 3896 -662
1886 -662 2256 2954 -984 1613 3087 -1342 -345 2073 -2543 -2241 1548 -1634 -2498 1065 -2428 -3325
1902 -3325 1095 -776 -3499 1224 429 -3398 -78 459 -2724 194 1590 -2135 776 3406 -1470
1917 -1470 -4 3467 103 629 4287 657 344 3703 293 -1556 3042 1370 -1944 1237 24
1932 24 -3482 -465 -52 -3406 -468 234 -4251 -1733 1484 -2812 -1738 1706 -1084 -1652 2145 -909
1948 -909 -1044 2752 477 -1441 2886 1354 -2030 2431 1859 -1024 2467 2904 -1231 1256 3148 -1019
1964 -1019 10 2574 -1072 35 1580 -2309 -1908 1819 -2376 -3307 1443 -1162 -4973 -330 268 -2939
1980 -2939 -175 366 -2372 736 1011 -1772 1952 2786 -1143 1176 3731 -1410 -171 4310 508 -1167
1996 -1167 3565 1728 -1838 503 270 -723 1995 -44 -1670 1623 -766 -4827 472 2768 -3366
2011 -3366 -2298 1232 -3135 -3290 375 -1227 -711 508 -1827 -1102 2034 -739 -820 4163 1893 -1720
2027 -1720 3977 3463 -1981 1256 4116 696 847 2177 237 324 -507 -3286 1164 3456 -2901 -2563
2043 -2563 2289 -2643 -5680 1246 1607 -2575 -1275 -799 -2484 -843 -858 -1036 2657 67 -3798 1742
2059 1742 2945 -3076 424 6127 -2 -1755 3678 2460 -1081 753 1616 1861 1682 -1228 -178 3056
2075 3056 -2554 -5231 2848 1989 -4811 -1542 1874 -3556 -4021 825 58 -854 -950 -2026 -14 1060
2091 1060 -2815 252 4148 -1336 -2419 3927 2128 -2671 2101 3794 -474 -67 2300 1450 1360 -213
2107 -213 -1530 2812 2489 -3050 -78 3255 -3192 -3977 2293 555 -3230 -1035 -833 -1832 -320 -1395
2123 -1395 -1568 1287 -1585 -3232 2092 2089 -3100 1057 3636 -2884 -1827 4420 2506 215 1572 641
2139 641 590 1997 -148 2262 4313 -1719 -3602 3083 1772 -3340 779 1380 -3783 -2659 499 -1029
2155 -1029 -1344 -655 -2939 -1045 95 -2513 522 2336 -3136 -2653 3185 995 -1118 3892 2291 -2550
2171 -2550 66 2333 2050 3547 1629 -1693 827 670 -1554 2854 3869 -2483 -2358 1015 -1392 -1195
2187 -1195 2173 -1427 -3292 -625 -1833 -2205 1278 -1029 -3477 -557 -611 -1966 2773 2071 -3173 -905
2203 -905 1533 -581 2217 4366 377 -310 1312 -540 1379 4752 971 -1479 841 -732 -1893
2218 -1893 2661 1000 -2348 -449 -1383 -3194 700 1292 -2772 -1787 -437 -2544 -508 1523 -1216 -1030
2234 -1030 165 -2431 -563 3900 590 -1667 1584 -65 -1131 3366 3235 -282 1495 1117 -1140
2249 -1140 1567 3123 163 689 998 -2462 393 2383 -1699 -1379 1891 -2367 -3663 1229 373 -2548
2265 -2548 -1214 -1774 -2195 878 -401 -1751 886 -27 -2896 1404 3042 -1100 160 3070 -760 -17
2281 -17 3684 1307 229 1784 2 169 2297 -5 -359 2269 -795 -3213 1406 1326 -3360 -951
2297 -951 907 -2466 -1515 -154 -1754 -666 -363 -2880 -64 2096 -1919 -1678 2571 -707 -1898 2526
2313 2526 1918 -553 1553 1465 -42 1990 1844 687 2531 978 -1579 1758 2650 -2347 -631 2711
2329 2711 -2000 -2777 1311 -577 -2726 -740 -1868 -1302 345 -2268 -2749 911 -936 -3082 1670 2412
2345 2412 -1791 532 2303 -1210 -123 2709 683 1290 2027 -349 715 2337 -601 282 3274 -254
2361 -254 -2156 2312 1087 -2717 8 1263 -1648 -253 -199 -1946 -530 -1120 -3252 -316 1256 -2917
2377 -2917 -1355 1622 -1735 -1997 1972 577 -383 2214 779 -525 1823 1228 225 3202 1737 -894
2393 -894 2237 1779 -2357 666 2488 -1414 -821 1782 -1091 -1513 300 -1722 -850 1059 -1588 -1659 1110
2410 1110 -1289 -3785 679 686 -2305 639 524 -2163 -108 1089 -1154 946 2255 -620 963 2284
2426 2284 -557 986 3768 96 -145 3085 734 -1714 750 244 -1527 327 -278 -2142 126 -943
2442 -943 -3929 -500 357 -2875 -851 1154 -2174 -1114 906 -1079 -1177 2173 -42 -587 2056 417
2458 417 -898 1934 704 -475 2854 1832 -1002 1722 2000 -1471 566 2293 4 321 926 -1859
2474 -1859 -1016 559 -2200 -1432 1371 -1711 -2788 -58 -1516 -2786 644 -148 -1728 1193 437 -2232
2490 -2232 727 1711 -555 1664 2576 -295 679 1882 -943 366 3412 519 -432 2023 -515 -1346
2506 -1346 943 20 -920 1859 299 -2453 -422 -225 -3295 -471 894 -2073 -637 -160 -3020 -1353
2522 -1353 1127 -1547 -564 1962 -404 -1056 1459 132 -315 2722 1409 -382 2237 1374 -1190 1292
2538 1292 2057 -300 1047 1238 -1734 -287 1018 -1974 -715 1692 -950 -1617 27 -1841 -1896 526
2554 526 -650 -1631 1183 -433 -2729 283 19 -1809 929 1678 -870 833 1868 -959 889 2844
2570 2844 63 669 2593 358 238 2571 -525 -841 1771 -486 -2236 1215 -61 -2548 401 -543
2586 -543 -2698 -422 -183 -2764 -344 655 -2168 -769 1583 -1051 -818 1620 -472 -1015 1854 125
2602 125 -165 2498 884 -791 1737 1231 -659 1962 1711 -591 1588 1879 -1535 -21 1240 -1423
2618 -1423 -1086 877 -1254 -1099 612 -2002 -2211 582 -1326 -2095 1048 -658 -2150 724 275 -1046
2634 -1046 1228 1227 -963 1466 1906 -841 1057 2210 -344 322 2325 -505 -215 2214 -261 -1056 2173
2651 2173 83 -1852 695 -378 -1566 832 -160 -2296 499 178 -3060 -786 951 -2105 -600
2666 -600 1310 -1162 -859 1361 -957 -572 2348 143 -411 2421 847 -459 2266 762 -945 2274
2682 2274 1381 -1446 849 1725 -1471 -106 1275 -1384 -174 347 -2128 -1152 1122 -1586 -1672 1075
2698 1075 -908 -2319 562 -715 -1780 1005 122 -1454 1071 734 -1451 892 1642 -666 1418 2521
2714 2521 -798 740 2732 -904 -254 2656 428 -566 1247 -105 -1182 1120 -429 -1656 1081
2729 1081 -284 -3043 -101 306 -2390 -385 708 -1800 -1011 631 -1659 -538 1718 -166 -117 1947
2745 1947 -213 -555 1983 496 125 2985 1551 -627 1289 1022 -1232 831 1577 -970 684 663
2761 663 -2200 -493 1245 -1808 -1192 829 -1677 -1589 295 -1281 -1426 960 -704 -1713 1143 613
2777 613 -1866 1024 1436 -1057 1444 1836 -469 557 1628 -688 791 2394 -55 266 1195 -1511
2793 -1511 -1432 2199 50 -1181 1719 -736 -3117 -148 430 -1302 197 -442 -2192 -426 223 -1997
2809 -1997 313 945 -2162 -552 2101 -283 -204 2118 -173 -768 1974 643 -3 2031 719 -914
2825 -914 1587 898 -454 2075 1039 -2348 226 1561 -1259 -748 1226 -1528 -1680 -286 -1262 -224
2841 -224 931 -1810 -2104 988 -836 -1434 1740 821 -2230 148 937 -604 1725 1872 -458 472 1030
2858 1030 -676 1216 2585 -403 271 1914 -1056 -969 2328 276 -1445 908 190 -1844 1 -715
2874 -715 -1736 166 -634 -2236 688 792 -2798 -862 1199 -1394 -468 1756 140 -452 1064 -205
2890 -205 -152 2671 878 20 2128 -66 -1453 2181 1241 -684 1150 1178 -2009 -821 767 -415 113
2907 113 457 -1509 -176 319 -2381 -1226 1653 -1016 -2099 1190 -420 -1955 320 296 -1075 927
2923 927 569 -827 1283 852 -668 1493 2086 -569 1245 2126 -1040 -786 2094 538 -948 1110
2939 1110 1 -1157 105 -1073 -1087 929 -1062 -2623 660 -19 -2964 -348 938 -1822 -387 1085
2955 1085 -791 -412 701 -633 256 1938 -241 46 2007 -741 -932 2381 1104 -793 1552 1117
2971 1117 -1082 650 1557 -478 493 432 -1628 218 855 -1956 -671 922 -2252 -2009 788 -1010
2987 -1010 -1465 724 -898 -1233 694 -238 -698 1328 210 -1340 1511 1309 -845 1291 2317 -1263
3003 -1263 9 2356 -54 -342 1120 -303 -513 1041 -832 -389 1595 -1096 -2355 1174 -200 -1877
3019 -1877 547 524 -2133 -765 -111 -1587 41 724 -1403 27 621 -1526 283 1898 -440 16
3035 16 2337 161 -690 2515 1316 -460 1373 944 -536 1330 276 -1111 776 416 -2228 -2
3051 -2 1004 -1973 -1043 558 -1360 -1173 651 -1116 -994 766 -853 -1511 1071 -43 -1193 1041 377
3068 377 -1208 1330 1162 -920 1208 1965 -819 417 1453 -416 495 1552 -468 -290 1326 -843
3084 -843 -955 1144 -665 -1954 646 -274 -1878 536 -224 -2127 33 300 -1937 -99 1074 -1198
3100 -1198 -404 990 -643 162 1757 -723 -48 2012 -13 -628 2052 780 -425 1248 790 -802
3116 -802 1168 963 -1509 750 734 -1491 351 557 -1575 -740 415 -1897 -811 990 -1375 -1284 507
3133 507 -544 -1246 776 -271 -997 1130 234 -998 1821 1444 -983 1089 1502 -760 610 1691
3149 1691 -602 180 1473 -545 -448 1113 -699 -836 915 -569 -994 917 -708 -1893 672 -214
3165 -214 -2262 -172 429 -1903 -223 488 -1208 227 771 -1176 261 2090 -588 2 2174 166
3181 166 -105 1915 677 -288 1625 599 -1141 1177 994 -1066 440 405 -1435 219 420 -1601 -326
3198 -326 906 -1545 -1265 861 -1012 -1260 727 -655 -639 1004 -358 -895 1345 295 -1159 1459
3214 1459 1338 -905 955 1182 -677 539 1506 -734 545 1769 22 -173 1253 -877 -664 1298
3230 1298 -936 -1324 979 -965 -2035 108 -35 -1917 39 3 -1287 300 387 -1357 83 1391
3246 1391 -981 53 1586 -460 -300 1658 170 62 1793 297 -489 1413 387 -646 1176 721
3262 721 -1198 888 715 -1590 52 510 -1742 -415 761 -1335 -831 221 -1540 -1025 861 -1090
3278 -1090 -727 881 -457 -1038 1068 404 -580 1307 1039 -462 995 1380 -729 1046 1603 -583 510
3295 510 1290 -801 -229 715 -783 -591 1352 -817 -1435 288 -191 -1726 213 -354 -1237 300 -103
3312 -103 -1822 278 704 -1338 229 1343 -692 163 1262 -592 121 1952 214 -102 1561 233
3328 233 -332 1434 524 -290 1313 211 -1431 808 600 -1460 130 724 -1299 -332 34 -1501 -672
3345 -672 606 -1551 -918 860 -877 -1093 932 -169 -956 1001 -15 -252 1334 663 -1114 1143
3361 1143 1383 -600 607 1402 -385 643 756 -732 -40 1217 -667 -880 986 -615 -1084 330
3377 330 -582 -1412 346 -519 -1701 385 -130 -1358 -13 340 -1403 89 743 -934 166 1183 -1008
3394 -1008 -68 1725 196 158 1457 99 -110 1143 66 -525 995 153 -1464 670 261 -1299 68
3411 68 692 -1286 -132 202 -1753 -616 750 -1374 -634 558 -657 -616 473 -875 -598 1667 215
3428 215 -826 1518 1009 -647 686 1197 -102 1125 1085 -525 586 918 -634 217 1175 -1011 -644
3445 -644 819 -1013 -1081 811 -331 -1735 360 -646 -1595 62 -362 -1269 697 226 -1287 621 866
3462 866 -1169 314 1717 -378 93 1496 139 277 1172 172 -138 1280 -26 -532 1502 239
3478 239 -1004 796 539 -1454 -11 650 -1462 -503 528 -1182 -540 432 -933 -392 237 -1109 -142
3495 -142 1574 -514 -944 1499 635 -826 931 1212 -136 1045 601 -99 1213 828 -838 703 1290
3512 1290 -1000 197 1241 -623 -590 817 -648 -877 415 -265 -1006 262 -849 -1021 432 -340 -1368
3529 -1368 778 270 -1872 369 1729 -481 135 988 -68 -60 1004 328 1095 1514 -340 -75 1439
3546 1439 -225 -681 1367 333 -1070 649 580 -1159 -316 114 -1402 -551 -216 -914 293 195 -1713
3563 -1713 -362 932 -1206 -1190 1054 -64 -1538 677 672 -83 854 456 -256 1045 450 -191 1411 1061
3581 1061 -577 789 939 -1184 -30 1396 -310 -660 473 -287 -1050 36 -758 -1401 -248 -814 -809
3598 -809 904 -485 -1905 298 465 -1319 416 1354 -407 295 794 26 247 1434 -237 366 1221
3615 1221 -177 -23 1612 262 -417 939 63 -775 525 385 -935 167 253 -809 110 -185 -1616
3632 -1616 -252 443 -1266 -120 819 -788 -1201 422 -188 -594 1215 244 -461 976 630 -485 1238
3649 1238 477 -602 1031 561 -433 1379 1263 -994 -414 721 -573 -168 1075 -558 -862 241 -724
3666 -724 -523 916 -412 -818 196 -535 -1371 796 577 -816 584 737 -999 390 1098 -519 362
3683 362 1013 379 570 1154 -152 -143 1233 67 -184 2072 661 -1643 -26 -121 -1014 651 774 -676
3701 -676 -155 -664 -1853 -388 272 -1137 -479 637 -1482 -283 1202 -391 -832 1011 252 -477 815
3718 815 527 -44 867 487 118 1385 681 -755 600 948 -1148 283 1624 -779 -783 154 -1147 -743
3736 -743 583 -465 -749 354 -1134 -1446 538 -575 -800 1045 409 -1435 527 1177 -762 -16 983
3753 983 25 299 1223 -197 388 696 -644 93 1559 106 -735 965 60 -762 588 -148 -862 104
3771 104 74 -1131 137 62 -1276 0 100 -1485 -495 795 -921 -457 911 -396 -704 913 545
3788 545 -157 895 311 -282 1234 522 -265 1365 920 -855 502 679 -730 136 608 -597 -36 622
3806 622 -818 -592 535 -1128 -985 329 -405 -938 435 -323 -1144 42 403 -746 87 702 -622
3823 -622 411 774 -289 735 1241 -655 290 1170 117 -55 1300 -327 -319 1054 84 -550 907 88
3841 88 -1052 146 -452 -1487 -399 -379 -1330 171 300 -1251 -324 470 -998 -701 886 -315 -251 768
3859 768 -306 36 893 368 -144 1252 808 -737 786 534 -474 543 659 -578 91 395 -834
3876 -834 -48 627 -848 -425 403 -743 -592 386 -763 -937 449 -87 -966 247 -28 -736 735 363
3894 363 -553 829 682 -596 276 1160 -185 315 1110 -142 232 1017 35 -212 1126 54 -475 832
3912 832 -7 -1053 326 -238 -1320 -53 72 -1160 -276 178 -1280 -388 557 -544 -252 660 -382
3929 -382 -442 1086 -135 -354 1262 336 -264 952 281 -280 1097 357 -296 693 722 -829 2 741 -722
3948 -722 -85 263 -1037 -352 195 -949 -834 491 -301 -811 262 -195 -957 265 52 -581 403 163
3966 163 -846 519 844 -195 729 864 -161 301 867 -374 405 1167 76 -272 1004 75 -903 511
3984 511 -221 -454 602 -22 -1177 -108 103 -1407 -227 84 -1089 -343 259 -1084 -470 422 -545 -93
4002 -93 1081 -68 -16 661 56 -373 1054 286 -290 1209 371 -587 407 617 -232 110 652 -320 203
4021 203 427 -1225 -346 602 -748 -887 262 -936 -585 244 -537 -712 244 105 -1042 517 573 -583
4039 -583 530 686 -249 750 1039 -418 471 1302 -292 182 1062 155 81 847 -195 -610 488 -159 -753
4058 -753 407 -263 -1058 447 83 -1167 -295 363 -1254 151 364 -602 -519 454 -176 -173 774 -260 25
4077 25 642 -317 -308 1327 477 -305 904 827 -267 660 421 -371 670 124 -734 12 420 -974 -270 523
4097 523 -1001 -476 167 -877 -810 415 -273 -917 397 129 -1006 46 64 -406 634 758 -549 486
4115 486 958 -483 148 1074 41 354 1036 37 -283 704 -232 -473 657 -171 -818 372 -142 -676 245
4134 245 -183 -1321 -4 239 -1062 -280 276 -1020 -413 345 -264 -81 1176 -544 -59 1015 31 -72
4152 -72 853 488 -97 919 315 -249 846 668 -726 528 182 -686 103 262 -514 -293 610 -912 -612
4171 -612 178 -814 -927 717 -312 -538 364 -310 -469 543 -10 -569 908 734 -404 818 903 -70
4189 -70 142 1012 -150 86 1224 -58 -118 665 -43 -310 582 -125 -560 588 -621 -896 381 48 -1271
4208 -1271 319 11 -975 -125 439 -452 122 386 -714 19 799 -324 230 908 -440 -57 1221 164
4226 164 -303 1372 440 -418 532 741 -89 51 83 -391 -248 166 -853 293 629 -1258 -594 572 -532
4245 -532 -784 215 -364 -807 163 -79 -396 469 140 -706 508 595 -312 968 996 -332 462 1054 -322
4264 -322 45 964 105 -703 379 -232 -161 337 -440 -218 641 -426 -914 441 31 -1237 -343 125 -1038
4283 -1038 -366 86 -493 -87 340 -314 201 621 -540 198 976 -16 -99 1224 415 -763 815 830 -140
4302 -140 623 696 -460 324 133 -653 473 493 -1233 -441 538 -788 -620 715 -330 -748 12 -343 -482
4321 -482 337 -293 -793 581 -249 -293 889 577 -855 708 716 -500 405 1251 167 74 416 -45 265
4340 265 867 -328 -168 599 -421 -979 686 61 -1130 249 -217 -660 -105 184 -1038 -126 112 -669
4358 -669 464 652 -520 42 578 -551 36 1006 108 -236 688 375 -589 424 315 144 486 184 -436
4377 -436 771 400 -1001 189 232 -1042 -401 450 -707 -361 305 -419 -638 286 -643 -327 205 -149 -574
4396 -574 533 -206 -438 603 348 -546 341 1009 27 471 868 -27 227 787 -377 240 675 -204 -519
4415 -519 357 -443 -425 359 -450 -841 247 177 -744 214 -315 -983 -505 207 -750 354 300 -574 67 650
4435 650 -342 -355 1082 -32 -414 773 466 -9 549 38 -435 785 237 -737 108 301 -694 170 451
4454 451 -607 -220 378 -823 -421 482 -415 -530 280 -641 -770 124 -375 -524 555 -237 -571 592 391
4473 391 -487 723 721 -373 588 825 -411 503 736 -218 339 580 -312 -421 444 -365 -560 405 -13 -740
4493 -740 562 -188 -989 374 351 -621 305 -7 -807 -178 295 -628 -53 879 -256 -7 683 -245 -117
4512 -117 1001 -65 311 604 65 -189 885 187 -493 671 252 -309 217 142 -1000 103 483 -563
4530 -563 -747 225 -448 -419 345 -670 -134 488 -530 -427 632 -44 -1000 426 341 -207 444 733 -339
4549 -339 749 686 -301 535 881 -306 95 540 -612 -295 873 -256 -526 345 -542 -875 169 73 -826
4568 -826 73 -377 -693 98 82 -739 -71 281 -534 148 809 -231 69 1111 -66 35 826 170 -43
4587 -43 780 123 -219 819 91 -315 673 296 -828 233 473 -906 -206 156 -642 -133 176 -655 -419
4606 -419 1 -754 -332 472 -364 -369 936 224 -428 712 441 -325 827 598 -456 157 678 -289 237
4625 237 541 -203 304 524 -413 -412 897 -318 -440 438 -326 -803 61 -518 -469 -37 -110 -774 111 6 -726
4646 -726 177 495 -341 369 211 -583 165 924 -170 -116 531 106 81 707 190 -142 599 188 -506 712
4666 712 353 -726 -26 -41 -663 214 377 -750 -48 -108 -970 -661 454 -793 -456 246 -20 -438 436
4685 436 42 -330 894 245 -182 455 305 -198 577 438 -283 717 710 -325 182 612 -271 -82 555 -227
4705 -227 -201 308 -338 -722 254 -652 -1059 76 -352 -786 66 286 -629 -124 519 -504 -209 410 -218 191
4725 191 853 2 -91 699 -137 -30 1149 -70 -86 902 197 -625 356 -50 -299 312 230 -503 43 124 -1012
4746 -1012 -339 128 -847 -492 464 -409 -661 340 -557 -297 539 -125 -657 271 249 1 813 155 371 532
4766 532 534 -457 342 673 -522 351 348 -308 -210 284 -348 -387 237 -300 -400 71 -361 -970 -139 -270 -392 83
4788 83 341 -529 63 468 -606 389 392 23 327 628 -207 234 671 207 -508 823 131 -93 734 131
4808 131 -148 384 180 -424 532 -80 -832 105 412 -1130 -382 128 -593 -330 24 -311 -370 429 -386 -233
4828 -233 403 -63 -104 513 107 -126 809 398 -207 918 552 -535 408 770 -122 313 645 -416 -48
4847 -48 447 -713 -196 355 -533 -471 5 -440 -435 71 -310 -843 202 -147 -626 -244 219 -579 151 594 -665
4868 -665 -55 216 -439 -92 717 -46 430 796 158 -439 598 91 -273 675 193 -415 122 365 -636
4887 -636 -140 -134 -438 128 299 -812 -115 267 -697 110 486 -127 -291 347 -399 -473 714 1 -156 899
4907 899 315 -295 345 601 -397 498 553 -415 198 618 -418 -105 599 -181 -294 461 -342 -404 165 -606
4927 -606 -478 519 -72 -938 159 41 -655 49 142 -357 22 523 -247 -6 370 -123 296 580 247 186
4947 186 678 20 90 690 112 -432 338 216 -267 100 329 -450 -205 223 -860 13 226 -868 43 171
4967 171 -512 -306 399 -412 -389 -31 -214 48 575 135 35 749 -9 -133 488 409 -256 430 292 -277 263
4988 263 739 -187 -255 169 -415 -10 485 -668 -454 136 -172 -612 366 -85 -816 41 107 -435 165 244 -245
5009 -245 -66 418 -513 454 616 9 532 832 -304 -124 734 -68 -44 590 298 -154 399 -307 -134 241
5029 241 -159 -334 300 391 -655 -112 -120 -655 -255 389 -317 -196 170 -192 -163 563 -22 -198 506 234 -381
5050 -381 584 290 -348 650 354 -469 253 580 105 -20 293 -224 57 496 -499 -121 78 -500 -557 192
5070 192 -632 -512 -37 -15 -632 314 5 -518 224 307 -388 147 353 -29 334 483 -310 463 628 -76 46
5091 46 493 105 -98 248 129 -32 215 121 -398 250 -185 -420 146 -165 -944 -359 152 -543 -130 -27 -544
5112 -544 -137 91 -350 -192 530 57 76 665 163 -127 338 429 -315 137 164 -266 159 107 -66 255 137
5133 137 -360 34 338 -308 -65 64 -253 -320 -223 -252 -303 477 -510 -766 207 -50 -641 -54 101 -124 279
5154 279 329 -167 373 614 125 53 440 -225 197 317 -58 -6 570 20 -3 517 96 -267 276 81 -566
5175 -566 -46 -38 -202 -50 220 -607 -370 90 -293 -283 243 -321 -45 338 -158 -126 578 241 -301 672 175
5196 175 -336 549 363 -128 630 202 -232 291 465 -392 127 343 -474 -173 241 -482 -191 216 -328 -479
5216 -479 402 -206 -550 240 -144 -304 -64 161 -86 494 474 -319 301 254 -208 380 525 35 -31 545 -329
5237 -329 -61 394 -60 -89 48 85 -567 138 -260 -218 311 117 -401 236 236 -459 -3 3 -237 -96 26 -426
5259 -426 239 185 2 155 120 233 -246 684 389 11 358 76 -213 300 248 -46 132 324 -366 -123 185
5280 185 -347 -174 397 -422 -357 235 -428 -468 -265 -316 -63 -65 -215 -452 353 57 -244 38 411 -185 7 505
5302 505 -293 20 421 -218 28 313 -124 320 222 159 -23 526 -377 -150 278 -477 -230 -49 -127 -632 -220
5323 -220 13 -531 -181 174 -448 52 567 -432 -393 249 -142 -293 197 77 60 362 112 191 587 328 -300
5344 -300 684 17 -389 220 324 -157 275 283 -336 -117 370 -316 -206 -37 -24 -277 269 -286 -648 178 -333
5365 -333 -288 60 214 -331 167 157 -74 281 507 -98 479 574 308 255 347 -12 8 505 -258 159 335 -267
5387 -267 -230 270 -125 -418 -19 -76 -509 23 212 -693 -82 -83 -463 -21 140 -186 -168 194 -455 -161 434 -20
5409 -20 -286 760 -42 -37 615 40 -66 382 301 -288 369 151 -384 81 114 -410 -213 94 -326 8 71 -691
5431 -691 -237 314 -330 18 271 88 -296 241 -393 -16 355 156 -503 100 571 -268 248 247 -55 -169 373
5452 373 -32 165 284 77 -81 124 -251 -292 336 37 -459 -104 -130 -838 316 -5 -441 -106 83 -166
5472 -166 -193 223 -382 122 214 -165 14 288 -139 74 471 74 -93 428 96 -113 478 210 -39 162 450
5493 450 -211 -105 447 -548 -37 359 -356 48 132 -232 -370 -43 -380 -331 244 -116 -409 343 -169 -25 200
5514 200 235 -251 482 288 -68 117 620 43 475 464 -331 237 643 -209 -450 225 -314 81 85 -312 -457
5535 -457 160 107 -471 -38 -24 -323 -27 247 -380 -89 13 -184 146 347 -226 -252 171 -218 72 221 154
5556 154 149 692 341 13 493 78 -37 320 132 -372 424 112 -41 -284 75 -470 -182 53 -172 -158 61
5577 61 5 -398 159 -266 -145 -4 63 -615 -68 122 -248 466 127 -300 200 484 65 455 360 27 -120
5598 -120 625 -103 -75 565 -159 -124 219 -330 -466 384 46 -572 156 12 -434 -80 162 -159 -105 25 -204
5619 -204 -178 682 -249 -52 402 -167 -210 469 9 -166 341 173 -49 309 183 -180 473 233 -369 96 -4
5640 -4 -443 116 130 -592 -110 336 -543 -284 141 -351 -374 213 -28 -440 374 84 -147 428 -45 -249 360
5661 360 188 -340 232 311 -65 75 72 -181 59 219 -365 14 399 -251 -340 317 -181 -18 -173 -80 -293 -6
5683 -6 15 -684 36 204 -638 9 247 -461 101 115 -314 100 278 -277 -108 362 235 -256 485 293 -16
5704 -16 -48 -282 -48 103 79 -270 282 114 -505 185 263 -725 -264 -50 -513 -332 105 -51 -156 197 -264
5725 -264 -238 322 66 -172 332 -108 -514 373 322 -111 248 339 -188 176 192 16 305 267 78 -30 213 -211
5747 -211 -379 54 57 -340 120 65 -271 37 -140 -297 331 -191 -321 4 -22 -521 -24 583 -371 -50 404
5768 404 17 -64 549 -156 -195 262 13 190 372 2 -164 -62 146 -151 143 264 -411 -96 173 -239 -83
5789 -83 353 -96 -371 -88 -389 -470 171 -444 125 267 -255 -110 397 -77 -217 507 -215 -1 378 316 -68
5810 -68 -149 495 78 -201 404 -212 -100 368 -238 -152 372 -119 -69 414 -169 -166 81 -89 -285 -74 125 -353
5832 -353 -93 -84 -405 -225 64 -196 23 409 -178 298 498 -336 -10 117 255 20 368 -93 22 77 61
5853 61 -385 279 99 -122 180 245 -203 -213 -208 -252 -91 -61 -344 -223 13 -143 -257 176 -100 -383 488 306
5875 306 -142 164 88 47 314 91 191 -50 443 -295 432 554 -361 -107 447 -498 -188 27 -29 -271 -193
5896 -193 40 -273 63 -92 -442 150 -173 -529 47 139 30 -207 327 -296 206 410 32 239 405 121
5916 121 20 223 -68 -221 443 266 50 214 -167 -415 87 353 -320 -171 85 -492 -100 250 -165 -70
5936 -70 -220 111 214 288 -138 -243 -6 -137 -340 207 -27 -313 295 200 -293 352 207 -114 133 58 3 328
5958 328 232 -10 -118 319 -108 -222 281 -142 -4 213 -327 -285 200 193 -310 168 84 -275 283 157 -214 0
5980 0 260 -148 24 359 -137 411 113 -22 -76 539 35 -263 397 -21 -8 419 -74 -16 170 -26 -426 226
6002 226 140 -479 -69 47 -622 -111 222 77 -406 29 -207 29 626 -43 -97 406 -193 -248 264 394 29
6023 29 187 43 81 575 355 15 266 319 -115 -116 434 7 -451 230 -136 -194 198 -2 -321 115 -134 -346
6045 -346 316 12 -211 29 266 -256 -35 244 -387 -316 145 -38 398 469 219 -267 487 30 100 261 180
6066 180 -48 451 86 -137 -25 48 -444 -224 -60 -94 -146 147 -237 38 48 -318 -199 144 -120 -571 113
6087 113 -2 -87 405 122 -99 87 467 -217 -21 282 -24 122 406 29 118 -162 -148 -74 178 -81 -226
6108 -226 258 118 -482 14 -225 282 152 -53 -316 84 -41 -119 546 -214 -138 -54 44 -60 265 235 -102 -190
6130 -190 48 -218 64 388 105 42 75 -62 -4 247 -210 -282 -34 314 -51 -171 178 -142 -54 -87 -231 125
6152 125 166 -57 -131 26 -97 -144 310 -158 -401 -41 -146 -247 38 94 -275 332 -14 41 221 294 -112 157
6174 157 179 -158 135 337 -204 -105 237 -187 -7 117 -285 -127 69 97 -313 348 116 -49 37 -203 -178 -185
6196 -185 -170 -165 105 281 -234 -16 277 -149 47 7 69 137 210 365 -273 124 58 27 250 -281 -241 57 149 -135
6220 -135 12 -144 -262 -320 207 -98 -293 329 127 -125 44 149 -118 218 -197 -188 408 309 -82 377 144
6241 144 -124 218 195 -430 6 252 -75 -32 264 15 -213 307 -256 34 -66 -110 -290 97 31 -49 -5 -35
6263 -35 -346 -183 403 -104 -117 247 -241 -190 41 -177 -228 552 28 122 219 314 207 284 238 -554 140 84 -116
6286 -116 -79 134 -146 212 31 -195 -125 -35 -512 -225 -194 -263 -3 74 -178 -88 107 -197 15 125 72 -352 193
6309 193 177 39 169 -150 -261 6 359 229 224 241 113 120 271 -41 -234 -101 -72 29 260 -57 -109 117 -258
6332 -258 -339 11 29 -215 -154 154 79 -159 98 -41 39 138 -266 12 296 -77 -74 1 177 40 203 198 -25 225
6356 225 154 -117 505 -17 -179 72 191 -235 -31 173 -276 243 335 -203 167 155 -98 -125 141 118 115 63 -113
6379 -113 -162 363 25 2 239 94 -130 50 573 -220 -204 275 -148 39 -76 -43 56 166 -72 -333 109 -136
6401 -136 -377 -59 -39 -366 -301 -252 -359 -158 192 44 -23 165 -85 252 224 -357 -88 -21 4 -56 231 -163 -190
6424 -190 -4 -17 130 387 242 -96 485 336 -133 -195 -39 -203 110 190 -462 84 -300 -96 -404 142 -109
6445 -109 -528 147 -6 56 497 -60 -195 331 -213 54 212 224 242 272 140 190 361 141 10 1 298 -63
6467 -63 -39 411 -25 268 274 115 -252 410 -255 57 -57 -51 -304 -334 126 -87 35 166 -376 327 82 -128
6489 -128 83 53 -95 357 742 195 292 380 -31 -87 219 -111 -39 -63 68 55 76 17 -84 77 -73 -84 71
6512 71 359 -190 -165 221 -65 -84 356 128 167 406 -45 -137 234 123 -341 252 56 -244 91 409 262 364
6534 364 122 -159 77 -185 -386 79 -66 -164 4 206 -196 -210 93 -195 -136 -43 -22 -179 124 8 -230 316
6556 316 -154 -335 195 -201 83 47 321 -119 121 195 -24 -253 229 -82 -1 131 -22 -51 61 -13 -124 182
6578 182 -204 -500 -8 48 -370 -344 155 -151 -119 -114 105 -461 -112 -321 -251 138 -139 32 106 265 -134 230
6600 230 -223 -56 111 -69 105 261 108 -43 224 431 -191 -39 120 52 -39 23 25 -530 117 -236 -129 -70
6622 -70 5 -204 328 -188 -352 197 119 -112 73 303 -158 130 175 -352 -225 601 82 66 455 35 174 39
6644 39 92 -248 -47 228 -702 95 98 -365 62 -60 -4 189 13 -154 -269 -2 -36 31 -91 304 -97 117
6666 117 -274 -301 337 110 46 126 29 -250 116 141 64 319 50 -161 110 191 116 -345 467 -274 -261 188 -209
6689 -209 -421 6 59 -109 -91 -180 333 53 -215 45 261 -74 -364 58 93 -101 -239 -63 31 -312 316 -111
6711 -111 35 319 148 -331 99 -136 -338 125 -226 -113 37 21 -216 49 19 -67 -238 614 -376 -211 206
6732 206 -28 -165 195 -242 19 250 -18 -39 -368 321 -164 94 201 136 28 104 -20 191 214 82 -175
6753 -175 340 -45 -43 -145 166 24 23 -143 -338 -48 -385 -434 -62 91 23 9 -5 -254 -159 466 -8 -109 49
6776 49 -227 206 104 210 8 16 -110 143 271 -107 -108 -30 -53 7 219 116 117 -233 -278 -65 143 87 103 -29
6800 -29 54 -102 -78 -24 69 18 -124 -387 -5 129 49 319 296 -172 -89 440 176 -102 169 -57 -292 35 125
6823 125 32 -331 -305 19 111 -248 157 -111 222 18 -114 60 180 174 95 -271 -128 183 -83 -71 27 150 146
6846 146 -111 176 -9 151 -204 -34 218 -146 -297 37 -164 153 37 101 109 -2 -21 257 -18 -225 79
6867 79 -210 142 92 -92 -38 111 -199 -489 0 -129 -97 153 -57 -72 -165 -155 -643 376 144 -195 289 413
6889 413 67 68 -211 -90 91 -52 -62 -66 258 -192 69 -122 109 -257 137 -85 154 14 -273 125 15 38
6911 38 -52 -66 -83 -219 299 165 255 105 20 -239 -165 -36 -55 -465 259 -3 72 -43 -256 192 209 328 38
6934 38 309 -122 36 212 10 -145 12 328 146 147 124 8 -87 332 -133 131 -152 -325 -39 82 118 -125
6956 -125 315 -240 154 288 215 -79 177 -88 11 238 -220 -277 131 -2 -63 143 212 35 107 -25 57 87 -24
6979 -24 -67 -140 -98 84 -202 99 -128 -188 -45 -230 -290 -412 118 -195 105 248 -141 -36 226 54 -24 143
7001 143 81 40 246 -64 115 293 61 228 30 38 191 -89 -93 -59 -23 -284 17 257 -30 60 -364 34 -109
7024 -109 52 104 -235 -114 22 -83 0 101 -68 -131 328 -82 -167 -181 211 23 -111 33 -276 87 160 -73
7046 -73 -102 90 -64 -467 -9 -60 -202 41 155 -78 118 124 -60 -75 29 55 122 294 -104 185 290 67 199
7069 199 181 -62 115 161 -71 -72 237 3 -135 68 -143 -13 214 151 -119 35 138 67 -20 -76 -61 69 238
7092 238 -245 101 111 -112 -128 343 -8 -246 -162 -286 -79 139 -49 -52 41 145 133 159 60 -281 -55 56 245
7115 245 229 65 -196 -75 -68 -217 273 188 -45 1 -108 -291 -6 -246 141 -55 -65 86 -110 70 334 -221
7137 -221 -248 -90 -260 -69 274 -159 35 -79 238 1 165 32 -59 7 -166 -178 71 160 -256 166 18 -132
7159 -132 -68 -69 -162 -389 5 223 -87 -13 195 -128 150 -60 4 193 290 68 96 245 -110 103 222 -26 -123
7182 -123 -298 -209 124 28 71 120 197 -86 -1 359 -143 -293 73 -13 -185 109 -68 -238 7 82 95 -107 -41
7205 -41 -414 -168 243 -100 290 9 41 253 305 -34 61 489 108 -163 378 -346 -290 -14 351 49 -107 -217
7227 -217 -270 181 -376 -139 -389 -75 -263 -3 -209 -114 -50 -29 -215 -104 31 -290 -72 400 81 -195 17
7248 17 0 -28 351 289 80 305 262 -84 136 212 145 -40 -2 69 -77 93 -29 211 -63 -115 390 25 161
7271 161 -125 74 187 -248 -69 66 147 -267 -50 56 24 125 -233 377 305 -148 60 241 -222 -13 123
7292 123 128 36 -40 222 -129 -164 171 -121 -271 -109 -152 -263 38 163 -193 -181 -165 -98 395 -111 18 -58 51
7315 51 46 -47 188 34 -32 18 -200 -14 194 -163 53 -45 -55 -123 153 -46 85 190 -135 14 409 -220 -218 205
7339 205 -298 -16 150 -126 116 263 -244 -107 -28 200 -33 240 202 4 236 178 -152 -130 137 -116 327
7360 327 -160 281 -75 441 2 -63 133 57 -122 132 -19 -244 30 161 -172 -60 -111 -168 165 -147 138
7381 138 -153 86 -10 -95 231 -414 32 295 -274 -114 199 -134 -39 69 -50 -229 107 -90 136 45 350
7402 350 -231 254 259 -92 81 229 -67 18 277 -35 -119 275 -270 -8 65 168 39 -60 75 -29 -21 290 -236
7425 -236 249 71 -86 108 305 53 -308 -128 14 104 49 -17 -246 -241 100 -342 -32 -167 172 151 -27 -213
7447 -213 219 90 -296 -281 -46 -233 -146 49 -232 43 89 114 -182 141 97 -11 67 84 -173 84 95 -57 46
7470 46 -25 -63 111 72 -44 -199 -79 -270 -158 -145 -193 -276 234 257 -61 154 105 -63 351 -109 141 318 -184
7493 -184 -109 -12 31 40 -258 152 -223 261 347 -76 28 273 15 105 123 -256 -92 111 -113 -69 -7 180 273 102
7517 102 101 -325 51 18 -44 -116 45 -233 3 -57 51 38 366 58 40 -94 -95 -52 241 212 68 209 -139 65
7541 65 217 173 -303 76 -6 -58 -53 -160 111 -130 -117 0 102 87 359 246 -210 99 -462 -104 -110 -126 89 -190
7565 -190 35 54 -42 124 21 -133 289 181 120 171 -31 -274 26 -32 195 -2 -19 114 -58 -196 95 90 -175
7588 -175 -130 144 -176 -94 425 -212 -6 54 284 -271 106 200 84 260 101 112 215 -148 -102 -4 -48 -4 173
7611 173 -134 -45 166 98 207 -41 -184 -78 -220 122 125 -62 -110 -202 8 94 -138 -219 28 -232 -85 -157 -102
7634 -102 -41 154 7 -61 -64 238 142 47 131 7 134 12 7 120 181 139 -82 -151 -231 304 173 -269 115 36 173
7659 173 -123 329 59 -263 -62 37 91 -22 11 -20 -370 92 -360 25 92 89 -103 72 180 -261 153 65 -73
7682 -73 26 -194 118 183 50 -84 -31 36 -238 272 148 -33 -13 401 -21 -123 -159 -88 78 -6 102 -141 91
7705 91 -28 216 -243 50 -36 -89 178 -17 -170 65 -65 166 -7 -103 146 5 107 -30 298 -283 93
7726 93 -1 -29 -199 5 9 29 130 -295 -226 157 48 105 16 -293 125 -93 287 262 -58 165 66 89 281 -63
7750 -63 30 73 172 102 230 299 214 -120 -8 27 -13 -285 -81 -196 206 106 -4 130 -122 -206 183 -96 -345
7773 -345 -92 -113 82 197 -241 -51 85 -310 -54 92 58 26 -5 84 118 -186 -174 42 19 321 102 -123 276
7796 276 70 -174 -21 30 123 8 33 8 135 -83 -79 -3 41 -284 -285 -121 -153 58 -69 -66 -83 -44 -49 43 -78 108
7822 108 -113 -14 174 -124 310 252 -70 -257 -27 -219 58 -80 -60 450 -266 -143 -289 366 -1 -39 200
7843 200 -118 -94 -24 -39 -212 62 -41 28 -61 73 -353 113 -43 -8 21 84 105 158 120 -179 64 123 -19 164
7867 164 138 71 47 322 504 -10 116 111 42 559 270 39 131 -122 185 -107 13 -334 -56 74 22 -314 -192
7890 -192 145 -180 270 189 -192 -46 -133 6 -30 -158 -94 -102 88 -53 -219 -18 170 34 206 -44 -237 -48
7912 -48 183 -326 -220 16 -214 53 -30 -128 -75 195 34 -362 -31 277 -89 181 -234 128 -49 -29 -317 -98
7934 -98 77 374 -49 -24 -238 -81 115 -232 73 -131 -95 -75 152 80 -70 107 -430 -15 -67 -232 -151 7
7956 7 -358 -236 141 -144 -429 289 25 -257 106 12 31 214 154 120 -125 299 -46 -24 -57 -131 -19 -94 -90 8
7980 8 14 -22 28 173 -228 84 -75 -187 32 205 -18 -223 335 49 128 18 57 -216 349 309 -46 -45 40 32 -18
8005 -18 -44 -272 206 195 -94 -354 149 -80 -319 -145 -113 -434 -221 247 34 186 -194 -280 -93 63 -303 -182
8027 -182 -135 163 -24 89 19 -142 -74 35 -66 59 66 186 299 -83 203 193 -245 -291 237 -63 -41 128 168
8050 168 -193 61 -54 28 -26 95 197 32 -225 -321 -107 -97 -153 -145 0 -43 146 31 116 -359 6 53 120 -281
8074 -281 57 80 -150 30 -119 237 83 124 75 290 -209 -109 -52 39 44 137 -78 -196 -259 -104 -192 106 -70
8097 -70 -286 -2 -173 -149 -395 96 155 24 0 -61 -184 -11 93 27 -4 -58 -265 -68 -6 -20 51 148 197 19
8121 19 515 243 -216 216 182 32 149 30 -301 263 -123 -109 397 111 9 -75 72 -119 -154 160 110 -174
8143 -174 -166 63 140 55 92 -226 258 256 -172 -32 53 128 348 -261 -11 -43 26 -319 -131 12 -137 79 149 -254
8167 -254 -43 118 11 132 -153 -171 -13 174 58 -102 20 4 -126 -83 -139 -62 233 62 -50 148 44 -280
8189 -280 81 87
8191H7
##END NTUPLES=NMR FID
##END=
