##TITLE=1H_Ser NMG-1600
 DMSO
 8 sc, 
 3.12.2024
##JCAMPDX= 6.0         $$ Bruker NMR JCAMP-DX V2.0
##DATA TYPE= NMR FID
##DATA CLASS= NTUPLES
##ORIGIN= UXNMR, Bruker Analytische Messtechnik GmbH
##OWNER= root
$$ XWIN-NMR		Version 3.5
$$ Tue Dec  3 14:29:23 2024 Russian Standard Time (UT+4h)  she@DPX200
##.OBSERVE FREQUENCY= 200.1315
##.OBSERVE NUCLEUS= ^1H
##.DELAY= (6, 6)
##.ACQUISITION MODE= SIMULTANEOUS
##.ACQUISITION SCHEME= undefined
##.AVERAGES= 8
##.DIGITISER RES= 18
##SPECTROMETER/DATA SYSTEM= spect
##.PULSE SEQUENCE= zg30
##.SOLVENT NAME= DMSO
##.SHIFT REFERENCE= (INTERNAL, DMSO, 0, 15.7039)
##AUDIT TRAIL= $$ (NUMBER, WHEN, WHO, WHERE, WHAT)
$$ ##TITLE= Audit trail, XWIN-NMR		Version 3.5
$$ ##JCAMPDX= 5.01
$$ ##ORIGIN= Bruker BioSpin GmbH
$$ ##OWNER= she
$$ F:/spectra/data/she/nmr/H-F/1/audita.txt
$$ ##AUDIT TRAIL=  $$ (NUMBER, WHEN, WHO, WHERE, WHAT)
(   1,<2024-12-03 14:28:10.23 +0400>,<she>,<DPX200>,
      <created by zg, POWCHK disabled, PULCHK disabled
       configuration hash MD5:
       00 E9 B6 7A A2 85 ED C7 34 08 36 98 17 FE 4E 26
       data hash MD5: 16K
       DB 39 60 D5 83 A4 AE 00 28 FC 04 98 6A D2 39 CC>)
$$ ##END=
$$ 
$$ hash MD5
$$ 77 BC E5 61 69 B6 75 E9 BE CB EB FB E9 8D D8 05
##$RELAX= 
##$RELAX= 
##$RELAX= 
##$RELAX= 
##$RELAX= 
##$RELAX= 
$$ Bruker specific parameters
$$ --------------------------
##$DU= <F:/spectra>
##$EXPNO= 1
##$NAME= <H-F>
##$PROCNO= 1
##$TYPE= <nmr>
##$USER= <she>
##$AMP= (0..31)
100 100 100 100 100 100 100 100 100 100 100 100 100 100 100 100 100 100 
100 100 100 100 100 100 100 100 100 100 100 100 100 100 
##$AQSEQ= 0
##$AQ_mod= 1
##$AUNM= <au_zg>
##$AUTOPOS= <>
##$BF1= 200.13
##$BF2= 200.13
##$BF3= 200.13
##$BF4= 200.13
##$BF5= 200.13
##$BF6= 200.13
##$BF7= 200.13
##$BF8= 200.13
##$BYTORDA= 1
##$CFDGTYP= 0
##$CFRGTYP= 5
##$CHEMSTR= <none>
##$CNST= (0..31)
1 1 145 1 1 1 1 1 1 1 1 1 1 1 1 1 1 1 1 1 1 1 1 1 1 1 1 1 1 1 1 1 
##$CPDPRG= <>
##$CPDPRG1= <>
##$CPDPRG2= <>
##$CPDPRG3= <>
##$CPDPRG4= <mlev>
##$CPDPRG5= <mlev>
##$CPDPRG6= <mlev>
##$CPDPRG7= <mlev>
##$CPDPRG8= <mlev>
##$CPDPRGB= <>
##$CPDPRGT= <>
##$D= (0..31)
0 1.2 0 0 0 0 0 0 0 0.06 0 0.03 0 0 0 0 0.0002 0 0 0 0 0 0 0 0 0 0 0 0 
0 0 0 
##$DATE= 1733221689
##$DBL= (0..7)
120 120 120 120 120 120 120 120 
##$DBP= (0..7)
150 150 150 150 150 150 150 150 
##$DBP07= 0
##$DBPNAM0= <>
##$DBPNAM1= <>
##$DBPNAM2= <>
##$DBPNAM3= <>
##$DBPNAM4= <>
##$DBPNAM5= <>
##$DBPNAM6= <>
##$DBPNAM7= <>
##$DBPOAL= (0..7)
0.5 0.5 0.5 0.5 0.5 0.5 0.5 0.5 
##$DBPOFFS= (0..7)
0 0 0 0 0 0 0 0 
##$DE= 6
##$DECBNUC= <off>
##$DECIM= 24
##$DECNUC= <off>
##$DECSTAT= 4
##$DIGMOD= 1
##$DIGTYP= 9
##$DL= (0..7)
0 120 120 120 120 120 120 120 
##$DP= (0..7)
150 150 150 150 150 150 150 150 
##$DP07= 0
##$DPNAME0= <>
##$DPNAME1= <>
##$DPNAME2= <>
##$DPNAME3= <>
##$DPNAME4= <>
##$DPNAME5= <>
##$DPNAME6= <>
##$DPNAME7= <>
##$DPOAL= (0..7)
0.5 0.5 0.5 0.5 0.5 0.5 0.5 0.5 
##$DPOFFS= (0..7)
0 0 0 0 0 0 0 0 
##$DQDMODE= 0
##$DR= 18
##$DS= 0
##$DSLIST= <SSSSSSSSSSSSSSS>
$$ [...]
##$SUBNAM2= <"">
##$SUBNAM3= <"">
##$SUBNAM4= <"">
##$SUBNAM5= <"">
##$SUBNAM6= <"">
##$SUBNAM7= <"">
##$SUBNAM8= <"">
##$SUBNAM9= <"">
##$SW= 24.0689530833862
##$SWIBOX= (0..15)
0 0 2 0 0 0 0 0 0 0 0 0 0 0 0 0 
##$SW_h= 4816.95568400771
##$TD= 16384
##$TD0= 1
##$TE= 0
##$TE2= 300
##$TE3= 300
##$TEG= 300
##$TL= (0..7)
0 120 120 120 120 120 120 120 
##$TP= (0..7)
150 150 150 150 150 150 150 150 
##$TP07= 0
##$TPNAME0= <>
##$TPNAME1= <>
##$TPNAME2= <>
##$TPNAME3= <>
##$TPNAME4= <>
##$TPNAME5= <>
##$TPNAME6= <>
##$TPNAME7= <>
##$TPOAL= (0..7)
0.5 0.5 0.5 0.5 0.5 0.5 0.5 0.5 
##$TPOFFS= (0..7)
0 0 0 0 0 0 0 0 
##$TUNHIN= 0
##$TUNHOUT= 0
##$TUNXOUT= 0
##$USERA1= <user>
##$USERA2= <user>
##$USERA3= <user>
##$USERA4= <user>
##$USERA5= <user>
##$V9= 5
##$VALIST= <valist>
##$VCLIST= <CCCCCCCCCCCCCCC>
##$VD= 0
##$VDLIST= <DDDDDDDDDDDDDDD>
##$VPLIST= <PPPPPPPPPPPPPPP>
##$VTLIST= <TTTTTTTTTTTTTTT>
##$WBST= 1024
##$WBSW= 4
##$XGAIN= (0..3)
0 0 0 0 
##$XL= 0
##$YL= 0
##$YMAX_a= 160306
##$YMIN_a= -100403
##$ZGOPTNS= <>
##$ZL1= 120
##$ZL2= 120
##$ZL3= 120
##$ZL4= 120
##$ABSF1= 10
##$ABSF2= 0
##$ABSG= 5
##$ABSL= 3
##$ALPHA= 0
##$AQORDER= 0
##$ASSFAC= 0
##$ASSFACI= 0
##$ASSFACX= 0
##$ASSWID= 0
##$AUNMP= <proc_1d>
##$AZFE= 0.1
##$AZFW= 0.1
##$BCFW= 1
##$BC_mod= 2
##$BYTORDP= 1
##$COROFFS= 0
##$CY= 11.3945322036743
##$DATMOD= 1
##$DC= 2
##$DFILT= <>
##$DTYPP= 0
##$F1P= 15.6554695791079
##$F2P= 12.8336369535428
##$FCOR= 0.5
##$FTSIZE= 0
##$FT_mod= 4
##$GAMMA= 1
##$GB= 0.15
##$INTBC= 1
##$INTSCL= 1
##$ISEN= 128
##$LB= 0.24
##$LEV0= 0
##$LPBIN= 0
##$MAXI= 10000
##$MC2= 0
##$MEAN= 0
##$ME_mod= 0
##$MI= 1.114404
##$NCOEF= 0
##$NC_proc= 0
##$NLEV= 6
##$NOISF1= 3.799351
##$NOISF2= 2.8
##$NSP= 1
##$NTH_PI= 0
##$NZP= 0
##$OFFSET= 15.70392
##$PC= 1
##$PHC0= -26719.36
##$PHC1= 12.38744
##$PH_mod= 1
##$PKNL= yes
##$PPARMOD= 0
##$PSCAL= 0
##$PSIGN= 0
##$REVERSE= no
##$SF= 200.130013532006
##$SI= 16384
##$SIGF1= 3
##$SIGF2= 2
##$SINO= 400
##$SIOLD= 16384
##$SREGLST= <1H.CDCl3>
##$SSB= 0
##$STSI= 0
##$STSR= 0
##$SW_p= 3612.71676300578
##$SYMM= 0
##$S_DEV= 0
##$TDeff= 0
##$TDoff= 0
##$TI= <>
##$TILT= no
##$TM1= 0
##$TM2= 0
##$TOPLEV= 0
##$USERP1= <user>
##$USERP2= <user>
##$USERP3= <user>
##$USERP4= <user>
##$USERP5= <user>
##$WDW= 1
##$XDIM= 8192
##$YMAX_p= 0
##$YMIN_p= 0
$$ End of Bruker specific parameters
$$ ---------------------------------
##NTUPLES= NMR FID
##VAR_NAME=  TIME,          FID/REAL,        FID/IMAG
##SYMBOL=    X,             R,               I
##VAR_TYPE=  INDEPENDENT,   DEPENDENT,       DEPENDENT
##VAR_FORM=  AFFN,          ASDF,            ASDF
##VAR_DIM=   8192,          8192,            8192
##UNITS=     SECONDS,       ARBITRARY UNITS, ARBITRARY UNITS
##FACTOR=    0.0002076,     1,               1
##FIRST=     0,             0,               0
##LAST=      1.7004516,     0,               0
##MIN=       0,             -100403,         0
##MAX=       1.7004516,     160306,          0
$$ Real data points
##PAGE= N=1
##DATA TABLE= (X++(R..R)), XYDATA
$$ [...]
2020B13k50l96j59O91o1o25N25L63K28r5N32n69l46j68k42k43K4r8l77M63J072
$$ 213 -37 -433 -592 99 38 -587 -62 301 529 434 966 397 51 -117 -359 -602 -578 -676 -1053 -590 482
2041D82Q2k00K22r88K34K18j08m51k00n1O74M78O10j62n68K85n12K6j03q45l55
$$ 482 564 364 586 -402 -168 50 -58 -509 -709 -760 -86 392 1002 840 272 557 45 71 -32 -877 -1232
2062a232P50j83N99M47O2n99N65J83k94n7l64n25N7N47n9R4L16j62j19Q80k35
$$ -1232 -482 -665 -66 381 443 -156 409 592 298 241 -123 -648 -591 -44 -103 -9 307 145 26 906 671
2083F71r72o9k78p0L54J35k0k49Q04p7L70N45n71n31k33j08r6J88k14m59Q72L02
$$ 671 -301 -370 -648 -718 -364 -229 -249 -498 306 229 599 1144 573 42 -191 -299 -395 -207 -421 -880 -8 294
2105B94J07K9l56j90m05P66n10n54L97K54k63O33N32n1j36qo80O6K57p26n94M02
$$ 294 401 430 74 -116 -521 245 -265 -819 -422 -168 -431 202 734 683 547 539 -141 -75 182 -544 -1138 -736
2127g36M32m82R44L75m91K23M95m96k7N0q86j2Q27l01J63j32K04P1L74j86q58
$$ -736 -304 -786 158 533 42 265 760 264 237 287 -599 -611 216 -85 78 -54 150 221 595 409 -449
2148d49k26j69j69J3N83l2j01P49j81L79N22m87o04j30n4Q7K09P6l60J67Q57r2
$$ -449 -675 -844 -1013 -1000 -417 -449 -550 199 18 397 919 432 -172 -302 -356 -269 -60 16 -344 -177 680 588
2170E88m00J68m72j49k87L48l80m04O21K8N72N36j58l06K42o41L46J76n83p42
$$ 588 188 356 -116 -265 -552 -204 -584 -988 -367 -339 233 769 611 305 547 -94 252 428 -155 -897
2190h97L02N59N7N79J4k98J19N56o66m14J48m94k82N81M07m76O86J20m65P62j85
$$ -897 -595 -36 21 600 614 316 435 991 325 -89 59 -435 -717 -136 271 -205 481 601 136 898 713
2211G13m82j19m25n70M59N98J9n12P61L44l3R1m33n57K7J75k19k74J54j0M04K65
$$ 713 231 112 -313 -883 -424 174 193 -319 442 786 753 844 411 -146 -119 56 -163 -437 -283 -293 111 376
2233C76P0j49L02k29r23R30k94l21pn8L39J6O30k01k81nj43k27J14j96r73N28
$$ 376 446 297 599 370 -553 377 83 -238 -245 -303 36 52 682 481 200 195 52 -175 -61 -257 -1230 -702
2255g02O78m5L76K10l70M10p3l58l86J02m50m84Q27L65j97K93q3k86N26L97q27
$$ -702 -24 -69 307 517 147 557 484 126 -260 -158 -608 -1092 -265 100 -97 196 113 -173 353 750 -77
2276g7l1k89p5L03N1P3o8N93R0n0K1l16n49q6r2j3r6K94r5Q5O27L49n85M45j20
$$ -77 -108 -397 -472 -169 -118 -45 -113 480 570 520 541 225 -324 -410 -502 -515 -611 -317 -412 -327 300 649 64 509 389
2301C89n53N8J16n1j63J67j14N91M62o61m39O63k67m61K42p52l93O32P61j14l6
$$ 389 -164 -106 10 -41 -204 -37 -151 440 902 241 -198 465 198 -263 -21 -773 -1166 -534 227 113 77
2322G7P41o05k80M64k98j70j48k11n00M90L48l1j50K38k29L56L05p51k94J13j01
$$ 77 818 213 -67 397 99 -71 -219 -430 -930 -440 -92 -123 -273 -35 -264 92 397 -354 -648 -535 -636
2343f36l3N59pk8M86k02N18j48M4p18m68O2o6K70Q2o3k83P16M20k00k83l04k63
$$ -636 -669 -110 -117 -145 341 139 657 509 553 -165 -633 -571 -637 -367 -285 -348 -631 85 505 305 22 -282 -545
2366e45J94J16l02l35R70r0J20O19k22j02kq5m51M5r0l02L23L21j96K33M54l24
$$ -545 -351 -235 -537 -872 98 8 128 747 525 423 421 336 -115 -70 -160 -462 -139 182 -14 219 673 349
2388C49l41J21K27m77j97k89J06M96L06k60J86K43l60J21J08n83k77M61j45k37
$$ 349 8 129 356 -121 -318 -607 -501 -5 301 41 227 470 110 231 339 -244 -521 -60 -205 -442
2408d42L93M54k77K13K86j55J55j33n48p76N57m9K00m9O06m70Q06K20o67j94J22
$$ -442 -49 405 128 341 627 472 627 494 -54 -830 -273 -322 -122 -171 435 -35 771 991 324 130 252
2429B52k99O2l69o3RN6J98K43J87r5o1l16o5k34M52k11L2j70M20M05J44L4m51
$$ 252 -47 15 -354 -417 -408 -352 -154 89 276 181 120 -196 -261 -495 -43 -254 -222 -392 28 433 577 611 160
2452A60j98K28J97q97j18K4P1L83K18q4R3K91j35L3mr3o0k88j94L1L72N90o09
$$ 160 -38 190 387 -510 -628 -604 -533 -150 68 -16 77 368 233 266 262 169 109 -179 -373 -342 30 620 11
2475A1Q8L46J69n86Q9n03k70K58K26m07M36PR0O79J19m33k47L28l30m19L22k6
$$ 11 99 445 614 28 117 -386 -656 -398 -172 -579 -143 -136 -46 633 752 319 72 400 70 -349 -27 -53
2497e3j26K21l6Nm6M71m96k28l44LL41K83l75n09J165j10J08L43j12m09P5Nl28
$$ -53 -179 42 6 11 -35 436 -60 -288 -632 -629 -288 -5 -380 -889 276 166 274 617 505 96 171 176 -152
2520a52j89J15k54P8L56J80k64K56j38K02p2k47k70k22L35k68M43L79l33J25N88
$$ -152 -341 -226 -480 -402 -46 134 -130 126 -12 190 118 -129 -399 -621 -286 -554 -111 268 -65 60 648
2541F48m21j28k59m56K82J68r4m12N18K12K58l2L60j91n51M2q3l0J34K30m37K13
$$ 648 227 99 -160 -616 -334 -166 -260 -672 -154 58 316 284 644 453 -98 -56 -139 -169 -35 195 -242 -29
2563b9K87l06L74M02n23k90K68m26L9k64j66Q3J173o71L7L28j76j35j98J43j50
$$ -29 258 -48 326 728 205 -85 183 -243 -204 -468 -634 -551 622 -49 -12 316 140 5 -193 -50 -200
2584b00M7J15k63r8O27L4j4j74O5k23N60k84p78K12L28k35K67j24P3L65K55j62
$$ -200 -153 -38 -301 -399 228 262 248 74 139 -84 476 192 -586 -374 -46 -281 -14 -138 -65 300 555 393
2606C93n23K28k62j67m9K0L14J17R3j7M0M11j57j63n45Q3l65L34m5j05L78R9q4
$$ 393 -130 98 -164 -331 -380 -360 -46 71 164 147 187 598 441 278 -267 -184 -549 -215 -260 -365 13 112 28
2629B8K92L01m09N6k3l50m77L73N06j82J49Q2o00L24K20l43j75j18M40o15k12
$$ 28 320 621 212 268 245 -105 -582 -209 297 115 264 346 -254 70 290 -53 -228 -346 94 -521 -733
2650g33L81pN82k06LJ94J0l18M43j58p74k1N37j83K97J2J13o5N09k72m91R7J71
$$ -733 -352 -359 223 17 20 214 224 -94 349 191 -583 -604 -67 -250 47 59 172 107 616 344 -147 -50 121
2673A21o31J66J9L67j91M66m08J33O21k22l89j55J37n85N13k4l76J72M64L9J90
$$ 121 -510 -344 -325 42 -149 317 -91 42 663 441 52 -103 34 -551 -38 -62 -438 -266 198 237 427
2694D27j75M3m16K61k99l20P52k99j14K05L89Qk56K70p81J11J71j40j86o5Q5J55
$$ 427 252 295 -121 140 -159 -479 273 -26 -140 65 454 462 206 476 -305 -194 -23 -163 -349 -414 -329 -174
2716a74K67R0j91L54L7k86j17J58n41j5k7K40L39K80m77L06J3K02k42k87j41k80
$$ -174 93 183 -8 346 383 97 -20 138 -403 -418 -445 -205 134 414 -63 243 256 458 216 -71 -212 -492
2738d92K1O04j24m1J60k40M26L69m00m01M0o1j38l86Q08k50Q8K67l5L0j36j07
$$ -492 -471 133 9 -32 128 -112 314 683 283 -118 -78 -139 -277 -663 145 -105 -17 250 215 245 109 2
2760Bk07L50k41k38R1K41l45L99J75M9j09l4n66L20L40l26J56j22N2o9J19J70
$$ 2 -205 145 -96 -334 -243 -2 -347 52 227 276 167 133 -433 -113 227 -99 57 -65 -13 -82 37 207
2782B07J89j66K04j58l04J7k95k75J35K88K0M38k15k1k8M06n09J56j51o56N74
$$ 207 396 230 434 276 -28 -11 -306 -581 -446 -158 -138 300 85 64 36 442 -67 89 -62 -718 -144
2803a44K9K0Q9j3K73J20J20m48k96m8L70j89j05K21K9m40P37k71J93K48j81o47
$$ -144 -115 -95 -6 -19 254 374 494 46 -250 -298 72 -117 -222 -1 28 -412 325 54 247 495 314 -333
2825c33k26L04n4K69j61l50N53L91k54k41K48l88M0K94m07P2O0K50l40N79P5N0
$$ -333 -559 -255 -309 -40 -201 -551 2 393 139 -102 146 -242 -202 92 -315 -243 -183 67 -273 306 381 431
2847D31j50k60L6p3k07l18k1L24k54N39K52k45k31L63J41j64n12J95j28K3O4M75
$$ 431 281 21 57 -16 -223 -541 -562 -238 -492 47 299 54 -177 186 327 163 -349 -154 -282 -259 -195 280
2869B80m75J46kj04K21L4m4l0m11j7K61J96r2l19P00P0K7j21k06l33L15k08j28
$$ 280 -195 -49 -51 -155 66 100 56 26 -385 -402 -141 55 -37 -356 344 414 441 320 114 -219 96 -112 -240
2892b40J34K77j87M4J95K15j76j89p5j74j3P2j98O0K92k73N01L65j28n37L18j60
$$ -240 -106 171 -16 28 223 438 262 73 -2 -176 -189 -117 -315 -255 37 -236 265 630 502 -35 283 123
2914A23j15q7q3k27J80K48O7K69K05k95j60o0k81j62K58k12m4K96K07O2j39O3
$$ 123 8 -79 -162 -389 -209 39 106 375 580 285 125 65 -216 -378 -120 -332 -376 -80 127 189 50 113
2936A13Q1K15j48n18K43p9k5m09L39m7K74L92L6j62j94J91m14j59Q5O9j22L37
$$ 113 194 409 261 -257 -14 -93 -118 -527 -188 -235 39 431 467 305 111 302 -112 -271 -186 -117 -239 98
2958I8n9J22n7N31n77n0L1k64L32J8n99N60m17M33L1K10k17j47M25k47l58J34
$$ 98 39 161 104 635 58 8 39 -225 107 125 -474 86 -331 102 133 343 126 -21 404 157 -201 -67
2980f7l01m4J89K41l2K74J86k06n2M33m18o4l10j43J14K87ok4O36l15Rn56M34
$$ -67 -368 -412 -223 18 -14 260 446 240 188 621 203 139 -171 -314 -200 87 81 57 693 378 387 -169 265
3003B65n65k42N61m92M0P22k44K72k4m2PP9k91J45k65m8l07M61k44K34n3J39j65
$$ 265 -300 -542 19 -473 -433 289 45 317 293 251 258 337 46 191 -74 -122 -429 32 -212 22 -31 108 -57
3026e7j6J93l50K19k34k1P4J74l72O79j04K5J7j1k7j48l56P8R6k08J00K85j35
$$ -57 -73 120 -230 -11 -245 -266 -192 -18 -390 289 185 210 227 216 189 41 -315 -237 -141 -349 -249 36 -99
3049i9N59n44M02m1l89K62j98j8j59J77P5q4Q9K36j85J34J97l24j64J59l32J93
$$ -99 460 -84 318 277 -112 150 -48 -66 -225 -48 27 -57 32 268 83 217 414 90 -74 85 -247 -54
3071e4k10J28K19L96l92J0J14J89l07n58K5J65J72j88L52J58j20K2J13r9p7j06
$$ -54 -264 -136 83 479 87 97 211 400 93 -465 -440 -275 -103 -291 61 219 99 121 234 135 58 -48
3093d8j97K05m9L8L5P5n9L78K22k38K2l66n4j26jO8m68J59N83j07K34l04J04J5
$$ -48 -245 -40 -89 -51 -16 59 0 378 600 362 384 18 -36 -162 -163 -95 -563 -404 179 72 306 2 106 121
3117A21k26j99j46L69l58J42P1K76O3j49M29Rl8O1p26K11l53L99O6J16q1j43J57
$$ 121 -105 -304 -450 -81 -439 -297 -226 50 113 -36 393 402 364 425 -301 -90 -443 -44 22 138 57 -86 71
3140G1L22m2j10m22J9l04L87J32k05K90j05J32L55l98l15N71n44J21k08j49p0
$$ 71 393 351 241 -181 -162 -466 -79 53 -152 138 33 165 520 122 -193 378 -166 -45 -253 -402 -472
3161d72N09j76K02n9M97q2m24k1L0jk74J50J2l4M16R8m77K68L98p08M72n33j61
$$ -472 37 -139 63 4 501 419 -5 -26 4 3 -271 -121 -109 -143 273 371 -106 162 560 -148 324 -209 -370
3184c70M29j6k97l6L87r5q7P4K09k02l5R4m83J64J60r0J41J79K58k13J9k74L02
$$ -370 59 43 -254 -290 97 2 -85 -11 198 -4 -39 55 -428 -264 -104 -194 -53 126 384 171 190 -84 218
3207B18k85j27J19q0L3j0K7J47r5L32j0k46K5j1k37J30m9q9M5P1K6J68J39K0k87
$$ 218 -67 -194 -75 -155 -122 -132 -105 42 -53 279 269 23 48 37 -200 -70 -119 -208 -163 -92 -66 102 241 261 -26
3232b6j5J62k81RJ6j9Q5J20O9L21k14j07o3k02N6J02R7k97K0m6K63n2M17k5m47
$$ -26 -41 121 -160 -151 -135 -154 -69 51 120 441 227 120 57 -145 -89 13 110 -187 -167 -213 50 -2 415 390 -57
3257e7R8m1l05r3J34J97r2L69J81l39K66n0J47m90k11N4J86n1rj01L03j22K41
$$ -57 41 0 -305 -398 -264 -67 -159 210 391 52 318 268 415 -75 -286 -232 -46 -97 -106 -207 96 -26 215
3280B15q3L9P7j7k92r9r7N28l99K4M81j36k22J31l06J63J8J45m91p7P5r3L84J1
$$ 215 132 171 248 231 -61 -160 -257 271 -128 -104 377 241 19 150 -156 7 25 170 -321 -398 -323 -416 -32 -21
3304b1L7MK76l2n3j83P5j64m06L99k0J39J0L27k92P6l19J93k8Op6j37J77m7J91
$$ -21 16 20 296 264 211 28 103 -61 -467 -68 -88 51 61 388 96 172 -147 46 18 24 -52 -189 -12 -59 132
3329A32J49k12lJ0L02m07j33j76Q4Q2J11j38K25L93j82J07P2j54l53q5j9J05Q4
$$ 132 281 69 66 76 378 -29 -162 -338 -254 -172 -61 -199 26 419 237 344 416 262 -91 -176 -195 -90 -6
3352fj39K16k25P14l99K78m10O3j86m2M5k28M77n55K03K60K24l23Q2Nn8l42L90
$$ -6 -145 71 -154 560 161 439 29 92 -94 -136 -91 -319 158 -397 -194 66 290 -33 49 54 -4 -346 44
3375D4m55O32n06NK52N3K79r1K67j59k91j6J6J96m07o0K30j54K89K64k42K6J52
$$ 44 -411 221 -285 -280 -28 25 304 213 480 321 30 14 30 226 -181 -241 -11 -165 124 388 146 172 324
3398C24n81J46j55P0M6j94R3L00J58J22k84J76L7k50j87k0j23L10r3k9J11K50
$$ 324 -257 -111 -266 -196 -150 -344 -251 49 207 329 45 221 258 8 -179 -199 -322 -12 -105 -134 -23 227
3420B27j44L20l91K60l18l33K45k98N04m8rK16j09N7k4j19rJ52k52K93n71k27
$$ 227 83 403 12 272 -46 -379 -134 -432 72 24 15 231 122 179 155 36 27 179 -73 220 -351 -578
3442e78N67p6P9K98M9m56L69l72j39Q6J04k18%L34K3N3L44l27K3J13l54lj79r9
$$ -578 -11 -87 -8 290 339 -117 252 -120 -259 -173 -69 -287 -287 47 70 123 467 140 163 276 -78 -81 -260 -359
3466c59J61j36K03p9P04l44L5J97m82J27M27p29l0j75J59K91l78N08M9j46J40
$$ -359 -198 -334 -131 -210 494 150 185 382 -100 27 454 -275 -305 -480 -321 -30 -408 100 149 3 143
3487A43J1l59J92m88K47K2R0J96O3M4j85L68m33J57k08L09l12j87K49N7k86M08
$$ 143 154 -205 -13 -501 -254 -232 -142 54 117 161 -24 344 -89 68 -140 169 -143 -330 -81 -24 -310 98
3509I8L05j38k90K06l00L6j02P6m7j74L83n7L94k85j87K94o9o8l17M03j39J9P1
$$ 98 403 265 -25 181 -119 -83 -185 -109 -156 -330 53 -4 390 105 -82 212 143 75 -242 161 22 41 112
3532A12k70J51p7M04n9m14M29n4l33o4k07N7K05j48M03k13K15J77l41K08j84j64
$$ 112 -158 -7 -84 320 261 -153 276 222 -111 -175 -382 -325 -120 -268 135 -78 137 314 -27 181 -3 -167
3554a67j50K01j31J01j3N25L5j93m02L89m1j97ml2k01m0L02K30p8Q9J3N8p1m49
$$ -167 -317 -116 -247 -146 -159 366 401 208 -194 195 154 -43 -47 -79 -280 -320 -18 212 134 223 236 294 223 -226
3578b26K2k11L57M1j42j65N82l17k98M11k3m71L88l01L01n6j57N58r7j88k12J79
$$ -226 -204 -415 -58 -17 -159 -324 258 -59 -357 54 31 -440 -52 -353 -52 -108 -265 293 196 8 -204 -25
3600b5J93N6q4m44K05j52k7L49l9p5J28K74m22Q9l8K19m05O1l11L71k52K51L73
$$ -25 168 224 140 -304 -99 -251 -278 71 32 -43 85 359 -63 26 -12 207 -198 -137 -448 -77 -329 -78 295
3623B95m90M84j47n9j50q9n7O1J72K5j3j3L0L72k55j11N14k59l26J90m8l12j55
$$ 295 -195 289 142 83 -67 -156 -213 -152 20 45 32 19 49 421 166 55 569 310 -16 174 126 -186 -341
3646c41K46M2O2Q2M7n5k56K48k95J00N6J14m30M59j0J5J53j05m3j78K25l96L56
$$ -341 -95 -53 9 91 138 83 -173 75 -220 -120 -64 50 -380 79 69 84 237 132 89 -89 136 -260 96
3669I6q4P1n98M64l96N50J25kj52l40J40K35l59k68L57K44j02RR4J24k23j06J88
$$ 96 12 83 -515 -51 -447 103 228 226 74 -266 -126 109 -250 -518 -161 83 -19 -10 84 208 -15 -121 67
3692F7o26M66j7J58m15L23r2K54k7K56j71k3j79k28J71p7J97L7l63KM40j18j7
$$ 67 -559 -93 -110 48 -367 -44 -136 118 91 347 176 153 -26 -254 -83 -160 37 74 -289 -287 153 35 18
3715A8L1J81k51k40K8K22m88M32k40M07l37L17j00J26j73J70j85m5k68J49K19
$$ 18 49 230 -21 -261 -233 -11 -499 -67 -307 100 -237 80 -20 106 -67 103 -82 -127 -395 -246 -27
3736b7K01j20r4M98q56P22l65j55N15p30K22P8J1K68j27l37K85L25j17O9o36J18
$$ -27 174 54 -40 458 -398 324 -41 -196 319 -411 -189 -111 -100 168 41 -296 -11 314 197 266 -370 -252
3758b52j00R8K68k68L9K10K72k04J85j14k82j21P6k32K99l9JJ64l1O7q6K41j04
$$ -252 -352 -254 14 -254 -215 -5 267 63 248 134 -148 -269 -193 -425 -126 -165 -164 0 -31 36 -50 191 87
3781H7k67j19j12J76L06J76m05L07P5J5o2l01L5K24j31l80N49j80P5k3N2jN4J19
$$ 87 -180 -299 -411 -235 71 247 -158 149 224 239 177 -124 -89 135 4 -376 173 -7 68 45 97 96 150 269
3805B69k16J6r6J65j31j97K95r3M58l89n0L76n43J05K2j90K08Ll11M23l17M15
$$ 269 53 69 -27 138 7 -190 105 12 470 81 31 407 -136 -31 -9 -199 9 12 -299 124 -193 222
3827B22m4R6j86n1Lk83J5R1l4L86l70l16L74N2J71j67J37j95j87M97k52j27J28
$$ 222 178 274 88 37 40 -243 -228 -137 -171 215 -155 -471 -97 -45 126 -41 96 -99 -286 211 -41 -168 -40
3850d0j56J46K01K6n6J95k36N6k65J40l60p0K80K09K4k87N31k49N2J89k92j2k21
$$ -40 -196 -50 151 177 121 316 80 136 -129 11 -349 -419 -139 70 94 -193 338 89 141 330 38 26 -195
3873a95J93J07l53R7J06K41K20l50q7n08P38o3l84k19K57J28J30j73J55L6J64
$$ -195 -2 105 -248 -151 -45 196 416 66 -21 -529 209 146 -238 -457 -200 -72 58 -115 40 76 240
3894B40j79n5l2j04Q9m79N35l03L47P8L4j27K78l35K18q6k88j19P8J67n1O6o5
$$ 240 61 6 -26 -130 -41 -520 15 -288 59 137 171 44 322 -13 205 119 -169 -288 -210 -43 -94 -28 -93
3917i3j98M41j69P9K41m16P4n6Nj67R0K91j87K44k03K37j82J05m32J33J09m59
$$ -93 -291 150 -19 60 301 -115 -41 -97 -92 -259 -169 122 -65 179 -24 213 31 136 -296 -163 -54 -513
3939e13L82K61n8j13R0N7J33m05L41m94K85k10M71k67L3k02K29j77L36l35J39
$$ -513 -131 130 72 -41 49 106 239 -166 175 -319 -34 -244 227 -40 -7 -209 20 -157 179 -156 -17
3960a7j83L22m00J74j34j11K99Q9J54k05L03n88j24O68m99P4J42j68MJ28K97j69
$$ -17 -200 122 -278 -104 -238 -349 -50 39 193 -12 291 -297 -421 247 -252 -178 -36 -204 -200 -72 225 56
3982E6k8l04M65k37j00o5n8K9J13M68k82j7K63l9k13o5K72m2m56J83n8O3M9j79
$$ 56 28 -276 189 -48 -148 -213 -271 -242 -129 339 57 40 303 264 51 -14 258 216 -240 -57 -115 -52 -3 -182
4006a82J86J20j86O6J93j59j02N76m97j90K72J18o9N5k66K16j70j6k24j84J82
$$ -182 4 124 -62 4 197 38 -64 512 15 -175 97 215 146 201 -65 151 -19 -35 -259 -443 -261
4027b61J65j53J43J45J06m0M5k44K62j44k82J90r8R0P2k9l0L42j64jK1k71K9n9
$$ -261 -96 -249 -106 39 145 105 150 -94 168 24 -258 -68 -166 -76 -4 -33 -63 279 115 114 135 -136 -107 -166
4051a66j20l4K87r0n7n1L52K17o1k97qj34J98%j41m3K5J90M6J44j44J70k72lm36
$$ -166 -286 -320 -33 -123 -180 -231 121 338 277 -20 -28 -162 36 36 -105 -148 -123 67 113 257 113 283 11 8 -428
4076d28K09J39pj67j16K93j01J46K06m33L65k34k98K81j69K03mJ67l20J26K79
$$ -428 -219 -80 -87 -254 -370 -77 -178 -32 174 -259 106 -128 -426 -145 -314 -111 -115 52 -268 -142 137
4097A37M0j48P2K2m7m5j08J2R7J43l3P3l1p5Q4Q4n74L19J27k53o0M3m1M12j81
$$ 137 177 29 101 123 76 31 -77 -65 32 175 142 215 184 109 193 277 -297 22 149 -104 -164 -121 -162 250 69
4122F9K41l01j3o3j61M2m9L9OJ70q8L98j86j57j34J77J16lm67J24L99l27KJ06
$$ 69 310 9 -4 -67 -228 -186 -235 -196 -190 -20 -108 290 104 -53 -187 -10 106 103 -364 -240 159 -168 -166 -60
4146f0M63m42P7j30K16j26M6p2k91K11O7K43k94J48j05M21n80M83k91K0k47J33
$$ -60 403 -39 38 -92 124 -2 44 -28 -319 -108 -41 202 -92 56 -49 372 -208 275 -16 4 -243 -110
4168a10k78j9M49r2L66k62K54k32P1n3L0l00K46M6j69M9j75M60k11K65n91N58
$$ -110 -388 -407 42 -50 316 54 308 76 147 94 124 -176 70 116 -53 -4 -179 281 70 335 -256 302
4190C02l17j33J44n8l50N17p3J14J59k15K84k92l6o4j86K12j25j99M55k25J18
$$ 302 -15 -148 -4 -62 -412 105 32 146 305 90 374 82 46 -18 -204 8 -117 -316 139 -86 32
4211C2L10n4j99L0Km93O8O10k52k59Q0J91j64L50L8n93JJ98j7K00K10l56P0n5
$$ 32 342 288 89 119 121 -372 -304 306 54 -205 -125 66 -98 252 290 -303 -302 -104 -121 79 289 -67 3 -52
4235e2J84j98K54k15J0J42j66k88N61r4P3k38l2L9N9M0K0%o9j80j99N19k62P6
$$ -52 132 -66 188 -27 -17 125 -41 -329 232 138 211 -27 -59 -20 39 79 99 99 30 -150 -349 170 -92 -16
4259a6l43K45k0K32Qj06j46L72j49k48k8J8L04k5K73l80j76L71j06r3r7q2j30
$$ -16 -359 -114 -134 98 106 0 -146 226 77 -171 -199 -181 123 98 371 -9 -185 186 80 -13 -110 -192 -322
4282c22K17L02L1J12k62o3J71l9J39l16j55j29L26j25K61j68J76j81J2L4K71n24
$$ -322 -105 197 228 340 78 15 186 147 286 -30 -185 -314 12 -113 148 -20 156 -25 -13 21 292 -232
4304b32N13j95l49K02j05m2K73j59J37n5L51K28l73j91j31K78k98K12j17L9L79
$$ -232 281 86 -263 -61 -166 -208 65 -94 43 -12 339 567 194 3 -128 150 -148 64 -53 -14 365
4325C65l29K69m23K15o1R9j05k85M07m24L37J30k09J46L4J87l68J35J07k11k15
$$ 365 36 305 -118 97 36 135 30 -255 152 -272 65 195 -14 132 166 353 -15 120 227 16 -199
4346a99J59J5j35K78K96k47j88L88m03M6j13J51j99j4J35k66M81j30K8K59k17
$$ -199 -40 -25 -160 118 414 167 -21 367 -36 10 -103 48 -151 -165 -30 -296 185 55 83 342 125
4367A25l5j15j54K23j53Pk6M5J65r9r3mM00m15j2K46j96K24n1q7k58L77j27n0
$$ 125 90 -25 -179 44 -109 -102 -128 -83 82 -17 -110 -114 286 -129 -141 105 -91 133 82 -5 -263 114 -13 -63
4391f3M13k32l73L32J2m70J84m9O2K10J43k01J44O5q9oL3r3Q4k71K88j24j42M79
$$ -63 350 118 -255 77 89 -381 -197 -246 -184 26 169 -32 112 177 88 82 115 22 106 -165 123 -1 -143 336
4415C36k02M4j12m6j13J01k29J60l33M29j24K23k46L37j18j4j18J69j93P4P8p8
$$ 336 134 178 66 20 -93 8 -221 -61 -394 35 -89 134 -112 225 107 93 -25 144 -49 25 103 25
4437B5k69J89L14n1K05m11J68j59k82J25j71k2M60l84K44K13m5j74K37k79Q8j51
$$ 25 -244 -55 259 208 413 2 170 11 -271 -146 -317 -339 121 -263 -19 194 149 -25 212 -67 21 -130
4459a30p4j63J19L35J03k20J44k75L41k59K41k20K36m70L79j47K1L45m38M00j05
$$ -130 -204 -367 -248 87 190 -30 114 -161 180 -79 162 -58 178 -292 87 -60 -39 306 -132 268 163
4480A63k86JK26j71j41L7m7l01O33k53Lm5M54J58p8j96k79J46j7p7K14j8j86q6
$$ 163 -123 -122 104 -67 -208 -171 -218 -519 114 -139 -136 -181 273 431 353 157 -122 24 7 -70 144 126 -60 -146
4504a46K07kl6j35J4q2J50J41m15O21k62q6N67l02j78k5j96j30K86l7K7P6l1J28
$$ -146 61 59 23 -112 -98 -180 -30 111 -304 317 55 -31 536 234 56 31 -165 -295 -9 -46 -19 57 26 154
4528A54k44J68R8k86J73j17k25R2J44J73p3J25j99K9K04l03K71l31L50q17N11
$$ 154 -90 78 176 -110 63 -54 -279 -187 -43 130 57 182 -17 12 216 -87 184 -147 203 -614 -103
4549a03J30j62n2N18m87K37o0j21L43n3l38Q8j52J64LJ71j01j40N2K14j25J36
$$ -103 27 -135 -187 331 -156 81 21 -100 243 190 -148 -60 -212 -48 -45 126 25 -115 -63 151 26 162
4571A62m0lm53M84k07Q3P0J10j66k6L14J2k26R3m45J39J73j46k78K15J41n3K28
$$ 162 122 119 -334 150 -57 26 96 206 40 14 328 340 114 207 -238 -99 74 -72 -350 -135 6 -47 181
4594A81j0J69rj10j89l1QJ4o7K49J61n50O6K35J7K3j20pj13j71J47R2j70K46K47
$$ 181 171 340 331 221 32 1 9 23 -44 205 366 -184 -118 117 134 157 37 30 -83 -254 -107 -15 -185 61 308
4619C08j58n7J54p8k65j94M53n57P37p39M50r7K06j32k78J49nQ2J68k17L21j85
$$ 308 150 93 247 169 -96 -290 163 -394 343 -396 54 -43 163 31 -247 -98 -103 -21 147 -70 251 66
4641F6j08m0n9J56J72l4l52k5J79j3k19J93j8j54J72R8k27L76n1J41m44r8L41
$$ 66 -42 -82 -141 15 187 153 -199 -224 -45 -58 -277 -84 -102 -256 -84 14 -213 163 112 253 -191 -289 52
4664E2l76K95k04M45l84N8L95j05L6J60m28K24k75j93K15L1J66j36L7j90J88M4
$$ 52 -324 -29 -233 212 -172 -114 281 176 212 372 -56 168 -107 -300 -85 -54 112 -24 13 -177 11 55
4686E5J83n5L1l81L6n0K07K8q0r8K06J03j56M01j62m15J81j19m14M14K17PP7J68
$$ 55 238 183 214 -167 -131 -181 26 54 -26 -124 82 185 29 430 268 -147 34 -85 -499 -85 132 139 216 384
4710C84p8l68J93m12J36N9O8r7J8k3J5K41l02K16n2J47k6l92K42j27j73M44j33
$$ 384 306 -62 131 -281 -145 -86 -18 -115 -97 -120 -105 136 -166 50 -2 145 119 -273 -31 -158 -331 113 -20
4733b0K79l93K60l11K41l4j04j21K40j38J3L02l70L11n6K25j65j40n5l8J64q4
$$ -20 259 -134 126 -185 56 22 -82 -203 37 -101 -88 214 -156 155 99 324 159 19 -36 -74 90 6
4755Fj80L88r4j70j7J60j28K79M0k62k99L02j71o8J16J17l62M69O9k48K46k53
$$ 6 -174 214 120 -50 -67 93 -35 244 284 22 -277 25 -146 -214 -98 19 -343 126 195 -53 193 -60
4777f0o8J63m13J59J22J56L29l4j11K12n21K1L45j33j93L84o20J7K97K21l42K06
$$ -60 -128 35 -378 -219 -97 59 388 354 243 455 -66 -45 300 167 -26 358 -262 -245 52 273 -69 137
4799A37Q3l3l04M3K22j6n85K32M95j85p3M8k91N15L0k27k5l89J92J84NLn6j20
$$ 137 220 187 -117 -74 148 132 -453 -221 274 89 16 64 -227 288 318 91 66 -323 -131 53 58 61 5 -115
4823a15K27K66k91K65r9l57P5j98L6J21j4J38j51J08j65L88l54J00K8l85L19J43
$$ -115 112 378 87 352 253 -104 -29 -227 -191 -70 -84 54 -97 11 -154 234 -120 -20 8 -377 -58 85
4845H5k06l11J45M01j87j92P9P6K18j18j06j8L63o6p1o1L24k61o6N7l4JP1q7n5
$$ 85 -121 -432 -287 114 -73 -265 -186 -110 108 -10 -116 -134 229 163 92 31 355 94 28 85 51 52 123 36 -19
4870a9K41q5k91K3K10P6l05L50j15j51K68m15r1O07l82Q8k09K73K53j34k18o4
$$ -19 222 137 -154 -131 79 155 -150 200 85 -66 202 -213 -304 303 -79 9 -200 73 326 192 -26 -90
4892i0M31k17r7M2j74l7J20J12j50K49k19J99l89N04m28P3J88l66L83Q7k37k65
$$ -90 341 124 27 69 -105 -142 -22 90 -60 189 -30 169 -220 284 -144 -71 117 -249 134 221 -16 -281
4914b81L25L9L43l04j09J50k82nL32m07n5J40M8K32Jj99j87J53%k86L05L96k20
$$ -281 44 83 426 122 13 163 -119 -124 208 -199 -254 -114 -66 166 167 -32 -219 -66 -66 -352 -47 349 129
4937A29J08j69K89m56J88j89L85l10L1j14K16j65K29k40L55l61J59N7k07Pjj17
$$ 129 237 68 357 -99 89 -100 285 -25 6 -108 108 -57 172 -68 287 -74 85 142 -65 -58 -59 -176
4959a76K35k26q6K30L09J02m01J19j60P7n2j58j15K90j46M00l56J31M94m53J35
$$ -176 59 -167 -253 -23 286 388 -13 106 -54 23 -29 -187 -302 -12 -158 242 -114 17 511 58 193
4980A93n00L75l25O5K92j7m3l1K13Mk20K42j49j32k41L63l4p6J31j89j27L36J82
$$ 193 -307 68 -257 -192 100 83 40 9 222 226 6 248 99 -33 -274 89 55 -21 110 -79 -206 130 312
5003C12l57J58J21m54K22k7j75L3K24K27k99O0j21K59j53O7j29j97L32m91K53
$$ 312 -45 113 234 -220 2 -25 -200 -167 57 284 -15 45 -76 183 30 97 -32 -229 103 -388 -135
5024a35J17j03L93l1j96%p2K3m1j05J21M3m8j91N33k76K99o19N74m38k52L40J79
$$ -135 -18 -121 272 241 45 45 -27 -4 -45 -150 -29 14 -34 -225 308 32 331 -288 286 -152 -404 -64 115
5047A15k76O4M2k3J26M04k05m18J97Ll94L74M0j78l6j24O6RJ93K55J09k35j01
$$ 115 -161 -97 -55 -78 48 452 247 -171 26 29 -365 9 49 -129 -165 -289 -223 -214 -21 234 343 108 7
5070Go6J27k53N2K48K5m26K55K85k07P5q0j1J55m02K38j92L50k07j59K04k22O3
$$ 7 -59 68 -185 -133 115 140 -286 -31 254 47 122 42 31 186 -216 22 -170 180 -27 -186 18 -204 -141
5093a41L06k59k24J57N1NJ30K60m05J89j07RJ80r5j39j02J11J46m15M46o8o9M7
$$ -141 165 -94 -318 -161 -110 -105 25 285 -120 69 -38 -29 151 56 -83 -185 -74 72 -343 103 35 -34 13
5116A3ro8j01M73k80j75J03K20m56L31N1m49L28K26p3j90p0K88k95o7K32j09J19
$$ 13 4 -64 -165 308 28 -147 -44 176 -280 51 102 -347 -19 207 134 -56 -126 162 -133 -200 32 -77 42
5139D2j14J32l2J18q5PK12j53l74N31l61Q0k3l3r9N2J91k80K52J16j45J55k68
$$ 42 -72 60 28 146 61 68 280 127 -247 284 -77 3 -20 -53 -152 -100 91 -189 63 179 34 189 -79
5162g9L3K47p7K31n33K71M4K3M8l56J60K3P2j76o3r9J92j59L79j37K50k10N0k26
$$ -79 -46 201 124 355 -178 93 137 160 208 -148 12 35 107 -69 -132 -231 -39 -198 181 44 294 84 134 -92
5186i2K76l01J60J58n11M39J38Rl46L84m55J14j46K13j80L45L1l9n9k57N2M22
$$ -92 184 -117 43 201 -310 129 267 276 -70 314 -141 -27 -173 40 -140 205 236 197 138 -119 -67 355
5208C55j66o01J92l9J78p5K94kJ18l67L87j30j41k70L10n9M3k53J11J9J49k65
$$ 355 189 -412 -220 -259 -81 -156 138 136 254 -113 274 144 3 -267 43 -16 27 -226 -115 -96 53 -212
5230b12M91k26M49l18m23M99P7j82j35j81K07m28J22K01j0K55k15K80r1m18O29
$$ -212 279 53 502 184 -239 260 337 155 20 -161 46 -382 -260 -59 -69 186 -29 251 160 -258 371
5251C71n28n0j67K90m4K18j27K74J06m16P6j28K25l25k4o3L93k17K86j10o9K24
$$ 371 -157 -207 -374 -84 -128 90 -37 237 343 -73 3 -125 100 -225 -249 -312 81 -136 150 40 -29 195
5273A95P2j37m53K23K1RL1j02J23l7J87O6L3j63q9j13J41J75l04L35r3r7L7L9
$$ 195 267 130 -323 -100 -79 -70 -39 -141 -18 -55 132 198 231 68 -21 -134 7 182 -122 213 120 23 60 99
5297I9J4J47J56l87k10L43p8l35k7R0k16J88M47k05M8J71k05m08K25K57n7Q7k93
$$ 99 113 260 416 29 -181 162 84 -251 -278 -188 -404 -216 231 26 74 245 40 -368 -143 114 57 144 -149
5320a49q7K17J31J56k35Q5L04m43Q9o1L3J34j89N1M32o09M24j33l99K2L2p7J76
$$ -149 -236 -19 112 268 33 118 422 -21 68 7 40 174 -15 36 468 -141 283 150 -249 -227 -195 -272 -96
5343i6J78p2k20K18J34j51j74J30J18j05j17K7oK53j74J18K16j24K87n39L04l16
$$ -96 82 10 -210 8 142 -9 -183 -53 65 -40 -157 -130 -136 117 -57 61 277 153 440 -99 205 -111
5365a11j06m9L02k49J73J74l48q9J23L05r2Lj28J88j41Kk3J97r7R5Kj63K60p9
$$ -111 -217 -266 36 -213 -40 134 -214 -303 -180 125 33 36 -92 96 -45 -43 -66 131 34 129 131 -32 228 149
5389A49k56K6K43k08k22m2M76j05m15L87O8J97j04J63l25L2j49N8L4K38k67J31
$$ 149 -107 -81 162 -46 -268 -310 166 61 -354 33 101 298 194 357 32 64 -85 -27 7 245 -22 109
5411A09J63j15o9j31J50J34j66jj82L55m74L85k8j35l45K95J3Q6Or5M08n17L01
$$ 109 272 157 88 -43 107 241 75 74 -108 247 -227 158 130 -5 -350 -55 -42 44 50 -45 363 -154 147
5434A47j66K52k31n7jl58K64K00k12L36n45O27k24J41L3k83p1M1ML21m62L31r
$$ 147 -19 233 2 -55 -56 -414 -150 50 -162 174 -371 256 32 173 206 -77 -148 -107 -103 218 -244 87 78
5457G8o0j41R1j01r5K52j12P5r4n2LK35l56L39k69N0K13J0j53J30p1m6l2k7J70
$$ 78 18 -123 -32 -133 -228 24 -88 -13 -107 -159 -156 79 -277 62 -207 -157 56 66 -87 43 -28 -74 -106 -133 37
5482C7r9M1J27O8p2j10J68J31l55J22k74J08J69j72J86j72L00j11k45J78q6M7
$$ 37 -62 -21 106 174 102 -8 160 291 -64 58 -216 -108 61 -111 75 -97 203 92 -153 25 -61 -14
5504a4J23m3j34l19L83k4J84j02J08p3j1K10m50L66j46J05l36l39M26L1J63R3
$$ -14 109 66 -68 -387 -4 -28 156 54 162 89 78 288 -162 204 58 163 -173 -512 -86 -55 108 201
5526B01l90L10l93J10K08k02L53j60k4j17J43k11L54j74P3k57J32K96m47k9j10
$$ 201 -189 121 -272 -162 46 -156 197 37 13 -104 39 -172 182 8 81 -176 -44 252 -195 -224 -334
5547c34L50m4L5k4lrJ96r5j38k04K07Q5l13M63pm70L06j53J78o0k28K12p0J13
$$ -334 16 -28 7 -17 -20 -29 167 72 -66 -270 -63 22 -291 172 165 -305 1 -152 26 -34 -262 -50 -120 -7
5571gK2k83K69r6O5L16j66k83J88p9L01n05J09j10N9L67j85K24M0n8l98L57m46
$$ -7 15 -268 1 -95 -30 286 120 -163 25 -54 247 -258 -149 -259 -200 167 -18 206 246 188 -210 147 -299
5594b99N09p4k50j2K03k02K40j98o6N8N8j11qL06J48m74L09R4m8j85l40M21p9
$$ -299 210 136 -114 -126 77 -125 115 -83 -149 -91 -33 -144 -152 154 302 -172 137 231 183 -2 -342 79 0
5617@K4K39l85k60L79j17j22K92k38J82n07M23J91k44n9K73l62J60k1K60r2p3
$$ 0 24 263 -122 -382 -3 -120 -242 50 -188 -6 -513 -90 101 -143 -202 71 -291 -131 -152 108 16 -57
5639e7l85L33J53K12J05o12L77m8M0j17L02J4q8k14J11k42K59J1J80o03K55m8
$$ -57 -442 -109 44 256 361 -251 126 78 118 1 303 317 229 15 126 -116 143 154 334 -269 -14 -62
5661f2J72j74l9J13J29j49p0n3J64J39l03O3q5L33j27k8J73k01o1L31m04J74l21
$$ -62 110 -64 -103 10 139 -10 -80 -133 31 170 -133 -70 -155 178 51 23 196 -5 -66 265 -139 35 -286
5684b86M21o31L64Kj00K04K46J7m59N00Nm39k34O13k04j91q5r8Q9J86L19l86J89
$$ -286 135 -496 -132 -130 -230 -26 220 237 -222 278 283 -156 -390 223 19 -172 -257 -355 -266 -80 239 -147 42
5707D2k05J78Q8j15J24k66j36J40J52r2M78n03K25rj12M8K57m06l4Q9p7J54J44
$$ 42 -163 15 103 -12 112 -154 -290 -150 2 -90 388 -115 110 101 -11 37 294 -112 -146 -57 -134 20 164
5730A64J63m29J98J05j40j83m2K59m30J88K66J46m97K66l4j66L55l92J17J18j59
$$ 164 327 -102 96 201 61 -122 -164 95 -335 -147 119 265 -232 34 0 -166 189 -203 -86 32 -127
5751a27K4m1j3L85k77m7M16j74m30K79J85j36r5l1j86O28k24Q7o6m25P50m59j00
$$ -127 -103 -144 -157 228 -49 -96 320 146 -284 -5 180 44 -51 -82 -268 360 136 223 157 -268 482 23 -77
5774g7K22j94O8K25l05J68q8k7L53o60Q6L09p6j25j90L68j5j78K06J64j52J03
$$ -77 145 -49 19 244 -61 107 19 -8 345 -315 -229 80 4 -121 -311 57 42 -136 70 234 82 185
5796A85p4Lj32k31L6K98j57L91k98J00R3k52n6L76l70N5l00L64PL70m85j29M54
$$ 185 111 114 -18 -249 -213 85 -72 319 21 121 214 -38 -94 282 -88 -33 -333 31 38 408 -77 -206 248
5819B48j07k82p1N76m47K71k9k39l00K07M23n45N43k24p2k9p2K54k14J88j29j04
$$ 248 141 -141 -212 364 -83 188 159 -80 -380 -173 250 -295 248 24 -48 -77 -149 105 -109 79 -50 -154
5841a54K95k97k4K67j49J08n3J3o3m3M13p09L78j65K0N4J52j23L08l58K67K96
$$ -154 141 -156 -180 87 -62 46 -7 6 -57 -100 313 -396 -18 -183 -163 -109 43 -80 228 -130 137 433
5863D33p84L82k0k0j64J08Q5k0j02L77j89k99J28K23k99J39K80k84j46L62L8J35
$$ 433 -351 31 11 -9 -173 -65 20 0 -102 275 86 -213 -85 138 -161 -22 258 -26 -172 190 228 363
5885C63n95K45k48J66l18N40r2l28J4M75k31J62j57K18l56j8M07j32n6j30J17
$$ 363 -232 13 -235 -69 -387 153 61 -267 -253 222 -9 153 -4 214 -142 -160 247 115 59 -71 46
5906D6m51N19K7m1k40K40j08K78j73k85J20o8J4J0K04l19L9K67J89l37k21p9K14
$$ 46 -405 114 141 100 -140 100 -8 270 97 -188 -68 -136 -122 -112 92 -227 -188 79 268 -69 -290 -369 -155
5929a55J80j00o3J21J95J63j89K06m66L54k85m53N33r9K00k37K00j09n3j57K47
$$ -155 25 -75 -138 -17 178 341 152 358 -108 246 -39 -492 41 -58 142 -95 105 -4 -57 -214 33
5950C3k70K90p1K26m28J08M85j89k95J15K02r0k24O4K78k29K39j63k16L61k44
$$ 33 -237 53 -18 208 -220 -112 373 184 -111 4 206 116 -108 -44 234 5 244 81 -135 226 -18
5971a8K78j71k59M03j35j28n2n2j61K18L00n9j19o0N9R3o8R5j20K07m68j6K81
$$ -18 260 89 -170 233 98 -30 -82 -134 -295 -77 223 164 45 -15 44 137 69 164 44 251 -217 -233 48
5994D8k92j4J08N76l39k34J91M4O1j99j68j32M83l02J15L05j60j60jJ35j31K99
$$ 48 -244 -258 -150 426 87 -147 44 88 149 -50 -218 -350 133 -169 -54 251 91 -69 -70 65 -66 233
6016B33k76l1K43m04K71n6j71J86l29N79j35q8J46k2j83J29k51N6J93k05J94k39
$$ 233 -43 -74 169 -235 36 -20 -191 -5 -334 245 110 22 168 146 -37 92 -159 -103 90 -115 79 -160
6038a60L4M66k40k1m24M36j28J64l50K63J36j32j41O1l12j2K80k25m5N30k43j38
$$ -160 -126 340 100 79 -345 91 -37 127 -223 40 176 44 -97 -36 -348 -360 -80 -305 -350 180 -63 -201
6060b01L0J69L39n56J76j31K16nr8O8j73k14L50j76N41l92K01Nj97J29j2ln2k15
$$ -201 -171 -2 337 -219 -43 -174 42 37 -61 7 -166 -380 -30 -206 335 -57 144 149 -48 81 69 66 14 -201
6084b01K40n9K35k09PK28k19k15J05l0J13j20J41L38l97l55N89k78j2k30M12K33
$$ -201 39 -20 215 6 13 241 22 -193 -88 -118 -5 -125 16 354 -43 -398 191 -87 -99 -329 83 316
6106C16k09k71Q6K30j79k24L32j13O8k64j62N13K91m92J38M3k70k9L58k79J93
$$ 316 107 -164 -78 152 -27 -251 81 -32 36 -228 -390 123 414 -78 60 103 -167 -196 162 -117 76
6127G6kJ31j4l30K56k5k31J12O9q8J35k63L98l40K29j92K23j79l6p7J33m0L6n9
$$ 76 74 205 191 -139 117 92 -139 -27 42 -46 89 -174 224 -116 113 -79 144 -35 -71 -148 -15 -55 -19 -78
6151g8k0J26J53j46p6J11n35N40o2q8K9r4N3Q7L12k67M3J73k40k63K84Q1q0o4
$$ -78 -98 28 181 35 -41 70 -465 75 13 -75 -46 -140 -87 0 312 45 88 261 21 -242 42 123 43 -21
6175b1J53j52K16l25K52k82R4L84m15J96l05K12j1J07J25k81J79N7o5q5j82Mj82
$$ -21 132 -20 196 -129 123 -159 -65 319 -96 100 -205 7 -4 103 228 -53 126 183 118 33 -149 -145 -327
6198c27K36nK92m09L45j52K15m33Q6J62J54k13O0k00J45m2R1K36j24k0n9K0j28
$$ -327 -91 -96 196 -213 132 -20 195 -238 -152 10 164 -49 11 -189 -44 -86 5 241 117 97 38 58 -70
6221g0K52l91L9R0q7L57O8k84J07j60M1J4kk03J89K30j72K08k17m0J44j63O0K28
$$ -70 182 -209 -170 -80 -167 190 258 -26 81 -79 -38 -24 -26 -229 -40 190 18 226 9 -31 113 -50 10 238
6245B38l69J72Q2o9p0j06J49j71K25j30q9M05j25J31r0m65k1M07p0L08m28J91
$$ 238 -131 41 123 54 -16 -122 27 -144 81 -49 -138 267 142 273 183 -282 -303 104 34 342 -86 105
6267A05J93m57n9J8K25J34l21J40R6j09k4K13m9j73J8n2J09k27R8N0j77M13q9
$$ 105 298 -159 -218 -200 25 159 -162 -22 74 -35 -59 154 105 -68 -50 -102 7 -220 -122 -72 -249 164 75
6290G5j55j14L22j4j77P1K4J95m30J22j01K10K0J12l26J21l23N49l65J05Q3q2
$$ 75 -80 -194 128 114 -63 8 32 227 -203 -81 -182 28 48 160 -166 -45 -368 181 -184 -79 4 -78
6312g8M3n2K42k47K35k44M3K15l65J55k11Q1J57L7j59K87J80l78J68q3J06j95
$$ -78 -35 -87 155 -92 143 -101 -58 157 -208 -53 -264 -183 -26 11 -148 139 319 -59 109 26 132 -63
6334f3L41l74R6M4K44j86l45L88O1n3j22J78k27J66k13k37K54Q3j97Q2K01k69
$$ -63 278 -96 0 44 288 102 -243 145 206 153 31 209 -18 148 -65 -302 -48 35 -162 -80 121 -148
6356a48L01j73j05l2J38K27m30L04L7j44j1Q5M8J99j88J48j18k64J86l2L5j50
$$ -148 153 -20 -125 -157 -19 208 -222 82 119 -25 -36 49 97 296 108 256 138 -126 60 28 63 -87
6378h7K1J10j63m3J14L2j69L67k79J63j86J44J33j37l20L53rK6J58k93n7J93r7
$$ -87 -66 44 -119 -162 -48 -16 -185 182 -97 66 -120 24 157 20 -300 53 44 70 228 -65 -122 71 -26
6401b6K19j04k91N66n97K73r2q9L01j40k82M30MJ29m52o5M87j63k56K87l32K15
$$ -26 193 89 -202 364 -233 40 -52 -141 160 20 -262 168 172 301 -151 -216 271 108 -148 139 -193 22
6423B2jl04O2M42o4K0l51M2K80rM1Ol34M8M7j31J79M0r8j78L86l16m1M30j17k61
$$ 22 21 -283 -221 221 157 177 -174 -132 148 139 180 186 -148 -100 -53 -184 -5 35 -63 -241 145 -171 -212 218 101 -160
6449a60J37J91j30j71J10o9j57K04j64L67k40j2J58R4N3l46J94n11K68K56j23
$$ -160 -23 168 38 -133 -23 -92 -249 -45 -209 158 -82 -94 64 158 211 -135 59 -452 -184 72 -51
6470e1nQ5K99k70r2J19P7O1k84L07m39J27J87P4k23K38l06J17p3J22l7o6k0j06
$$ -51 -56 29 328 58 -34 85 162 223 -61 246 -193 -66 121 195 -28 210 -96 21 -52 70 33 -33 -53 -159
6494a59K90p4J32j05K21k16j86K90p9k68N57m04k11M34l60L52n3k35k24N01J63
$$ -159 131 57 189 84 305 89 -97 193 114 -154 403 -1 -212 222 -138 214 161 -74 -298 203 366
6515C66k23R0k73L23J28k06O7k77r5L98o44K02q7N34J24k60k29L64n50m1K93N4
$$ 366 143 233 -40 283 411 205 272 -5 -100 298 -346 -144 -231 303 427 167 -62 302 -248 -289 4 58
6537E8J49m86M81m21L44qj62J27P9j25J31l26K0M04j00L5k88K46m16M12o6J5k0
$$ 58 207 -279 202 -219 125 117 -45 82 161 36 167 -159 -139 265 165 200 -88 158 -258 154 88 103 83
6560H3q5j6L68m78k2O4nK22m58J62L8l3J80K36m67l1M9L27l02l7J0mO3L44j82
$$ 83 -2 -18 350 -128 -150 -86 -91 131 -327 -165 -127 -160 20 256 -211 -242 -193 134 -168 -205 -195 -199 -136 208 26
6585B6j1Nk63N54n86L59k94P24q71L13M75l8o16n3K32J38j38llJ53k46L9K09J03
$$ 26 15 20 -243 311 -275 84 -210 514 -357 -44 431 393 -223 -276 -44 94 -44 -47 -50 103 -143 -104 105 208
6609B08q5j49L78K8r8n86L86j7l91M33j36J00L10l87J23j01j13J45J02mR5k65
$$ 208 123 -26 352 380 282 -304 82 65 -326 107 -29 71 381 -6 117 16 -97 48 150 146 241 -24
6631b4Q2j18Pp7mK24j88L20k47k11J47M19o34K25J20n9k77K92J11J98m34J78L8
$$ -24 58 -60 -53 -130 -134 90 -98 222 -25 -236 -89 330 -304 -79 41 -18 -295 -3 108 306 -128 50 88
6654H8L9l6k98L05j36Q5n9K91o50L88L16k19j06K16j03L1k68l4r9J38M93r18L87
$$ 88 127 91 -207 98 -38 47 -12 279 -371 17 333 114 8 224 121 152 -116 -150 -249 -111 382 -536 -149
6677a49M95m22K76rm24L76k15J56j92K78Ol6K8M0l50M46n94L51q2k98J82J25L78
$$ -149 346 -76 200 191 -233 143 -72 84 -108 170 176 140 168 208 -142 304 -290 61 -21 -319 -137 -12 366
6700C66r4l17lJ94n6L2k13j19k04M19j21Kj73M95Q4k65P5j6j77P7q8l13L75J49
$$ 366 272 -45 -48 146 90 122 -91 -210 -414 5 -116 -114 -287 208 292 27 102 86 -91 -14 -102 -415 -40 109
6724A09K22l57j5K3J60k28J03J13j1j87K47k08m35K12J26K94J45k48N9k31K59
$$ 109 331 -26 -41 -18 142 -86 17 130 119 -68 179 -29 -464 -252 -126 168 313 65 124 -107 152
6745A52j05J36K3m49K50K92n71J83K1J57L79m25m2j39J46l19K13j92J98O54l88
$$ 152 47 183 206 -243 7 299 -272 -89 -68 89 468 43 1 -138 8 -311 -98 -290 -92 562 174
6766A74j34K12l52J21l4m1l7N9K4k44K62j99L40P4n60O07l21n5M49m29j02J97
$$ 174 40 252 -100 21 -13 -54 -91 -32 -8 -252 10 -189 151 225 -335 272 -49 -104 345 -84 -186 11
6788A1j92QJ56K5k6J36k07J35j88K01j17K50j31J10k8q1L6o2k2m1l07L03M7K17
$$ 11 -181 -173 -17 8 -18 118 -89 46 -142 59 -58 192 61 171 143 62 98 36 14 -27 -334 -31 16 233
6812B33l88M16j69j17kk15K09MM1j51N8k85L82m4L03n64K59J77m72N86l07k10
$$ 233 -155 261 92 -25 -27 -242 -33 -29 12 -139 -81 -366 16 -28 275 -289 -30 147 -325 261 -46 -256
6834b56K30j08Q7K83l73L73j48l46N12j42o5Q5mR6k6m50J0N30n79J33j27J95K32
$$ -256 -26 -134 -47 236 -137 236 88 -258 254 112 47 132 128 224 198 -252 -242 288 -291 -158 -285 -90 142
6857A42o9q6jK86l44k12L20K32k14J60Ql65J23MJ84k2k03R1Jj2n8J09k28K95k1
$$ 142 73 -13 -14 272 -72 -284 36 268 54 214 222 -143 -20 -16 168 146 -57 34 35 23 -35 74 -154 141 120
6882A20l8m09M99j85O9j82J87k70q7K49K37k44N1l5J85j98R1N2N5j74k06N66o95
$$ 120 82 -327 172 -13 56 -126 61 -209 -296 -47 190 -54 -3 -38 147 -51 40 92 147 -27 -233 333 -362
6905c62L22J24M0J7n55N85m5j9J76k00M6j31m3M7L2J93m06K25n45O87J09j39K23
$$ -362 -40 84 124 141 -414 171 126 107 283 83 129 -2 -45 2 34 227 -179 46 -499 188 297 158 381
6928C81k62j99J62n2J42j40l2j2N2l3k29L70j62q4L78n80L40M7J84n40K11O7l58
$$ 381 119 -80 82 30 172 32 0 -12 40 7 -222 148 -14 -98 280 -300 40 87 271 -269 -58 9 -349
6951c49L95r5j22L13R7m7l77L10k28R9P6J00j90j35K71r4J62kj49k09K50k72O4
$$ -349 46 -49 -171 142 239 192 -185 125 -103 -4 72 172 -18 -153 118 24 186 184 35 -174 76 -196 -132
6974a32K46p4L3k76Q1j8J23N2O4n76M37K00l50J31j00K08K00j77qj74K05J6j66
$$ -132 114 40 73 -203 -122 -140 -17 35 99 -477 -40 160 -190 -59 -159 49 249 72 64 -110 95 111 -55
6997e5mQ4o4p4L53J13j49o10L92J29j86R9nJ83j18Q6k7KK5j86N3J83o8J69k89
$$ -55 -59 25 -39 -113 240 353 204 -406 -14 115 -71 28 23 206 88 174 147 149 174 -12 41 224 156 325 36
7022C6J37n9k3l47r7L64k8q6J75l10Q3L65r4K23k05j90K77O5m69K55l7J62J17
$$ 36 173 114 91 -256 -353 11 -17 -103 72 -238 -155 210 116 339 134 -56 221 286 -183 72 35 197 314
7045C14l23p6j56j17L59k2K76l22J22j51J34J67k98J79j55l52K91J77j48k12M41
$$ 314 -9 -85 -241 -358 1 -21 255 -67 55 -96 38 205 -93 86 -69 -421 -130 47 -101 -313 128
7066A28j34L2j75K45j51m9K07m4Q8l76M03L2k09r9K11n7q8J01k01K77m76N27n61
$$ 128 -6 26 -149 96 -55 -104 103 59 147 -229 174 206 -3 -102 109 52 -36 65 -136 141 -335 192 -369
7089c69K20K06l74M53J18r9k9j44q3J09L68n94j61P56m79j71K27qK4J21p1K59
$$ -369 -149 57 -317 136 254 155 126 -18 -101 8 376 -218 -379 377 -102 -273 -46 -54 -30 91 20 279
7111B79m98M80l17j38j79N39j60Q0j72j5L63k57j77K77K11n55M66k38k90L04n7
$$ 279 -219 261 -56 -194 -373 166 6 86 -86 -101 262 5 -172 105 316 -239 227 -11 -301 3 -54
7132e4r5K60N7m3k07j43J47p2J35k9L8K33j81l33J14r1K21o1n8Q2L46q2L3J7l16
$$ -54 -149 111 168 125 -82 -225 -78 -150 -15 -44 -6 227 46 -287 -173 -264 -43 -104 -162 -80 266 184 217 234 -82
7157h2j7N65j71k33k68K21J47j41l35j8L98l49J57O2J72l4J3L42n67Q2j28j6L84
$$ -82 -99 466 295 62 -206 15 162 21 -314 -332 66 -283 -126 -64 108 74 87 429 -138 -56 -184 -200 184
7180A84m16P1J22j40R1J78k99L07l18K53N17n35l13O19o20N81l73K79J06l87J98
$$ 184 -232 -161 -39 -179 -88 90 -209 98 -220 33 550 15 -298 321 -299 282 -91 188 294 -93 105
7201A05m57M29m37K78k99K19M2L90k05k09K32j94k00K37k4N8R7j14j90M04k3k09
$$ 105 -352 77 -360 -82 -381 -162 -120 270 65 -144 88 -106 -306 -69 -93 -35 62 -52 -242 162 139 -70
7223g0k18N29n9j85P5q2J4m6M6k81J37J02j42RM86j85k45J08J97j09l8P1nj6k44
$$ -70 -288 241 182 -3 72 -10 4 -42 4 -277 -140 -38 -180 -171 315 130 -115 -7 190 81 43 114 109 93 -151
7248a51j33M50J11j44j12k74L48r9k10l2L72l75K85NK0k32L76p8l3p9j07J69l02
$$ -151 -284 166 277 133 21 -253 95 -4 -214 -246 126 -249 36 41 61 -171 205 127 94 15 -92 77 -225
7271b25P9kP6J57O2j80J72K26l69j40j45O8L35J7j66L50n34L1J29M03k81q4k44
$$ -225 -146 -148 -72 85 147 -33 139 365 -4 -144 -289 -221 114 131 -35 315 -219 -188 -59 344 63 -21 -265
7294b65J94K01k88L00j47L71o8k94P6k3k33K24j88K45J84j53J0m47K58M7J28p5
$$ -265 -71 130 -158 142 -5 366 298 4 80 57 -176 48 -140 105 289 136 146 -301 -43 4 132 57
7316E7M6m39J74M6K35k33L03k29j92K71K32k91L0j97J01J17Kq4L16Mk82P8p5J85
$$ 57 103 -336 -162 -116 119 -114 189 -40 -232 39 271 -20 10 -187 -86 31 33 -51 265 269 -13 65 -10 175
7340A75k51P2L3k32j12L21k8j74P8lo2N05n36Q8J63M1L00n03r5K46L4j04K83j77
$$ 175 -76 -4 29 -203 -315 6 -22 -196 -118 -121 -183 322 -214 -126 37 78 378 -125 -220 26 60 -44 239 62
7364F2O1n7M6q5MK48k67j22Q8j98J99M6K98k40N0J58k04j91L62l63k6K23N7q8
$$ 62 123 66 112 27 31 279 12 -110 -22 -220 -21 25 323 83 133 291 87 -104 258 -105 -131 92 149 61
7388F1k56P5J84J17l10j3P2J36o9j25Qo7M4j56P30l93K9k2J95l09M6lk17O70m81
$$ 61 -195 -120 64 181 -129 -142 -70 66 -3 -128 -120 -187 -143 -299 431 38 67 45 240 -69 -23 -26 -243 427 -54
7413e4L17k64L3j30K48j44R7l06N3K23Q7m12K45j9K72m19K90k15o6L62j16l10
$$ -54 263 -1 32 -98 150 6 103 -203 -150 73 160 -252 -7 -26 246 -173 117 -98 -164 198 82 -228
7435b28J75N5k6k76J77N34l78M6K75l50P0k3pQ5m5P8k66L34k50o1J72j0j53j00
$$ -228 -53 2 -24 -300 -123 411 33 79 354 4 74 51 44 129 84 162 -104 230 -20 -81 91 81 -72 -172
7459a72L08k43j28J8J24J87P0Q4m23N15n76J51j10j05O57l39P5N3j72L41l0k38
$$ -172 136 -107 -235 -217 -93 94 164 248 -175 340 -236 -85 -195 -300 357 18 93 146 -26 315 285 47
7481D7K68k54r2Q5j02Q4J02k87J3k94P29m72j17M99k68j24R9M0J42j36J47R7l35
$$ 47 315 61 -31 54 -48 36 138 -149 -136 -430 299 -173 -290 209 -59 -183 -84 -44 98 -38 109 206 -129
7504a29O01p19J78K05l31n7J23J62j28j84L90j78J07R6n83P54k97J65j29O3R5
$$ -129 472 -247 -69 136 -195 -252 -129 33 -95 -279 111 -67 40 136 -447 307 10 175 46 109 204
7525B04j83M2j45j40k0K29J37P8l20L41l58L78l43K38J89l67R8q7M0j73L11m29
$$ 204 21 63 -82 -222 -242 -13 124 202 -118 223 -135 243 -100 138 327 -40 58 -29 11 -162 149 -280
7547b80L00J50j97j31K23o7q4K09j1m66J41J96km8j9O1L9N7j26k4j6K19J46j67
$$ -280 20 170 -27 -158 65 -2 -86 123 112 -354 -213 -17 -19 -67 -86 -25 14 71 -55 -79 -95 124 270 103
7571A03l34K49r1qj17k80L71RJ06q6J7J72j64j88L82j44m9L69j71p5m3j89K07
$$ 103 -231 18 -73 -81 -198 -478 -107 -98 8 -78 -61 111 -53 -241 141 -3 -52 317 146 71 28 -161 46
7594D6k69L3J32PR8p4J59l80K56l5Q6p3k3k85L38J62j92R7n1L19k13j54J36Jk36
$$ 46 -223 -190 -58 -51 47 -27 132 -248 8 -27 59 -14 -37 -322 16 178 -14 83 32 351 138 -16 120 121 -115
7619a15L06M2j19k18MJ62n7j03j23K95j38j24M1J88O8l40K84J42o4k30Q5L6J91
$$ -115 191 233 114 -104 -100 62 5 -98 -221 74 -64 -188 -147 41 109 -231 53 195 131 -99 -14 22 213
7642B13%k77K64j20N1j59k37N64l13K53k30j81L05j84r3J15o4K92k06J37M7k4
$$ 213 213 -64 200 80 131 -28 -265 299 -14 239 9 -172 133 -51 -144 -29 -93 199 -7 130 177 153
7664A53m72J03J02L29K8l80M02j91j43K3M3j02L1j35J66k7q8J63J88j63J43k71
$$ 153 -319 -216 -114 215 243 -137 265 74 -69 -46 -3 -105 -74 -209 -43 -70 -158 5 193 30 173 -98
7686i8R5N2j71K95m64L27K8q7j14K90J33j47J1m87N61r1k61K65k81K86J10m30
$$ -98 -3 49 -122 173 -291 36 64 -23 -137 153 286 139 150 -337 224 133 -128 137 -144 142 252 -178
7708a78K39Nj30J48k15j15K5K8N57k29k49j04J92J13j09j21K28k8n4J34l65pJ25
$$ -178 61 66 -64 84 -131 -246 -221 -193 364 135 -114 -218 -26 87 -22 -143 85 57 3 137 -228 -235 -110
7731a10K14J17k75p6O5J39J08j49J42k31m4K51J20k04j2J37q1k80M2K6K35j84
$$ -110 104 221 -54 -130 -65 74 182 33 175 -56 -100 151 271 67 55 192 111 -169 -127 -101 134 -50
7753e0m0J26j95K66l24R3L9J82o9j16l7j66L74o7m0j7M5K82k72K3J39jj58l9q
$$ -50 -90 36 -159 107 -217 -124 -85 97 28 -88 -125 -291 83 16 -24 -41 4 286 14 37 176 175 17 -22 -30
7778c0m2J87l30p9M47K45n42P1k6L16jJ63l16n3k34K31q3J82J45j64n6n2j90L40
$$ -30 -72 115 -215 -294 153 398 -144 -73 -99 217 216 379 63 10 -224 7 -76 106 251 87 31 -21 -211 129
7802A29o9Q4j2j99o4L37l73J45Nm7Mj15K37k35k6NL92k07k09L55j71Q1N5L9m69
$$ 129 60 144 132 -67 -131 206 -167 -22 -17 -64 -60 -175 62 -173 -199 -194 198 -9 -218 137 -34 47 102 141 -328
7827c28J22J58J42j86K58j59jPJ9J67l52J81o8K41m7m59K34J7J41q9j13J23J48
$$ -328 -206 -48 94 -92 166 7 6 13 32 199 -153 28 -40 201 154 -305 -71 -54 87 -2 -115 8 156
7850A56k8k40J44j12p3J66n4O4m19L76n5O3J57j81M8R9k60K81M4o4L9p7j35J33
$$ 156 128 -112 32 -80 -153 13 -41 23 -396 -20 -75 -12 145 -36 12 111 -149 132 176 112 151 74 -61 72
7874G2O7j94J41k22j56L23k34L17l36K53j05K56k34J3n8K01%k03MJ35k8r6K84
$$ 72 139 -55 86 -136 -292 31 -203 114 -222 31 -74 182 -52 -39 -97 104 104 -99 -95 40 12 -84 200
7897B00j61n5l15J57K91l30p9L68J75k91j22o6K62q6k07N32j14N2m09N27k51r0
$$ 200 39 -16 -331 -174 117 -213 -292 76 251 -40 -162 -228 34 -52 -259 273 159 211 -198 329 78 -12
7919a2k0r1K73k11K88m10L27l83K54k36K81l77N77l76J48m11L45L01k59J29k05
$$ -12 -32 -123 150 -61 227 -183 144 -239 15 -221 60 -317 260 -116 32 -379 -34 267 8 137 -68
7940f8K45m45J59Q1J31mk55M76m41L3k77N07j16k11K24j9K17l25k43J32j28L84
$$ -68 177 -268 -109 -28 103 99 -156 320 -121 -88 -365 142 26 -185 39 20 237 -88 -331 -199 -327 57
7962E7m33J37J67M5l73L50j19J55Rk15M40l45R4Q5K20m09M05l24L33l80L7q0J54
$$ 57 -376 -239 -72 -27 -400 -50 -169 -14 -5 -220 220 -125 -31 54 274 -135 270 -54 279 -101 -64 -144 10
7985A0o7k43L76k68L64o0K34l95m20M79j73K99K0m62J85K80R5o6J63r3k27J98
$$ 10 -57 -300 76 -192 172 112 346 -49 -469 10 -163 136 156 -306 -121 159 254 188 351 258 31 229
8007B29j85m24K50P6N4k4p6R0l4J27k21m4J63K09m29L02k50M20J13m96J20K1P1
$$ 229 44 -380 -130 -54 0 -24 -100 -10 -44 83 -138 -182 -19 190 -239 63 -187 233 346 -150 -30 -9 62
8030F2J33k4K88l77j30L24l22p9O1L7K15l87kJ25L16j15j13J66K2j94K00k48M6
$$ 62 195 171 459 82 -48 276 -46 -125 -64 -27 188 -199 -201 -76 240 125 12 178 200 6 206 -42 4
8053DK00j74K37m07oL24j35j04R7P1n8P0J76l81O6K07j93J35K49m83K74l66K59
$$ 4 204 30 267 -140 -146 178 43 -61 36 107 49 119 295 -86 -20 187 -6 129 378 -105 169 -197 62
8076F2q8L6O0j32J62q4q0n2R6k16J86J40J39l50J45J54k8m18K00j28J93K0j15
$$ 62 -26 10 70 -62 100 16 -64 -116 -20 -236 -50 90 229 -121 24 178 150 -268 -68 -196 -3 17 -98
8099i8M5K16j69J51n3no3p7J05k40L38l59K87l4j2r5p9k3J82o6K3M25k94j28n1
$$ -98 -53 163 -6 145 92 87 24 -53 52 -188 150 -209 78 44 32 -63 -142 -165 17 -49 -26 399 105 -23 -74
8124g4K35j68j36L52m02J83J21J27j1p07O12K6k17l00L04O4n8n3K41J52k93J6
$$ -74 161 -7 -143 209 -193 -10 111 238 227 -480 132 158 -59 -359 -55 9 -49 -102 139 291 -2 14
8146A4j20K52P8m42Q5l6K32K27j74k4p9k10L15j57p1J42k7P8P5k27J79k0k28L19
$$ 14 -106 146 224 -218 -133 -169 63 290 116 92 13 -197 118 -39 -110 32 5 83 158 -69 110 90 -138 181
8170A81qK3j03j9m5P7j12l59N38pm57J66M08K33l76k65K17K47l55K9K13
$$ 181 173 196 93 74 29 106 -6 -365 173 166 -291 -125 283 516 140 -125 92 339 -16 13 226
8191B26
$$ Imaginary data points
##PAGE= N=2
##DATA TABLE= (X++(I..I)), XYDATA
0@%%%%%%%qJ6j6J6k4L2l2M0n5O3p2Q8j04J20j40J64j92K22k53K89l29L71m19M74
$$ 0 0 0 0 0 0 0 0 -8 8 -8 8 -16 16 -16 24 -31 32 -40 48 -56 64 -76 88 -104 118 -135 154 -175 196 -223 251
31B51n34N99o69P49q35R28j032J146j271J409j561J727j911K116k347K608k900
$$ 251 -283 316 -353 396 -439 489 -543 603 -668 741 -820 907 -1004 1112 -1235 1373 -1527
48a527L235l625M081m627N291o119P186q622J0676j3871J9570l2840J20068O1430
$$ -1527 1708 -1917 2164 -2463 2828 -3291 3895 -4727 5949 -7922 11648 -21192 98876 160306
62A60306k06028j031J12207M9835j07672o5370M2256O1836n0408n3645M8435P0406
$$ 160306 -45722 -46753 65454 115289 7617 -57753 -15497 46339 -4069 -57714 -9279 61127
74F1127n2123p1969L0632P5306p962n5255j1163M8413J9973l2936j131O2719J644
$$ 61127 9004 -62965 -32333 42973 35011 -20244 -31407 17006 36979 4043 2912 65631 67275
87F7275q6286k5576Q8084M3326q0766q5082K6466Q4611J3951o8097k9931M9069
$$ 67275 -19011 -44587 43497 86823 6057 -79025 -52559 32052 46003 -22094 -52025 -2956
99b956K7703l1684j1875K4790l243l1053p291K4263K3155m916k1814J448K1705
$$ -2956 24747 -6937 -18812 5978 2735 -28318 -35609 -11346 11809 6893 -14921 -13473 8232
112H232J18m682J8867l859m5963j3049M7559L4090k8141m5789K932N3564K6421
$$ 8232 8350 3668 22535 18676 -27287 -40336 7223 41313 13172 -32617 -29685 23879 50300
125E0300m0118l3987K2030J4532k4864r656K1479N390k0484j3602J8926L7280
$$ 50300 10182 -23805 -1775 12757 -12107 -21763 -284 5106 -15378 -28980 -10054 27226
137B7226M888l6542j6103K6174J4231j1574l692j16r130J462J5043J3446K220
$$ 27226 32114 -4428 -20531 5643 19874 8300 4608 4492 -4638 -3176 11867 25313 27533
150B7533j7039k1882R229K3834r486k7627q289N659P178R001j247o929M529L004
$$ 27533 10494 -11388 -2159 21675 12189 -15438 -23727 -18068 -10890 -1889 -3136 -10065 -5536 -2532
164b532p847L712J2774m088j7435j0696O562K9289K0490k7119l3554K4103M4738
$$ -2532 -10379 -6667 6107 2019 -15416 -26112 -19550 9739 30229 3110 -30444 -6341 38397
177C8397o104m3682k0099K1745K2256k0915l3995J4388L4636j6271l6588J5522
$$ 38397 32293 -11389 -31488 -9743 12513 -8402 -42397 -28009 6627 -9644 -46232 -30710
189c0710L9765l881l9142j5723K8665L0755j3791k7586J6673L1679q509j3375
$$ -30710 9055 5174 -33968 -49691 -21026 9729 -4062 -31648 -14975 16704 8195 -5180
201e180K4677J6838l0737l0042J7822L6206j1379n6306j5521N5029K9846m7449
$$ -5180 19497 36335 5598 -24444 -6622 29584 18205 -38101 -53622 1407 31253 -16196
213a6196l5013L7331L5654k5642l5600J4404M0694R74m1840p006N1697K8521l3829
$$ -16196 -51209 -13878 21776 -3866 -39466 -25062 15632 16606 -25234 -32240 19457 47978 14149
226A4149k5338K3266K0500j1626j7453k632J905r227r555J6451J9815k1566k9634
$$ 14149 -11189 12077 32577 20951 3498 866 2771 -6456 -16011 440 20255 -1311 -30945
239c0945K4326M0137j4153l9178J561L1725O869k6664j3164K9239K4725k7216
$$ -30945 -6619 33518 19365 -19813 -18252 13473 20342 -6322 -19486 9753 34478 7262
251G262k7383K7835L1871k1912l6452J822K4696N534j8915j1918J5540J2082j1891
$$ 7262 -20121 7714 39585 17673 -18779 -16957 7739 13273 -5642 -17560 -2020 10062 -1829
264a829P53K3864k696l2489m232L0497R746k8687k3784J6631L2484o665l3059
$$ -1829 -1076 22788 20092 -12397 -16629 13868 23614 -5073 -28857 -12226 20258 13593 -19466
277a9466N528L5967m272l7412j903L2864R974k8422k2532K1179L7523l857l5214
$$ -19466 -13938 22029 17757 -19655 -21558 11306 21280 -7142 -29674 -8495 29028 25171 -10043
290a0043k362K8991M730k0931p996N959j550q503k569J0538J0480j0873j2902
$$ -10043 -12405 16586 21316 385 -7611 -1652 -3202 -11705 -14274 -3736 6744 -4129 -17031
303a7031J4826J8813r971j4878N890P633l958m027L820R942L050j2705o159J8595
$$ -17031 -2205 16608 6637 -8241 -2351 5282 1324 -2703 1117 11059 14109 1404 -4755 13840
317A3840J2638j8814k0294J603J1991N590p691j4676J227J6951N911p110j917
$$ 13840 26478 7664 -12630 -11027 964 6554 -1137 -15813 -14586 2365 8276 1166 -751
330g51J812j18O19k541m242N872M907q995l698J3514J0353l880q770o190K982
$$ -751 1061 943 1562 -979 -5221 651 5558 -3437 -7135 6379 16732 12852 4082 -2108 874
345H74R906k954j3146l534L784O61O494O376p757r589N468Q983O06p814j0907
$$ 874 10780 7826 -5320 -8854 -5070 -4409 2085 8461 704 -8885 -3417 5566 6172 -1642 -12549
360a2549J935J3244K11j0107O802J4090m372j1334M020J2132J074j4151j6286
$$ -12549 -10614 2630 2841 -7266 -464 13626 9254 -2080 1940 14072 15146 995 -15291
373a5291O196J8355k396j7069J59J1383R81j622K783j645o568l568K902J0751
$$ -15291 -9095 9260 6864 -10205 -10046 1337 2318 696 3479 1834 -4734 -8302 -5400 5351
387E351K239j3823l409J9501Q662j3791n386J0183J633j3216j0056O959J3694
$$ 5351 7590 -6233 -9642 9859 18521 4730 -656 9527 11160 -2056 -12112 -5153 8541
400H541p007k3272K178K8810Q053k2086j0120J3339J1210m879j1600L05R950j602
$$ 8541 1534 -21738 -19560 9250 17303 -4783 -14903 -1564 9646 4767 -6833 -6528 3422 1820
414A820r504P666J6502p133j7127M223J3835j681j4432o335P121O669q048o147
$$ 1820 -7684 -18 16484 9351 -7776 -3553 10282 8601 -5831 -12166 -5045 1624 -6424 -12571
428a2571J5300J2137j6076j3024J6120J7558j0293k2276l943J7683J1888j3511
$$ -12571 2729 14866 -1210 -14234 1886 19444 9151 -13125 -17068 615 12503 -1008
440a008j4044J1412J4279p784p637P379M800p692q597K290J0755L182j0420m204
$$ -1008 -15052 -3640 10639 2855 -4782 2597 7397 -295 -8892 -6602 4153 7335 -3085 -7289
454g289J2546O999p983j692N913n192j0096K64P539K770q982j1908Q112J9764
$$ -7289 5257 12256 4273 2581 8494 3302 -6794 -6530 1009 3779 -5203 -17111 -8999 10765
468A0765lj6071k000J0789K780n727l811R06L403j227m522N163R824l578j0742
$$ 10765 10762 -5309 -7309 3480 6260 533 -3278 -2372 1031 -196 -4718 445 10269 6691 -4051
483d051Q47N845j393m064m299l656J858L668J828L786Q60o845o3J0988K406r683
$$ -4051 -3204 2641 1248 -2816 -7115 -10771 -8913 -5245 -3417 369 1229 -5616 -5679 5309 7715 -1968
499a968o632J011L973M009j903n032L261N211l255j556M848j378o720l614N63
$$ -1968 -8600 -7589 -3616 393 -1510 -6542 -3281 1930 -1325 -2881 1967 589 -6131 -9745 -9182
514i182M161N018l723o941M782R391J129l079k843l930J100M222j134k880J410
$$ -9182 -5021 -3 -3726 -10667 -5885 3506 4635 1556 -1287 -5217 -4117 105 -1029 -3909 -2499
529b499j3PO673M703m042l378n54n08J353m34n146j473K945j026P26P652R29q400
$$ -2499 -2512 -2505 4168 8871 4829 1451 897 389 1742 1308 -3838 -5311 -2366 -3392 -2666 4986 5915 -2485
547b485k153N495M921n09p511n652P414J0554k332n319L639L720j473j376o82
$$ -2485 -4638 857 5778 5269 -2242 -7894 -480 10074 7742 2423 6062 9782 8309 6933 6251
562F251j247j286o590m223O708O038n739m164M203L102k68J283r25l737k049k16
$$ 6251 5004 3718 -2872 -7095 -387 5651 -88 -4252 -49 3053 2785 4068 3143 -594 -2643 -2859
578b859L845O745l291q757L404J1488R35q101n119N19K743j040o045m41O129J36
$$ -2859 986 7731 4440 -4317 -913 10575 11510 3409 -1710 -1191 1552 512 -5533 -5974 155 291
594B91o081M111R186n16o102l211J565L377J85n501k205M075M99j62N727Q83p504
$$ 291 -5790 -1679 7507 6991 889 -2322 -757 2620 2805 -2696 -4901 -826 -327 -489 5238 6121 -1383
611a383k581N117L821k973o401l769O448P245k547m144M872L331l397j961J202
$$ -1383 -3964 1153 4974 2001 -4400 -8169 -1721 5524 2977 -1167 3705 7036 3639 1678 2880
626B880L70k321n271l007O458O686m570m135M671L773o55O48p86l936r31R28K079
$$ 2880 3250 929 -4342 -7349 -891 5795 1225 -2910 1761 5534 4879 5527 4741 805 -126 802 2881
643B881L328j533n533J868P587k47n845k736j355m84N06j910j707L127N29k164
$$ 2881 6209 4676 -857 1011 8598 8351 2506 -230 -1585 -2069 -1563 -3473 -5180 -2053 -1524 -3688
659c688L873O552j466m965l83R70K041K03m177k720L689J427l98K525L09n762
$$ -3688 185 6737 5271 306 -77 893 2934 3137 -1040 -3760 -71 1356 958 3483 3792 -1970
675a970j534K750k30k390k291l884P34O292J858k559M97J050p55J817L96k264
$$ -1970 -3504 -754 -984 -3374 -5665 -9549 -8815 -2523 -665 -3224 -2727 -1677 -2432 -615 -219 -2483
691b483k287j076q42M111M681l156l118L751K579q39m18j902l848n49Q99j14J489
$$ -2483 -4770 -5846 -6688 -2577 2104 -1052 -4170 -419 2160 1321 903 -999 -4847 -5396 -4497 -4611 -3122
708c122J548k793q39M417K806j012k525l789m16N408J088l882L75K468P77K823
$$ -3122 -1574 -4367 -5206 -789 2017 1005 -1520 -5309 -5725 -317 771 -3111 -2736 -268 509 3332
724C332L547k555l982o75P05o18O82k973l529K796K974J93J180J664k511r98J516
$$ 3332 6879 4324 342 -333 372 -246 436 -2537 -6066 -3270 -296 -103 1077 2741 230 -768 748
741G48K9L83K02m460j154O812M534k912k019r2l81J610L25m369l350L25l72K286
$$ 748 777 1160 1362 -3098 -4252 2560 7094 4182 2163 2071 1690 3300 3625 -744 -4094 -3769 -4141 -1855
759a855L462j177k679K127L071k59k26k044l677N75K021j198J222J996j752k155
$$ -1855 1607 430 -2249 -122 2949 2690 2464 420 -3257 -2682 -661 -1859 -637 1359 -393 -2548
775b548L887L301j577k329l829r94M563J767l294j284K387J171J469L001k152
$$ -2548 1339 4640 3063 734 -3095 -4089 474 2241 -1053 -2337 50 1221 2690 5691 3539
790C539m460l38k44p04J112k030l237J685M403Q08R12J142k282k10J847O39m51
$$ 3539 -921 -1259 -1503 -2207 -1095 -3125 -6362 -4677 -274 534 1446 2588 306 96 1943 2582 2131
807B131M30k495j455M794M099k512k135l21p87O02j64l380l105j67O78J451M076
$$ 2131 2561 66 -1389 3405 7504 4992 2857 2536 1749 2351 2187 -1193 -4298 -4465 -3787 -2336 1740
824A740j43l143K196K946J70N81q84l971o17L136M62m99J150j436j158K248J996
$$ 1740 1597 -1546 650 3596 3766 4347 3463 -508 -1125 2011 2473 1974 3124 1688 530 2778 4774
841D774j697k647k686j843K522K344j969j497J853Q99J725L545j428l957p62M14
$$ 4774 3077 430 -2256 -4099 -1577 767 -1202 -2699 -846 53 1778 5323 3895 -62 -824 -410
857d10k61J348n12l566K13L765J329N96j08k780j363K061Jk037k61j378j256L481
$$ -410 -671 677 165 -3401 -3188 577 1906 2502 2394 -386 -1749 312 313 -1724 -1985 -3363 -4619 -1138
875a138L875j044j524Q9j254R64J867j988l566R7J347J468K723P95k485J55K046
$$ -1138 2737 1693 169 258 -996 -32 1835 -153 -3719 -3622 -2275 -807 1916 2711 226 381 2427
892B427n35N99o23m663j400K760J091m23J47l92r03L073J554j911j521j252j902
$$ 2427 1892 2491 1868 -2795 -4195 -1435 -344 -767 -620 -1012 -1915 1158 2712 801 -720 -1972 -3874
909c874J070L069o35j192R12J159J637K220j133l338o05P07j218J270M36k393
$$ -3874 -2804 265 -370 -1562 -650 509 2146 4366 3233 -105 -710 -3 -1221 49 485 -1908
925a908p24L355J683O76j38k567j866J714N83k216p97q31r18K436K998k07r17
$$ -1908 -2632 723 2406 3082 2944 377 -1489 225 808 -1408 -2205 -3036 -3954 -1518 1480 1273 356
942C56R4j239Q10K003j400l144L09J625R99K095P52k022K09J405q40m69o21l495
$$ 356 450 -789 21 2024 624 -2520 -2211 -586 413 2508 3260 1238 1447 2852 2012 1543 922 -2573
960b573k272K204J746m37P82j92j139K439K229j569j054o59j352Q15K661n91j660
$$ -2573 -4845 -2641 -895 -1332 -550 -742 -1881 558 2787 1218 164 -495 -1847 -1032 1629 1038 -622
977f22P19R45Q05J677j289l588j299P21o19K01R20j724K4K831J775P80R01j672
$$ -622 97 1042 1847 3524 2235 -1353 -2652 -1931 -2550 -2349 -1429 -3153 -3129 -298 1477 2257 3158 1486
995A486k436J492J398j918j146n07m26J495K641o90j440j16j234l44J799r30l059
$$ 1486 -950 542 1940 22 -1124 -1631 -2057 -562 2079 1389 -51 -167 -1401 -1745 54 -876 -3935
1012c935l95J969J578K039J063j735j32K010l20j293k6k256k210J502J820j87
$$ -3935 -4330 -2361 -783 1256 2319 584 452 2462 2142 849 823 -1433 -3643 -2141 -321 -508
1028e08O39o31r94K136K365j891k103m05o01j9K214P74j486P38M97P81J960L5
$$ -508 131 -500 -1494 642 3007 1116 -987 -1392 -1993 -2012 202 976 -510 228 725 1506 3466 3501
1046C501m279j807J481K31n08J40p10p6K558J314M19P12j452k752Q07K306j282
$$ 3501 -778 -2585 -1104 -873 -1381 -1241 -1951 -2027 531 1845 2264 2976 1524 -1228 -421 1885 603
1063F03j895m5K00J896J822k16r52k97r07j385J637m3k828j152J601J828J606
$$ 603 -1292 -1337 -1137 759 2581 2365 1413 1116 209 -1176 461 418 -2410 -3562 -1961 -133 1473
1080A473L63k015J00J857k62j514J90j578k328J226K335Q32M34q37p19J460K409
$$ 1473 1836 -179 -79 1778 1516 2 192 -1386 -3714 -2488 -153 679 1113 276 -443 1017 3426
1097C426j843k500L41j153O8J385R53p39j62N37L84J929R2l556j673J576N10n82
$$ 3426 1583 -917 -576 -1729 -1661 -276 677 -62 -224 313 697 2626 2718 -838 -2511 -935 -425 -1007
1115a007P83n93l89K149J226K45K74j283k227p6K004j099j532J57N21J221K543
$$ -1007 -224 -817 -1206 943 2169 2414 2688 1405 -822 -898 1106 7 -1525 -1368 -847 374 2917
1132B917j53j274K91j20j325J236N42k641r67J486J257R68P59j424j402J160J15
$$ 2917 2764 1490 1781 1661 336 1572 2114 -527 -1494 -8 1249 2217 2976 1552 150 1310 1425
1149A425j591l41j217j539J388K163M39O75N0n11O68K616j206k726o67l16j12
$$ 1425 -166 -507 -1724 -3263 -1875 288 727 1402 1452 941 1609 4225 3019 293 -374 -690 -802
1166h02J332j64q03J1O38N9N26M39k179k042L55R84N14O87o84l87K482K132r41
$$ -802 530 366 -437 -426 212 271 797 1236 -943 -2985 -2630 -1646 -1132 -445 -1129 -1516 966 3098 2157
1185B157m31n84k416l25J074k50j637J7l84P84L070l60k063KR60j166K24J010
$$ 2157 1726 1142 -1274 -1599 -525 -775 -2412 -2395 -2779 -1995 1075 715 -1348 -1346 -386 -1552 -1328 -318
1203c18j263p26J449O08J490J635j683j860J494O92j535j164o45j131N20J830
$$ -318 -1581 -2307 -858 -250 1240 2875 1192 -668 826 1518 -17 -1181 -1826 -2957 -2437 -607
1219f07JO67O12j051J28K374n93k732n86J01M83J234K17p57N82J093m95O73J041
$$ -607 -606 61 673 -378 -250 2124 1531 -1201 -1787 -1686 -1203 31 248 -509 73 1166 671 1344 2385
1238B385k194k679K54J909L0L84n05m34K243J455j138m02L17k228j150J123K38
$$ 2385 191 -2488 -2234 -325 -295 89 -416 -850 1393 2848 1710 1308 1625 -603 -1753 -630 -392
1255c92j272k75P9R34K252L56k174j02N20j008j49Q57q27j202J043J200J582Q96
$$ -392 -1664 -1939 -1860 -926 1326 1682 -492 -594 -74 -1082 -1231 -374 -1201 -2403 -1360 -160 1422 2318
1273B318j464j560J370R84j810j066J15r31N0J502O08L27K73j274l82K570m07
$$ 2318 854 -706 664 1648 -162 -1228 -1113 -2044 -1994 -492 116 443 716 -558 -940 1630 1223
1290A223k701p52K53m7J343J061l16j2J174j35M43R94j884k362Q26J405l53M9
$$ 1223 -1478 -2230 -1977 -2024 -681 380 64 52 1226 1091 1534 2528 644 -1718 -892 513 160 209
1308B09k62m27J470J211p59o18O5j485j266J481M88q36l9P52N98K105J115j889
$$ 209 -53 -480 990 2201 1442 824 889 -596 -1862 -381 107 -729 -768 -16 582 2687 3802 1913
1326A913p79M76q66o4L89j526q37J078Q75K00R54p24j965L28J213j045q83r8j84
$$ 1913 1134 1610 744 680 1069 -457 -1294 -216 659 859 1813 1089 -876 -548 665 -380 -1263 -1361 -1545
1345a545L16K174Q17k71R00m42o89J162k0k332j167j00P5J230R18j714l68J493
$$ -1545 -1229 945 1762 1491 2391 1949 1260 2422 2402 70 -1097 -1197 -1122 108 1026 -688 -1056 437
1363D37K45n71L73r41j573k0J271M50O61j4q50R24K094q57j153L58j888p84J113
$$ 437 682 111 484 -457 -2030 -2050 -779 -329 332 318 -532 392 2486 1629 476 834 -1054 -1838 -725
1382g25L62j341P52M08J76J709J276j826j143O33J72k77n54j77j091J357M02L
$$ -725 -363 -1704 -952 -544 -368 1341 2617 791 -352 281 453 176 -378 -555 -1646 -289 113 116
1400A16J449j90k302n57J985m54j408l57k64L78K180R03m54N31J61j228Q13P76
$$ 116 1565 1375 -927 -1484 501 47 -1361 -1718 -1982 -1604 576 1479 1025 1556 1717 489 1302 2078
1418B078k229j369K41M02R21Q60j524k0J306J50r59N00K0k132l92J556M85O08
$$ 2078 -151 -1520 -1279 -877 44 904 -620 -640 666 816 -143 357 377 -1755 -2147 -591 -106 502
1436E02r3j078J328J930l51j736l30o17j376Q25O92q79J57L38j59J769J300j519
$$ 502 409 -669 659 2589 2238 502 172 -445 -1821 -996 -304 -1183 -1026 -688 -847 922 2222 703
1454G03k068R28O05q89K61k00q10P37R54J34J569K42k022o14J078k01j514l00
$$ 703 -1365 -437 168 -721 -460 -660 -1470 -733 221 355 1924 2166 144 -470 608 407 -1107 -1407
1472a407Jo5J744N38o64L81m29p77M80N72j404j015M69M07P17J498m01p91J297
$$ -1407 -1406 -1471 273 811 147 528 99 -678 -198 374 -1030 -2045 -1576 -1169 -452 1046 645 -146 1151
1491A151O08j055O36n72j838l69J402R8k56O56j080L36J717k09j520k42n65p74
$$ 1151 1759 704 1340 768 -1070 -1439 -37 61 -195 461 -619 -283 1434 1225 -295 -537 -1102 -1876
1509a876J090L94l98n2J280K29M41J352p44j769j57K18o81K59k35o52L85J135
$$ -1876 -786 -392 -790 -842 438 667 1108 2460 1716 -53 -210 8 -673 -414 -649 -1301 -916 219
1527B19O01P3L03j498j40J346m84p61l05n6j51J757M79o80k37Q68r29k73O6q51
$$ 219 820 893 1196 -302 -442 904 420 -341 -646 -702 -853 904 1383 703 466 1334 405 132 198 -653
1547f53j200N1M78Q88J279k45q93P23J498q80l93k77j417l81J369oJ23N49m89
$$ -653 -1853 -1802 -1324 -436 843 598 -295 428 1926 1046 653 376 -1041 -1422 -53 -59 64 613 124
1566A24m43J135R39j650o51m65m91O51N66m84K67J033m65R77J035m38k062j49
$$ 124 -319 816 1755 105 -546 -1011 -1502 -851 -285 -769 -502 531 66 1043 2078 1640 -422 -571
1584e71K34l39K69m68n11O46Q63k8N01J95q68r83J023R7q90K39n18N94J311J074
$$ -571 -337 -676 -407 -875 -1386 -740 123 95 596 791 -77 -1060 -37 60 -830 -591 -1109 -515 796 1870
1604A870j050k61O79q57o19O02n35j377K17j12J066R18j7j300R18J410q16l17
$$ 1870 820 559 1238 381 -238 364 -171 -1548 -1331 -1443 -377 541 524 -776 142 1552 736 419
1622D19l78r46j47Q29K62L64P76n75m37J178Q18j308j355O27r69L73Q15q22lJ242
$$ 419 41 -905 -1052 -223 39 403 1179 604 167 1345 2163 855 -500 127 -842 -469 346 -476 -479 763
1642G63l92L70J023n00j585l84P52j59j73L26q40R09P49J28M05j78q86q86Q45
$$ 763 371 741 1764 1264 -321 -705 47 -112 -285 41 -799 110 859 987 1392 1214 328 -558 287
1661B87O2o11m45R6l0J070O63n27k27L39k47n08K66o40p18K33N44L74Q71J2q45
$$ 287 349 -262 -707 -611 -641 429 1092 565 338 677 430 -78 188 -452 -1170 -937 -393 -19 852 864 19
1682A9N02N56n19n75j29j215l60Q15M65l3K22k70m15J092J032j330p33L39o28
$$ 19 521 1077 558 -17 -146 -1361 -1721 -906 -441 -474 -252 -522 -937 155 1187 -143 -876 -537 -1165
1701a165N63Q54m55j39O15P59l27N97k57j611k21P69j037L30K9l27L65J099L67
$$ -1165 -602 252 -203 -342 273 1032 705 1302 1045 -566 -787 -18 -1055 -725 -696 -1023 -658 441 808
1720H08m28J14Or80L68J39n00j51Om1J113N93l90n08q9k0j95J15p51n93N42N17
$$ 808 380 494 500 -480 -112 27 -473 -624 -618 -659 454 1047 657 149 60 40 -155 -40 -791 -1384 -842 -325
1742c25j47J201L50m24k07N75k27q90J37j082n82J097J55j57J98N56p39M68N59
$$ -325 -472 729 1079 655 448 1023 796 -94 43 -1039 -1621 -524 -369 -526 -328 228 -511 -43 516
1761E16o91q84Q7m2p5Q42O6o42J203M47j10K25M1j443q70K80M9j2M43o10J9J634
$$ 516 -175 -1059 -972 -1014 -1089 -247 -181 -823 380 827 717 942 983 -460 -1330 -1050 -1001 -1013 -570 -1180 -1161 473
1783D73K06j23j63l49o87m6O37n72j82L08J60O49J077j76j036j5L0p31J65j68
$$ 473 679 556 393 44 -643 -689 -52 -624 -806 -498 -338 311 1388 1212 176 161 191 -540 -375 -543
1803e43r46N49L39M57M98P89n41n58J024k00p04l28j44o67R98P70j99J27J42r9
$$ -543 -1489 -940 -601 -144 354 1143 602 44 1068 868 164 -164 -308 -975 23 793 594 721 863 764
1823G64j05P43q53p91o0l98M8R68j01p37R34M30m56M15P5j223m57N16J38o6L47
$$ 764 659 1402 549 -242 -302 -700 -652 316 215 -522 412 842 386 801 876 -347 -804 -288 -150 -216 131
1844A31o11N91R21P73o30k92l8j249L09L03p89L21l2j67K13J475n15o58J35k65
$$ 131 -480 111 1032 1805 1175 883 845 -404 -95 208 -581 -260 -292 -459 -246 1229 714 56 191 -74
1864g4m67L45K2q21q9J120L18K40L73l62l90K55K25j222J30k67p30M26J123j66
$$ -74 -541 -196 -174 -995 -1084 36 354 594 967 605 215 470 695 -527 -397 -664 -1394 -968 155 -11
1884a1P8N10o3n3M77k99j080m8j62q6O43O28q49N38L55kN3j35p89p66K87N18l4
$$ -11 67 577 514 461 938 639 -441 -489 -651 -737 -94 534 -315 223 578 576 629 494 -295 -1061 -774 -256 -290
1907b90K11Q0j05R52L24j68l75l58m95j25O88j115K69J85K32l36J453l49o82J59
$$ -290 -79 1 -104 848 1172 1004 629 271 -224 -349 339 -776 -507 -322 -90 -426 1027 678 -4 155
1927A55j75r2n9L02p35j33J142J28K64K20k16m10K11k95o96p2o60m51O37P75n9
$$ 155 -20 -112 -171 131 -604 -737 405 533 797 1017 801 391 602 307 -389 -461 -1121 -1572 -935 -160 -219
1948b19r8L92o7j31J073l38j285K72k67N99K78M43o27J67N78L4j64k42r29p65
$$ -219 -317 75 8 -123 950 612 -673 -401 -668 -69 209 652 25 192 770 804 640 398 -531 -1296
1968a296O40j63k7O09n4q10R48R03m74l09O4p16J13L44j33k49K75K44L24Q13N4
$$ -1296 -656 -819 -846 -237 -291 -1101 -153 750 276 -33 31 -685 -572 -228 -361 -610 -335 -91 233 1046 1100
1989A100r75k4j63p8n0N8q16M35M94M83n5K67Lj095M90j3l98l36K1o65P13J104
$$ 1100 125 101 -62 -140 -190 -132 -948 -513 -19 464 409 676 679 -416 74 61 -337 -673 -652 -1317 -604 500
2011E00j15K18j35n0j76N37j75j022p2k00J09O38L92n56J32P62K41p44p7l68m86
$$ 500 385 603 468 418 242 779 604 -418 -490 -690 -581 57 449 -107 25 787 1028 284 207 -161 -647
2032f47K24j53M48Q8L80o72Q69O64m01m19l40p99K41L28P2n40L29M00K51M47j45
$$ -647 -423 -576 -128 -40 340 -332 537 1201 800 381 41 -758 -517 -189 -117 -657 -328 72 323 770 625
2053F25m92m28O89n23m14L88n35j68R09K31j26M82p5n62J79J32l70k72J68r14
$$ 625 133 -295 394 -129 -543 -155 -690 -858 51 282 156 638 563 1 180 312 -58 -330 -162 -1076
2073a076M38R60J90J5M0j85K2P9r0r39l72L90l91L89P00n23J43N86P6n48L89m8
$$ -1076 -638 322 512 527 567 382 404 483 393 -546 -918 -528 -919 -530 170 -353 -210 376 452 -96 293 245
2095B45j012J94O08k15K80L14k29L83N36m21m63n00j94l98P32k33k57L13K58J93
$$ 245 -767 -573 35 -180 100 414 185 568 1104 683 220 -280 -474 -872 -140 -373 -630 -317 -59 134
2115A34k1N43m92R5J76p07J10o9K36m62N88L05j88M29J02q15j76K22j00o02J48
$$ 134 113 656 164 259 435 -272 -162 -231 5 -457 131 436 248 677 779 -36 -212 10 -90 -692 -544
2136e44N2K17N55J96j48K21K57j82l91J37p65q9K91k84L93Q39n14k11M45R7l81
$$ -544 -492 -275 280 476 328 549 806 624 233 370 -395 -484 -193 -477 -84 755 241 30 475 572 191
2157A91P8o52o43M30M97K32m1L89l79J13R50m86m83J38m94m00L10M58q59K29Q01
$$ 191 269 -383 -1026 -596 -99 133 92 481 102 215 1165 679 196 334 -160 -560 -250 208 -651 -422 379
2178C79J40l5M49n84m31l4j03P5k53J7k39N17M66J99k76K16p38N3K31l08o75N05
$$ 379 519 484 933 349 -82 -116 -219 -144 -397 -380 -619 -102 364 563 287 503 -235 -182 49 -259 -934 -429
2200d29k3J29M60M24j07J83r2m12K58j33o70k77N43k03J31O72l3j36N4L0J50j35
$$ -429 -452 -323 137 561 454 637 545 133 391 258 -412 -689 -146 -349 -218 454 421 285 339 369 519 384
2222C84m37r06L38L58J96l00N87M3M32Qn59j93K00j95l44J22L97l84J51K84N40
$$ 384 -53 -959 -621 -263 -67 -367 220 263 695 703 144 -49 151 -44 -388 -266 131 -253 -102 182 722
2243G22n0L84n74p51J28l3k28k1J50o34O66O60m54J77J64l20m62M21n31j35J15
$$ 722 672 1056 482 -269 -141 -174 -402 -423 -273 -907 -241 419 -35 142 306 -14 -476 -55 -586 -721 -606
2264f06K75m04Q73J10K84j54j86n77K37pl87p61M37L05K0M02K5k90N53L01k12
$$ -606 -331 -735 138 248 532 378 192 -385 -148 -155 -542 -1303 -866 -561 -541 -139 -114 -404 149 450 238
2285B38m97o7j88l36R60m08J96M95m1l14L27k83j90l29l62j89N68K17l74K85L89
$$ 238 -259 -326 -514 -850 110 -298 -102 393 352 38 365 82 -108 -437 -799 -988 -420 -203 -577 -292 97
2306I7J59N41k74p2q24kL88m08L5J79l5M26J52j00J49p2j31m30M25k87n24K16
$$ 97 256 797 523 451 -373 -375 13 -395 -360 -181 -216 210 362 262 411 339 208 -222 203 -84 -608 -392
2328c92J85n0O18K96k47j28j08l14M51k22n28o47P37L07k4mO5M11P2L59o86r8
$$ -392 -207 -257 361 657 410 282 174 -140 311 89 -439 -1086 -349 -42 -66 -70 -5 406 478 837 151 53
2350E3r3Mp58O30m6K26M95j06r6J22N9n57l80l06j4M23N00m46j83P94j37J56L55
$$ 53 -40 -36 -794 -164 -210 16 511 405 309 431 490 -67 -447 -753 -767 -344 156 -290 -473 321 184 340 695
2373F95m91k64R3J33q54L69Q3j9RN84O3l1M49q35k82O9M17o07j41N35J78O08p3
$$ 695 204 -60 33 166 -688 -319 -236 -255 -246 338 401 370 819 -16 -298 -229 188 -419 -560 -25 153 761 688
2396F88j55k50QK69l83l96j05n43R68m36J95N59k33K95l69PP5n12L00n54l5Q65
$$ 688 533 283 291 560 177 -219 -324 -867 101 -335 -140 419 186 481 112 119 194 -318 -18 -572 -607 258
2418B58L9j18k1J35J58J62J01p26l09O03n81J4L65O9J67K59j64j66Q7Mn79K43
$$ 258 297 179 158 293 451 613 714 -12 -321 282 -299 -285 80 149 316 575 411 245 332 336 -243 0
2440@l30k90j11M32j10L43M17k35N35m70l80j64N41j03m87j32L88R7L29K64Q3
$$ 0 -330 -620 -731 -299 -409 -66 351 116 651 181 -199 -363 178 75 -412 -544 -156 -59 270 534 617
2461F17m63O8K2n34O0J04o63M23J07J09M57K7J1j56J35k32j25m27Q5j03J74M82
$$ 617 154 222 244 -290 -230 -126 -789 -366 -259 -150 307 334 345 189 324 92 -33 -460 -375 -478 -304 178
2483A78m35L15p0J76L9J9k64n46L53jl41M12J67K35J49L6p2K15l2j029J98l2l06
$$ 178 -257 58 -12 164 203 222 -42 -588 -235 -236 -577 -165 2 237 386 422 350 565 533 -496 -298 -330 -636
2506f36K91K98j08j90O33J29n9k14r1l52k80K93j60P0M90J88l69O09Q3o06m9j74
$$ -636 -345 -47 -155 -345 288 417 358 144 53 -299 -579 -286 -446 -376 114 302 -67 542 625 19 -30 -204
2528b04j93K08j60j36m7M90K01J74O5o05M74J84j61j72l34M6k29M51j37j44K82
$$ -204 -397 -189 -349 -485 -532 -42 159 333 398 -207 267 451 290 118 -216 -170 -399 52 -85 -229 53
2549E3L60k77rp3p3k55m3j17j2M23p4L82q7N36l85P2J32j243J16P75p7m16O0N38
$$ 53 413 136 127 54 -19 -274 -317 -434 -446 -23 -97 285 198 734 349 421 553 -690 -574 201 124 -292 -232 306
2573C06l82M29L26l88l10N0l05j55L88k74K80Q4O9l48O63j78j32l76L25j10j1
$$ 306 -76 353 679 291 -19 31 -274 -429 -41 -315 -35 49 118 -230 433 255 123 -253 72 -38 -49
2594d9k11j60L36K93j50n9K24m0J03J80m33j57p3j11j93L48J03K42J7L43p56L24
$$ -49 -260 -420 -84 209 59 0 224 184 287 467 34 -123 -196 -307 -500 -152 -49 193 210 553 -203 121
2616A21OJ34k93m11j28L75N60n2j45o2J97l9j69l17k32J70Q8l08L5L05J12M42
$$ 121 127 261 -32 -443 -571 -196 364 312 167 105 302 263 94 -223 -455 -285 -197 -505 -470 -165 -53 389
2638C89m10P17j72J35l43l58j14L69n72M25k47J63L11K90k81m38L4J13l21K78
$$ 389 -21 696 524 659 316 -42 -156 213 -359 66 -181 -18 293 583 302 -136 -102 11 -310 -32
2658c2m6l99M23J30J06j72L84Q4k53l4j29m17K96j29m7k04M99PM14j69p6j38O40
$$ -32 -78 -477 -54 76 182 10 394 478 225 191 62 -355 -59 -188 -235 -439 60 67 481 312 236 98 738
2681G38p76l83kK06N5M75k52j31J72L12k88o9Q0r7n54R0j29L61M5J72j07J66K34
$$ 738 -38 -421 -423 -217 -162 313 61 -70 102 414 126 57 137 40 -514 -424 -553 -192 -147 25 -82 84 318
2704C18k01j20J59k7l95N21m61j50M16L31o7M7r2o8k38K66n98R6K50k61j75M73
$$ 318 117 -3 156 129 -266 255 -206 -356 60 391 324 371 279 211 -27 239 -359 -263 -13 -274 -449 24
2726B4L37P9K11j78p06K1L61n02J75k99J77k56P24K24k07L46R7m56J10l14o00
$$ 24 361 440 651 473 -233 -212 149 -353 -178 -477 -300 -556 168 392 185 531 628 172 282 -32 -632
2747f32L60O55o06L04L26k64M60j14k79k18M24l72n58J77q5K18K60j0J89o7M04
$$ -632 -272 383 -223 81 407 143 603 489 210 -8 416 44 -514 -337 -422 -204 56 46 235 168 572
2768E72p30L56o70J20Q2K5k78L88L02jJ64L66o31k10J23J6n87Q6K47j21J24L36
$$ 572 -158 198 -472 -352 -270 -245 -523 -135 167 166 330 696 65 -145 -22 -6 -593 -507 -260 -381 -257 79
2790G9K21k65N02k78k25k31J34m40J80j34J76j98Q03k89j16J93N28n26N7k58m76
$$ 79 300 35 537 259 34 -197 -63 -503 -323 -457 -281 -479 324 35 -81 112 640 114 171 -87 -563
2811e63M91k36L61k66K74j8l5M18k32j15n2k81L6Q8L21m05J86K09JJ42J32j20
$$ -563 -72 -308 53 -213 61 43 8 426 194 79 27 -254 -218 -130 191 -214 -28 181 182 324 456 336
2833C36l67n4k58j2j26K47j71K98L12k66L60j17J08m72K41j84j39L06O4m49K86
$$ 336 -31 -85 -343 -355 -481 -234 -405 -107 205 -61 299 182 290 -182 59 -125 -264 42 106 -343 -57
2854e7L26L56l83k10O8j49j95R1j68r7M22M8j97L03L78j28l31J38j82K12k94j52
$$ -57 269 625 242 32 100 -49 -244 -153 -321 -418 4 52 -145 158 536 408 77 215 33 245 -49 -201
2876b01j84q3M25M28l49K01J38k26m37O4k01j35M07kQ7L55r6R0q0L78pq02N89
$$ -201 -385 -468 -43 385 36 237 375 149 -288 -224 -425 -560 -153 -155 -68 287 191 281 201 579 572 -230 359
2899C59q2q00JM43M3J3L04m12N11L50o31j61n5m19M62J8l4J52k5L43l65M42j50
$$ 359 277 -523 -522 -79 -36 -23 281 -131 380 730 99 -62 -117 -536 -74 -56 -90 62 37 380 15 457 307
2922C07m9l45K40l52j67J62r4m7M81oJ00L7k94k17L70j27j85j1J40j54L41L62
$$ 307 258 -87 153 -199 -366 -204 -298 -345 136 130 230 267 -27 -244 126 -1 -186 -197 -57 -211 130 492
2944D92k74j87m4L98m26J98m73j75Q5L29J56R6j27J27p4J69q1l52M82l04l60L38
$$ 492 218 31 -13 385 -41 157 -316 -491 -406 -77 79 175 48 175 101 270 189 -163 319 15 -345 -7
2966gN7k21L25J99J13J22k54O2l53k35J72k48J52j27K57j26K28J4K10m52j26R5
$$ -7 50 -171 154 353 466 588 334 396 43 -192 -20 -268 -116 -243 14 -112 116 130 340 -112 -238 -143
2988a43N0l02J05K3J47K77r1K14K76l35J7n25J13K23k43j91l6j01M55K78j39n4
$$ -143 -93 -395 -290 -267 -120 157 66 280 556 221 238 -287 -174 49 -194 -385 -421 -522 -67 211 72 18
3010A8L47P1p64J95q4j29k90Q43K2j91k02N24k32J12o03K5p3K10J11m26M03j10
$$ 18 365 436 -328 -133 -217 -346 -636 207 229 38 -164 360 128 240 -363 -338 -411 -201 -90 -516 -113 -223
3032b23K66J84J55k66K69j51k67L42o78j26M31J07K30l63J21J18N7n3j42l36J5
$$ -223 43 227 382 116 385 234 -33 309 -369 -495 -64 43 273 -90 31 149 206 153 11 -325 -310
3053c10M9OJ79J53k7K00P9n7j5K3n70J18J3j39K27j33J81p0P1O16l25l43j29K96
$$ -310 -261 -255 -76 77 50 250 329 272 257 280 -290 -172 -159 -298 -71 -204 -23 -93 -22 594 269 -74 -203 93
3077I3l32n8m7j05L79j07J95M89k54m0K66l27Q4m13j64j80J85L69j69L95K4j26
$$ 93 -239 -297 -344 -449 -70 -177 18 507 253 213 479 152 236 -177 -341 -521 -336 33 -136 259 283 157
3099A57j62j84J28J26n4L91m02j81M15j04P4K85l49J19k48q2j20J09p9j73J45
$$ 157 -5 -189 -61 65 11 402 0 -181 234 130 204 489 140 259 11 -71 -191 -82 -161 -334 -189
3120a89P26l49k5q8L34l28r1k55L59j07k40O0O8K07m8L95r8k35Mj05j50j67j00
$$ -189 537 188 163 75 409 81 -10 -265 94 -13 -253 -193 -125 82 34 429 331 96 100 -5 -155 -322 -422
3143d22J41J0L22l07K90L32J3j68R6m2n13J04j48L29j90K8pm1J63L04j61M8j38
$$ -422 -281 -271 51 -256 34 366 379 211 307 265 -248 -144 -292 37 -153 -125 -132 -173 -10 294 133 181 43
3166D3k86p2j50K08M6L88l6K08M1j8k81J66k01l86L31n36O73k27P5p9J53K24p0
$$ 43 -243 -315 -465 -257 -211 177 141 349 390 372 91 257 56 -330 1 -535 138 -89 -14 -93 60 284 214
3189B14j79k22L68l20j80r3k96O47j5j43L40L0j55P6K7j82j91J94j76L97p7R2
$$ 214 35 -187 181 -139 -319 -412 -708 -61 -76 -219 121 151 -4 72 99 -83 -274 -80 -256 141 64 156
3211A56N3K16k30J97k04q1j12j13K58k74n8L49p6O2R8J36j47o6n5l17k13j9l7
$$ 156 209 425 195 392 188 107 -5 -118 140 -134 -192 157 81 143 241 377 230 164 109 -208 -421 -440 -477
3234d77M33k28K14K96q3k14K67J88k41q63M94L89l25j66N10L1j85L34j64n0K13
$$ -477 -44 -272 -58 238 155 -59 208 396 155 -708 -214 175 -150 -316 194 225 40 374 210 160 373
3255C73p37J45j22M41l07K26j94L48J68m29L23l09J34O0l52L73p0j77J20m2N9
$$ 373 -364 -219 -341 100 -207 19 -175 173 341 -88 235 -74 60 120 -232 141 71 -106 14 -28 31
3276C1k02N26k60J03k57k28p0J67J87j29J82n2L6K86j24M6r9K37l70j81l91M31
$$ 31 -171 355 95 198 -59 -287 -357 -190 -3 -132 50 -2 34 320 196 242 143 380 10 -171 -562 -131
3298a31M6MJ90L10l31l8N6j08n9k10J10n1N6k07N33r2P9k5L86p81M56l07o0O6
$$ -131 -85 -81 109 419 88 50 106 -2 -61 -271 -161 -212 -156 -363 170 78 157 132 518 -263 193 -114 -174 -108
3322a08J34j68J08K70l47K50M51o82K70o3l83p0J79p1l12K46J72j12M27j36K4
$$ -108 26 -142 -34 236 -111 139 590 -92 178 115 -268 -338 -159 -230 -542 -296 -124 -236 191 55 79
3343G9ln6l04J0L79k6k08L16J21m39N63r7r4m25L44Mo13L23N6k9M16p3q1nR1k12
$$ 79 76 20 -284 -274 105 79 -129 187 308 -131 432 335 241 -184 160 164 -449 -126 -70 -99 317 244 163 158 249 37
3369C7k62N7l4O7n3J44k86O56p5j13p0K72m76j20J97rp1j52K87j29M39p3J28N2
$$ 37 -225 -168 -202 -135 -188 -44 -330 326 251 138 68 340 -136 -256 -59 -68 -139 -291 -4 -133 306 233 361 413
3393D13l03J51k77j62O8l87K54K18J71k54P7Q3R9N6o8j90j21J10K71n41O3L15
$$ 413 110 261 -16 -178 -110 -497 -243 -25 146 -108 -31 52 151 207 139 -51 -172 -62 209 -332 -269 46
3415D6K7j62K47J02l31K22k61j42J86J12k64J40j42L82K27m22M16k96r8j69K00
$$ 46 73 -89 158 260 -71 151 -110 -252 -66 46 -218 -78 -220 162 389 -33 383 87 -11 -180 20
3436B0Lj31L36j16j38R2O9j02J91j89j38k49K07o5J0j1M49o2R0k10Q0l1R8j73
$$ 20 23 -108 228 112 -26 66 135 33 224 35 -103 -352 -145 -210 -200 -211 238 176 266 56 136 105 203 30
3460C0M1l74QJ46K68l00K13nK20j19j9j31q9O7l7JJ6J49P6M79m83r4J20L9o5k43
$$ 30 71 -303 -295 -149 119 -181 32 27 247 128 109 -22 -111 -44 -81 -80 -64 85 161 640 157 63 183 222 157 -86
3486h6K05l40J11j01J44j67L04n1L6K39l64j33K72j72p1O1M6j23j84Q07m01J66
$$ -86 119 -221 -110 -211 -67 -234 70 19 55 294 -70 -203 69 -103 -174 -113 -67 -190 -374 433 32 198
3508A98j55L66n38P5l52J78K58k56J04J39L41l96K06M3k11k01j6J16o6J59j18
$$ 198 43 409 -129 -54 -406 -228 30 -226 -122 17 358 -38 168 211 0 -201 -217 -101 -167 -8 -126
3529a26n4N63k80J98M0J81o20J16l46J32J00r1J10OK17J02l33K54j12K31k58J93
$$ -126 -180 383 103 301 341 522 -98 18 -328 -196 -96 -187 -77 -71 146 248 -85 169 57 288 30 223
3551B23q60N13k42J05J93J14J23j26K11j20j66j13K77j59q3k42M28k72K73j57
$$ 223 -637 -124 -366 -261 -68 46 169 43 254 134 -32 -145 132 -27 -110 -352 76 -196 77 -80
3571h0J30J93j14j71j46K46m12K18k43O58m23M0K99l8n1K05o51j4K63J72k20J53
$$ -80 50 243 129 -42 -188 58 -354 -136 -379 279 -144 -104 195 157 106 311 -340 -354 -91 81 -139 14
3593A4l51J89K82j63J85K5k71J25L9m62kL96j34j61M32r1M8k40L18j59r0Q3j35
$$ 14 -337 -148 134 -29 156 181 -90 35 74 -388 -390 6 -128 -289 143 52 100 -140 178 19 -71 12 -123
3616a23K6O0j81M31j31k26O00l45J11l42K6m91J50L46J83j92P8L02O1m84M20n65
$$ -123 -97 -37 -218 213 82 -144 456 111 222 -120 -94 -585 -435 -89 94 -98 -20 282 343 -141 279 -286
3638b86L45k61P7o9%R0J35J08N1J9J09j99m7j42mN5k27n0J30m8N01l11K54j3j07
$$ -286 59 -202 -125 -194 -194 -104 31 139 190 209 318 119 72 -70 -74 -19 -246 -296 -166 -214 287 -24 230 217 110
3663A10O1j33k94m3R0K06l1M2j1L1J74L07k04j83q1M5k78o8L17M8k32J99k49K72
$$ 110 171 38 -256 -299 -209 -3 -34 8 -3 28 202 509 305 122 41 86 -192 -260 57 105 -127 72 -177 95
3687I5l4j02J41k07q5oK4K6j58M14j81k56N54l64K25j07r4L30l52R9P9j54M41
$$ 95 61 -41 100 -107 -192 -198 -174 -148 -306 108 -73 -329 225 -139 86 -21 -115 215 -137 -38 41 -113 328
3710C28l78K65oo8k34j19M9o1J75J97l8L5kp3l48K77K92k02k75K36o39K79%M35
$$ 328 -50 215 209 141 -93 -212 -163 -224 -49 148 110 145 143 70 -278 -1 291 89 -186 50 -589 -310 -310 125
3734A25j18N6J7k58K74k90O1k01O9N2R5PJ21J63O4l28L45N7j63j98J11K32l43
$$ 125 7 63 80 -178 96 -194 -133 -334 -265 -213 -118 -111 10 173 237 -91 254 311 148 -50 61 293 -50
3757e0j84L92J88j94L20k43Kq2l40M1O4k10K92j54L96k63%J70j07j73K16l24J70
$$ -50 -234 158 346 152 472 229 231 149 -191 -150 -86 -296 -4 -158 238 -25 -25 145 38 -135 81 -243 -73
3780g3mP9l88J96K66M1M4Mr8J65n6k73J98q2j39L9J17k36M97j72J9j69K65m40
$$ -73 -77 2 -386 -190 76 117 161 165 67 232 176 -97 101 19 -120 -81 36 -200 297 125 144 -25 240 -200
3804b00P2L7j95K32j25J4K04R4j05K57l41K65j71Qj15J63j33j34j77K12K51RN0
$$ -200 -128 -91 -286 -54 -179 -165 39 133 28 285 -56 209 38 46 -69 94 -39 -173 -350 -138 113 122 172
3827A72K4L0m24k35M61j86j84L46N3K12l74J49M87o46O2k51O7L7qK42j33K33L20
$$ 172 196 226 -198 -433 28 -158 -342 4 57 269 -105 44 531 -115 -53 -304 -237 -200 -208 34 -99 134 454
3850D54j59j46p9j06k4p5k65J09J1K12N2M8p1pj16O30k89l61j52pL06k65K24r0
$$ 454 295 149 70 -36 -60 -135 -400 -291 -280 -68 -16 32 -39 -46 -162 468 179 -182 -334 -341 -35 -300 -76 -166
3874a66J91R3q7J03n6P0M7l21oj6L42j31j12K33j82o2J44ro3p4l38K79j77M24
$$ -166 25 118 31 134 78 148 195 -126 -132 -148 194 63 -49 184 2 -60 84 75 12 -62 -400 -121 -298 126
3898A26j49k1J55m1r0l9nK84o11J95J6j66L46m8k7L12KQ0j42k46K06k91q7K27
$$ 126 -23 -44 111 70 -20 -59 -64 220 -391 -196 -180 -346 0 -48 -75 237 239 319 177 -69 137 -154 -241 -14
3922a4j62JJ72j51N98j67j78O6K5M7k71K44l95LQ6K0l1L30q6l78O11k76k31j06
$$ -14 -176 -175 -3 -154 444 277 99 165 190 237 -34 210 -185 -182 -96 -76 -107 223 137 -241 370 94 -137 -243
3946b43R0j91J47J59J63J78l04j8n6P5O3j0j79n1Q1J65p5Q8j63L3M5K91l13L44
$$ -243 -153 -344 -197 -38 125 303 -1 -19 -75 0 63 53 -126 -177 -96 69 -6 82 -81 -48 -3 288 -25 319
3970C19k74l15k91O36K42m59K59L21j71l73L72m25K18n02K33K98j36k82J26j1
$$ 319 45 -270 -561 75 317 -142 117 438 267 -106 266 -159 59 -443 -210 88 -48 -330 -204 -215
3990b15L13l0K7j97K0K57M0k26j64j11pM7L10j0M03l75r9K16j78k10M3m6J40q8
$$ -215 98 68 95 -102 -82 175 215 -11 -175 -286 -293 -246 64 54 457 82 -17 199 21 -189 -146 -192 -52 -140
4014a40M38n2j83p2J20Mj40j61L80j36k20K33L71o17M7P7L88k50k50P2j71L41
$$ -140 298 246 63 -9 111 115 -25 -186 194 58 -162 71 442 -175 -128 -51 337 87 -163 -91 -262 79
4036G9j32J39n5j97L93k01R1m7J19rj82N4r4k52J54j09J04K57M8m4J25K8l43L92
$$ 79 -53 86 31 -166 227 26 117 70 189 180 -2 52 -42 -294 -140 -249 -145 112 160 116 241 269 -74 318
4060C18l95jR2k0Q1l54J86K2Ok8L79q9k34P3j82j33L10j41K39jj40K81J5j30j85
$$ 318 -77 -78 14 -6 75 -279 -93 -71 -65 -93 286 197 -37 36 -146 -279 31 -110 129 128 -12 269 284 154 -31
4085c1J99n26k17M39j17K07m9L36Om79M68l33Lj14j01K22P3k3L93n25L88q6j5
$$ -31 168 -358 -575 -136 -253 -46 -95 241 247 -232 236 -97 -94 -208 -309 -87 -14 -37 356 -169 219 133 118
4108A18k03L93k09j53k8k6n5J26N5m1n8M11m87M96l14r7K70m30J02j67J94L11
$$ 118 -85 308 99 -54 -82 -108 -163 -37 18 -23 -81 330 -157 339 25 -72 198 -232 -130 -297 -103 208
4130B08k40K98j13n89Q06n67J88R2Kq6q6J23k01L04M27k00j54k57j03j53K13J6
$$ 208 -32 266 153 -436 370 -197 -9 83 85 -1 -87 36 -165 139 566 366 212 -45 -148 -301 -88 -72
4152g2l23L84J09j04Q5p8k39K22M4L6p0l3j26J88j3r9J78J6n5K8J65m74L68n81
$$ -72 -395 -11 98 -6 79 1 -238 -16 28 64 -6 -39 -165 23 10 -89 89 105 50 78 243 -231 137 -444
4176d44L14n0K29j60K41K16k43k01R9L55n02M30l49j71J22K76K2k53R3K18K17
$$ -444 -130 -180 49 -111 130 346 103 -98 1 356 -146 284 -65 -236 -114 162 184 -69 24 242 459
4197D59l28j27M8k05k72K43R4P5J38N6l02L14k22J20m0r2j75j97N00l0M16m38
$$ 459 131 4 52 -153 -425 -182 -88 -13 125 181 -121 193 -29 91 51 -41 -216 -413 87 57 473 35
4219C5q1K41l37L56r7K65k21k79N1P8n40P91m9j36r7l8O4M88m36o7j58J10Q9j55
$$ 35 -46 195 -142 214 117 382 161 -118 -67 11 -529 262 213 77 -20 -58 6 494 58 -9 -167 -57 32 -123
4243a23N1L1J65M1l3k39L08J64l37n7O5P3J90m73J48K66j2r7p2p1K13k87JK49
$$ -123 -72 -41 124 165 132 -107 201 365 28 -29 36 109 299 -174 -26 240 228 131 59 -12 201 -86 -85 164
4267A64m06M5K77N4l3l1j44K97n1k23L0J01l52K25J3J11r0O0Mj33M9J81k0n2k42
$$ 164 -242 -197 80 134 101 70 -74 223 172 -51 -21 80 -272 -47 -34 77 -13 47 51 -82 -33 148 128 76 -166
4292a66O4L32j79j43q5J69o9J02L4r7j57k16K31L36k76p9m0L78k3J43l05N1j28
$$ -166 -102 230 51 -92 -177 -8 -77 25 59 -38 -195 -411 -180 156 -120 -199 -239 139 116 259 -46 5 -123
4315a23j12nL36l29L14k6n4O1J50j41k37J31r6J22Q2k34k9M3p9J94K45l00K06
$$ -123 -235 -240 96 -233 81 55 1 62 212 71 -166 -35 -131 -9 73 -161 -190 -147 -226 -32 213 -87 119
4338A19J60q8l21J07J55o01N66m8N2j53J1K22j90j50J60J97l83L06k9j83J19J71
$$ 119 279 191 -130 -23 132 -469 97 49 101 -52 -41 181 -9 -159 1 198 -185 121 92 -91 28 199
4360A99J1k38J6J97l4L2o5J71j76l30o1K26k01L42j6M3j9j35K36j23j6k47J80
$$ 199 210 -28 -12 185 151 183 118 289 113 -217 -278 -52 -253 89 73 116 97 -38 198 75 59 -188 -8
4383hj07j18J30K30o4PK51l24p2l83L75K83m72K40k00M02j43j12J07J6J06m2l49
$$ -8 -115 -233 -103 127 63 70 321 -3 -75 -458 -83 200 -272 -32 -232 170 27 -85 22 38 144 102 -247
4406b47k7K44k37K95k31J87O6K69l04K2k7K05o29J55M03k66J83R0m41K81L12k46
$$ -247 -274 -30 -267 28 -203 -16 50 319 15 37 10 215 -414 -259 144 -122 61 151 -290 -9 303 57
4428E7m8n22N86k41J38K00j47J97j96o8j69M67j60j16J79j16k0j9k01K92k09J03
$$ 57 9 -513 73 -168 -30 170 23 220 24 -44 -213 254 94 -22 157 41 21 2 -199 93 -116 -13
4450a3N32l75J94n91M10k26j52K56j76m4K16R6N9o0PJ8k05OK18j33j82RO7N3P3
$$ -13 519 144 338 -253 157 -69 -221 35 -141 -185 31 127 186 126 133 151 -54 -48 170 37 -145 -136 -69 -16 57
4475E7Q9j83J04K00k42k41K02j16m4K40K79l72L8L70K1o59K73l24K42O1k2n5l00
$$ 57 146 -37 67 267 25 -216 -14 -130 -174 66 345 -27 11 381 402 -257 16 -308 -66 -5 -27 -82 -382
4498c82L84j97j33M23j60rL39o07K2K58m8j06L03j21J04k35Q0K36P4P7k98o3p0
$$ -382 2 -195 -328 95 -65 -74 265 -342 -320 -62 -110 -216 87 -34 70 -165 -85 151 225 302 4 -59 -129
4521a29J43P5j98kK17K85j80j38J22l27p4K41k6k35j55L20q1M6K01n6k14L95k32
$$ -129 14 89 -109 -111 106 391 211 73 195 -132 -206 35 9 -226 -381 -61 -142 -96 105 49 -165 230 -2
4544bl63L01P3L2k63M07j4l41K4K7K46J57O5n81J31N5q5J40K60m92J79J07j89
$$ -2 -365 -64 9 41 -222 185 171 -170 -146 -119 127 284 349 -232 -101 -46 -131 9 269 -223 -44 63 -126
4567a26K40K17l48j33L12K9l40M60m32K50P2q1O9l74J10j08L71qn77K52Q3J30
$$ -126 114 331 -17 -150 162 191 -149 311 -121 129 201 120 189 -185 -75 -183 188 180 -397 -145 -62 68
4589F8J05l3J6K80j44n54K73q3J37j05J89m01j2N66l49O7j00Jj54O6L0K99l94
$$ 68 173 140 156 436 292 -262 11 -72 65 -40 149 -252 -264 302 -47 20 -80 -79 -233 -167 -137 162 -232
4612b32MK00K87k10J23Q3ok02m3K4l08K72n7J22j72L56J7j94J19j62J54l02j32
$$ -232 -228 -28 259 49 172 255 249 47 4 28 -280 -8 -65 57 -115 241 258 64 183 21 175 -127 -259
4635b59P4J33J52l71oL35J29k79K36J61l58K23m3O3j79Qj66M87k18P9j06j70K59
$$ -259 -185 -52 100 -271 -277 58 187 -92 144 305 -53 170 127 190 11 19 -147 340 122 201 95 -75 184
4658A84N7n07L33Qq0J89j10J76m9l57rJ59k9K8l37R9L78l73K42o8r4L07K15o7
$$ 184 241 -266 67 75 -5 184 74 250 201 -156 -165 -6 -35 -7 -344 -245 133 -240 2 -66 -160 147 362 295
4682B95l08N14p52L65j7j24N7J69l93K96j95qK06p9K52m82J87r1m5K88k17l3J08
$$ 295 -13 501 -251 114 97 -27 30 199 -194 102 -93 -101 105 26 278 -204 -17 -108 -153 135 -82 -115 -7
4705gM5M7M4l03J77j57K32r9l19K06j90M84q0O4o4J3J26k21j17o5P2k00J63L47
$$ -7 38 85 129 -174 3 -154 78 -21 -340 -134 -324 160 80 144 80 93 219 -2 -119 -184 -112 -312 -149 198
4729A98n42M54N8N2j5l8k07N3q6j18J16K04l64Q5L03nm92K07K62k11K3k8rK2r
$$ 198 -344 110 168 220 205 167 -40 13 -73 -191 -75 129 -235 -150 153 148 -344 -137 125 -86 -63 -91 -100 -78 -87
4754h7J3k06L91q5J93l08NM31o85J74K58k78N69m28k1K55o06L85K56l29k08J30
$$ -87 -74 -280 111 26 219 -89 -84 347 -338 -164 94 -184 385 -43 -64 191 -415 -30 226 -103 -311 -181
4776a81Q6J20p7L53m12k01O24j60j96lj2O3O8J4p5k9K36l7m13L89K28k35L6l85
$$ -181 -95 25 -52 301 -111 -312 312 152 -44 -47 -59 4 72 86 11 -18 218 181 -232 157 385 150 186 -199
4800a99J47J64l62M92m00K56p2K43p5p2j58o9N34l25j66K5j41M02k83pm2O0O5
$$ -199 -52 112 -250 242 -158 98 26 269 194 122 -36 -105 429 104 -62 -37 -178 224 -59 -66 -108 -48 17
4823A7K23m16M4J57j04K51q3p5N09j75l68J48l73K85j72p5J86o7R8K52O4l68J1
$$ 17 240 -176 -132 25 -79 172 89 14 523 348 -20 128 -245 40 -132 -207 -21 -88 10 262 326 -42 -31
4846c1M33j30j90m8J59k99p3J16N1l28L27J65j97j35J49K02l01K71k48k2n3K43
$$ -31 402 272 82 34 193 -106 -179 -63 -12 -340 -13 152 -45 -180 -31 171 -130 141 -107 -129 -182 61
4868F1j27J46L2J08k04k41N8J05KJ1L9pk88P39k81J52k56n6J76k56J11N4k54O1
$$ 61 -66 80 112 220 16 -225 -167 -62 -60 -49 -10 -17 -305 434 153 305 49 -7 169 -87 24 78 -176 -115
4892a15J04k49L54l05L05n7p7j35N1P6k38N6Q6L91o20N13k81j08N73m04J26Q2
$$ -115 -11 -260 94 -211 94 37 -40 -175 -124 -48 -286 -230 -144 247 -373 140 -141 -249 324 -80 46 128
4914A28l68J93O2k98K07J20J1j70L80m98L63j25Q4o6n5j52J41q9k33L77P1k78
$$ 128 -240 -47 15 -283 -76 44 55 -115 265 -233 130 5 89 23 -32 -184 -43 -132 -365 12 83 -195
4936a95J74J55j57J35j2l11Q9m5q0M43k4k88pK81k61K82k23K12L3m11j64K23K29
$$ -195 -21 134 -23 112 100 -211 -122 -167 -247 196 172 -116 -123 158 -103 179 -44 168 201 -210 -374 -151 78
4959G8k66M85m6j12k14j75J90j89j36M59M2k77j53R6L08k36L15n0K83o72J52K50
$$ 78 -188 297 251 139 -75 -250 -60 -249 -385 74 116 -161 -314 -218 90 -146 169 119 402 -270 -118 132
4981A32l47P7P8L58j39j72J98Q1Q0k82kn39L11Q8p8q0K91Q8J9o6r4M5qJ82k32
$$ 132 -215 -138 -60 298 159 -13 185 266 346 64 62 -477 -166 -78 -156 -236 55 143 162 96 2 47 39 221 -11
5006a1J21p9P8j71M15l5l85J03k36L55m6kk61K81Q8l20o4l3M29l28L15J6k27J68
$$ -11 110 31 109 -62 353 318 -67 36 -200 155 109 107 -154 127 215 -105 -169 -202 227 -101 214 230 3 171
5030A71l09k49L24J49J37l08j30M30k73p4M24j44m28l0M54K22o29K70K55N9Nj70
$$ 171 -138 -387 -63 86 223 -85 -215 215 -58 -132 292 148 -280 -310 144 366 -263 7 262 321 326 156
5052A56o8j17m6k9o3J46L08l87M00l16k86M16k14j65J47p3J4N1J28j19J62p1N7
$$ 156 88 -29 -75 -104 -167 -21 287 -100 300 -16 -302 114 -100 -265 -118 -191 -177 -126 2 -117 45 -26 31
5075C1J01Q9q4j4j07K49l82L48l23J49k01j95L97J98o26J88L63o9J35o44L67K48
$$ 31 132 221 137 123 16 265 -117 231 -92 57 -144 -339 58 256 -370 -182 181 112 247 -397 -30 218
5097B18k90P4m6O2p3J43K3l29J4J70j30J21q4k0o4J25J00n8K72J35j92n08L26
$$ 218 -72 2 -44 18 -55 88 111 -218 -204 -34 -164 -43 -127 -147 -211 -86 14 -44 228 363 171 -337 -11
5120a1j41K40k1L8j96J98j32J98K8j38M2j22K31j11j43l0J65J55j71j51J7P7J
$$ -11 -152 88 67 105 -91 107 -25 173 201 63 105 -17 214 103 -40 -70 95 250 79 -72 -55 22 23
5143B3j79K49P1m03O2l3L34j19N8P9j88p1K45o1J73m56M7J50l4J70k88J55K73
$$ 23 -156 93 164 -239 -177 -210 124 5 63 142 -46 -117 128 67 240 -216 -169 -19 -53 117 -171 -16 257
5166B57j10k59K36j51O6k4k09K05l04R7L61J57m11L27P7l29j54M21L4k16L7N4
$$ 257 147 -112 124 -27 39 15 -194 11 -293 -196 165 322 -89 238 315 -14 -168 253 287 71 108 162
5188A62j07M5L88o02N9M7J39R8k53j66J52M4K7k95N41l36R6N9Rk09n8K37l90L60
$$ 162 55 100 488 -114 -55 -8 131 229 -24 -190 -38 6 33 -262 279 -57 39 98 107 -102 -160 77 -313 47
5212D7q8J46Q0l09m5N30l30J14l92j42L34l46K00K61l47P7K34R0O2j07k16p7L20
$$ 47 -41 105 185 -124 -169 361 31 145 -247 -389 -55 -401 -201 60 -287 -210 24 114 176 69 -147 -224 96
5235I6L5j47n6J33j09M29n12k36N70k68l17M91M8l59K24o7P2k53M85j35j83J41
$$ 96 131 -16 -72 61 -48 381 -131 -367 203 -65 -382 109 157 -202 22 -45 27 -226 259 124 -59 82
5257H2j21PJ56K91l65K02k07P3j39k4k7R1j10O4k52J58K56p5k46O3K8j41M92k41
$$ 82 -39 -32 124 415 50 252 45 118 -21 -45 -72 19 -91 -27 -279 -121 135 60 -186 -123 -95 -236 256 15
5281A5j82M37m29K12j31J75m1j94K68ml5J13l62j1K45J26Q8k43L4l94L65m34L83
$$ 15 -167 270 -159 53 -78 97 56 -138 130 126 91 204 -158 -169 76 202 290 47 81 -313 52 -382 1
5304AK27j97l69L45l3j83pJ74j77N3J84O5N9K8J17l14K11j29J33k31j54j10L46
$$ 1 228 31 -338 7 -26 -209 -216 -42 -219 -166 18 83 142 170 287 -27 184 55 188 -43 -197 -307 39
5327C9l6j10J36j2K58k01l6O0q4J85R1n26J04pK4N39l35k13K67ln5k17J86k13
$$ 39 3 -107 29 17 275 74 38 98 14 199 290 -236 -132 -139 -115 424 89 -124 143 140 85 -132 54 -159
5351a59N0J43l29K38P7N9j24k1N69l41k41N1o5j62QK41Q2m9k6nJ38j7q9q9nm2
$$ -159 -109 34 -295 -57 20 79 -45 -66 503 162 -79 -28 -93 -255 -247 -6 76 27 1 -4 134 117 28 -61 -66 -108
5377a08k9M3k19L51j52J09j03L88k09k96J03K17p2r9QJ36j18L95q3r1J5j86L54
$$ -108 -137 -94 -313 38 -114 -5 -108 280 71 -225 -122 95 23 -76 -68 68 -50 345 262 171 186 0 354
5400C54l16j14n0j32Q3L38n39L48K38m14L97Q0o11L80Q5p6Lj28J00m34J09L17
$$ 354 38 -76 -126 -258 -175 163 -376 -28 210 -204 193 273 -338 42 127 51 54 -74 26 -408 -299 18
5422A8k04N7J47K1j88k85K64K84k36K27j01K08k58Q6m5K36k53J07k95q3L30J29
$$ 18 -186 -129 18 39 -149 -434 -170 114 -122 105 4 212 -46 40 -5 231 -22 85 -210 -293 37 166
5444A66J63Mk12r0l81K37K70k4j48J7p9P0O2p7K36k97M80k10m02j04N43j03j23
$$ 166 329 333 121 31 -350 -113 157 133 -15 2 -77 -7 55 -22 214 -83 397 187 -215 -319 224 121 -2
5467bj15J86K25j07o0m12K39N4K40l32l5m2Q0K27n8Q7j95l9K6K87l57K87k38L85
$$ -2 -117 69 294 187 127 -285 -46 8 248 -84 -119 -161 -81 146 88 175 -20 -59 -33 254 -103 184 -54 331
5491C31m12R7J11K8k87J6N2L2L8k22K98j7l03M64m3l35K37j70j45M73J58m18J6
$$ 331 -81 16 127 155 -132 -116 -64 -32 6 -216 82 65 -238 226 183 -152 85 -85 -230 243 401 -17 -1
5514ak90N45m56K15j89K00k81L56M3n6k47K22j26rL66k84l31M56k46L45QL1l56
$$ -1 -291 254 -202 13 -176 24 -257 99 142 86 -161 61 -65 -74 292 8 -323 133 -113 232 240 271 -85
5537h5o0L52k71o2R5J60j28m2j1M40l02K0K20j4L1k38l38O4k14J68K5Q4L06k73
$$ -85 -145 207 -64 -126 -31 129 1 -41 -52 388 86 106 326 312 343 105 -233 -169 -383 -215 -190 -106 200 -73
5561g3j49J69j38L62k95J79k92O2J3K17n56K42K38j42K60J90j10o49M83L21n8
$$ -73 -222 -53 -191 171 -124 55 -237 -175 -162 55 -501 -259 -21 -163 97 287 177 -472 11 332 274
5582B74k25r2K75j77m4P0M1k62M27l94j78L37K71q43L82m8J73j54j06L76o3k40
$$ 274 49 -43 232 55 11 81 122 -140 287 -107 -285 52 323 -520 -138 -186 -13 -167 -273 103 40 -200
5604b00K4L12Q0n54Q5L48K77k81K8K30j75n25M78p7R2m9k33M9J41K5M87o31O36
$$ -200 -176 136 216 -338 -253 95 372 91 119 349 174 -351 127 50 142 93 -140 -91 50 75 562 -69 567
5627E67l21k85R6j58J1j67N23l73N6o6p0J76kK4k2k59K79l37N34j43j03R6l41
$$ 567 246 -39 57 -101 -90 -257 266 -107 -51 -117 -187 -11 -13 11 -11 -270 9 -328 206 63 -40 56 -285
5650b85K33O6Q1k04O59n29k38J88M2k37L81j99J90r2K5k63M59m22j12Q8J29k46
$$ -285 -52 14 95 -109 550 21 -217 -29 13 -224 157 -42 148 56 81 -182 277 -145 -257 -169 -40 -286
5672b86L92j70K47j27l7pj22N1l3J94j10o07N00L04m1k3j79j20j24K81j10K42
$$ -286 106 -64 183 56 19 12 -110 -59 -92 102 -8 -615 -115 189 148 125 -54 -174 -298 -17 -127 115
5694A15k2l93K3O14k76j53k47Q4K54P8k30J69J17l33L0K81j40l26M24k19P6K30
$$ 115 93 -300 -277 337 61 -92 -339 -255 -1 77 -153 16 133 -200 -170 111 -29 -355 69 -150 -74 156
5716A56J27m9n41M2L89m76J92J66o6M78o64P5L74j03l4K7pm31J9O51p66J15L73
$$ 156 283 234 -307 -265 124 -352 -160 6 -60 418 -246 -171 203 100 66 93 86 -345 -326 325 -441 -326 47
$$ [...]
8191a06
##END NTUPLES=NMR FID
##END=
