##TITLE=1H_Ser NMG-1599
 CDCl3
 8 sc, 
 7.11.2024
##JCAMPDX= 6.0         $$ Bruker NMR JCAMP-DX V2.0
##DATA TYPE= NMR FID
##DATA CLASS= NTUPLES
##ORIGIN= UXNMR, Bruker Analytische Messtechnik GmbH
##OWNER= root
$$ XWIN-NMR		Version 3.5
$$ Thu Nov  7 14:34:08 2024 Russian Standard Time (UT+4h)  she@DPX200
##.OBSERVE FREQUENCY= 200.1318
##.OBSERVE NUCLEUS= ^1H
##.DELAY= (6, 6)
##.ACQUISITION MODE= SIMULTANEOUS
##.ACQUISITION SCHEME= undefined
##.AVERAGES= 8
##.DIGITISER RES= 18
##SPECTROMETER/DATA SYSTEM= spect
##.PULSE SEQUENCE= zg30
##.SOLVENT NAME= D2O
##.SHIFT REFERENCE= (INTERNAL, D2O, 0, 15.7039)
##AUDIT TRAIL= $$ (NUMBER, WHEN, WHO, WHERE, WHAT)
$$ ##TITLE= Audit trail, XWIN-NMR		Version 3.5
$$ ##JCAMPDX= 5.01
$$ ##ORIGIN= Bruker BioSpin GmbH
$$ ##OWNER= she
$$ F:/spectra/data/she/nmr/H-F/1/audita.txt
$$ ##AUDIT TRAIL=  $$ (NUMBER, WHEN, WHO, WHERE, WHAT)
(   1,<2024-11-07 14:32:55.82 +0400>,<she>,<DPX200>,
      <created by zg, POWCHK disabled, PULCHK disabled
       configuration hash MD5:
       00 E9 B6 7A A2 85 ED C7 34 08 36 98 17 FE 4E 26
       data hash MD5: 16K
       9B D9 0B FE 1F 0A 4A FD 7C 49 AA 7F 00 B0 B9 90>)
$$ ##END=
$$ 
$$ hash MD5
$$ 67 BB 50 30 A9 64 41 10 E6 6C 24 38 99 40 B2 9C
##$RELAX= 
##$RELAX= 
##$RELAX= 
##$RELAX= 
##$RELAX= 
##$RELAX= 
$$ Bruker specific parameters
$$ --------------------------
##$DU= <F:/spectra>
##$EXPNO= 1
##$NAME= <H-F>
##$PROCNO= 1
##$TYPE= <nmr>
##$USER= <she>
##$AMP= (0..31)
100 100 100 100 100 100 100 100 100 100 100 100 100 100 100 100 100 100 
100 100 100 100 100 100 100 100 100 100 100 100 100 100 
##$AQSEQ= 0
##$AQ_mod= 1
##$AUNM= <au_zg>
##$AUTOPOS= <>
##$BF1= 200.13
##$BF2= 200.13
##$BF3= 200.13
##$BF4= 200.13
##$BF5= 200.13
##$BF6= 200.13
##$BF7= 200.13
##$BF8= 200.13
##$BYTORDA= 1
##$CFDGTYP= 0
##$CFRGTYP= 5
##$CHEMSTR= <none>
##$CNST= (0..31)
1 1 145 1 1 1 1 1 1 1 1 1 1 1 1 1 1 1 1 1 1 1 1 1 1 1 1 1 1 1 1 1 
##$CPDPRG= <>
##$CPDPRG1= <>
##$CPDPRG2= <>
##$CPDPRG3= <>
##$CPDPRG4= <mlev>
##$CPDPRG5= <mlev>
##$CPDPRG6= <mlev>
##$CPDPRG7= <mlev>
##$CPDPRG8= <mlev>
##$CPDPRGB= <>
##$CPDPRGT= <>
##$D= (0..31)
0 1.2 0 0 0 0 0 0 0 0.06 0 0.03 0 0 0 0 0.0002 0 0 0 0 0 0 0 0 0 0 0 0 
0 0 0 
##$DATE= 1730975575
##$DBL= (0..7)
120 120 120 120 120 120 120 120 
##$DBP= (0..7)
150 150 150 150 150 150 150 150 
##$DBP07= 0
##$DBPNAM0= <>
##$DBPNAM1= <>
##$DBPNAM2= <>
##$DBPNAM3= <>
##$DBPNAM4= <>
##$DBPNAM5= <>
##$DBPNAM6= <>
##$DBPNAM7= <>
##$DBPOAL= (0..7)
0.5 0.5 0.5 0.5 0.5 0.5 0.5 0.5 
##$DBPOFFS= (0..7)
0 0 0 0 0 0 0 0 
##$DE= 6
##$DECBNUC= <off>
##$DECIM= 24
##$DECNUC= <off>
##$DECSTAT= 4
##$DIGMOD= 1
##$DIGTYP= 9
##$DL= (0..7)
0 120 120 120 120 120 120 120 
##$DP= (0..7)
150 150 150 150 150 150 150 150 
##$DP07= 0
##$DPNAME0= <>
##$DPNAME1= <>
##$DPNAME2= <>
##$DPNAME3= <>
##$DPNAME4= <>
##$DPNAME5= <>
##$DPNAME6= <>
##$DPNAME7= <>
##$DPOAL= (0..7)
0.5 0.5 0.5 0.5 0.5 0.5 0.5 0.5 
##$DPOFFS= (0..7)
0 0 0 0 0 0 0 0 
##$DQDMODE= 0
##$DR= 18
##$DS= 0
##$DSLIST= <SSSSSSSSSSSSSSS>
$$ [...]
##$SUBNAM2= <"">
##$SUBNAM3= <"">
##$SUBNAM4= <"">
##$SUBNAM5= <"">
##$SUBNAM6= <"">
##$SUBNAM7= <"">
##$SUBNAM8= <"">
##$SUBNAM9= <"">
##$SW= 24.0689170037331
##$SWIBOX= (0..15)
0 0 2 0 0 0 0 0 0 0 0 0 0 0 0 0 
##$SW_h= 4816.95568400771
##$TD= 16384
##$TD0= 1
##$TE= 0
##$TE2= 300
##$TE3= 300
##$TEG= 300
##$TL= (0..7)
0 120 120 120 120 120 120 120 
##$TP= (0..7)
150 150 150 150 150 150 150 150 
##$TP07= 0
##$TPNAME0= <>
##$TPNAME1= <>
##$TPNAME2= <>
##$TPNAME3= <>
##$TPNAME4= <>
##$TPNAME5= <>
##$TPNAME6= <>
##$TPNAME7= <>
##$TPOAL= (0..7)
0.5 0.5 0.5 0.5 0.5 0.5 0.5 0.5 
##$TPOFFS= (0..7)
0 0 0 0 0 0 0 0 
##$TUNHIN= 0
##$TUNHOUT= 0
##$TUNXOUT= 0
##$USERA1= <user>
##$USERA2= <user>
##$USERA3= <user>
##$USERA4= <user>
##$USERA5= <user>
##$V9= 5
##$VALIST= <valist>
##$VCLIST= <CCCCCCCCCCCCCCC>
##$VD= 0
##$VDLIST= <DDDDDDDDDDDDDDD>
##$VPLIST= <PPPPPPPPPPPPPPP>
##$VTLIST= <TTTTTTTTTTTTTTT>
##$WBST= 1024
##$WBSW= 4
##$XGAIN= (0..3)
0 0 0 0 
##$XL= 0
##$YL= 0
##$YMAX_a= 144783
##$YMIN_a= -127312
##$ZGOPTNS= <>
##$ZL1= 120
##$ZL2= 120
##$ZL3= 120
##$ZL4= 120
##$ABSF1= 10
##$ABSF2= 0
##$ABSG= 5
##$ABSL= 3
##$ALPHA= 0
##$AQORDER= 0
##$ASSFAC= 0
##$ASSFACI= 0
##$ASSFACX= 0
##$ASSWID= 0
##$AUNMP= <proc_1d>
##$AZFE= 0.1
##$AZFW= 0.1
##$BCFW= 1
##$BC_mod= 2
##$BYTORDP= 1
##$COROFFS= 0
##$CY= 11.3945322036743
##$DATMOD= 1
##$DC= 2
##$DFILT= <>
##$DTYPP= 0
##$F1P= 15.6554695791079
##$F2P= 12.8336369535428
##$FCOR= 0.5
##$FTSIZE= 0
##$FT_mod= 4
##$GAMMA= 1
##$GB= 0.15
##$INTBC= 1
##$INTSCL= 1
##$ISEN= 128
##$LB= 0.24
##$LEV0= 0
##$LPBIN= 0
##$MAXI= 10000
##$MC2= 0
##$MEAN= 0
##$ME_mod= 0
##$MI= 1.114404
##$NCOEF= 0
##$NC_proc= 0
##$NLEV= 6
##$NOISF1= 3.799351
##$NOISF2= 2.8
##$NSP= 1
##$NTH_PI= 0
##$NZP= 0
##$OFFSET= 15.70392
##$PC= 1
##$PHC0= -26712.21
##$PHC1= 17.98744
##$PH_mod= 1
##$PKNL= yes
##$PPARMOD= 0
##$PSCAL= 0
##$PSIGN= 0
##$REVERSE= no
##$SF= 200.130013532006
##$SI= 16384
##$SIGF1= 3
##$SIGF2= 2
##$SINO= 400
##$SIOLD= 16384
##$SREGLST= <1H.CDCl3>
##$SSB= 0
##$STSI= 0
##$STSR= 0
##$SW_p= 3612.71676300578
##$SYMM= 0
##$S_DEV= 0
##$TDeff= 0
##$TDoff= 0
##$TI= <>
##$TILT= no
##$TM1= 0
##$TM2= 0
##$TOPLEV= 0
##$USERP1= <user>
##$USERP2= <user>
##$USERP3= <user>
##$USERP4= <user>
##$USERP5= <user>
##$WDW= 1
##$XDIM= 8192
##$YMAX_p= 0
##$YMIN_p= 0
$$ End of Bruker specific parameters
$$ ---------------------------------
##NTUPLES= NMR FID
##VAR_NAME=  TIME,          FID/REAL,        FID/IMAG
##SYMBOL=    X,             R,               I
##VAR_TYPE=  INDEPENDENT,   DEPENDENT,       DEPENDENT
##VAR_FORM=  AFFN,          ASDF,            ASDF
##VAR_DIM=   8192,          8192,            8192
##UNITS=     SECONDS,       ARBITRARY UNITS, ARBITRARY UNITS
##FACTOR=    0.0002076,     1,               1
##FIRST=     0,             0,               0
##LAST=      1.7004516,     0,               0
##MIN=       0,             -127312,         0
##MAX=       1.7004516,     144783,          0
$$ Real data points
##PAGE= N=1
##DATA TABLE= (X++(R..R)), XYDATA
0 0 0 0 0 0 0 0 0 0 -3 8 -8 8 -16 16 -17 24 -32 36 -44 52 -64 73 -89 102 -120 138 -157 181 -206 237 -269
31 -269 303 -343 384 -433 484 -541 602 -669 745 -825 917 -1013 1120 -1241 1370 -1516 1677
48 1677 -1859 2062 -2293 2559 -2866 3222 -3645 4154 -4769 5513 -6375 7061 -11301 144783
62 144783 -122379 40777 26677 -83649 77225 -80384 69261 -57673 20946 33669 -89763
73 -89763 88040 -36926 -6024 48462 -41450 17607 2052 14467 -14765 17313 14569 -39515
85 -39515 30157 3313 -33956 48960 -29535 -22270 40724 -43597 17452 6410 -15682 2345
97 2345 -14799 24142 -33375 34139 -2703 -39051 58574 -48680 19531 24933 -33596 33672
109 33672 -28445 21777 -12405 6384 28559 -60420 59526 -31144 -22480 62423 -62543 31125
121 31125 -26 -32924 30565 -17764 18093 -22287 11135 7861 -36604 51552 -28839 -3154
133 -3154 34589 -45026 24525 5150 -8229 11504 -11669 14364 -24771 24717 195 -28617
145 -28617 47234 -44983 8277 21195 -28880 25775 -16964 6095 -12185 8716 8335 -25728
157 -25728 39245 -33916 3413 20779 -26650 27441 -12328 193 -1459 -859 10577 -14688 19275
170 19275 -8561 -14673 21891 -15777 3047 19539 -29775 15659 -1505 -11752 18619 -14014
182 -14014 13484 -17014 7671 4493 -17266 36016 -34486 12842 9026 -25895 31091 -18517
194 -18517 9391 -3151 -5380 7768 -12650 22895 -16668 -79 10304 -17335 11611 3467
206 3467 -8089 5122 -1706 -7252 4665 6052 -2905 -4994 8793 -11712 3265 13380 -17322
219 -17322 15363 -6695 -7345 10058 -6992 12936 -13777 8703 -4015 -10752 24199 -21927 13331
232 13331 327 -15800 15007 -10086 10099 -3424 -2788 4047 -12752 16531 -9292 1119 10163
245 10163 -18154 11591 -4899 1245 7884 -9221 5307 -7282 5040 1789 -3503 7360 -8131
258 -8131 444 2417 -2001 4945 -29 -5230 1005 239 -1414 5281 -2540 782 -2858 -728 1518
273 1518 -25 5540 -8835 4914 -3715 615 5593 -5343 7025 -9279 4632 -2770 759 8882
287 8882 -11277 7672 -6587 477 6533 -5403 7096 -6797 1553 -896 -1190 7417 -5731 2107
301 2107 -1882 -3289 5281 -1230 625 1840 -5323 2196 -1315 2912 2987 -5636 3727 -5943 3374 1962
317 1962 -1988 3444 -4747 1157 -1684 3264 808 -39 -1101 -3427 3211 -1846 3849 -1889 -448
332 -448 -187 -3830 4958 -1647 3344 -3218 -1616 843 -1252 4662 -2787 3005 -4796 457 184 470
348 470 4316 -4819 2287 -5084 3036 674 -296 3500 -5945 3535 -4103 3015 2814 -3080 2981 -5387
364 -5387 2269 765 430 2087 -2539 -593 -1768 1817 866 2077 -2242 -1577 -25 -577 3730 -893
380 -893 129 -892 -2921 1380 1400 254 1937 -3946 -138 724 -737 3519 -2737 969 -2095 -958
396 -958 2912 -649 2341 -2267 -1201 -732 629 2105 -381 218 -2287 357 -805 3311 332 -841
412 -841 158 -4491 4829 -2882 3401 -141 -4193 3205 -5273 5435 -884 -308 1214 -4616 3141 -672
428 -672 2730 -33 -1196 -766 -1450 1667 1040 1842 -1899 -794 -1018 467 2090 -241 433 -2639 -16
445 -16 -735 2208 979 -1127 58 -3760 2181 66 1593 670 -2172 135 -1648 1980 1298 7
461 7 168 -2521 365 1776 -512 3078 -2650 -664 141 -2003 5304 -3462 2593 -2290 -3383 5762
477 5762 -4931 6284 -2698 -2730 3675 -5990 7059 -2786 886 201 -4473 4032 -2295 3270 14
492 14 -2285 -209 -856 279 2707 -127 -1318 139 -3175 3292 -790 2543 -1340 -2751 2731 -4925
508 -4925 6422 -2845 293 1520 -6160 6321 -4681 5311 -1666 -3424 4627 -7532 8285 -2501
522 -2501 137 2560 -6327 4653 -2510 2100 1620 -4119 2979 -3722 1409 4098 -4367 4690 -4296
537 -4296 -1677 5131 -5210 6640 -3920 -1374 2886 -6236 8837 -4875 2123 1155 -7510 8356
551 8356 -6445 4938 376 -5022 4415 -6532 5504 -1247 -671 2928 -7149 5476 -2424 -174
565 -174 5810 -6933 3950 -2251 -1021 5478 -4487 4822 -4541 -443 3358 -5572 7806 -4532
579 -4532 -1563 3501 -6824 7575 -2880 872 1585 -6615 7293 -6139 4662 2785 -8766 9193
593 9193 -8610 3298 4866 -7716 10008 -10581 4858 979 -5337 12123 -12927 8035 -3810
606 -3810 -3405 9993 -10234 9774 -7500 160 4342 -7367 10569 -7862 2627 700 -6169
619 -6169 8513 -5282 3284 835 -5761 5041 -3363 1190 4225 -6426 4458 -3473 -313 6182
633 6182 -6859 8026 -7693 1683 3785 -7586 12116 -10321 5111 -1180 -5813 11395 -11365
646 -11365 10851 -6205 -2988 9713 -12321 13226 -6580 -1178 5576 -9842 10160 -5255 1924
659 1924 3204 -8239 7100 -4859 1565 4697 -7347 5814 -5449 924 4645 -6524 8717
672 8717 -8472 2405 2933 -7623 11464 -9658 3544 729 -7458 11419 -9955 7362 -1747
685 -1747 -6859 10838 -10992 9178 -1621 -4670 7164 -9895 8938 -4062 639 5382 -11142
698 -11142 10014 -6602 2003 5974 -9332 8479 -8216 3488 2576 -6128 9868 -10008 4188
711 4188 1246 -6214 10181 -7228 2224 1094 -5964 8059 -5747 4238 20 -6379 7927 -8052
725 -8052 5989 1345 -6492 8144 -9750 6609 -310 -3879 8830 -11553 8679 -4572 -903
738 -903 8145 -11029 9814 -7734 1055 5713 -8015 9793 -7548 1296 2669 -5568 8275 -5661
752 -5661 2743 571 -6105 8662 -6298 3033 2442 -8796 8129 -5943 3003 2953 -5878 7548
766 7548 -9781 7337 -995 -3989 10875 -12995 7983 -2901 -2357 7901 -8372 8035 -7261
779 -7261 2184 3826 -7071 10192 -8359 726 3798 -6405 7352 -3302 373 693 -3969 5288
793 5288 -3775 2790 1539 -6486 6382 -4841 1723 4382 -6202 5509 -5758 2687 1256 -3312
807 -3312 7451 -8696 5540 -1756 -2845 8332 -8055 5671 -3176 -2900 6300 -6005 6082
820 6082 -3676 -1099 3308 -6343 7331 -4029 559 2659 -6810 6743 -3379 1076 2159 -5592
834 -5592 4339 -4201 2933 1171 -3698 5280 -7128 3358 1814 -3586 6300 -5016 997 238 -2218
849 -2218 4950 -4090 2887 -1869 -3349 6072 -5211 4423 -864 -3667 4166 -4473 4575 -1494 429
864 429 767 -5194 5825 -4236 2555 2121 -5206 4365 -3570 2051 769 -1057 1798 -3660 1989
879 1989 -94 -480 2635 -2265 -652 1144 -2381 3114 -674 -276 933 -3473 3908 -2372 2503 47
895 47 -3587 3972 -4762 4351 -446 -1666 3579 -5822 4489 -1830 1021 2470 -3946 3378 -3707
910 -3707 2078 841 -971 2048 -2663 788 248 274 787 -546 -630 -429 -411 1947 -603 -191 217 -3034
928 -3034 2613 -795 927 1143 -3006 1673 -2006 1777 201 -988 2166 -4096 2825 -471 451 2012
944 2012 -2922 1391 -2117 1440 621 -629 1476 -2660 744 190 -149 1342 -967 -138 -607 -191 783
961 783 31 443 -669 -746 -17 636 298 979 -813 -616 -19 -68 1505 -804 109 -1090 -450 1358 -462
980 -462 1535 -1040 -754 193 -1181 2408 -1246 1095 -865 -1524 1348 -1282 2626 -1534 241 -662
996 -662 -1197 2378 -1301 2129 -1969 -52 -61 -392 2213 -1392 1129 -1569 305 676 137 1841 -1704
1013 -1704 714 -1262 435 639 66 678 -2391 1186 -1329 1567 419 -538 734 -1854 1761 -822
1029 -822 1249 -245 -1218 355 -1375 1570 202 743 -172 -1036 365 -867 1434 -323 229 -926
1045 -926 -530 840 -261 928 -1070 -81 -693 298 873 385 442 -767 205 -296 1189 245 261 -486 -832
1064 -832 260 -26 1035 -35 -744 -496 -191 941 440 443 -382 -707 -564 154 869 334 -172 -561 -466 226
1084 226 834 296 -122 -907 -777 340 -217 1019 -369 -509 -485 -25 749 2 1047 -1041 -270 -222 -623
1103 -623 996 8 -288 -347 -484 556 729 330 22 -1224 125 -101 472 838 -647 -304 -780 -29 1355
1122 1355 -780 1269 -1429 -60 -157 -177 1919 -1616 985 -1132 -342 1123 -488 1330 -1118 -341
1138 -341 20 -168 1254 -31 -291 -257 -832 496 651 -203 1206 -1495 90 556 -9 1492 -1115 729
1156 729 -1010 -345 1728 -1439 2441 -2185 165 353 -1055 2548 -1537 781 -939 -1027 1609 -1157
1172 -1157 2086 -896 -1338 1216 -1789 1520 434 -889 473 -1922 1508 -275 393 1546 -2641
1187 -2641 1350 -950 44 2543 -2335 1043 -1137 -144 1255 -892 1989 -2209 414 7 -1196 2416
1203 2416 -1198 69 103 -2069 1625 -479 456 607 -1972 1423 -2262 2091 946 -2491 2926 -3430
1219 -3430 1302 1070 -1498 2506 -2929 2226 -1590 -294 2757 -3311 3441 -2762 20 2198 -2620
1234 -2620 2870 -2357 101 300 -1122 2722 -2099 1609 -591 -2641 3040 -2120 1090 1117 -2825 2144
1250 2144 -1676 1048 756 -1117 1692 -3435 1979 -28 -1507 3505 -3713 1664 -509 -1409 3141
1265 3141 -2612 1939 -2015 -625 1899 -2902 3606 -2572 -835 2738 -3848 3605 -786 -1132 1945
1280 1945 -3221 2947 -2189 1296 677 -3157 3872 -3722 2302 1414 -2989 3068 -3342 1464 -52
1295 -52 -328 2835 -3923 2920 -1871 -1045 4303 -4253 2280 -598 -2136 3348 -2047 2601 -1021 -703
1311 -703 1841 -3848 4621 -2218 -437 2633 -4918 3678 -1679 311 1699 -3072 2788 -3145 2376
1326 2376 548 -2586 3859 -4837 1563 913 -2389 3781 -2866 512 316 -1692 2984 -2335 2312
1341 2312 -907 -2619 4339 -3917 3238 -105 -3107 3387 -4110 3385 -767 -158 1801 -4436 4166
1356 4166 -3314 1072 2466 -4930 4105 -3261 874 1458 -2539 2590 -3219 1591 -187 -818 3550
1371 3550 -3429 1667 571 -2621 3482 -2111 596 762 -2705 2618 -2173 2690 -481 -2019 3308
1386 3308 -4614 3569 58 -1968 3309 -4289 2610 -1097 -130 2195 -3869 3973 -3657 749 2440
1401 2440 -3761 4437 -3274 352 1367 -2249 3376 -3102 832 -378 -1994 3923 -2709 2191 -195
1416 -195 -2597 2949 -2492 2027 -98 -1444 1047 -2390 1937 -632 -341 2285 -3050 2132 -390
1431 -390 -1042 3159 -3406 1420 -427 -1232 2626 -2336 2948 -2042 -543 2460 -3322 3980 -1896 -431
1447 -431 1713 -3109 3535 -1797 1314 -229 -1741 2699 -3057 2681 -493 -1246 2470 -2912 1815
1462 1815 294 -862 1526 -2656 1294 -824 -217 2283 -2895 1870 -838 -1460 2703 -2169 1607
1477 1607 -1179 -812 1746 -2287 3290 -1922 438 914 -2989 3578 -1925 1279 -52 -2105 2290
1492 2290 -2252 1892 84 -1200 1446 -2882 1571 8 -472 1504 -1571 211 207 -543 1505 -791
1508 -791 1 179 -1118 2124 -1160 1003 -336 -1590 2160 -2038 1940 -681 -1030 1328 -2498 2307
1524 2307 -698 898 1165 -2725 2221 -1805 1097 1065 -2304 1841 -2110 1289 231 -413 1656 -2172
1540 -2172 1193 -596 -175 1504 -1481 980 -825 -396 904 -205 1123 -505 -79 214 -635 1073
1556 1073 260 -502 -65 -853 663 488 -413 993 -1559 794 -491 -301 1853 -1976 1350 -1041 -286
1573 -286 1563 -1516 1830 -1392 271 294 -769 2332 -1430 878 -1120 -222 1049 -759 1351 -1186
1589 -1186 -111 43 -702 764 -204 233 -565 -403 412 555 170 71 -756 -155 384 -230 1189 -573 338
1608 338 248 -740 1431 -343 937 -435 -665 426 -654 1491 -244 32 -2 -471 1026 -536 677
1625 677 -810 -615 71 -280 519 100 -71 203 -353 1 158 176 252 -511 -469 -1 30 813 -307 -272 -205
1646 -205 -323 570 45 498 -223 -368 235 36 807 132 149 -401 -602 178 8 202 -35 -553 -43 -133 683
1667 683 657 -150 -411 -709 111 387 463 48 -361 -46 -465 -29 461 235 -239 -115 55 -144 199 72 -199
1688 -199 -261 -128 2 166 636 -517 -47 -699 133 591 81 858 -984 -114 -340 257 642 -482 288
1707 288 -970 -3 -279 524 260 -536 242 -977 696 421 5 -134 -583 40 -312 570 348 -475 135
1726 135 -500 -77 150 421 -620 -105 -378 -86 385 -66 550 -510 -124 -502 271 478 -182 346 -422
1745 -422 84 228 -359 617 -486 -133 -199 -18 805 -40 386 -618 -252 36 -218 774 -349 -437 -382 -514
1765 -514 271 345 108 -52 -951 612 -452 504 385 -356 460 -350 93 -113 25 4 -429 -71 199 58
1785 58 720 -603 -220 -69 -81 302 -81 3 -190 -631 259 -78 190 197 -602 258 -913 779 325 -92 437
1806 437 -1136 549 -361 252 945 -695 681 -657 189 565 24 484 -665 310 14 -176 718 -729
1824 -729 90 -277 -453 772 -263 566 -349 -589 375 -644 1086 -221 -345 456 -778 1112 -105
1841 -105 33 453 -1329 550 -277 390 593 -647 249 -754 194 726 -467 720 -1109 -27 308
1858 308 -619 1095 -677 -1 -77 -861 1358 -643 463 226 -994 1118 -1193 1097 175 -930 838
1875 838 -1342 708 -267 76 513 -1556 1094 -613 32 1181 -1311 606 -796 -42 773 -716 1273
1892 1273 -1139 -132 623 -1028 1245 -465 -118 394 -865 1422 -492 831 284 -1224 1203 -1168
1908 -1168 1248 96 -1186 688 -1502 587 107 -182 785 -1359 731 -508 -263 1467 -1629 1007
1924 1007 -820 -274 1512 -1571 1346 -926 -519 1034 -1441 1733 -652 178 542 -1542 2010 -1358
1940 -1358 929 382 -1394 1320 -1460 1196 -65 -408 978 -1563 939 -148 -613 1436 -1597 662
1956 662 144 -676 1556 -1203 1190 -648 -358 1163 -1204 1436 -868 -764 1174 -1764 1598 -590
1972 -590 -447 827 -1472 1435 -603 385 399 -1828 1445 -1051 924 612 -1474 1698 -1388 450
1988 450 478 -1039 1611 -1691 1090 -201 -970 1814 -1911 1317 -503 -853 1663 -1600 911 -513
2004 -513 -735 1002 -1701 1863 -1231 79 966 -1747 1775 -309 -30 707 -1364 1340 -1159 577
2020 577 1105 -1223 1496 -1894 522 750 -1308 1950 -1634 311 361 -695 1699 -1296 1077 -672
2036 -672 -682 1400 -1437 1577 -547 -970 999 -1642 1266 -272 -166 788 -1319 1460 -598 188 701
2053 701 -1995 1309 -845 -20 1549 -1623 1415 -1107 17 821 -1378 1601 -1673 177 540 -1259
2069 -1259 1832 -1299 387 328 -1109 1367 -1249 1156 -365 -774 965 -1951 1499 -419 -497 1006
2085 1006 -1685 1255 -262 57 1167 -1338 1160 -1015 -2 1279 -1281 1513 -1233 4 1249
2100 1249 -994 1443 -1163 32 342 -1191 1210 -880 431 130 -1406 1562 -822 811 183 -984
2116 -984 536 -1107 918 130 -165 787 -1469 773 -686 -175 1331 -1373 832 -301 115 1037 -841
2133 -841 916 -1167 -196 813 -979 1328 -585 -384 249 -1057 798 -542 -249 58 -957 1032
2149 1032 -472 595 317 -1246 1169 -907 483 552 -706 660 -1259 360 -21 -84 1063 -1242
2165 -1242 855 -382 -275 887 -1157 796 -721 -417 672 -339 1036 -582 73 258 -891 830
2181 830 -278 268 77 -579 397 -167 264 548 -705 474 -807 377 374 -444 670 -807 403 336
2199 336 -307 782 -705 -48 -155 -98 739 -472 811 -539 -777 402 -553 691 104 -267 -173 -892
2217 -892 713 -284 121 320 -927 381 -247 289 481 -455 235 -510 217 437 -369 392 -685 135 350
2236 350 -195 228 -551 236 -362 -395 809 45 447 -195 -352 395 -311 381 -253 -237 -3 -171 513 234
2256 234 80 195 -1019 19 -132 187 413 -518 -9 -694 -89 534 -309 205 -27 214 348 289 159 49
2276 49 -271 -160 -194 494 -15 -174 -33 -345 191 -363 324 -288 -639 -112 -266 206 397 -46 165 -267 41
2297 41 -184 91 -51 -579 21 -309 256 73 -15 98 -119 -214 273 -67 399 176 -417 51 -157 270 272 138
2319 138 289 -597 -103 -117 437 215 -152 62 -293 -66 57 -99 -203 198 -28 -28 558 -39 -55 152 -352
2340 -352 136 272 150 -295 -69 -290 102 134 -15 180 -362 -343 -452 -148 203 35 289 -232 -103 214 487
2361 487 161 -128 -217 -111 -21 13 97 -121 -121 -450 -237 477 369 366 -287 149 24 433 141 155 -557 -446 186
2384 186 26 225 -115 -301 111 -186 113 343 33 36 -40 125 59 225 146 -25 106 -258 -22 209 236 134
2406 134 -222 -291 127 114 117 6 246 -397 -341 298 182 300 -407 -457 -75 -48 251 153 67 -260 -97 299 32
2429 32 300 80 -246 -32 -74 468 41 21 -12 -264 -276 234 -239 12 -288 -227 175 -166 394 -347 -53 -292
2451 -292 -526 577 -239 234 -164 -100 33 -424 368 -365 277 289 -812 278 236 185 43 -545 276 -446
2471 -446 265 54 -280 96 -494 69 335 -256 358 -234 -74 -100 -257 525 -216 188 -162 -160 468 88 122
2492 122 -142 -225 235 -53 473 18 148 287 -767 215 -211 55 177 -338 176 -192 400 297 -528 487
2512 487 -437 -9 329 -305 817 -526 2 27 -409 582 -499 566 137 -299 347 -381 448 -140 -368
2531 -368 112 -518 288 14 -82 66 -829 485 -143 228 394 -753 455 -346 -28 809 -381 709 -295
2550 -295 -59 633 -604 811 -530 -27 -283 -493 740 -292 397 -85 -964 771 -256 71 90 -327
2568 -327 735 -718 458 -71 65 356 -864 368 42 267 1103 -811 219 -359 25 601 -174 760
2586 760 -509 -287 507 -314 594 -685 -3 412 -596 801 -354 165 -258 -805 557 -339 171 111
2604 111 -532 540 -796 342 373 -435 527 -919 393 42 -99 836 -793 602 -469 -159 968
2621 968 -575 822 -618 -131 576 -416 624 -345 -353 490 -623 1082 -329 289 205 -355 778 -689
2639 -689 706 135 -339 559 -627 391 -6 -728 779 -935 86 -172 -517 700 -785 229 -348
2656 -348 -217 713 -526 627 -446 -315 542 -234 668 -258 -109 272 -989 754 -543 -124 243 -1043
2674 -1043 684 -591 378 128 -592 394 -153 251 422 -447 725 -994 254 -154 -499 1109 -252
2691 -252 482 -508 -410 1052 -611 819 -460 -376 306 -895 787 -310 106 496 -898 397 -55 -63
2709 -63 233 -1047 548 -340 490 619 -667 454 -443 386 418 -435 858 -641 251 92 -538 691
2727 691 -768 240 174 -534 551 -557 215 -83 -520 412 -482 488 223 -67 633 -479 494 7 249
2746 249 497 -907 684 -315 193 997 -500 506 -527 59 384 -326 831 -622 -183 203 -257 442
2764 442 -481 -38 74 -613 774 -500 351 33 -333 667 -504 40 -70 -243 326 -713 211 4
2782 4 -462 515 -682 437 47 -36 719 -540 562 -429 13 239 -193 593 -273 220 20 -479 676
2801 676 -186 271 -162 -329 256 220 255 189 -482 498 -464 30 184 -231 528 -755 284 -51 119 284
2821 284 -906 408 -228 -81 312 -366 78 -470 -215 361 -259 159 -76 -155 589 -452 370 -213 -198 67
2841 67 -399 349 115 -87 -93 -187 81 -435 314 125 -366 419 -310 143 -190 -159 138 -726 444 -145 -2
2862 -2 286 -96 183 -76 -52 424 -106 213 -107 -116 154 -27 530 -81 -125 -506 -418 448 25 250 77 -80
2884 -80 313 -89 234 221 58 37 -234 138 59 -61 192 -195 91 200 -131 147 -173 52 -119 -114 334 -131
2906 -131 252 -162 -77 165 -265 254 -90 -155 50 -296 171 214 -8 141 -207 -65 61 -23 309 -403 -264
2927 -264 -313 103 89 -259 -50 -361 -30 106 -83 121 -263 -70 -74 51 60 -187 383 -14 51 116 -228 191 159
2950 159 -258 -106 187 202 152 104 -201 -31 -45 -187 214 -9 29 25 70 40 -5 -4 41 99 27 83 -314 539 -133
2975 -133 -186 97 -221 311 -42 478 147 42 -191 172 149 25 208 117 -128 210 157 199 161 213 323 142
2997 142 -147 110 -97 -114 85 -457 -113 145 179 -110 -57 -50 -49 34 -10 -86 -80 23 55 11 -53 -86 -168 137 244 -140
3023 -140 613 -24 -25 -22 -242 -5 202 179 232 -31 -155 174 56 130 113 221 -122 421 -277 -30 -232 -76 -102
3046 -102 -134 49 228 -2 -266 -122 167 75 95 66 -150 119 29 260 219 -39 72 -124 -73 84 19 -101 -139
3069 -139 39 -316 -258 104 -144 321 -266 -144 8 116 -202 -393 96 -31 -157 196 -86 10 -119 -301 -105
3090 -105 -167 178 -7 -359 -72 -17 151 186 208 194 -427 2 -311 -38 30 -42 164 12 -14 157 -115 352 1
3113 1 -92 -347 136 -41 -147 192 -106 181 112 108 34 156 -204 -51 -32 50 297 13 4 -20 453 251 221 -84
3137 -84 -368 238 -130 -462 65 144 68 -145 -9 -41 72 204 -356 40 -126 -195 187 -39 -129 80 -556 346
3159 346 282 117 108 -285 169 -154 213 -116 -204 274 -196 -324 -115 -91 43 -139 368 87 -439 522 23 155
3181 155 -160 -250 224 113 431 -420 -109 321 95 83 -278 198 196 -61 448 92 6 40 -400 237 -175 -17
3203 -17 628 -204 376 -506 77 331 -310 294 -259 -148 162 -439 236 -338 -237 -90 -21 224 35 48 -305
3224 -305 -428 130 -261 269 -167 -204 370 -451 146 200 129 60 -240 39 -334 145 233 -91 78 -159 -52 141
3246 141 -441 119 -158 -54 124 -124 118 -89 113 166 -560 397 33 -6 -87 -543 313 -306 361 163 -158
3267 -158 31 108 442 -107 220 206 -473 497 -199 -106 -56 -417 286 -195 -96 188 -53 192 -379 -97 450 -134
3289 -134 544 -337 141 152 -277 483 -227 150 19 -367 215 -325 -98 -31 -78 225 -156 207 -86 -170 549
3310 549 -272 201 -87 -6 391 -361 94 -34 -232 244 -300 209 -234 -95 143 -73 420 81 41 -107 -526
3331 -526 276 -128 528 -88 -300 310 -231 114 1 -189 412 -330 163 -23 -313 -208 -113 261 -127 -41 39
3352 39 -308 80 -204 -45 743 -358 438 -202 190 323 -385 362 102 -67 35 -436 342 -249 362 90
3372 90 -394 53 -174 200 395 -204 369 -6 -7 6 89 186 -259 411 10 179 270 -232 219 -193 120 248
3394 248 -111 352 -522 20 547 -268 -149 32 291 397 -371 354 106 6 327 -167 215 -293 48 -73
3414 -73 -342 217 -624 -130 -107 -152 272 -126 58 -248 -31 559 -122 267 -203 -377 -139 -32 50 -145 -83 178
3436 178 -174 212 138 -15 191 -10 42 8 108 307 17 198 -106 166 364 125 304 197 -47 288 19
3457 19 309 -43 -31 -57 160 97 -505 166 76 -398 195 -202 190 158 -395 305 -459 191 -350 -12 70 -295
3479 -295 50 49 -245 390 -276 367 -197 -288 36 -272 113 -336 88 29 55 55 -11 36 148 23 201 -53 61
3502 61 -86 -423 140 -8 -71 -50 -278 9 -161 360 165 -32 220 5 83 -183 12 221 78 -456 -358 118
3524 118 128 -168 128 -56 105 30 -169 -113 79 229 64 343 76 6 7 149 17 -11 -15 102 89 -100 -239
3547 -239 331 -151 54 -6 -135 -262 119 193 -223 303 -80 -123 212 -215 161 15 295 -51 266 -106 -458
3568 -458 344 -279 -179 71 -16 -110 220 271 -136 177 -10 -244 128 -130 258 -171 -159 -61 60 72 -25 70 -302
3591 -302 -170 272 -59 373 1 -183 -55 179 229 -9 -80 -74 37 109 154 -220 99 49 -1 123 -136 -96 23
3614 23 62 -79 -263 116 219 -340 -161 -243 14 -150 -214 -20 -82 -65 -73 100 139 39 -57 40 -59 307 55 85
3638 85 -85 6 238 54 -59 -99 163 138 -236 -13 -203 -163 333 2 -200 -255 140 -118 68 65 -89 59 99
3661 99 88 -56 -81 -160 37 -40 196 -256 -375 -70 -137 34 117 193 -44 -212 34 -275 -70 63 251 84 -82
3684 -82 413 352 199 72 36 28 -57 121 151 -100 282 -62 -49 -6 56 -36 -151 273 -79 -129 -246 33 -19 -175
3708 -175 -206 -64 -102 210 106 -150 -35 -191 66 144 -57 -73 -174 -167 -25 -271 169 251 225 248 88 -234 -40
3731 -40 171 323 61 -36 56 36 -101 -115 381 -43 400 74 -47 -188 -521 252 -108 141 6 -291 -140 223
3753 223 169 158 185 -26 -45 -127 167 257 -35 -288 16 -141 196 -97 -112 -28 211 -167 85 242 -195 24 -163
3776 -163 -92 -147 -207 302 -161 -74 26 -36 1 -9 -36 -144 66 -99 195 -203 131 183 64 238 -24 93 -7
3799 -7 -195 -195 64 282 40 25 -5 -263 -297 210 -103 218 -103 102 -31 38 129 -142 -222 121 161 191 -305 339
3823 339 -435 169 -182 -9 13 144 82 190 -107 223 -19 208 20 85 -58 55 61 80 136 -303 372 -27
3845 -27 288 -54 131 -11 -292 12 286 121 -243 25 -169 40 103 19 79 12 -96 297 -410 165 111 45
3867 45 9 -226 216 -117 -181 -30 -28 169 -185 -23 -127 -230 438 -141 -125 47 -152 217 -36 -95 -203 -91
3889 -91 -107 -151 427 115 -141 32 -40 34 206 -266 188 -214 129 304 -136 166 -181 -109 38 70 218 -232
3911 -232 121 -196 -26 -122 250 203 -100 -129 -28 46 295 146 64 126 180 327 -75 297 -92 -292 100 -363
3933 -363 -75 186 -248 -78 -159 112 181 -212 121 5 -125 172 -15 83 -217 86 -345 -70 362 -65 130
3954 130 -155 -298 482 -94 -13 19 -114 259 -287 213 -429 -112 348 -468 122 190 97 -195 -206 88 17 -12
3976 -12 79 -215 126 -460 241 194 -58 244 -153 32 70 5 130 -69 85 225 -240 23 -290 496 0 153
3998 153 78 -138 180 -389 -97 79 -446 -82 -12 -17 65 74 195 -327 195 200 -67 -139 -237 197 66 -371 197 94
4022 94 -203 238 -236 331 31 97 84 -338 -55 172 -323 117 67 -172 -91 -109 165 -36 -96 -71 41 -219 213
4045 213 210 143 162 120 5 -101 29 219 49 105 115 -294 300 58 9 461 -15 71 -198 247 -69 -61 398 -180
4069 -180 175 252 179 279 -211 154 -127 146 336 -34 86 28 354 85 -222 2 -169 -218 57 -24 -132 162
4091 162 -171 31 -285 -124 -275 -99 -36 -169 -118 72 13 52 71 -101 -70 -204 -98 -68 -130 -75 155 -83 70
4114 70 -183 22 -190 73 87 -159 93 72 -172 -86 234 -255 94 292 272 155 -291 234 126 3 68 65 247
4137 247 -18 17 -197 5 62 -17 248 165 -7 287 -218 5 140 -126 171 -98 -47 130 19 143 36 -189
4159 -189 229 -327 -171 -70 4 -72 132 164 -89 66 -193 155 -38 -203 373 -147 84 -26 44 85 -152 31
4181 31 -217 77 -71 -111 261 -116 -84 -37 -105 -151 298 153 183 -28 -78 213 -322 194 15 63 59 74 -207 235
4205 235 113 154 137 44 95 -22 65 124 152 140 -30 35 -18 103 -193 -73 -22 -97 116 106 -133 -134 -39 66 -37
4230 -37 164 -315 83 -56 -107 98 -190 425 -156 -128 139 -41 -111 85 144 177 -244 260 135 48 -14 279 -65
4253 -65 97 63 58 184 123 142 202 135 76 -53 49 92 -72 -104 -127 -116 -391 -165 16 -162 -13 -5 -24 -257 57
4278 57 -188 227 36 30 -106 -183 173 -102 300 17 -91 249 -112 123 -6 -195 -115 170 -273 -345 181 -42
4300 -42 -64 -205 97 160 12 97 316 12 -263 -67 301 5 147 170 -219 -204 89 66 219 418 83 78 255
4323 255 42 152 54 16 2 -10 -108 386 9 237 152 61 256 -34 77 -169 461 -71 -59 302 1 -81 -43
4346 -43 -15 36 96 91 43 -208 -87 -2 262 185 37 53 223 219 -20 84 60 173 -7 -116 48 16 74 55 222
4371 222 -114 -100 77 204 142 -106 -160 77 -94 -100 -51 31 -204 -21 -47 -3 -127 116 37 -403 100 -279 45
4394 45 8 94 -39 -169 442 -95 -372 129 -22 2 -367 -83 60 -57 -190 -140 -3 290 -195 3 -235 -382
4416 -382 135 -34 -124 -244 311 -12 -20 69 344 138 -36 43 118 -82 70 20 -275 14 23 42 44 144 328 -223
4440 -223 60 -21 12 31 -125 -383 212 -70 -194 -318 96 -140 -215 19 63 -73 -284 -29 183 211 -45 -138
4462 -138 -132 48 78 27 195 310 -102 65 -153 -118 72 185 77 150 -157 -116 -121 -80 -82 -180 -175 -164 70 -252 -323 15
4488 15 -140 -75 -18 -15 10 -296 89 -163 85 -9 262 -62 -267 140 87 -170 -119 74 128 -301 -56 162 -261
4511 -261 -94 127 -46 -169 77 44 -21 -92 -232 -47 -134 -163 -187 -111 -225 529 -148 -221 122 -152 16 -178 82
4534 82 99 90 200 -95 234 -34 -168 95 -365 35 77 -40 150 -126 -131 32 17 131 97 -63 137 -233 -89
4557 -89 -89 145 192 -61 132 42 8 92 185 155 21 -22 10 -191 79 9 122 -257 92 226 34 -139 -143 10 -246
4582 -246 -323 51 17 188 228 -189 118 28 -21 -159 115 281 -153 134 129 104 122 -65 70 2 -81 -58 -198 68
4606 68 68 -35 34 -131 -53 311 -168 137 42 -413 -326 0 205 -66 -109 -23 1 -4 -179 6 104 168 -142 -13 -66
4631 -66 -381 20 -263 233 -83 66 -57 206 -27 20 -259 -204 20 -83 393 -64 -51 258 163 -32 -128 -49
4653 -49 303 -65 25 153 -188 348 -362 -86 101 314 -98 36 367 267 -227 -36 -229 22 -207 70 -137
4674 -137 -185 50 127 265 -36 -73 -237 -16 46 69 110 -62 94 42 31 204 88 20 110 211 -16 -33 -161 -133
4698 -133 -200 -106 -179 -136 -90 -151 383 -177 -40 -119 47 -129 48 -67 41 311 158 -129 43 95 -80 -3 291
4721 291 -236 32 190 -37 183 109 -279 -153 -6 -78 114 -82 -187 -121 -431 -130 391 139 -191 354 39
4742 39 -168 -21 -255 118 -326 -171 -350 -49 111 463 -64 -117 -6 -247 97 114 103 183 -7 16 -72 229
4764 229 -15 67 267 -153 122 50 343 124 -145 231 60 178 0 3 2 -126 -11 130 140 63 -118 -143 226
4787 226 105 354 198 -38 119 -144 327 -45 213 328 -202 55 -236 -107 -109 55 -99 225 -337 69 215
4808 215 248 -168 -193 125 54 140 64 223 -69 146 -39 -127 72 229 6 170 24 314 261 -223 -148 83 44
4831 44 2 -282 -210 -112 -151 37 132 331 -107 260 -208 155 54 17 419 -72 -10 -7 -236 -131 -23 -289 54
4854 54 -161 221 -24 -165 -179 30 -232 -138 14 -143 368 -42 -278 185 -138 -43 0 -296 -56 57 -123 -88
4876 -88 271 -23 108 -140 152 -105 62 52 -21 133 -44 -311 -158 -126 110 -136 -73 97 193 -207 -152 -158 -65
4899 -65 -232 -181 371 -39 315 -257 -57 -166 80 154 -18 -23 13 -111 -174 52 -345 -106 157 -183 -7 -131
4921 -131 234 -120 95 -56 174 57 -99 98 75 20 13 45 68 -60 114 75 -39 -222 -171 64 181 147 34
4944 34 -272 29 -198 -105 100 0 -403 -106 -73 -11 241 -31 -16 112 187 -14 -142 -110 150 -156 -67 132 186
4967 186 259 -108 92 -342 -61 -42 -161 -58 -13 -403 95 4 -80 302 232 323 -128 -133 -65 -237 60 -98 74
4990 74 -102 59 56 50 216 -89 -2 -170 -19 52 -146 35 -328 -80 -38 -186 -467 -177 70 -151 194 -132 33
5013 33 130 257 -230 -469 -97 125 -121 93 91 -5 289 313 -200 34 -133 94 132 -55 108 -336 -60 114
5035 114 -44 -1 148 111 -333 -60 -134 20 -270 337 59 -112 -276 -204 -11 106 262 330 49 -127 445 202
5057 202 29 -214 137 -195 -1 31 -30 41 -210 142 68 214 15 -17 252 127 -152 -167 227 -96 402 -327
5079 -327 14 -49 74 -195 91 164 150 -173 -116 -12 -280 -413 117 204 -133 66 137 53 -225 -303 -60 -129 52
5102 52 172 -222 -69 271 86 -27 229 -74 -43 -63 -195 -55 76 -21 2 -80 205 123 88 -171 329 101 -29
5125 -29 97 -195 -134 -278 -46 393 144 -221 -180 -80 263 64 21 -24 -179 -226 -46 44 -15 180 -1 -166 104
5148 104 -272 238 187 -159 -160 122 -30 98 -76 47 -318 -19 -39 -29 -17 -49 -28 181 -205 22 -222 -171 57
5171 57 -92 -252 -117 290 35 -190 -293 -241 276 313 17 18 -196 320 29 -3 -75 -24 224 216 -136 217 20
5194 20 -167 98 108 283 -253 50 209 -67 22 -138 -196 -121 34 -26 -136 -122 101 -268 -95 -68 341 -115 165
5217 165 -66 3 92 -6 -53 8 -60 -220 223 24 94 64 24 49 263 -50 280 -3 435 126 27 -177 99 289
5241 289 208 -12 -122 -9 39 -84 465 50 -280 526 -375 -41 -247 44 -176 -255 30 85 -331 -100 82
5262 82 19 25 -44 386 332 -107 158 177 -68 24 23 24 -7 -399 -129 -58 -185 110 76 54 28 -239 -79 19 20 36 72
5289 72 -90 -64 -6 142 -115 85 -110 -182 106 -174 -373 -161 -42 -107 -64 221 -92 -30 -84 103 -38 178 -90
5312 -90 -32 155 -106 113 42 104 62 142 -104 -190 198 343 -161 -110 -290 -11 123 -303 54 -129 45 29 -67
5335 -67 -184 -172 72 -247 -12 -34 -205 235 320 -139 199 4 25 -39 134 -161 19 -70 -186 183 -107 160
5357 160 -176 51 -142 120 -51 220 -32 191 -69 -96 -259 453 -304 191 44 -138 -21 -288 -47 119
5377 119 191 145 148 325 8 212 -108 372 125 203 18 8 94 -141 233 65 147 241 186 -242 21 131 134 -76
5401 -76 90 211 45 63 -314 206 183 -17 -30 48 -160 46 -73 114 161 169 204 20 349 -81 -34 224 119
5424 119 45 86 6 12 152 261 109 196 -25 -212 -54 437 -4 121 -101 50 59 -23 -405 -105 23 -190 110
5447 110 280 55 -38 -85 -128 63 -63 87 22 263 -475 187 225 213 -182 -178 201 366 -3 169 -301 46 11
5470 11 289 -389 -202 298 -216 -57 -143 48 56 394 76 -163 -175 -195 -349 360 156 -127 63 -150 39 170
5492 170 469 290 -71 291 297 68 -138 304 -185 105 283 14 5 239 -256 180 26 328 224 71 128 -244
5514 -244 107 -5 222 -336 -226 -13 -182 177 32 126 -258 -221 26 50 -212 36 0 -242 72 -57 153
5535 153 64 223 -63 101 -136 335 -8 -222 -48 114 -57 -158 -62 -32 239 38 -106 90 2 64 -75 -74
5557 -74 196 213 -161 6 -227 -139 271 -142 78 -37 179 349 -52 -189 293 131 103 137 118 5 -62 -64 -64 2
5581 2 -223 139 163 -84 12 186 -129 -59 91 113 158 216 -116 -111 -163 37 -173 -72 90 214 219 181 100 -267 -125
5606 -125 -43 204 208 -31 106 152 210 -24 114 -288 -89 -186 254 -87 -141 -117 -101 -24 -167 195 -175 -261 152 108
5630 108 65 -97 -128 -101 59 -11 -294 -14 1 179 -239 -102 232 81 -85 -79 -83 -25 122 -191 -24 35 30 106 -210
5655 -210 -43 -160 -34 -171 -6 121 -71 -29 -89 0 236 -70 1 -141 -156 -35 -142 84 -105 -2 -164 56
5677 56 -213 153 56 -175 -60 -97 -114 -113 100 -136 25 2 -87 -94 -171 165 -8 -141 -92 -67 250 264 187 28 -27
5702 -27 54 127 86 112 294 -416 -62 283 -43 59 -54 114 126 18 4 37 -43 -231 107 195 -64 268 -76
5725 -76 -9 -204 121 72 -162 -45 115 -332 45 79 -109 -65 225 37 -122 -296 60 40 72 47 -134 -66 225
5748 225 235 -149 -191 -192 -56 366 -47 -124 -175 -321 -121 -370 -42 -16 116 6 -267 170 -143 113 71 -156 298
5771 298 -203 -125 -151 115 106 23 -33 -44 86 -11 -145 -27 -372 228 275 -105 -315 -268 19 147 -100 -90 31 52
5795 52 -80 -187 -388 -86 -180 -99 336 -4 98 17 373 -34 -59 -43 368 -154 146 126 91 92 -120 53 27 -98
5819 -98 -70 103 -92 48 -39 195 137 -30 109 135 -177 112 81 -100 45 221 316 -179 38 -25 -235 -151 -36
5842 -36 2 -36 -119 61 141 42 237 -9 176 95 176 -45 -248 -146 6 65 -128 179 -123 66 415 270 9
5865 9 -28 -184 -63 -22 24 -134 56 -61 -212 -97 -60 222 -6 -161 -88 188 -101 158 154 -68 -156 132 -238
5888 -238 238 272 -109 168 -58 -278 285 -295 -190 -68 25 -53 39 -236 -114 6 48 -57 88 -170 -11 -146
5910 -146 -329 70 -195 -69 23 276 63 -253 -104 -89 -343 -14 -135 73 -12 -217 183 69 15 -268 -117
5931 -117 277 -247 -118 -2 -192 -214 -16 180 294 244 149 44 -134 -253 -161 145 -163 -72 -350 48 286 140
5953 140 -211 98 20 -21 247 106 -189 89 58 -31 -50 -155 307 35 -8 -148 68 -2 -126 -324 -85 93
5975 93 -60 -53 84 -50 -17 -81 -53 -62 158 -174 -124 150 32 -150 -176 -385 -198 -33 -495 73 -19 73 -27 102
5999 102 212 121 -181 255 -139 -45 209 -123 344 40 -67 -392 -147 18 345 -6 81 279 146 130 -104
6020 -104 -272 19 69 323 -380 255 17 71 -37 -59 -124 -3 161 -16 -21 -21 -73 129 -171 -207 246 217 -442 -87
6044 -87 -112 102 124 36 161 147 327 -368 -27 -59 198 -130 204 370 -10 154 -143 371 -201 -17 -300 -201
6066 -201 -57 -234 -18 -74 490 -46 32 -345 10 148 157 131 51 81 -122 -33 -156 -36 50 -156 -183 221 -98
6089 -98 -85 10 -287 -76 -52 139 4 52 -104 45 33 43 -167 60 53 -140 299 -43 -30 -49 -55 39 290 -107 81
6114 81 16 -66 -32 -66 141 132 -63 -237 190 -53 204 13 -229 278 -46 -185 103 -204 205 129 201 -111 -33
6137 -33 -210 44 -470 75 -55 128 103 -401 -26 -106 542 -142 -192 -249 397 -81 -225 315 -328 141 -208 -124
6159 -124 -17 -250 288 -70 38 -98 -266 174 183 279 116 20 -198 501 -36 -64 70 166 71 17 -85 -98 87
6182 87 151 -33 -79 -191 219 67 -123 121 175 -255 17 -144 177 -11 -249 -103 251 -63 -284 47 -472
6203 -472 271 86 383 114 0 202 220 66 -151 -54 101 64 -240 -275 95 12 65 -170 -131 -344 159 137 -148
6226 -148 444 206 327 69 203 -213 -34 159 158 -202 53 -159 189 172 98 -132 218 -80 -206 -108 53 -69
6248 -69 167 -215 -220 48 414 -348 130 292 5 -76 -169 377 -349 113 -78 306 78 45 398 32 -317 25
6270 25 -37 187 -89 91 -48 -5 123 11 96 -67 -67 207 88 -67 273 -55 237 -214 -54 5 11 33 -91
6293 -91 116 -353 -139 -210 116 40 8 -79 -29 135 41 -90 220 -90 -105 -201 258 102 227 73 15 212 -241
6316 -241 -50 -24 -87 122 265 28 160 8 -120 -47 97 -95 176 -53 30 -246 0 -8 -55 80 362 -90
6338 -90 108 -28 513 287 -76 38 30 -110 -100 97 -139 -154 -420 38 33 11 -42 -38 -137 -116 67 96 -7 132 16
6363 16 -79 56 155 -71 187 -23 167 13 -279 78 40 -74 110 -61 4 -333 39 68 -37 186 36 439
6385 439 55 -183 234 -99 21 28 136 214 -194 -17 -211 280 -63 -6 7 -148 -58 -124 274 -102 62 280
6407 280 303 9 -107 -146 109 -271 -162 53 112 -127 -181 -61 124 215 180 -59 153 -70 506 -86 -80 -37 159
6430 159 270 66 187 94 -248 311 -291 14 -230 -404 316 74 -87 177 -59 -255 81 313 -356 42
6450 42 242 -54 324 -106 -55 -112 169 66 244 46 345 -103 306 -169 101 -25 138 -217 -377 -227 -144
6471 -144 -81 -191 -107 81 257 -58 -108 227 -9 281 211 -22 -45 -105 -324 105 -103 -167 111 -171 301 172
6493 172 -108 -42 8 -111 106 343 149 109 -11 -84 28 5 401 122 -89 87 124 27 193 57 -40 -403 52
6516 52 133 256 -36 -46 -168 -222 157 291 26 29 -2 -348 -14 169 208 198 107 105 -41 178 139 -242 -17 70 298
6541 298 -81 154 -150 167 -33 10 -59 70 -14 -149 271 17 -104 -48 109 -89 106 -90 -347 -165 40
6562 40 36 402 -123 -10 -160 -108 99 -215 -159 -140 20 -81 -80 -205 -8 -39 195 -3 345 1 201 -171 -196
6585 -196 125 373 76 -357 -103 -47 -88 60 14 239 -109 -124 5 10 -78 45 -403 277 -32 -227 -36 -237
6607 -237 49 -232 44 95 124 76 325 -248 162 33 -14 -41 -72 -305 175 47 204 -132 264 -172 -124 265
6629 265 296 -54 -72 158 -439 20 210 -90 195 -101 -288 -71 55 26 -42 -189 -49 91 -58 -14 -2 169
6651 169 9 6 241 -368 -24 256 7 269 -9 21 29 -450 -105 215 163 78 65 -341 139 88 -53 -104 42
6674 42 -271 126 28 127 119 33 -262 5 -57 265 -146 -30 -89 -424 87 -20 166 90 46 65 55 51 -116 -15 139
6699 139 260 183 -190 3 40 118 -86 -45 69 -74 118 -28 -101 -106 -3 29 -87 108 192 -91 -24 202 107 214
6723 214 114 183 -197 240 -374 -175 -193 -129 115 -80 -194 17 -35 201 -116 -105 309 -355 6 -145 40 20
6745 20 -79 223 -206 -37 -59 -179 -158 96 -125 143 -157 -125 -155 -82 127 -52 184 182 119 -394 194 16 -143
6768 -143 68 -103 -37 -53 139 35 194 47 91 243 272 -43 -50 -4 134 42 223 52 -273 153 -4 233 -129
6791 -129 119 223 220 -218 198 -68 135 -261 18 -60 -445 150 0 307 -109 -193 -53 -70 1 -44 -173 137
6813 137 -16 -11 43 68 -32 -312 77 288 -112 177 -345 31 -198 135 -49 -82 -228 56 -180 -106 83 26
6835 26 -27 8 172 267 279 -283 206 179 -76 71 -139 -43 -395 190 103 2 41 -240 -188 -163 70 89 -309 -99
6859 -99 -19 -7 140 -59 332 -125 145 9 132 118 -78 65 8 177 314 -175 46 102 -603 -372 -380 -20 -6
6882 -6 14 113 -140 153 -124 -66 -140 -45 129 -233 79 170 -96 -80 -11 -152 -46 -224 -151 -199 -84 -193 272 -8
6906 -8 -117 104 -22 -130 -202 -9 -64 99 -28 44 -232 80 -250 216 75 -101 -127 42 186 450 -130 -52
6928 -52 -136 -19 -86 17 -64 -310 218 -377 -224 176 -6 -18 69 -72 106 51 53 -176 -139 -74 -46 17 -191 -39
6952 -39 -62 158 -330 -7 -22 23 192 -254 283 139 109 -170 55 16 -32 -316 87 -186 -41 79 88 -153 -136
6975 -136 -331 -361 -194 -94 153 31 95 -168 -273 -154 -113 138 237 -294 0 -31 -441 13 104 -151 -119 131
6997 131 -36 73 180 99 94 34 -37 -24 391 211 30 102 -47 89 162 -200 -109 -87 -21 28 70 164 188 -148 40
7022 40 -58 161 53 260 50 -6 211 -299 -114 98 82 65 -181 -62 -155 -2 264 209 14 -228 113 5
7044 5 -171 83 -234 80 -193 168 -134 -40 176 -251 -56 -68 107 39 -12 -170 104 -74 72 203 38 -216
7066 -216 251 -162 103 -52 -196 -295 -101 -245 245 460 -219 75 -9 25 119 -45 -279 -139 -226 -76 -10 -61
7088 -61 -186 -172 -70 43 102 111 -318 -108 148 139 -258 17 -13 -342 -237 84 53 38 70 69 195 97 -122 -23 349
7113 349 -115 -152 10 -189 -44 -92 -264 116 -60 218 -240 -140 36 113 218 -96 -153 -97 -78 -190 152 4
7135 4 -138 305 -114 20 127 118 -32 -186 -127 -137 -229 82 -101 -225 -35 -327 -357 81 -288 -61 50 74 -125
7158 -125 11 26 -277 -74 322 125 -77 193 3 -41 -65 67 88 28 -24 -53 77 10 92 -9 -26 77 53 -46
7182 -46 -169 114 222 137 167 379 286 386 105 125 -51 59 -34 35 72 -259 91 3 77 183 95 134 -82 166
7206 166 224 -175 211 -34 -58 -39 6 254 -4 173 77 -422 223 118 18 127 -89 76 -113 230 -14 268
7228 268 195 0 -47 -257 161 -333 405 208 97 143 -390 28 -65 -287 202 -101 217 -230 146 -35 -172
7249 -172 -209 -32 -128 11 -292 -142 -6 -224 -113 -42 138 311 216 68 175 152 180 150 201 490 -190 166 -213
7272 -213 -142 29 -60 -63 -378 -38 -69 -64 84 23 26 -207 33 200 146 90 -282 -238 125 -306 -21 -56 76 181 -41
7297 -41 -77 -89 -177 91 66 170 -244 131 -37 49 195 104 -58 -129 12 -74 -139 176 -37 -300 154 240 -51 74
7321 74 45 -204 -15 10 -5 120 -150 -111 18 -289 88 -163 -3 116 -40 -111 -132 -32 33 -4 -65 100 -127
7344 -127 -11 -24 -46 -78 -124 -416 -242 99 86 219 269 15 -161 -19 -344 -177 86 433 -137 -33 109 -73
7366 -73 -63 -92 33 54 373 112 -16 -138 52 -59 -171 1 -244 186 -92 -166 106 225 51 -156 148 164
7388 164 156 -34 -175 5 42 29 -211 155 -49 443 193 -177 -101 83 -214 -126 238 107 114 0 118 278 264
7411 264 58 -200 160 -63 76 -315 54 311 -29 -156 -122 258 174 25 58 -159 -154 103 114 -82 -151 353
7433 353 -147 -50 252 50 -21 266 -47 -98 -73 61 -205 -132 -113 -269 177 -91 -30 131 -85 187 190 -21 -125
7456 -125 -35 218 -17 -46 59 45 412 188 -76 31 -35 -313 267 87 -306 107 4 101 53 -91 -156 171
7478 171 -36 -304 -114 162 60 -95 -14 -39 -184 138 382 -396 -146 14 245 -74 121 268 196 324 -152
7499 -152 -108 125 -279 -45 -227 100 80 -47 238 -34 76 -45 -130 117 105 63 -189 -41 -5 -327 -55 187
7521 187 212 142 188 126 -31 -247 237 68 -86 270 -48 -128 98 19 -197 -196 243 70 19 39 -39 -45 -206 53
7545 53 3 -66 -205 89 151 150 2 -133 291 -361 -285 -65 -108 207 300 -108 264 -16 -62 -91 139 210 17 196
7569 196 -9 148 8 -81 -421 287 -59 -182 90 -23 -54 160 -90 -104 213 265 -124 54 41 -183 239 -204
7591 -204 -37 164 -47 -110 -178 375 -168 -175 -3 12 368 16 196 -39 -101 236 -30 126 1 147 206 12
7613 12 -393 107 -214 51 -140 -54 -2 -31 3 119 197 86 -113 141 331 28 34 112 200 23 -34 -63 -121 -33 64
7638 64 215 148 93 414 153 23 67 -101 203 -246 -64 -148 13 -44 1 -121 150 -163 123 182 -77 55 -1
7661 -1 108 -143 -86 -203 27 323 174 350 -13 -17 596 -97 13 50 85 17 -140 -68 -216 -43 262 -366 -145
7684 -145 272 76 60 114 343 -328 -178 -206 -94 65 169 -88 -61 208 -36 68 19 150 242 28 -5 -150
7706 -150 89 37 -87 60 -30 -283 -214 -127 -196 449 -65 69 -83 -16 4 22 99 -374 204 15 -14 108 249
7729 249 -298 87 168 92 -10 50 121 164 -191 -218 -87 86 -113 -241 83 18 11 19 139 160 315 -11 -35 -121 -3
7754 -3 -77 186 -189 237 -141 212 328 -222 -18 90 -37 59 60 -277 18 -256 -268 62 -208 184 271 -3 -212
7777 -212 -80 -333 228 -182 -92 -110 -54 238 17 208 -286 233 -16 90 149 -68 -40 22 97 -154 331 -31
7799 -31 58 21 190 -64 90 -489 148 186 289 -31 -380 42 202 67 -36 47 -55 -143 -58 -444 -130 100
7821 100 -440 -108 59 134 -155 -5 171 -108 -75 -50 -102 165 -105 101 -471 36 42 -237 206 55 217 27
7843 27 289 -95 22 67 14 -22 129 115 11 200 64 -147 -82 112 -117 -209 -83 173 331 33 91 -363 -265
7866 -265 -134 -36 -74 -70 574 54 -282 46 -63 -135 240 -261 98 -276 335 -156 -8 29 174 163 -9 -18 -41
7889 -41 -98 -310 -65 -252 2 -202 50 -172 155 55 183 -232 43 -91 -33 99 39 78 6 33 -171 -78 -116
7912 -116 -371 -55 14 162 -36 -170 -241 -69 -89 85 101 31 22 287 269 -109 178 -26 -333 -22 -85 -73 263
7935 263 258 35 74 -90 44 -80 225 -130 -339 -162 -124 19 -263 23 37 68 63 177 -234 -136 -11 -148 61
7958 61 -64 346 -129 -151 130 -94 152 -89 -221 -129 10 -15 99 151 202 -231 270 14 370 -88 -285 -6
7980 -6 25 -108 189 428 -480 -4 248 -269 240 -63 -47 20 -123 -23 -4 225 12 1 -256 131 -39 -40 173
8003 173 -349 271 77 -136 115 92 22 107 382 68 -234 160 -35 -78 -42 -162 -303 205 279 -145 -172 219
8025 219 62 239 183 300 59 74 -403 -11 -15 26 -144 220 -14 113 41 -29 181 169 22 -109 34 101 69
8048 69 368 -130 144 71 -129 83 78 -83 400 26 -217 78 -328 -208 -165 170 71 185 -200 -232 -162 -119 -100
8071 -100 239 186 -151 138 -55 149 43 326 -2 124 -236 -141 214 -346 -59 -49 -200 115 -163 -93 38
8092 38 -66 -6 -35 39 -119 -211 109 -28 -244 29 -156 53 131 -188 -49 124 -51 -106 359 255 -218 -91
8114 -91 -51 -106 -135 170 121 12 -139 -47 60 165 -75 47 139 72 179 -145 -329 117 -65 6 124 29 30 9
8138 9 21 75 -186 24 225 -69 -39 -26 -17 257 -98 -52 133 249 203 170 -167 -44 366 24 324 339 121 217
8162 217 57 -81 -48 -74 160 114 -26 297 85 -141 70 43 39 -145 25 -213 -15 136 -175 84 236 135
8184 135 199 80 75 51 -18 215 16
8191A6
$$ Imaginary data points
##PAGE= N=2
##DATA TABLE= (X++(I..I)), XYDATA
0 0 0 0 0 0 0 -8 8 -8 8 -16 16 -24 32 -36 43 -56 64 -76 88 -104 121 -144 168 -192 218 -249 284 -322 365
29 365 -411 463 -519 580 -649 723 -805 894 -991 1099 -1217 1346 -1488 1647 -1821 2017
45 2017 -2237 2484 -2768 3091 -3468 3913 -4448 5100 -5922 6987 -8426 10481 -13661 19238
59 19238 -31750 105408 -5102 -88433 136538 -127312 78290 -32375 1984 20625 -58846
70 -58846 76435 -91976 36553 27991 -72855 66057 -43620 -4752 16993 -2014 -1803 -3785
82 -3785 25044 -30985 11178 33320 -37855 31761 8774 -45526 50511 -16471 -12696 35109 -30883
95 -30883 9164 -11843 14500 -10785 -5961 28473 -58337 41758 -9455 -30984 54972 -47579
107 -47579 17784 -2093 -9606 23208 -24040 41514 -45813 19436 29080 -61170 71818 -32143
119 -32143 -16838 44892 -50882 31748 -2136 -6009 2069 -17500 28719 -38542 27790 6275
131 6275 -41310 46268 -32948 -2459 31362 -26423 13691 -9933 6067 -3756 -1091 26777 -40193
144 -40193 34271 -9189 -27990 49465 -33618 12582 1912 -13529 9998 -9739 22519 -29394
156 -29394 21013 -3229 -28455 41451 -28278 10892 5704 -18359 13097 -8480 13438 -10577
168 -10577 5283 6493 -22682 20086 -29 -13398 24552 -21121 -2735 20546 -22620 19210
180 19210 -6400 -2330 2031 -11543 21749 -24117 23751 -9688 -19786 35173 -33431 21499
192 21499 271 -14223 14880 -17186 15170 -9864 11663 -616 -17180 20587 -13906 3556
204 3556 11536 -12244 2585 3077 -7197 4328 6212 -3365 -6724 5506 -1729 -6648 17658 -14328
218 -14328 1194 8437 -17579 15531 -5187 4383 -2590 -6805 12415 -18144 21684 -8078 -8218
231 -8218 18381 -23561 14257 -302 -2975 6836 -12285 9294 -9255 7841 3782 -12686 15410
244 15410 -14920 2676 9073 -9657 11583 -10045 1266 824 -2064 8135 -7380 5353 -3511
257 -3511 -4429 6744 -2190 2413 782 -5693 160 3471 -1624 3582 -998 -3333 978 -2421 5124
272 5124 -1619 4054 -5650 -1566 4829 -5176 9292 -6518 2593 -2297 -2754 6512 -6023 10048
286 10048 -9594 362 3519 -6621 11180 -6733 2186 -1201 -4361 5632 -4121 6972 -3594
299 -3594 -3176 2790 -4244 5144 880 -3183 2169 -3968 798 3154 -1347 4577 -6703 1284 -43
314 -43 -1141 6846 -5067 2715 -2982 -1097 1776 630 2641 -3164 123 -3393 3326 658 524 944
330 944 -4692 2459 -3291 4316 738 -1337 439 -4840 3976 -1225 4003 -1783 -737 -2 -3131 4664
346 4664 -2628 4755 -4715 -332 -142 -818 5009 -4414 3595 -4987 844 1773 -1673 5642 -5320 1456
362 1456 -2116 -115 4568 -2447 2256 -2980 -1121 107 1379 1471 -14 -1099 -2885 2106 -286 2878
378 2878 -361 -2218 263 -1967 1508 2441 -974 145 -2090 -1863 3660 -1217 2911 -1469 -2149 897
394 897 -1951 3971 -554 -252 -1096 -2492 1878 -13 2294 -1208 -827 -1496 85 1572 1282 1707 -3344
411 -3344 1357 -3139 3229 1396 -1869 3551 -6626 3967 -1746 1496 3626 -5262 3069 -4303 2421
426 2421 1799 -422 864 -3021 448 -261 2253 838 -166 -1482 -1938 1114 309 2646 -1030 -361
442 -361 -1715 -458 1803 252 1639 -3314 627 -2009 1390 2391 -1096 1259 -3334 543 228 1145
458 1145 1914 -1590 -812 -1301 -753 3067 -1056 857 -1103 -2900 3052 -1836 3811 -1309 -2539 2215
474 2215 -5537 6386 -1739 -114 3095 -7688 5709 -3986 2845 2499 -4910 3549 -5123 3537 596
489 596 -367 1758 -3951 558 504 815 1520 344 -2859 1156 -1430 1888 1389 -1282 1042 -4538 4000
506 4000 -2299 2306 2219 -6123 5248 -5896 4357 721 -1748 4439 -8188 6404 -4270 2423
520 2423 4075 -6813 5529 -5818 2452 2306 -2256 3749 -5266 1294 491 -1815 5824 -4440 451
535 451 987 -5450 7134 -3613 1464 1790 -7086 6779 -5148 4328 1429 -5927 6811 -8679
549 -8679 5927 461 -2998 6659 -8580 4991 -2023 557 4424 -5553 4758 -5546 1588 3916
563 3916 -5088 6664 -5431 -1095 3637 -4618 6606 -3548 219 641 -4576 7154 -4589 3018
577 3018 1223 -7344 6725 -5040 2887 2785 -5819 5036 -6458 4481 722 -3619 7929 -10269
591 -10269 5372 694 -5256 11205 -10040 5188 -1651 -5080 10321 -10571 9895 -5986 -3391
604 -3391 8387 -11433 12159 -7293 836 2908 -9003 11042 -8250 5935 -742 -6039 7956
617 7956 -7814 6727 -302 -3535 4964 -7214 3739 1217 -3052 5463 -5120 428 3015 -4979
631 -4979 7965 -5811 1182 1254 -6730 10632 -8900 6871 -1850 -5778 9642 -10686 11249 -5510
645 -5510 -744 5999 -12824 13856 -8926 3430 4804 -11793 10800 -8680 4757 3069 -7206
658 -7206 7605 -8397 3690 2265 -4784 7820 -6702 1296 2321 -4697 8354 -6673 3429
671 3429 -643 -6097 10405 -8533 6955 -1233 -6627 9350 -10417 9280 -2519 -3963 8102
684 8102 -12683 10732 -4048 -1235 7945 -11791 8766 -5769 1889 4845 -8142 9128 -9626
697 -9626 3704 3521 -7167 10918 -9662 3442 794 -5067 9948 -8883 6474 -2896 -4311
710 -4311 9250 -8718 7441 -1039 -5518 6924 -7135 5839 -266 -3358 5728 -8874 6396
723 6396 -1086 -2652 8233 -10388 6619 -2673 -2167 8648 -9958 8425 -6254 -226 6697 -8964
737 -8964 11781 -8777 2025 2467 -7937 11902 -9133 4533 -56 -6335 8670 -6585 5142
750 5142 -426 -4984 5955 -7463 6213 244 -4606 7520 -9285 4549 1552 -4662 7918
763 7918 -8259 4952 -2744 -1872 8777 -10874 10461 -6638 -1697 8282 -10034 10134 -6790
776 -6790 1306 1628 -6105 9898 -8736 5454 -608 -6938 9247 -6433 3736 1510 -5222 4043
790 4043 -4365 3625 57 -2285 4748 -6894 3462 1532 -4326 7619 -6770 1958 400 -3322
804 -3322 6773 -6496 5466 -4249 -1899 6543 -7419 8346 -4449 -1659 4507 -7271 8098
817 8098 -3882 335 2733 -6373 6512 -4677 2932 1653 -5510 6066 -6331 3154 2361 -4491
831 -4491 5096 -5518 2033 383 -1907 4879 -6200 4001 -2497 -2133 6462 -5991 4054 -1283
845 -1283 -3491 4988 -3656 3826 -1344 -1368 2636 -5410 6144 -1685 -1268 4003 -6676 4501 -1726
860 -1726 415 2307 -3845 3547 -5094 3728 543 -3213 5443 -6542 2442 603 -1358 3564 -3765
875 -3765 1823 -2039 -151 2632 -1726 2300 -1138 -2063 2358 -1163 1009 1365 -2824 1891 -2543 2064
891 2064 937 -2012 3329 -4811 3324 -1143 -153 4041 -5781 4137 -3557 877 3181 -3771 4136
906 4136 -4557 1854 -72 -1163 3619 -3422 2026 -1750 -533 2060 -618 475 -825 -848 281 32
922 32 958 293 -1272 785 -2298 1041 1436 -1961 2219 -2923 864 430 -290 2643 -3071 2181 -2425
939 -2425 339 2470 -2164 2512 -2679 483 98 -321 2208 -2319 985 -1532 -211 1682 -805 1452
955 1452 -905 -729 383 -225 1344 -146 -225 -367 -512 252 684 -42 -334 -395 -866 1131 -17 1144
973 1144 -187 -1168 22 -877 1994 -233 111 -253 -1957 1523 -718 1991 172 -1379 1112 -2052
989 -2052 2339 -454 579 -241 -2075 1468 -1731 2502 -771 226 54 -1776 1752 -955 2072 -1010
1005 -1010 -427 291 -1253 2053 -804 1086 -1496 -747 349 -245 2182 -1537 1104 -1338 324 498
1021 498 -478 1642 -2096 698 -1475 1195 1099 -423 1326 -2103 831 -544 1050 663 -800 622
1037 622 -1531 921 31 395 416 -1371 25 -749 1295 -203 237 -527 -750 382 -172 1269 -180
1054 -180 -61 -823 -62 471 487 453 -449 -213 -553 667 418 668 0 -1014 -334 -128 1152 321 166 -257
1074 -257 -946 556 391 591 426 -362 -652 -181 485 723 195 -443 -200 -578 1015 320 658 -68 -1127
1093 -1127 439 -420 1067 56 -38 -684 -1037 897 50 946 -409 -774 -376 -503 668 354 -157 -159 -517
1112 -517 1 701 86 893 -1257 -427 271 -437 1192 -487 214 -569 -1025 1615 -321 1481 -1188 -507
1130 -507 490 -1219 1868 -509 609 -435 -1032 474 -108 454 171 -828 36 -248 387 1032 -1070 465
1148 465 -832 -551 1162 -655 991 -915 -793 537 -1022 2653 -1626 635 -281 -2041 2321 -1670
1164 -1670 2039 -643 -1059 685 -1361 2315 -758 -189 531 -2249 1239 -68 307 1305 -1852 370
1180 370 -1059 509 1222 -1426 1523 -1738 396 1245 -1580 2849 -1484 -504 643 -1377 2559 -1347
1196 -1347 1053 -478 -1334 1736 -1287 1957 -37 -1536 1456 -1131 999 987 -1121 1250 -1876 1094
1212 1094 270 -586 2638 -3315 2019 -849 -1319 3606 -3099 2272 -1357 -841 2122 -2394 3941 -3414
1228 -3414 612 600 -3286 4384 -2823 1526 44 -2012 2080 -1617 2468 -907 -1328 1816 -3177 2898
1244 2898 5 -1409 2747 -3009 1146 535 -966 2333 -2242 1091 -1457 -162 2652 -2987 2597
1259 2597 -1438 -1503 2776 -2843 2992 -1176 -739 1145 -2372 3483 -1950 1139 715 -3719 3870 -2358
1275 -2358 719 2467 -3500 2812 -2211 1166 1055 -1396 3168 -4390 2716 -395 -1389 4451 -4248
1290 -4248 2300 -525 -1634 3401 -2618 2879 -2622 -128 2154 -3638 4564 -2486 -788 2416 -3675
1305 -3675 3109 -808 -495 1779 -3176 2685 -2284 1609 1380 -3912 4237 -3624 1359 2174 -2794 3294
1321 3294 -3407 1229 -170 -872 3412 -4157 2909 -1120 -1890 4298 -3626 2705 -575 -2003 2372
1336 2372 -2155 2514 -951 -904 1637 -3475 3913 -1014 -905 3167 -5141 3100 -1239 -513 2921 -3355
1352 -3355 3141 -3276 1998 1398 -3202 4632 -4798 1494 939 -2515 4237 -3620 1303 -491 -1481 2745
1368 2745 -2535 2855 -1647 -1632 3199 -3156 2704 577 -2461 2247 -2797 1637 149 -583 2427 -4006
1384 -4006 3286 -1418 -277 3973 -4676 3313 -2184 -501 2807 -2691 3290 -3733 1224 635 -2926
1399 -2926 5132 -4369 1962 160 -3167 4048 -2768 2267 -543 -1791 2450 -2990 3294 -820 -1208
1414 -1208 2590 -3732 2855 -132 -513 1970 -2703 1695 -1012 346 1402 -2006 2173 -2333 -275
1429 -275 2340 -2656 2999 -2003 -1013 2036 -2682 3201 -1342 -364 1271 -3090 3628 -2520 1088 1509
1445 1509 -3665 3563 -2793 1707 884 -1861 2176 -3468 2647 -945 -183 2492 -3853 2741 -1257
1460 -1257 -330 2248 -2246 1501 -1418 -309 1614 -1732 2727 -1667 -973 2108 -2776 2750 -333
1475 -333 -977 1013 -2372 2365 -1263 970 692 -2428 2792 -2730 2172 521 -1843 2047 -3101 2079
1491 2079 -494 -374 1900 -2533 1561 -1252 262 1862 -1433 981 -1120 -599 1555 -894 1174
1506 1174 -310 -1379 1194 -1382 1596 -245 -572 1300 -2589 1897 -713 -179 1608 -2888 1752
1521 1752 -1200 771 1352 -2011 1879 -2557 914 439 -1090 2672 -2370 686 -353 -831 1888 -1823
1537 -1823 1637 -1373 -320 1338 -911 1631 -801 -276 474 -862 1452 -263 -128 37 -933 1455
1553 1455 -137 306 182 -967 339 -219 -19 896 -891 566 -462 -434 1176 -1354 1885 -1083 -368
1570 -368 544 -1634 2278 -1172 409 -159 -1378 1848 -1150 1457 -334 -654 452 -1544 1995 -698
1586 -698 340 -98 -981 961 -691 945 -227 -391 -313 -474 559 510 523 -298 -97 -703 1000 -170
1604 -170 365 133 -1161 975 -572 1042 173 -415 238 -1215 991 -485 889 392 -820 701 -1085
1621 -1085 536 -87 157 324 -1184 246 -88 473 329 -169 -127 -207 240 740 194 65 -377 -536 252
1640 252 10 466 75 -565 69 -166 685 -130 87 -233 -479 -56 -270 682 98 -373 -293 -291 369 1 21
1661 21 -37 -614 -261 527 531 523 -82 -297 -97 43 763 327 134 -283 -55 304 93 266 222 -88 -321 -55
1683 -55 388 321 -124 -328 -482 -178 487 61 256 -435 -493 38 -37 735 -543 107 -503 -509 235 -53 690 -580
1705 -580 -152 -239 30 796 -321 500 -731 155 -125 271 511 -622 -128 -950 62 479 255 142 -456
1724 -456 -227 -535 520 305 -69 89 -415 209 -263 987 -194 37 18 -341 321 -285 684 -417 -273
1743 -273 20 -413 834 -182 247 -395 -367 47 -118 761 -75 -42 -257 -600 541 40 290 -174 -559 50
1763 50 -123 639 181 -528 -97 -622 145 388 -141 655 -877 -101 7 172 295 -183 -150 -809 188 425
1783 425 44 351 -280 -172 159 -77 610 -120 -253 -19 -474 274 372 229 613 -861 290 106 -207 795
1803 795 -813 351 -562 353 637 -344 587 -740 -67 249 -380 942 -309 -2 -284 -528 628 -312
1821 -312 755 -411 -393 334 -652 911 -140 -97 47 -1102 591 42 -157 528 -1308 705 -354 168
1839 168 1002 -812 675 -723 225 483 -509 918 -1068 246 211 -266 960 -533 -10 -339 -596 837
1857 837 -320 418 234 -1094 735 -648 573 105 -702 667 -1374 922 127 -509 1385 -1964 981
1874 981 -604 149 918 -1012 927 -868 261 569 -932 1223 -1121 80 174 -986 1031 -611
1890 -611 264 13 -895 1241 -749 734 56 -1083 936 -1058 401 568 -875 635 -1421 634
1906 634 -152 -541 1003 -1753 1248 -763 -324 1211 -1265 1005 -806 -323 976 -1197 1250 -838
1922 -838 -317 739 -1525 1902 -1026 341 759 -1848 1874 -722 530 319 -1717 1166 -1325 1160
1938 1160 393 -1178 1525 -2122 1283 101 -528 1292 -1361 947 -864 47 1169 -1388 1296 -1055
1954 -1055 -371 1438 -1299 1658 -352 -488 578 -1385 1814 -460 185 598 -1683 1532 -1303 453
1970 453 697 -1619 1132 -1199 575 603 -1227 1519 -1876 861 400 -823 1800 -2006 625 -98
1986 -98 -1223 2233 -1742 940 -682 -692 1162 -1487 1840 -1012 -532 1118 -1743 1955 -747 -275
2002 -275 973 -1944 1242 -1072 848 464 -1749 1705 -1789 527 761 -1402 1630 -1351 50 588
2018 588 -504 1576 -1531 956 -253 -968 2015 -1679 1236 -222 -1324 1625 -1602 1284 -331
2033 -331 -747 858 -1464 1678 -641 -84 1310 -1931 1538 -596 -63 1034 -1154 1005 -890 244
2049 244 908 -971 1156 -1408 144 1132 -944 1563 -1294 27 396 -1079 2122 -1362 799 -226
2065 -226 -1371 1653 -1663 1664 -42 -1129 1283 -1450 1476 -303 -296 948 -1653 1102 -1035 421
2081 421 861 -1888 1218 -1013 -12 1229 -904 720 -914 -356 586 -828 1721 -1276 163 358
2097 358 -1561 1619 -1003 160 -5 -814 1237 -927 1049 -35 -704 1165 -1505 1159 90 -550
2113 -550 1346 -1465 636 -615 24 1044 -1192 741 -1097 23 975 -1151 1260 -903 -185 835
2129 835 -781 1260 -823 6 -43 -983 1269 -725 430 -407 -811 981 -573 726 549 -695 656
2146 656 -755 652 319 -273 1033 -1114 520 68 -565 1358 -1052 579 -286 -554 946 -1341 1061
2163 1061 -749 -123 589 -874 1362 -681 146 360 -903 964 -464 212 -246 -839 662 -667 940
2180 940 325 -460 415 -893 100 398 -257 559 -667 -262 132 -4 692 -652 603 -361 -527 1148
2198 1148 -356 621 -310 -588 458 -514 467 -244 -10 -109 -671 624 -401 288 281 -790 396 -440 -20
2217 -20 167 -599 226 -490 36 70 -285 605 -607 -149 155 -77 698 -913 365 -303 -216 434 7 258
2237 258 -329 -523 137 -225 158 -305 18 59 -247 126 218 14 303 -561 233 -427 290 448 -388 110 -368
2258 -368 -71 123 310 -83 -554 -179 -20 37 627 -577 174 -365 -457 481 375 19 61 -256 371 79 66
2279 66 211 -149 192 -470 120 187 83 224 -385 116 128 97 418 21 213 -231 -131 240 -321 480 -181
2300 -181 -230 -24 198 193 -72 -124 56 113 156 93 -372 233 -456 31 84 379 130 -257 27 -308 248 -257 -21
2323 -21 300 -566 -66 190 -152 124 -201 157 -464 -59 325 161 364 -329 -364 -280 195 461 -130 139 275
2344 275 -36 -79 308 485 292 -421 -133 58 311 140 -168 -32 -303 290 64 275 137 -192 36 -540
2364 -540 229 47 -177 23 -400 -210 12 -42 255 -258 71 46 -304 251 250 98 58 -105 89 14 546 235
2386 235 -86 -106 -136 44 16 98 -36 236 -25 373 79 203 50 -459 -9 315 562 -16 -102 -56 2 -49 -63
2409 -63 313 -224 -269 12 -419 325 11 -212 -217 -183 99 -83 658 97 -254 335 -380 155 34 -178 -237 -344
2431 -344 -18 203 230 117 -175 -337 47 -243 421 165 158 -39 -370 445 -2 661 65 -340 0 -285 347
2452 347 183 -101 203 -656 233 -144 309 377 -649 -40 -355 362 249 -146 644 -390 40 -55 116 344
2472 344 -46 90 -343 -107 432 -40 -261 -208 -456 229 -130 323 -401 -614 219 -673 485 -271 148 209
2492 209 -572 277 -272 172 479 5 71 -557 -93 384 -298 206 -399 -55 73 -389 507 -32 -20 -23 -309
2513 -309 709 -229 511 -203 -637 746 -457 351 -132 -316 192 -446 499 -221 37 195 -657 -144 -425
2532 -425 231 514 -445 82 -643 197 500 -257 290 -643 -155 120 -471 973 -770 -352 -52 -590 1089
2551 1089 -383 431 93 -936 355 -542 562 56 -914 487 -493 534 -80 -125 457 -684 546
2568 546 -341 -273 649 -768 571 -233 -14 555 -560 282 -405 81 83 -542 943 -476 -80 326 -725
2587 -725 833 -387 553 345 -467 431 -161 361 -24 -486 575 -663 527 100 -405 723 -604 422
2605 422 -174 -74 627 -512 556 -629 -133 834 -657 634 -544 -202 453 -613 1083 -119 125
2622 125 432 -734 1021 -413 138 53 -905 519 -625 417 380 -453 518 -983 799 248 -50 622
2640 622 -927 247 -227 -152 685 -634 197 -353 -344 912 -554 801 -335 -249 258 -641 793 -555
2658 -555 -181 67 -301 751 -83 412 497 -853 546 -516 274 470 -859 782 -858 699 450 -444
2676 -444 704 -1096 344 -4 -287 978 -562 484 -231 -85 687 -477 880 -267 -617 371 -693
2693 -693 899 -26 -66 291 -539 634 -495 -57 543 -840 454 -334 43 479 -664 460 -530 470
2711 470 290 -450 908 -613 51 -26 -476 723 -501 276 -193 -402 398 -662 515 -213 -303 435 -656
2730 -656 682 31 -368 370 -414 438 -114 -25 613 -644 700 -779 -44 417 -42 817 -574 153 179
2749 179 -441 779 -374 259 19 -295 639 -730 234 -108 -566 633 -378 442 -170 -837 236 -733
2767 -733 411 -132 -258 441 -867 517 140 13 584 -854 508 125 -164 652 -677 487 -285 -341
2785 -341 417 -247 533 -72 7 167 29 699 -98 257 302 -215 740 -636 412 120 -439 577 -867
2804 -867 614 204 -391 408 -572 349 -48 164 346 -741 235 -209 -26 192 -136 386 -309 -13 546
2823 546 -225 371 -143 -10 125 -85 515 69 221 -2 -238 362 103 56 250 -681 225 -140 257 197 12
2844 12 420 -258 175 308 -229 244 -266 116 -161 -3 728 -109 336 -163 -152 336 -192 62 -233 -84 -65
2865 -65 -366 473 19 -66 209 -131 278 -107 477 131 -468 265 -179 329 13 48 42 -468 190 -249 328 342
2887 342 -372 353 113 70 368 -200 2 -11 -291 242 -361 8 -187 -232 -139 -61 294 -117 -166 -474 -533 68
2909 68 -94 -158 -98 -171 -9 -330 -39 320 -226 411 -258 -92 180 -77 303 29 -181 54 -132 189 -129
2930 -129 161 -154 -186 287 -332 229 203 244 19 13 36 -6 -172 -35 -23 -91 26 68 -210 177 143 140 216 150 267
2955 267 -69 90 130 2 173 163 171 107 -7 -259 99 -115 -102 -40 -579 62 -43 -221 125 24 167 8
2977 8 -210 149 -380 -178 -109 -113 226 146 65 -54 -125 -182 93 70 269 -60 34 138 -50 78 120 -251 -78 42
3001 42 -68 186 42 -25 -18 -179 -115 287 -16 -120 88 -317 -172 215 468 123 -41 -20 -10 2 112 450 36
3024 36 -9 -190 264 -107 21 -97 -168 -123 -33 -139 -236 -135 69 -197 -244 -204 -99 40 -419 -151 202 139 110
3047 110 60 35 -199 -332 -118 32 55 -157 -473 -117 200 -18 112 -82 208 -109 -147 86 70 32 34 -35 -73
3070 -73 148 233 -135 157 54 -366 215 135 174 -217 -131 -97 -153 160 21 -399 -24 -119 -62 -69 43 -5 -107 233
3094 233 -50 186 157 -214 -19 -194 -288 273 -46 64 49 -272 84 -204 39 -388 168 -117 -248 111 15
3115 15 171 -97 -10 -57 -293 86 156 -262 225 -234 49 43 -148 341 -315 102 125 -18 77 -325 103 170 -167
3138 -167 43 -85 -19 242 -390 75 -228 145 67 -178 331 -3 -29 -58 139 308 -424 321 -125 -56 -93 145
3160 145 92 -576 404 -407 -171 234 -474 96 -101 -398 486 184 -294 240 95 270 231 128 -101 73 169
3181 169 -82 260 36 68 -18 -48 8 -136 65 187 -168 263 -204 95 -288 -295 502 -202 -220 -58 25 75 -339
3204 -339 231 -379 -272 555 -367 372 172 27 186 -164 24 -254 -181 -111 -68 512 36 -99 -6 -329 380
3225 380 309 133 528 -117 468 255 -6 438 -232 150 -345 78 256 -85 222 -683 -202 284 -274 436
3245 436 -135 458 29 35 135 -304 149 -44 -399 230 -391 -7 135 107 424 -622 63 152 13 312 -469
3266 -469 404 355 -132 308 -196 186 -235 -47 135 -208 287 -451 -205 186 -190 147 -502 215 97 -376
3286 -376 338 -364 329 -34 -147 376 -360 404 -201 212 321 -414 345 -165 -66 302 -365 -21 -30 71 207
3307 207 182 326 -363 -348 190 -37 570 -545 -104 1 -319 319 -166 278 284 -135 488 -86 148 35 -314
3328 -314 489 -300 173 197 27 48 -121 245 -138 -117 231 -321 472 -346 -417 265 -141 152 -105 -17 168 -24
3350 -24 487 -138 40 202 -367 384 -98 305 -72 -649 329 -13 236 213 -234 306 -149 108 293 -364 129
3371 129 -179 87 -35 215 141 -194 257 -260 -152 330 -162 124 -152 -200 13 -146 384 -16 -8 -24 -73 317
3393 317 36 -65 214 -137 593 -243 310 -28 -177 284 168 144 282 96 -39 2 -14 17 145 547 -30
3414 -30 287 152 -209 202 -61 -98 258 -117 282 -98 322 336 51 238 -19 248 156 -125 166 -100 115
3435 115 -246 -67 317 -364 96 -172 -19 30 -370 -12 -402 173 -69 -178 384 -188 56 -197 -333 2
3455 2 257 243 -26 -232 116 260 262 53 54 -77 -326 203 119 -24 205 -141 91 -110 -226 175 -48 208 -141
3478 -141 169 433 -266 -213 -73 -141 66 -75 292 -74 56 248 -260 -118 -233 106 -10 -297 204 -376 337
3499 337 -203 126 176 -328 406 -106 51 355 -111 40 73 -74 196 -121 -431 -390 -263 120 134 179 -115 -104
3521 -104 102 7 -16 -138 -41 24 -55 306 248 182 -130 -189 -273 162 107 18 -324 245 -164 -4 179 69 106 -112
3545 -112 -143 -91 81 234 143 -171 -7 -113 211 -33 403 158 14 145 -292 -62 170 -11 33 -130 -165 -102
3567 -102 5 -159 -196 53 -1 57 62 156 48 -283 -200 17 268 -55 -144 22 98 394 297 48 -98 -270 100
3590 100 -188 -79 101 186 -92 -64 297 28 14 -36 -303 -227 -116 -249 86 245 62 10 100 401 32 -4 -266
3613 -266 -4 12 134 -158 230 -131 -126 15 10 187 -132 -198 27 -378 -129 369 72 -74 -118 -65 82 -4 -13 326
3637 326 -76 -176 61 152 -122 133 -75 -37 -114 162 36 85 -149 -132 -52 -7 -24 142 -172 155 -137 -201 -109
3660 -109 6 203 -191 20 18 -29 85 70 -308 -311 -148 79 -16 -12 37 98 -145 -301 98 138 -51 -190 -38 -43 -84
3685 -84 136 15 140 68 277 139 68 155 115 433 71 -109 78 -97 159 88 21 -159 148 327 -123 3
3707 3 -23 222 319 151 -270 43 -31 90 -96 78 -121 55 -220 89 -71 -35 16 -15 -48 -123 94 -30 -181
3730 -181 113 43 -144 157 -101 99 1 7 -232 -254 123 132 -75 504 -95 155 33 -219 105 -61 215 -39
3752 -39 226 -13 -354 -93 -56 16 270 -88 62 261 -96 40 -24 35 -330 -273 -24 -56 143 -48 -78 355 -46
3775 -46 -335 119 80 -99 -184 -282 -6 90 -97 -223 -206 -329 -101 178 -115 209 -456 -111 -202 -100 149 -159
3797 -159 -137 -201 -221 35 109 96 -84 -26 -20 259 256 18 -119 4 21 5 74 -147 84 148 11 132 57 75 103 429
3823 429 -50 -211 -212 125 132 -262 83 73 10 77 54 45 -238 75 -367 167 268 -18 -51 -148 106 -51 312 21
3847 21 -28 21 421 8 196 71 -110 -64 -230 115 137 159 221 -195 463 106 88 388 -287 51 -146 4 386
3870 386 -496 -64 99 138 200 -199 572 -119 -115 -58 148 74 -3 23 -168 -66 -155 29 143 51 -89 91 -129
3893 -129 -232 -15 192 238 -403 151 40 -93 161 169 52 -79 -32 72 78 307 -166 43 219 -209 309 -104
3915 -104 78 264 -68 285 62 206 147 -26 -86 53 92 -12 -26 90 -166 158 204 53 178 -84 110 109
3937 109 -47 -75 296 153 -21 172 349 107 169 176 -107 61 -88 227 188 -214 74 -395 373 -33 -83 116
3959 116 204 24 -427 225 142 -107 -72 -43 -109 -18 -92 479 -343 -408 -15 -175 23 -242 26 93 -90 307 -52
3982 -52 237 19 -30 -18 -43 361 113 93 -123 -228 177 -111 -143 57 -346 111 -62 304 272 259 -9 -266 133
4005 133 60 159 306 -349 -44 177 -42 143 -14 231 161 -429 84 -1 -71 -152 -58 104 -77 295 -252 -343 105
4028 105 -197 474 -12 -172 45 -163 -31 -204 -31 67 -267 -161 21 -385 293 -218 111 -209 -120 -7 -188
4049 -188 352 47 83 56 -76 -152 -162 2 -314 -113 -58 175 -97 -104 -560 126 -238 179 32 -168 320 -60
4071 -60 220 -72 -78 166 -56 252 -259 -111 -86 -405 -152 56 -302 -103 124 -10 -27 124 169 -35 219 106
4093 106 140 33 -134 -26 114 150 292 -51 -51 62 147 51 12 113 -18 330 23 -60 306 97 -69 -107 329
4116 329 197 -8 167 -93 -217 -192 -167 57 -98 77 259 -425 -248 138 -165 -201 -276 45 -44 -5 524 -463
4138 -463 167 60 -146 -1 -149 288 -396 -110 -86 74 261 -144 -2 -11 -383 288 -17 46 -223 -239 15 -199
4160 -199 -46 49 -376 -314 61 -17 424 278 257 -31 55 9 -113 -56 177 31 -97 -278 -306 73 489 44 137
4183 137 -249 -15 -45 -147 -26 105 212 -24 -33 -178 115 43 300 -174 201 142 -40 -63 57 81 -107 -251
4205 -251 -31 311 -190 -27 4 18 -146 -60 314 -37 50 -78 227 21 90 -115 38 -16 -172 16 80 -124
4227 -124 -71 -9 -99 42 -180 98 -46 117 291 233 527 -170 -115 -29 -19 -21 65 -3 43 -171 -60 -196 -254 -86
4251 -86 -144 -335 -134 265 -190 -147 -108 -133 101 101 453 -104 -52 -52 -110 223 54 75 -60 -180 -57 -166 -88 -11 -144
4276 -144 107 -94 -8 58 -180 340 -16 -284 -66 -10 108 -137 69 -230 52 75 109 -92 -92 145 73 -12 81
4299 81 14 133 13 169 -215 -168 185 133 124 -269 -135 -73 84 118 -64 -115 153 219 1 24 138 -18 339 59
4323 59 359 -107 -26 -146 -303 116 167 -123 -155 -76 -166 197 73 217 55 28 14 24 105 191 -4 438 -8 65
4347 65 159 -109 -55 -43 -132 -39 54 -3 33 167 -139 153 73 -3 248 294 -61 -2 200 -7 147 6 -47 -6 -44
4372 -44 46 26 189 434 306 133 -69 105 -59 243 94 -163 256 118 -4 42 -31 -23 -176 -39 156 57 -102
4395 -102 -265 21 196 102 -175 -33 -170 -92 64 -79 -195 61 -99 -89 265 37 62 29 -141 46 254 -23
4417 -23 -3 330 -231 34 107 -189 -89 41 134 226 103 317 211 11 180 550 21 -91 85 25 17 -205 108
4440 108 -29 14 87 -40 5 -206 6 11 -3 -145 -22 229 -109 -102 -165 91 -97 102 106 169 -56 -18 -57 -157 145
4465 145 33 -38 148 163 -9 -89 8 165 30 253 -348 69 88 118 33 -313 -111 73 -76 81 -181 -370
4487 -370 35 -399 155 -142 173 61 108 38 256 1 -233 120 -68 66 335 307 -65 -8 -34 -77 198 124
4509 124 -232 -105 314 -134 350 -328 -32 290 -17 4 68 204 -96 -131 61 48 1 -190 -133 73 -137 83
4531 83 -384 -222 -57 -277 -158 -135 -66 3 201 317 5 -116 45 33 136 -54 80 -153 98 -58 145 -53
4553 -53 111 -35 -3 149 -27 -22 -5 39 102 -2 -13 -184 -257 -7 -141 -75 189 87 16 -278 84 111 -38 215
4577 215 223 -65 -65 -93 -141 -142 -213 485 192 -153 44 184 -128 232 223 293 27 92 76 -233 8 339 104 181 -12
4602 -12 163 42 139 -81 -175 -72 -267 -30 -239 112 115 126 47 -40 -207 -36 123 -193 334 -77 166 126 54
4625 54 134 216 -92 -175 198 -110 105 -80 15 -127 -44 -192 64 -125 -113 -71 -360 -134 -20 -149 161 -37 141
4648 141 20 95 -101 28 -66 -58 -57 -82 -30 -194 -106 88 348 -119 38 91 -216 -338 230 -90 80 227 -290
4671 -290 371 -195 103 168 165 22 152 -295 -196 -62 90 -247 -262 41 -49 108 150 163 92 -145 -83 -177 40 21
4695 21 102 -312 -89 10 107 110 81 5 -80 -52 -129 280 50 -140 5 -79 -49 -222 19 11 -256 130 -125 115 51
4720 51 -356 166 -198 39 -91 71 64 -203 -117 -336 -62 69 148 -27 -215 129 267 109 134 -208 132 172
4742 172 12 -176 -331 -87 148 -16 -55 -114 332 163 170 128 -156 -26 -40 210 -367 77 -102 135 -103 53
4764 53 -67 -239 284 110 -150 -457 -122 -263 264 -118 30 -45 435 42 -6 -182 270 121 -12 -108 222
4785 222 -41 -25 297 170 -11 180 -204 18 99 314 -62 311 243 -141 -81 -88 231 -65 401 -180 32 -121
4807 -121 177 217 -273 64 135 291 18 -35 112 105 -97 -205 271 92 14 112 -124 291 75 -128 -129 221 362
4830 362 28 221 -92 -213 222 -131 41 -25 -86 -140 -17 199 383 74 -268 -133 -3 -36 204 -110 52
4851 52 150 213 -11 -115 69 -59 368 1 -122 113 -61 71 53 40 36 209 348 -23 -274 88 -176 -292
4873 -292 -90 -100 26 96 316 -191 152 373 -72 132 -299 -205 -159 -283 57 129 262 183 61 -70 -145 -92 -428
4896 -428 -123 -29 -29 360 8 -110 138 -42 161 -82 -366 35 -208 -288 -137 -100 217 115 -226 -430 151 388
4918 388 45 345 -193 277 52 49 17 341 -263 -264 -8 363 -49 -311 82 -138 4 31 269 -210 92 163
4940 163 83 -243 75 285 -178 -205 62 2 279 -85 -107 -245 -158 104 -47 328 92 -179 -147 179 -36 35
4962 35 -133 177 -27 -364 -85 117 52 18 155 -148 -264 -411 -177 159 15 -101 -68 18 363 -60 311 -109
4984 -109 113 -168 -41 316 -232 373 -187 -169 -210 76 -194 -19 176 11 201 213 58 272 -310 12 75
5005 75 132 -76 87 228 18 -191 -425 68 130 -14 -259 -22 -21 -80 -90 309 -192 202 302 -149 221 47
5027 47 86 -38 117 167 154 -171 145 -281 69 150 -90 82 -149 23 -107 136 -14 116 -223 -95 21 -40
5049 -40 -260 87 200 165 186 24 -37 145 55 49 132 -173 97 40 -280 25 -8 421 -99 6 -117 -141 -79 -96
5073 -96 161 -14 -67 69 -384 -96 142 -248 49 -95 420 -315 152 143 321 -51 -145 32 155 127 126 35 204
5096 204 265 214 -62 101 -145 -325 -96 -181 211 -56 261 -26 -12 75 -153 -92 154 -377 220 504 -201 40
5118 40 -15 202 173 -9 -88 175 55 -39 76 -41 387 -355 55 126 -84 272 -211 -183 -75 14 -12 -86 -131 -44
5142 -44 116 -173 -132 266 262 99 -58 7 -140 51 -104 55 -61 61 116 283 58 -152 148 -429 -265 -212
5164 -212 231 -37 66 296 274 62 -1 -275 -313 5 326 72 -92 -22 306 15 82 2 111 -190 116 -340
5186 -340 -48 14 450 3 -194 -21 -222 -191 24 267 -17 -107 44 -140 186 -125 259 97 -118 25 49
5207 49 113 45 79 -175 118 79 -89 -95 153 -111 -58 -237 -254 3 -49 -186 -94 143 264 138 -318 220 -95 -117
5231 -117 226 -7 -248 271 119 -69 114 158 -304 -110 -183 45 -75 75 -158 -69 205 -128 -82 -46 -77 -161
5253 -161 40 -136 -307 56 -307 -234 318 37 17 -33 -40 -126 29 42 -345 93 126 -118 119 -56 -191 -66 85
5276 85 -148 63 287 75 -91 -22 -84 -27 -21 121 131 -74 68 -109 135 -122 171 150 -344 258 -382 85 17
5299 17 -4 163 201 -21 193 -94 -111 101 -15 -54 -142 265 231 10 -11 20 34 -44 92 11 -12 -128 -225 -293 -62
5324 -62 125 24 -9 -23 -144 152 -437 -213 179 -276 181 48 -256 334 -86 37 44 -237 -212 99 60 134 -76
5347 -76 -142 -132 -155 236 -19 -55 -35 -27 -73 235 64 -7 -46 -216 112 -246 154 -112 -137 -76 21 23 -493 -28 -403
5372 -403 155 -24 135 -129 19 -65 -164 48 429 196 245 0 -73 141 -100 11 -126 194 84 -384 188
5393 188 102 -316 -60 40 290 28 -236 -145 74 -161 81 52 -138 -36 -137 31 384 -263 -160 233 -28
5414 -28 -42 141 37 9 167 -175 -103 -2 193 100 86 -106 56 23 163 117 -197 165 71 -249 -25 452 247
5437 247 123 188 31 -281 97 -26 -85 82 -13 -335 404 139 80 112 -390 132 -218 325 63 -160 -5 78
5459 78 99 -126 112 -136 -182 9 -80 109 -124 69 -30 47 36 -236 31 -13 29 -180 -117 2 75 -400 82 -397
5483 -397 -93 -182 -125 19 -201 200 -217 -85 202 -84 115 262 -169 73 -36 387 242 147 -53 177 35
5504 35 -35 23 68 96 48 154 87 19 323 -5 92 -96 73 -258 -191 -5 412 -308 54 145 350 141 -172 99
5528 99 -30 -62 217 76 100 -7 172 268 -231 -109 266 172 104 107 319 284 122 238 -206 33 159 190 58
5551 58 139 317 44 -29 -71 250 -110 318 -67 1 -61 79 -33 -67 234 200 -35 137 133 51 55 -91 -23 238 -41
5576 -41 -157 153 156 31 118 -116 99 -186 82 -94 -372 -389 -242 162 -389 19 149 130 43 -393 40 203
5598 203 -155 -63 -291 -463 -55 28 -133 51 -127 -102 -169 161 -25 226 113 157 225 1 222 -28 67 368
5620 368 110 -55 -47 33 160 104 197 -104 -223 4 185 -232 -41 -91 54 -156 30 -66 13 142 -105 -25 -189
5643 -189 -170 -204 172 59 -46 79 114 64 -274 -23 6 -38 76 45 -25 -21 127 -46 94 -266 -9 23 100 -174
5667 -174 -5 -45 199 -49 32 47 -87 124 272 179 85 -228 180 266 189 -312 -127 128 49 -76 -294 -39 -368
5690 -368 -63 -46 76 -86 -41 4 -105 78 -130 39 -195 -36 -79 -90 116 -141 -71 98 228 -125 -206 -136 290
5713 290 141 -74 -185 295 17 -86 12 -98 23 -66 192 21 -174 172 16 50 67 151 182 164 -166 -85 -216
5736 -216 -59 -28 11 -15 -53 30 -76 105 47 -281 -23 56 346 154 -20 -109 16 -274 -3 -114 -236 177 -28
5759 -28 7 -198 -40 133 36 209 -217 -64 198 -4 103 -141 -145 442 171 -82 116 -229 67 -73 227 156
5781 156 -28 -68 19 82 118 97 -18 267 -78 9 -146 -19 333 168 204 -93 -45 -34 26 26 -68 270 -81 333
5805 333 -532 -132 -53 107 -92 86 -196 42 99 -195 224 113 -64 57 39 -363 -26 50 265 356 170 -258
5827 -258 -241 -81 82 -34 224 218 43 -43 65 -16 -164 -31 173 350 210 -124 51 -130 16 -139 -180 -98
5849 -98 -81 341 299 -27 -293 6 -156 -201 433 167 -76 -241 -205 233 -35 28 -48 -6 -178 41 -182 180 16
5872 16 166 -199 30 47 73 233 24 303 -182 204 234 -293 186 158 -40 305 19 177 190 347 136 27
5894 27 55 180 41 -163 -65 32 -104 -363 105 -306 307 -13 114 -121 110 159 -88 5 16 -227 -57 47
5916 47 -245 -81 73 -61 -188 -51 112 170 -32 222 -105 84 164 56 160 205 -379 400 54 10 59 -182
5938 -182 160 27 -54 -130 168 15 -82 125 -281 185 -98 357 56 -311 170 94 357 206 13 91 19 -125
5960 -125 134 -7 31 245 301 -60 -190 -49 252 66 121 -74 -43 -12 100 58 -78 147 178 17 85 -5 151
5983 151 141 165 14 -121 -60 189 1 99 -145 314 -116 -133 -22 -30 28 109 -192 -97 -86 138 -100 -91 31 -269
6007 -269 94 33 -62 -87 -45 2 -184 62 350 393 -32 -97 187 -125 -126 -276 231 103 -20 177 -45 -23 101
6030 101 131 167 -89 -177 -339 157 -8 28 -135 -112 195 -266 199 -111 -30 -19 13 123 30 157 44 -34 -120 100
6054 100 -311 -104 -77 -8 109 -64 -206 160 18 -43 241 251 -152 90 -111 -253 206 -208 257 -65 -109 139
6076 139 70 13 -106 -169 -104 -170 -154 179 -90 -173 -38 21 514 68 -2 96 -163 406 105 280 322 133 19 99
6100 99 5 -81 25 165 161 151 168 86 231 -29 142 -38 -38 42 -256 160 291 -33 -26 -105 -47 64 78 8 -14 42
6126 42 137 -38 -165 10 76 -461 -192 290 99 -114 289 -279 55 99 35 138 98 -181 -215 -22 -76 -207 130
6149 130 -3 33 -250 -360 212 97 -148 -8 -310 -33 190 146 -247 108 -144 90 90 -131 -10 -159 -300
6170 -300 214 175 -26 -87 -80 -175 80 90 -335 -46 -191 90 337 -258 48 -33 -73 -34 -75 110 -51 102 0
6193 0 47 -86 34 -2 52 -205 -19 2 44 -330 0 -183 -78 87 -92 -310 -221 135 -169 -241 238 20 -325
6216 -325 -18 95 255 -198 -239 -134 94 35 -63 29 136 -18 82 -21 11 95 32 -268 -52 -228 118 115 -58
6239 -58 -74 -257 -22 -310 312 -18 141 -135 -127 -56 -188 -68 72 -69 159 -19 -205 52 -113 267 -30 110
6261 110 132 239 -180 -16 -206 95 346 168 103 -97 -168 15 -112 115 294 113 -91 219 -162 205 -105
6282 -105 -165 -5 -38 -170 -149 91 209 46 -177 -12 107 113 77 41 -155 27 44 180 -59 9 -96 -17 285
6305 285 110 -211 -16 115 -65 2 61 -124 -154 75 249 151 15 279 -81 -52 21 110 58 211 19 9 4 -61
6329 -61 -137 -133 169 71 -170 2 -95 276 36 -106 -55 60 -389 -9 123 -104 177 156 42 -138 54 -80 172
6352 172 -229 -12 172 222 239 -208 -242 -77 -68 -527 432 -200 -162 -186 133 29 -92 413 20 -74 228 110 110
6375 110 -292 -338 -109 -48 -52 15 -370 119 161 -18 20 49 11 7 92 284 -59 -268 147 -333 80 -46 -70 97
6399 97 -7 12 61 10 -158 44 -439 287 -123 75 323 -226 -103 -115 -43 149 -329 -295 132 -159 50 18 -141
6422 -141 324 -96 -102 -107 146 124 -161 -445 274 281 -26 124 -195 146 -32 142 233 -100 -253 -135 119 217 161
6445 161 166 -48 -45 -13 -41 263 29 -207 -62 104 -81 -200 129 50 -67 68 -148 147 -299 7 252 122
6467 122 96 69 -58 -45 150 -247 -21 -142 -65 136 -197 107 97 59 57 -203 408 -187 31 345 -151 163 131
6490 131 -202 211 44 -170 -200 11 23 -185 -214 13 -27 370 299 -194 -131 -102 -54 -312 -55 -98 71 107 126 81
6514 81 -276 101 -24 -65 105 -94 38 -60 -5 32 173 -172 -179 157 52 189 -80 -10 -233 46 -112 -279 -18
6537 -18 342 174 -63 176 -119 -209 60 117 -43 -65 -92 188 -50 4 349 -34 16 -29 230 197 -112 81 -276
6560 -276 -340 119 28 -144 277 102 -178 -165 137 153 -51 166 -65 172 193 23 -27 65 -56 -5 -130 -3 -33
6583 -33 -119 -74 0 30 68 -290 -104 -110 166 -200 194 126 -105 -365 -15 154 188 -89 27 -95 34 -18 -78 282
6607 282 238 81 -78 -24 -111 -341 0 -223 27 46 -100 182 174 266 -105 -180 -25 66 -207 45 161 -155 92
6630 92 155 -112 -38 -72 -43 221 122 318 -143 348 -52 161 439 -46 -93 -33 -49 -15 65 242 156 61 107 -127 257
6655 257 -13 51 117 -24 61 19 -43 191 86 5 250 28 164 198 89 -143 244 -37 102 -141 -238 169 -141
6678 -141 185 -5 95 -27 110 -240 265 209 13 -18 120 -49 -17 -58 -200 -6 156 -12 186 -196 22
6699 22 -173 90 -115 -109 169 169 -102 -56 -49 -7 -51 65 259 77 -127 170 16 -64 191 -569 -40 -191 -11 -40
6723 -40 -319 -88 194 207 -111 -79 175 -166 -51 -36 49 239 17 -109 18 72 -40 -418 99 -319 211 -34
6745 -34 189 63 5 192 198 5 295 -64 107 278 3 113 130 -21 -83 -221 103 69 -185 -164 -73 -48 -105 68
6769 68 -143 105 46 -53 -29 -45 -159 -363 -60 342 243 418 246 309 -42 118 -67 -6 -239 24 -80 14 -104
6792 -104 -336 137 -49 63 132 -10 -139 46 -120 -157 118 353 -299 -105 -27 161 38 42 -99 286 77 -63
6814 -63 -46 -36 -72 -158 -106 33 120 -69 102 -368 65 42 -125 -330 -143 88 344 -161 -241 117 101 -123 -167 101
6838 101 -1 213 -56 -18 85 -106 272 1 -105 56 -223 -59 -51 13 63 231 27 -191 122 241 -32 -80
6860 -80 -163 -194 -25 -288 -276 181 -351 9 69 -81 -68 -169 33 35 31 -30 -2 -46 272 175 137 -265 69 -79 -251
6885 -251 211 -151 -77 -96 61 186 109 82 -158 10 110 178 331 104 -155 101 -313 59 142 95 -43 -307
6907 -307 -298 27 -226 -379 -333 -178 -116 49 6 -264 343 -18 -16 157 -52 54 -29 -113 89 134 -374 -21 68 23
6931 23 -51 -87 -9 -180 -21 40 -16 -108 40 49 60 83 -41 -238 69 82 -7 70 114 50 -165 -64 40 -234 -250 145
6957 145 95 12 -19 -49 0 38 70 93 73 266 -122 -41 -131 19 75 -183 137 -65 -139 -184 254 -59 -55 73 -228
6982 -228 182 170 13 -117 -80 65 -50 137 32 -122 199 -88 -73 117 -54 -126 -134 -226 173 -270 -157 -203 -336
7005 -336 -69 150 408 -84 -39 39 277 -229 10 19 -49 227 -77 172 -20 -108 -142 308 121 360 -138 -169 -275
7028 -275 -198 114 -115 -115 80 213 -161 -225 -144 -169 -119 67 58 -56 -130 -168 -67 173 -76 15 140 198 -48 -3 -187
7053 -187 186 -282 -191 -127 108 -71 132 -16 -62 77 -191 -67 -256 -176 -16 -46 133 106 86 -139 -25 -249
7075 -249 -17 210 -85 184 -149 -39 -102 151 14 165 58 69 143 228 130 189 -48 -118 70 71 -223 58 25
7098 25 -384 447 102 200 54 -172 156 -116 65 -262 66 101 161 -79 -80 45 -199 -126 343 -34 -30 169 -399
7121 -399 -84 -304 -30 35 -80 30 0 -186 253 -70 -118 109 -142 107 129 59 -38 124 -74 -56 -224 83
7143 83 340 -83 -231 56 56 -126 72 -55 -177 -32 -135 48 -97 272 96 -161 -307 -91 119 64 -193
7164 -193 -56 -49 -74 265 -238 248 112 35 80 -2 40 -323 -114 -15 123 120 14 28 158 -46 -53 100 207 -16
7188 -16 516 -241 63 -33 285 36 -249 67 -18 39 -221 294 0 68 77 205 44 74 221 196 -405 228 -182
7211 -182 -53 105 -116 147 285 -81 315 -53 -117 -36 -61 -52 20 -23 -203 10 -250 27 -152 78 115 424 -94
7234 -94 14 129 -80 107 -37 -72 -193 75 142 -79 340 86 259 -118 210 -68 205 249 62 33 -277 -213
7256 -213 176 -81 -73 -202 -115 80 -226 -94 42 133 -131 2 351 -93 -349 -200 26 -93 -54 -183 -311 32
7278 32 -98 -76 -95 -25 -88 31 -290 156 -274 -120 183 -121 -297 26 -54 115 184 243 430 -63 -65 -5 112 111
7302 111 -281 125 92 8 -212 209 184 172 57 -111 -23 284 139 27 71 99 320 -90 323 -42 211 68
7324 68 217 -97 -329 -245 -124 24 -148 -213 126 70 186 -5 11 1 130 -162 -237 52 -78 114 47 115 153
7347 153 36 -53 -135 30 104 98 -91 155 -147 113 62 -232 24 404 153 90 170 -27 -81 -356 -202 70 111
7370 111 -176 167 -4 102 -166 309 -169 -55 -195 -201 82 -153 75 -74 210 -141 -211 -134 176 -85 -269
7391 -269 -20 210 -78 114 73 6 27 303 -21 -1 -12 157 170 -4 3 -27 92 -66 231 244 -73 159 174 -114
7415 -114 225 24 -266 -138 127 97 143 -196 46 -214 -32 -46 -44 -181 -279 230 46 317 -45 -147 4 8 25
7438 25 312 128 -102 4 -126 -180 -38 -4 20 74 -4 418 -55 -315 43 143 -70 -220 83 281 -358 269
7460 269 -241 -208 75 -60 4 410 75 177 71 6 -37 5 -264 8 105 -193 146 -83 106 -148 221 -73
7482 -73 309 -59 407 -162 -139 -96 17 86 4 -234 353 -111 -158 -43 -223 -157 56 -124 -4 227 39 -106
7504 -106 -228 -190 333 -339 420 163 -85 -154 -91 -293 48 101 -24 32 124 121 -106 68 127 -253 224 86 -199
7527 -199 -318 -178 -180 121 54 -11 191 227 -95 -220 -225 -191 121 -290 -126 -57 31 -52 164 149 -240 -87 -259 57
7551 57 -53 -56 -111 -115 -151 139 479 -104 -43 41 96 158 75 -88 -58 18 35 4 51 -240 -47 138 -44 -15 124 174
7577 174 -148 -167 -57 46 -108 130 -46 97 -85 246 79 148 310 45 352 -46 -186 238 -37 90 225
7598 225 -253 106 249 179 -198 82 3 -126 -16 -194 128 45 36 170 -199 288 -261 -163 84 -158 280 -93
7620 -93 -319 -139 -1 123 -88 36 34 328 -75 63 -100 104 197 -397 -85 93 139 58 -220 238 -72 -24
7642 -24 227 -136 -181 1 -15 -87 -136 111 -173 -28 -83 -37 -162 37 -181 232 303 -31 33 54 -412 -143 60
7665 60 -33 217 27 262 227 69 278 114 376 79 185 -346 -326 -70 138 310 91 -141 446 544 -61 26
7687 26 -190 -80 35 291 78 177 -151 -42 68 118 137 30 -114 -186 -86 -20 -199 303 -68 307 -116 44
7709 44 20 -92 -124 -39 46 255 90 -312 -85 -225 -129 -50 118 107 143 -48 -267 61 212 -78 143 -91 137
7732 137 159 128 149 -64 -200 -6 -52 -323 -129 -108 149 -193 242 284 -34 -76 20 -186 211 -138 -196 -27 -183
7755 -183 15 -213 -32 119 68 -72 29 -15 -118 -28 -105 -35 -45 250 -120 51 69 -196 -60 -257 -325 -143 -95
7778 -95 -181 94 132 42 -131 -194 -99 68 143 108 -218 168 -47 126 -7 -141 -268 135 221 70 90 -210 123
7801 123 -362 96 -120 -211 69 -47 -79 289 -130 -17 279 -6 168 -316 62 300 -155 -259 -260 -57 -88 -119
7823 -119 -380 -46 163 173 -115 76 265 72 30 -12 -171 -335 169 -62 -323 -7 -81 33 -244 -50 242
7844 242 -99 -245 348 -114 60 106 199 -82 253 -158 -108 251 52 32 -115 -48 253 88 119 -164 -108 386
7866 386 -52 -177 -195 -14 -37 73 -64 -72 -82 147 -187 12 121 43 -116 -84 117 61 254 -175 -324 -32 14
7889 14 -190 -139 93 70 110 -59 -59 -199 -42 254 361 -57 38 -217 90 252 -1 147 -160 -41 -23 -154 -116
7912 -116 -154 -10 321 91 -15 42 -97 199 181 179 -142 55 37 10 96 115 -46 -182 155 -4 9 -63 -12 -347
7936 -347 -219 -247 -10 37 126 204 8 55 -242 107 -42 111 -120 -25 -59 -55 184 -41 -5 157 167 -43 -118 77
7960 77 -20 -150 54 -273 -52 -180 -243 -83 -127 330 -82 194 -209 229 -122 -69 138 -184 -227 114 10 149
7982 149 344 -124 118 60 -68 48 68 -174 198 22 143 -75 44 -83 -106 -121 54 87 47 181 119 -21
8004 -21 -159 -238 17 163 -183 -128 -48 -210 22 200 -39 -102 101 268 52 105 -214 153 -57 -53 82 63 32
8027 32 -117 -119 167 -223 53 267 94 341 57 -10 154 -119 54 -14 -37 174 -192 203 -121 161 70 149 -190
8050 -190 160 256 -282 168 163 44 -37 234 -234 32 99 -165 -113 38 73 150 -137 -205 -185 129 56 -152 225 -303
8074 -303 -86 -176 142 -25 -9 279 7 -15 -140 -19 216 -189 204 -99 -42 -151 161 -181 58 94 -119 286
8096 286 83 -161 -266 189 -57 -184 179 82 -298 187 -203 -222 -13 240 57 -6 157 188 -55 12 -257 -87
8118 -87 56 107 -144 105 99 -123 -87 -230 -49 -127 -29 -143 -45 140 -15 -43 -131 -128 88 254 -274 34 -47 -84 215
8143 215 60 32 165 -30 104 -222 -42 -42 304 64 103 100 -91 -90 -186 54 47 331 168 316 -198 -2 33 108
8167 108 -122 61 -225 -40 287 -326 278 88 -226 109 64 142 -181 55 347 -33 -92 -219 21 -156 -179
8188 -179 67 -142 -350
8191c50
##END NTUPLES=NMR FID
##END=
