##TITLE=1H_Ser NMG-111-0
 CDCl3+DMSO
 8 sc, 
 31.05.2022
##JCAMPDX= 6.0         $$ Bruker NMR JCAMP-DX V2.0
##DATA TYPE= NMR FID
##DATA CLASS= NTUPLES
##ORIGIN= UXNMR, Bruker Analytische Messtechnik GmbH
##OWNER= root
$$ XWIN-NMR		Version 3.5
$$ Tue May 31 16:19:55 2022 Russian Standard Time (UT+4h)  she@DPX200
##.OBSERVE FREQUENCY= 200.1313499996
##.OBSERVE NUCLEUS= ^1H
##.DELAY= (6, 6)
##.ACQUISITION MODE= SIMULTANEOUS
##.ACQUISITION SCHEME= undefined
##.AVERAGES= 8
##.DIGITISER RES= 18
##SPECTROMETER/DATA SYSTEM= spect
##.PULSE SEQUENCE= zg30
##.SOLVENT NAME= CDCl3
##.SHIFT REFERENCE= (INTERNAL, CDCl3, 0, 15.7039)
##AUDIT TRAIL= $$ (NUMBER, WHEN, WHO, WHERE, WHAT)
$$ ##TITLE= Audit trail, XWIN-NMR		Version 3.5
$$ ##JCAMPDX= 5.01
$$ ##ORIGIN= Bruker BioSpin GmbH
$$ ##OWNER= she
$$ F:/spectra/data/she/nmr/H-F/1/audita.txt
$$ ##AUDIT TRAIL=  $$ (NUMBER, WHEN, WHO, WHERE, WHAT)
(   1,<2022-05-31 16:18:44.07 +0400>,<she>,<DPX200>,
      <created by zg, POWCHK disabled, PULCHK disabled
       configuration hash MD5:
       00 E9 B6 7A A2 85 ED C7 34 08 36 98 17 FE 4E 26
       data hash MD5: 16K
       DD 66 22 D3 5E D2 73 5B 99 E2 5B 93 42 E6 85 10>)
$$ ##END=
$$ 
$$ hash MD5
$$ 4A D5 CC 80 52 CF D8 11 DC 50 DD FA 44 C5 70 58
##$RELAX= 
##$RELAX= 
##$RELAX= 
##$RELAX= 
##$RELAX= 
##$RELAX= 
$$ Bruker specific parameters
$$ --------------------------
##$DU= <F:/spectra>
##$EXPNO= 1
##$NAME= <H-F>
##$PROCNO= 1
##$TYPE= <nmr>
##$USER= <she>
##$AMP= (0..31)
100 100 100 100 100 100 100 100 100 100 100 100 100 100 100 100 100 100 
100 100 100 100 100 100 100 100 100 100 100 100 100 100 
##$AQSEQ= 0
##$AQ_mod= 1
##$AUNM= <au_zg>
##$AUTOPOS= <>
##$BF1= 200.13
##$BF2= 200.13
##$BF3= 200.13
##$BF4= 200.13
##$BF5= 200.13
##$BF6= 200.13
##$BF7= 200.13
##$BF8= 200.13
##$BYTORDA= 1
##$CFDGTYP= 0
##$CFRGTYP= 5
##$CHEMSTR= <none>
##$CNST= (0..31)
1 1 145 1 1 1 1 1 1 1 1 1 1 1 1 1 1 1 1 1 1 1 1 1 1 1 1 1 1 1 1 1 
##$CPDPRG= <>
##$CPDPRG1= <>
##$CPDPRG2= <>
##$CPDPRG3= <>
##$CPDPRG4= <mlev>
##$CPDPRG5= <mlev>
##$CPDPRG6= <mlev>
##$CPDPRG7= <mlev>
##$CPDPRG8= <mlev>
##$CPDPRGB= <>
##$CPDPRGT= <>
##$D= (0..31)
0 1.2 0 0 0 0 0 0 0 0.06 0 0.03 0 0 0 0 0.0002 0 0 0 0 0 0 0 0 0 0 0 0 
0 0 0 
##$DATE= 1653999523
##$DBL= (0..7)
120 120 120 120 120 120 120 120 
##$DBP= (0..7)
150 150 150 150 150 150 150 150 
##$DBP07= 0
##$DBPNAM0= <>
##$DBPNAM1= <>
##$DBPNAM2= <>
##$DBPNAM3= <>
##$DBPNAM4= <>
##$DBPNAM5= <>
##$DBPNAM6= <>
##$DBPNAM7= <>
##$DBPOAL= (0..7)
0.5 0.5 0.5 0.5 0.5 0.5 0.5 0.5 
##$DBPOFFS= (0..7)
0 0 0 0 0 0 0 0 
##$DE= 6
##$DECBNUC= <off>
##$DECIM= 32
##$DECNUC= <off>
##$DECSTAT= 4
##$DIGMOD= 1
##$DIGTYP= 9
##$DL= (0..7)
0 120 120 120 120 120 120 120 
##$DP= (0..7)
150 150 150 150 150 150 150 150 
##$DP07= 0
##$DPNAME0= <>
##$DPNAME1= <>
##$DPNAME2= <>
##$DPNAME3= <>
##$DPNAME4= <>
##$DPNAME5= <>
##$DPNAME6= <>
##$DPNAME7= <>
##$DPOAL= (0..7)
0.5 0.5 0.5 0.5 0.5 0.5 0.5 0.5 
##$DPOFFS= (0..7)
0 0 0 0 0 0 0 0 
##$DQDMODE= 0
##$DR= 18
##$DS= 0
$$ [...]
##$SUBNAM2= <"">
##$SUBNAM3= <"">
##$SUBNAM4= <"">
##$SUBNAM5= <"">
##$SUBNAM6= <"">
##$SUBNAM7= <"">
##$SUBNAM8= <"">
##$SUBNAM9= <"">
##$SW= 18.0517283424761
##$SWIBOX= (0..15)
0 0 2 0 0 0 0 0 0 0 0 0 0 0 0 0 
##$SW_h= 3612.71676300578
##$TD= 16384
##$TD0= 1
##$TE= 0
##$TE2= 300
##$TE3= 300
##$TEG= 300
##$TL= (0..7)
0 120 120 120 120 120 120 120 
##$TP= (0..7)
150 150 150 150 150 150 150 150 
##$TP07= 0
##$TPNAME0= <>
##$TPNAME1= <>
##$TPNAME2= <>
##$TPNAME3= <>
##$TPNAME4= <>
##$TPNAME5= <>
##$TPNAME6= <>
##$TPNAME7= <>
##$TPOAL= (0..7)
0.5 0.5 0.5 0.5 0.5 0.5 0.5 0.5 
##$TPOFFS= (0..7)
0 0 0 0 0 0 0 0 
##$TUNHIN= 0
##$TUNHOUT= 0
##$TUNXOUT= 0
##$USERA1= <user>
##$USERA2= <user>
##$USERA3= <user>
##$USERA4= <user>
##$USERA5= <user>
##$V9= 5
##$VALIST= <valist>
##$VCLIST= <CCCCCCCCCCCCCCC>
##$VD= 0
##$VDLIST= <DDDDDDDDDDDDDDD>
##$VPLIST= <PPPPPPPPPPPPPPP>
##$VTLIST= <TTTTTTTTTTTTTTT>
##$WBST= 1024
##$WBSW= 4
##$XGAIN= (0..3)
0 0 0 0 
##$XL= 0
##$YL= 0
##$YMAX_a= 72850
##$YMIN_a= -91511
##$ZGOPTNS= <>
##$ZL1= 120
##$ZL2= 120
##$ZL3= 120
##$ZL4= 120
##$ABSF1= 10
##$ABSF2= 0
##$ABSG= 5
##$ABSL= 3
##$ALPHA= 0
##$AQORDER= 0
##$ASSFAC= 0
##$ASSFACI= 0
##$ASSFACX= 0
##$ASSWID= 0
##$AUNMP= <proc_1d>
##$AZFE= 0.1
##$AZFW= 0.1
##$BCFW= 1
##$BC_mod= 2
##$BYTORDP= 1
##$COROFFS= 0
##$CY= 11.3945322036743
##$DATMOD= 1
##$DC= 2
##$DFILT= <>
##$DTYPP= 0
##$F1P= 2.36226072786647
##$F2P= -0.459571619588291
##$FCOR= 0.5
##$FTSIZE= 0
##$FT_mod= 4
##$GAMMA= 1
##$GB= 0.15
##$INTBC= 1
##$INTSCL= 1
##$ISEN= 128
##$LB= 0.24
##$LEV0= 0
##$LPBIN= 0
##$MAXI= 10000
##$MC2= 0
##$MEAN= 0
##$ME_mod= 0
##$MI= 1.114404
##$NCOEF= 0
##$NC_proc= 0
##$NLEV= 6
##$NOISF1= 3.799351
##$NOISF2= 2.8
##$NSP= 1
##$NTH_PI= 0
##$NZP= 0
##$OFFSET= 15.70392
##$PC= 1
##$PHC0= -18030.49
##$PHC1= 5.80074
##$PH_mod= 1
##$PKNL= yes
##$PPARMOD= 0
##$PSCAL= 0
##$PSIGN= 0
##$REVERSE= no
##$SF= 200.130013532006
##$SI= 16384
##$SIGF1= 3
##$SIGF2= 2
##$SINO= 400
##$SIOLD= 16384
##$SREGLST= <1H.CDCl3>
##$SSB= 0
##$STSI= 0
##$STSR= 0
##$SW_p= 3612.71676300578
##$SYMM= 0
##$S_DEV= 0
##$TDeff= 0
##$TDoff= 0
##$TI= <>
##$TILT= no
##$TM1= 0
##$TM2= 0
##$TOPLEV= 0
##$USERP1= <user>
##$USERP2= <user>
##$USERP3= <user>
##$USERP4= <user>
##$USERP5= <user>
##$WDW= 1
##$XDIM= 8192
##$YMAX_p= 0
##$YMIN_p= 0
$$ End of Bruker specific parameters
$$ ---------------------------------
##NTUPLES= NMR FID
##VAR_NAME=  TIME,          FID/REAL,        FID/IMAG
##SYMBOL=    X,             R,               I
##VAR_TYPE=  INDEPENDENT,   DEPENDENT,       DEPENDENT
##VAR_FORM=  AFFN,          ASDF,            ASDF
##VAR_DIM=   8192,          8192,            8192
##UNITS=     SECONDS,       ARBITRARY UNITS, ARBITRARY UNITS
##FACTOR=    0.0002768,     1,               1
##FIRST=     0,             0,               0
##LAST=      2.2672688,     0,               0
##MIN=       0,             -91511,          0
##MAX=       2.2672688,     72850,           0
$$ Real data points
##PAGE= N=1
##DATA TABLE= (X++(R..R)), XYDATA
0@%%%%%%%%%%%%%%kJ0j6J6j6J7k5L2l3M1m9N7p2Q1r0J06j22J38j57J81k04K28
36A21k58K90l24L63m05M49m98N53o14O78p47Q24r08J001j104J217j342J481j633
55h56J803j998K222k480K781l138L571m108M792n704O987q937J2296j9694P0570
70E8107m0018n3267J08028q164o5704o478O1615l7226n6417N0316L0712o4915
82b3411n062L7442k319l7454J9818M6719m3080l9349O7350K3163m9493j4141L4271
95A4454R658l5163O966L0391l3878r563L3846k915j3817O054J1596j0517j4216
108g104L1450L245m0373P612K0444q117q485j394N880j5631n721K9250j2977k8472
122c0393J7128J5998p295j1742J6213K0102k6286k973L5027m395j7562j256P476
$$ y = [0, 0, 0, 0, 0, 0, 0, 0, 0, 0, 0, 0, 0, 0, 0, -2, 8, -8, 8, -8, 9, -16, 16, -17, 24, -25, 32, -40, 41, -49, 57, -65, 73, -84, 97, -107, 121, -137, 153, -171, 192, -213, 236, -262, 291, -323, 355, -392, 432, -476, 525, -579, 638, -704, 777, -856, 947, -1051, 1171, -1309, 1472, -1666, 1905, -2203, 2589, -3115, 3872, -5065, 7231, -12463, 58107, 18089, -35178, 72850, 64686, -1018, -7496, 54119, 16893, -39524, 10792, 41504, -23411, -28473, 8969, 6650, -30804, -10986, 35733, -7347, -46696, 20654, 43817, -5676, -19817, 14454, 24112, -11051, -4085, 26306, -7572, -17135, 16711, 13796, -21, 6033, 17629, 7112, -7104, 24346, 27591, -12782, -5170, 15274, 7157, -1328, -2722, 3158, -12473, -18194, 11056, -1921, -30393, -13265, 2733, -4562, -16304, -91, 20011, -6275, -9248, 25779, 21384, 3822, 2566, 10042]
135A0042Q381j0823O50M556j5161M797P592m848n672j3693R181J0048j9032P53
149a3229J1868j533p719o032K2365P380l0859P34K3147J209j5689q079K1896n74
163D885k2458J9328J2400k2756m092J6942O933k2433k412L0919j5673k5332K9292
176E543J4861k5409j6029K1977J5899l2034o696K8433j2533j7067J5403J1371
188C719j1487j3233K2269R984k7302R973K2413j7762r632J7558J2795j7095j1968
201i768K5987k364k3961J4700O519j8048m364J3859N713k2615J552K7516j5543
214h17j6078K1761P012j8284q339K1879O132k9275Q550K4302j9330j0334J9255
227F434O195j9528q276K8204q67l0857J5988K1201j6946j1223J4961J4168j9733
$$ y = [10042, 18423, 7600, 8250, 12806, -2355, 2442, 10034, 5186, -486, -14179, -4998, 5050, -13982, -13229, -1361, -2894, -10613, -16645, 5720, 13100, -17759, -17025, 6122, 7331, -8358, -16437, 5459, 4885, -17573, 1755, 14155, -8601, -12693, 4249, 11182, -11251, -13663, 17256, 1583, -23749, 5543, 20404, -5005, -21034, 943, 16842, -15192, -21888, 6545, -5988, -23055, -7652, 3719, -7768, -21001, 1268, 11252, -16050, -6077, 16336, -1426, -11058, 6500, 19295, 2200, -9768, 16219, 13855, -10106, 4594, 11113, -6935, -11299, 2560, 8273, -14342, -12790, 14726, -817, -16895, 4866, 11878, -6406, -14745, 7134, 13266, -16009, -7459, 16843, -2487, -12821, 6434, 12629, -6899, -15175, 13029, 12162, -18695, -2707, 18494, 1548, -9675, 5286, 19454, -279]
240b79j2601K6254l555k2511R177J0240p555j0819R989J3328j9326m381K1543
253I504n641j2128N589Q781o15j2248Q617J2011j2817o73Q043k340j819m150L689
268C803J853r118O593K498o545L823m17Q68L59o164N612r07n456N021j988J790
284A625J211m664O757m83n005M880j640k16O3k439O044m336k598Q704m841k490
300E72L653j038j85n520K917N914j1034K515R116o346k248K684M270l490r076
315g296J0501K960j4291N730P782m399n066L015J0563r048q493J5206j277j2660
329f773N360P225k643r617N684J2037j4531n291J5165m241j0793J583R475k236
343D04j3668R826J1481j4530r07J2219j534p937o45J2048m078j2486J2667N013
$$ y = [-279, -12880, 13374, 9819, -12692, -3515, 6725, -830, -11649, -1660, 11668, -7658, -12039, 9504, 3863, -8265, -2676, 6105, 5490, -6758, 1859, 13870, 1053, 380, 8423, 6083, 4264, 114, 3803, 5656, -3462, 3131, 5629, -916, 2907, 2490, 3358, 3717, -2447, 3165, 2258, -3198, 1823, -165, 1625, 2836, -1828, 4929, 4446, -559, 4321, 2681, 2465, 2528, 89, 6133, 1797, -801, 7903, 3062, 572, 4225, 3187, 3002, -2518, 399, 6313, -4721, -2206, 6910, 564, -1684, 1000, 5270, 1780, -7296, 3205, 6165, -8126, -2396, 5386, 987, -4079, -1064, 9499, 451, -8042, 7164, 5887, -6773, -1413, 5812, 3169, -6448, -764, 11273, -3258, -8549, 6616, 2375, -8418, -6835, 2640, 404, -13264, -3438, 8043, -6487, -7394, 4825, 3291, -4646, -5291, 6757, 2679, -9807, 2860, 7873]
357G873j2475J804P038K44r285r14J2040q400r030J1525J219p084M6N805L286
372C692r538K124J0141r817k878P707p88l618k250P086J465j0383O328O009q816
387c536n36L649J851l265l720Q761o14p791O795J420m700p83j9L861o315l491
403h433Q780l872m611M315J170Q77m059J377O155o361K92O440l045K92J017K177
419B511K386o597L405L547p112J76J883m41j436m425N977J717o777M076J817k542
435a835J215j067K895j442l412P192k110l145M203j96l61k553m63O380n661l353
451c713P076r50p71K59J115K938m734J919L677o893O18K889l540l51j268K958
467A229n21o633N050K129m974L28M22K952J13l280O444k33l657O234jk392n58
$$ y = [7873, -4602, -2798, 4240, 4484, -4801, -5715, 6325, -2075, -11105, 420, 1639, -5445, -5399, 406, 3692, -5846, -3722, 6419, -3398, -6276, 1431, 643, -2975, -5225, 1861, 3326, -7057, -729, 5280, -3536, -4072, -423, 1428, -1837, -5557, 3204, 2590, -5201, 1594, 3014, -1686, -2469, -2488, 1373, -4942, -8433, 347, -3525, -8136, -3821, -2651, -1774, -5833, -4456, 1699, -4662, -4370, 2070, -975, -683, 334, 2511, 4897, -1700, 1705, 5252, -1860, -1684, 199, -242, -1678, -6103, -126, 1591, -5186, -1110, 707, -1835, -620, -1687, 1208, -234, -3646, 3546, 1436, -1709, 2494, 2298, 1937, -616, -1079, 5301, -360, -3713, 3363, 2413, 1642, 1901, 3016, 5954, 1220, 3139, 6816, -77, 541, 3430, -110, -461, -1729, 1229, 708, -5925, -875, 1254, -3720, -3392, -2970, -18, 95, -3185, 3259, 3026, -631, 5603, 5602, 3210, 2652]
484B652Q36K406n843n59O514n453k720L753L01O00l772K74M024m572J089L100
500B630l408J351J327J181K52m684M948J408p085K872K293j898j282p94N822m32
516D501l982M761j012j112K806k170K91j415k87L795m506j966M235k209k095j360
532a725R12K417o631P74M933k906J119J239o10K606p51J510m34l133M046K78l130
549E14J189p45K135j031l987M818o66m532J493j34J438q60k220L328j890O14L768
566C232m303m02K301j400R63k899R5L251l314J161J733k86J668l040J329L842
582C931l632P60O83k027L610k60q20q15k139L765j938l855K400j959p93J017k013
599d085L277p27k186K801l78J392P4k664J706M61M51K461m495Q49L594k530Q62
$$ y = [2652, 3488, 5894, 51, -508, 6006, 553, -2167, 1586, 1887, 2487, -1285, -1011, 3013, -1559, -470, 2630, -778, 573, 1900, 3081, 3333, -1351, 3597, 5005, -2080, 792, 3085, 1187, -95, -889, 4933, 4501, 519, 5280, 4268, 3156, 5962, 3792, 4083, 2668, 2381, 6176, 1670, -296, 3939, 1730, -365, -1725, -813, 1604, -5027, -4253, 680, -2226, -1107, 132, -478, 2128, 1377, 2887, 2453, -680, 3366, 3644, 514, 1703, 958, 3093, 2062, -1925, 2893, 2227, -2305, -812, -946, 492, -368, -2588, 740, -1150, -536, 3232, -1071, -1473, 828, -572, 391, -2508, -2413, 838, -2476, -1315, 418, 132, 1800, -1240, 89, 3931, 299, 1059, 1742, -285, 3325, 3065, 2245, 1430, -709, 3056, 1118, -2737, -337, -2296, -3089, -2072, -4085, -808, -1535, -3721, -920, -1298, 94, 168, -2496, -790, -329, 122, 2583, -1912, -1063, 2531, 1, 863]
616H63j115o09J183l156J709J498k424J872j634O07L350k817j16o29j819L628
632C91j046k536Q81m31K516o94k179L719k110q65K623j425J319J47k257L033K95
649A381Q73N04l283J918L23r06Q17l667M74K657k830R96M09j188J160j686J345
666g03Q67k577J518o73j52L999k421n27J400j165K979j193k427J519j120J217
682E41L07j482K390j304j183K911j310J51j70k388J731r8N2O12l080K218J200
699A098j558J221j819j50K277k677J291Q28j812K156r19J244J790l063J460j53
715A214j175K535j798j043J391j280K218o14j940K154j417j97O56k160K089j272
731f39j195L051j274K42R50j881J629k61n93J306k520J213J604j692J300n09k58
$$ y = [863, -252, -861, 322, -2834, -1125, 373, -2051, -179, -1813, -1206, 2144, -673, -789, -1418, -3237, 391, -655, -3191, -2310, -2741, -225, -919, -3098, 621, -1489, -2354, 269, -1156, 163, 310, -1947, 1086, 1381, 2254, 2758, -525, 1393, 1716, 810, 1627, -2040, -1566, 1091, -1739, -743, -334, -1522, -362, -2048, -703, 164, -2413, -895, -1568, -1720, 2279, -142, -669, 731, -434, 2545, 1352, -1075, 444, -676, 541, 848, -634, 1756, 452, -731, 2180, 870, 1021, 851, -1537, 194, 96, 148, 760, -2320, -102, 1098, -460, 761, -1058, -1208, 1069, -1608, -317, 511, -1301, 855, -64, 1180, 2970, -93, 1367, 1214, 39, 2574, 776, -267, 1124, -156, 2062, 1448, -492, 1662, 245, 48, 704, -1456, 633, -639, -1834, 1217, -57, 185, 1135, -746, 883, 622, 29, 1335, -1185, 28, 1632, -60, 1240, 731, 473]
748D73J947k726R82J002k301J092o04J21J262k320J556O06j882K270j304j196
764a022J306j281J431l84j352K422j202k06J569j685P48o68r64K070j251m09J846
781I68j329J287J89r00J172j829L60J518k915J256L71j121J039j160J299P18k751
798a828J969l57j361J458j256J105L22j128K511q65j289K195j632J07J0j264J901
815E98j585l74K528k082M95R35j297J612j766L19J211k236J429O03j171J089o05
832b97K53Q38k243J611k08k199J906q29L83O10j214K048l33j167J918j170m84
849e77R09j135J488j270l66K269k103K38J307j934J062q85j86J425j912O99J380
866D09j753J477M50m50J108j855J276J07k348J745p5q17J099j318J520l28j862
$$ y = [473, 2420, -306, 676, 1678, -623, 469, -135, -14, 1248, -1072, 484, 1090, -792, 1478, 174, -1022, 284, -997, 434, 50, -1302, 1120, -82, -288, 1281, -404, 344, -324, -1288, 782, -469, -878, 968, -361, 926, 1115, 215, 1387, -442, -82, 1436, -1479, -223, 148, -973, 66, -1094, 205, 923, -1828, 141, -216, -1577, -119, -1375, -270, 52, -1076, 1435, 570, -719, 1476, -156, -49, -39, -1303, 598, -987, -1361, 1167, -915, -420, 515, -782, 830, -936, -617, 594, -1642, -213, 390, -781, 308, -297, -44, 794, -1449, 162, -46, -2245, -339, -1168, -785, -175, -1389, 659, 326, -841, 1077, -93, -577, 332, -803, 685, -585, -951, 1318, -785, -547, 760, -1174, -112, -997, -1183, 242, -1670, -971, 409, -1344, 133, 583, 133, 1241, -614, 662, 769, -1579, 166, 91, -726, 373, -945, 575, 247, -1615]
883a615K213r91p28J317j162J187J58o59K038j495m48J916j747N63l66q91J370
900F60j894N83J793j940R42K93m75J024j743J091O77k149J840N30j472J270o34
917C96R79m10j870J847p87j688J736o88k4M47m64J953j133n89K390j733o55J444
935A151p57P62j421P62J543k439P72J225j689L10q72L29O80j858J770P91j705
952f46J866m9m91L43j231J761p23j814K203q55o60R78n32Q63o87o64J717j890
970e11J25J395j552P05N54j72J162j476L59J383k095O33k78p28P16j352J064J029
988I61j999J485J73r18J192q88K36j3p71J762o49o32J615r66O44l86j575J912
1006A183j352j065J869j103L99K0m54J527j246N11J319k221M82Q36j198P62p10
$$ y = [-1615, 598, -393, -1121, 196, -966, 221, 379, -280, 1758, 263, -185, 1731, -16, 547, 181, -710, 660, -1234, -651, 1142, -798, 144, 437, -38, 986, -757, 334, 1011, -1138, 702, 1232, -240, 1030, 396, 1375, 965, -905, 942, 155, -1533, 203, -485, -509, -62, -526, 1427, 294, -295, 2095, 362, -293, 1151, 394, 1156, -265, 497, 2040, -399, 373, 1598, -91, 219, -653, -324, 356, -1502, 268, 1059, -646, 1220, 1171, 680, 1023, -208, 1553, 830, -984, 1219, 364, -296, 682, 150, 1013, 326, -338, 1379, -511, -386, 1009, -543, 162, 716, 544, 1706, 230, 589, 1972, -123, 510, 232, -496, 220, -1132, -68, 961, -1038, 447, 620, -298, 894, 6, 242, 229, -542, 1220, 571, -61, 1554, 588, 1232, 846, -729, 1183, -169, -1234, 635, -468, -69, -49, -503, 1024, -222, 289, 1608, -613, -131, 705, -493, 269, -441]
1023d41O08R91k195J098N61j151O87j047L56Q43j560J592Qj297K017m82j54k9
1041D05n20J278j573q55K141j399k40P27j71J091j429l95J417j670N58Q24j202
1058a013R53k50Q58O45k173J410J295k331P21L69o13k18o83J505N3j497K044q67
1076B08r84J437r25K39o38q39K223j011o24J288m41J84n96m18J729k272J73J515
1094B48j463J031K15q27R44n61R20N22k212J401J3p53Q40j234J149K19j593J646
1112E05N3r69P31j476P17N3p04J074p64m00K147j450m7P90p23P24o24j6J139j541
1132g81O63M12l74J085r35j87J073j673J034J70j611J108J4M41l1j194J497m06
1150C05j256J312q04k33O05j098J299l22n11J338r54J50K34n12P72j001j07J857
$$ y = [-441, 167, 1158, -1037, 61, 622, -529, 158, -889, -533, 310, -1250, 342, 350, -947, 1070, 588, 434, 405, -115, 1163, -410, -1265, 876, -523, -763, -36, -207, 884, -545, -940, 477, -1193, -635, 189, -1013, -60, -310, 548, 1193, -980, 430, 1725, -606, 115, 484, -129, -347, -1030, 475, 528, -969, 1075, 208, -776, 661, -264, -25, -663, -1502, 721, -290, -914, 374, -67, 117, -479, -897, 832, -1440, -1267, 248, -1215, -184, 31, -796, 148, -413, 507, 1029, -1183, 218, 231, -522, 318, -916, 233, 452, -1141, 505, 558, -411, 320, -1156, -439, -386, -1090, -16, -780, -1180, 967, -483, -530, 260, -463, 261, -363, -379, 760, -781, -118, 294, -80, 1005, 70, -117, 956, -717, 317, 487, -1124, -16, -2, 439, 408, -786, 711, 305, -951, 361, -443, -676, -71, -1169, 130, -192, -703, 635, -319, -169, 65, -447, 325, -676, -783, 1074]
1168A074j488o8J425j029Q22k86r9M08j320N81L68j079J056m53n36J279j289O33
1186aL13j618R38K11r69O61k48J321k29j023J702q80j59J032j055J28K29n36J080
1205H97j066L12J304j749L82L12l77N72j596P20R53j270Q05K33p16M79o35O35
1223A95J49j664J315l84q00J501l82J96rn48J618o24p98J146q05j76N67p03R68
1242G62o27l9J198j296J16L76j079M20o45J12Q67j720J001R83j057Q65m56n6P67
1261D92r17M76L97q57J194m80j6M80j155Q74l06r57J282m73p15R47p98J098m80
1280H6k26Q14q93N8O52j209P29m34m07J170j080O58J89q56O69J43k31K75o95P02
1300A14M22r66J321j53n40J051q66K69m83o73Q65m98n22N69o19L25J60n17J045
$$ y = [1074, -414, -482, 943, -86, 736, 450, 351, 759, -561, 20, 388, -691, 365, -88, -624, 655, -634, -1, 312, -1306, -368, -157, -1126, -465, -713, 608, 379, -644, 1058, 178, 19, 1051, -4, 124, 353, -183, 897, -169, 143, 1447, -302, 80, 392, 15, 587, -1009, -289, 664, -606, 199, 432, -284, 195, -440, 195, 344, -1320, -5, -389, -1189, 312, -70, 126, 117, -431, 1187, 563, -235, 911, 106, -70, 497, -206, 762, 135, 96, 1294, -2, 114, 490, -589, -169, -814, -702, 165, -1555, -554, 429, -628, 237, -219, -275, 492, -425, 51, 448, -409, 785, 305, 289, 769, -386, 488, 182, -775, 507, 34, -681, 266, -532, 566, 86, -140, 674, -219, -161, 491, -718, 11, -423, -830, 340, -740, -82, 107, -749, -80, 63, -168, 107, -588, 114, 536, -430, 891, 738, 198, 1249, 383, 652, 169, -504, 361, -137, -659, -90, -709, -384, -224, -741, 304]
1319C04p61l97P71p92P62J73m83Q32p78P59L48j134O70jp21O22p01P59K08j211
1339g71J362k22q27R31o16J43M02j086J069o39n15J081o56n6N46j009J021o85
1357e27l49J265j433N55O61j03O27n43RJ211j225N45K83j081M29j15k32O82j144
1376d85O43n8n88O47k26m11P70j053P29l11k65J158k21o4L92p38O39l46o57J114
1396F69j053J59O50o49O04j83m8N93r60L97M35j207Q98j08m72J024r07N25J97
1415E64j213Q10k51n67M62n16K62L68n78J133k19j99P90n82L80j33m45Q40m71
1434D35m43J115r01K39J5l95O41n50l68M82o91L11J02j99Q17q92O51L37o06P78
1454H78m73o92R75q94K34O64r18O25J14n47L97k73J03l1o84J220m29n23P59n48
$$ y = [304, -457, -854, -83, -875, -113, 60, -423, 409, -369, 390, 738, -396, 274, 273, -448, 174, -527, 232, 440, -771, 591, 369, -458, 473, -143, 0, 402, -684, 385, -254, -769, 312, -344, -400, 146, -863, 158, -527, -876, 389, -1044, -489, 172, 69, 696, 153, 162, 1373, 148, 693, 976, -105, 324, 209, -23, 659, -485, 158, 100, -488, 159, -67, -478, 292, -761, -32, -343, -608, 550, 329, 265, 657, -81, 558, 212, -445, 669, -384, -225, 425, -224, 380, 197, 149, 742, -218, 179, 614, -593, 305, 197, -275, 749, -158, 367, 564, -649, 161, -90, -657, -195, -711, -449, -81, -659, 474, 255, 56, 846, 264, 644, 511, 66, 906, 435, -8, 1107, 206, 445, 460, 65, 706, 156, -212, 270, -421, -110, -8, -207, 610, -282, 369, 706, 100, 878, 405, -287, 688, -206, 28, 692, -226, 399, 513, -34, 363, 90, 193, 162, -522, 698, 269, -254, 505, -43]
1474d3K96J19r75P56m65l64P10q21M15M39q38Q51K58k60J65n13N01Q9q56R88l07
1495A45j28O51o21N06O3j059J297p34n97O91o88M77n1n07R05m65Q2O86j130O37
1515A60P0n08K23j28L26K62o97M75J19k46Q68j098K0O36j296J056p8n84Q27n35
1535a28kL78p67O81m94m89J060q10J71K02l55M84j12l15R18o88M1J67m73P37m56
1556b50J33N51o21L36K84m18K56l20l00L13o04L23J47j75N20n39J78M18j004N89
1576a83l21r7O13n03N1L60p5O68k00o43J037o15O4L34q95N76j0l39O50n37m9K22
1598A08o33O72m12n37Q78q98N57K95q23R04j72n15O33k55L42l00m22M21n7J49
1618f5L77m28L15O09p46L80n46j79M58k23L62J03n45O66q10M8N50q26K66M6l10
$$ y = [-43, 253, 372, -603, 153, -312, -676, 34, -787, -372, 67, -771, 80, 338, 78, 243, -270, 231, 320, -536, 452, 145, 17, 668, 47, 553, 616, -443, 854, 120, -477, 214, -474, 3, -48, -555, 350, -115, -33, 653, -477, 160, 230, -278, -55, -183, 143, 405, -292, 183, 302, 56, 924, -174, -154, 482, -814, 242, 164, -420, 407, -128, -130, 248, -519, 162, -332, -821, 239, -571, -400, -198, -553, -69, -181, -496, 422, -266, -225, -58, -531, 206, -250, -117, 434, -187, 149, 433, 15, 271, -49, -349, -36, -640, -317, -170, -345, 175, -364, -186, 232, -772, -183, -504, -601, 12, -491, -440, -80, -155, 513, 313, -330, 707, 92, 156, 490, -405, 171, 161, -178, 472, -65, -114, 108, -525, 147, -265, -802, 76, -822, -265, 30, -793, 111, -61, -576, 57, -198, 144, -156, -578, -157, -214, -65, 312, -116, 199, 808, 62, 442, -104, -283, 175, -48, 314, 417, -128, 538, -272, -224, 326, -500, -234, -188, -498]
1639d98M28n72K91J61l11N83m3l93P93p18J1P45m86N30k3j95L64k43j16K04n85
1660g3K72j99k18M31o31K91K06k78M21l1j53K3m23K73j03l23P84m47l26J067l70
1681A93P2K94o65N31j13j45L00o88P51J0n53R13n42j49N0j61l6o7o11O10m27N0
1703c83L39n67M25k56r9O39n39K5Q13p99P53L3J1N05n23k3L62j079P94j10o26
1724c05N39n52J39J49l35O05l21j44Rl16L42K01n02L53J16j43L97l86K66K76o23
1745b35L06j07p8L42m87M55J39j44P47n24l13O87n95j3L06p28N27n19K4M37p79
1766e52K07J07k60M22m97j60N51l00L60J79k74Q52n64J56R4k63J31j4l21N78o46
1787b14L11n4k77M00k43j29N3j86KK02p30Q58p7l99P77n72m2J03q2K94m98O4L71
$$ y = [-498, -70, -642, -351, -190, -501, 82, 39, -354, 439, -279, -268, 477, -9, 521, 498, 303, 667, 424, 308, 512, -73, 199, 0, -218, 213, -418, -127, 79, -199, 222, 191, 38, 61, -362, -89, -192, -515, 269, -178, -504, 563, 193, 265, 559, -106, 425, 312, 167, 467, -221, 530, 540, -13, 900, 358, 209, 259, 98, 62, -5, -616, -6, -433, -383, -44, -611, -186, -442, -541, 98, -441, -416, 397, -402, 351, 384, 395, 900, 377, 354, 716, -363, 431, 321, -305, 234, -318, -179, -30, -365, 240, -81, -225, -216, -532, -190, 11, -491, -138, -22, -165, 232, -154, 112, 388, -235, 71, -36, -114, 228, -259, 196, 335, 191, 938, 414, 101, 788, 193, 180, 486, -242, 285, -234, -210, 227, -552, -345, -238, -498, -76, -573, -733, -182, -482, -122, 57, -217, 635, 71, 227, 321, 58, 189, 175, -146, 432, -214, 97, 43, -234, 166, -77, -206, -153, -339, -337, -135, -865, -7, -84, -483, 294, -278, -320, -217, -299, -5, -503, -439, -68]
1810f8j42M78j46k87O32j77l2K66n17M76po34N47k89L5L58p79M16j44l62q8k4
1832d88K5M4k15N72l13n9P99m38J31K46k22J4J66n24Q07o14K84J72n01O19l47
1853A58l28N44p60K84L61l48J58m7k8J64l47M46R9o71L18j89J5K15l68L02J18
1874I6k74O90m62j54O06n22K42J98k75O01o04L4K94k16J16j34m97N48n83J39K10
1895E3l59L38k48l00O57k32L79j52p5J58j50j13L25j69n9M65n11N92l13j51M23
1916E58o23J44m8m04N16j39k7K94m94L55r3m32M98k55o2N06o93M20P5l50L54r1
1938Ij61K79l26K40J80n64P53m49L62J98k85R2o5k79M32l65k32P1J55J76m6m57
1960b82N73n13m2K53n18P63k20k96M65m12K36L79m92L76o2p1L53m96J07J9m64
$$ y = [-68, -210, 268, 122, -165, 467, 290, 258, 524, 7, 483, 476, -158, 389, 100, 135, 493, -286, 130, -14, -376, -464, -488, -463, -419, -634, -62, -375, -434, 365, -73, 58, 304, 82, 96, 262, -262, 545, -69, 215, 387, -114, 505, 158, -170, 374, -386, -102, 259, -89, 69, 22, -6, 158, -189, 257, 356, -315, 3, -186, -171, 44, -324, -22, 96, -178, 512, 50, -104, 502, -20, 222, 420, 145, 746, 142, 176, 470, 254, 370, 236, -261, 287, -296, -157, 53, -306, 32, -216, -516, 141, -91, 288, 136, 61, 219, 69, -44, 281, 112, 53, 518, 7, 599, 286, 135, 558, -65, 79, 31, -373, 143, 4, -23, 271, -223, 132, 39, -393, 105, -150, -212, 294, -399, 21, 96, -254, 100, 9, -152, 127, -199, 41, 221, -343, 410, -39, 323, 521, 236, 328, 263, -16, 416, 51, -181, -110, 45, 221, 175, -282, 291, -222, -264, -11, -529, 234, 14, -282, 183, -229, 7, 386, -106, 270, 208, 137, 490, -6, 101, 120, -344]
1981c44O71l67o1J44j53J16K42j115O60M9k13M44o36K48N56n76L34l24R2J90l40
2002c83L18j72Q0M71k97J62P8n40M71N4n79M36m44K77K86l38K58l5j50L01n07
2023b53J64J78p08P07l38r4L91l96M13K55m69L16k49K6J10m21N29K9j12K50l68
2044d0j3M89n84J24J58o53K49N7L6L83l60j82M86l50K94P1r4Pm02L06L4j47N10
2067C79m26N8M35n73L32k1n12P41o08K13J16k51M44m12M8M56q99L99J00k46k6
2088b53L8k28L53j03o4J10j45M17l40jL15j30K94K21o42N86j33j16K75k28k20
2109FO6j49K49j41k36N83p30L32M5l31L01j4k37M74m26N4L62n25N74l17L9O42
2131F21p52J34L14m50L37m12Q1M10m66M15j66m0L31n80K73Q2j58q6O7j32K15k61
$$ y = [-344, 327, -40, -101, 43, -110, 6, 248, -867, -207, -158, -371, 73, -563, -315, 241, -335, -1, -325, -233, -43, -383, -65, -237, -157, 314, 17, 179, 257, -283, 188, 242, -337, 99, -345, -68, 218, -120, 138, 103, -47, 254, -253, -89, 89, -619, 88, -250, -344, 47, -349, 64, 319, -150, 166, -83, -57, 53, -368, 161, 190, 78, 328, -40, -53, 436, -148, -24, 134, -519, -270, -213, -177, 206, -154, -336, 150, -200, 94, 165, 71, 78, -324, -18, 16, -131, 379, -47, 11, 446, -127, 205, 184, -328, 413, -195, 18, 134, -117, 327, -85, -37, 419, -480, -81, 19, -227, -253, -215, -443, -90, -193, -257, -147, -292, 125, -215, -216, 99, -31, 263, 484, -158, 428, 295, 179, 454, 226, 6, 72, -77, 172, 31, -205, 378, -352, -20, 25, -306, -5, -19, -256, 218, -208, -154, 208, -317, 257, -60, -21, 621, -131, 3, 317, -133, 204, -208, -127, 283, -183, 232, 66, 26, 357, -223, 50, 132, -26, -112, -45, -177, 38, -223]
2153b23K79L9m74O38o56K82O5l23L36K1k36M57Nl24O72m83J16j56l00N58l15j13
2175a35N22o59K55J50l98L17l91J49J54l39L7L23j71J02o5j34O06l07j13J56j83
2196a24N5k03K83K00m43O92m78P1K53l41K17J56m54M17j98k00L45n10K54j3m49
2217d70L38m39K60K99l40M48j41j84L05J67l82J69k11J86K59m80N20j48k07N01
2237D50n07o8M81o52J97L8K3k20J31n6J17k91O18j95k21L51j46j64J66l53M18
2258A17k35KN32m85N43r4m46K50l50K9N35p30M78Mm6L78k86r6P8k48k6j00k15
2281d11K33Q5k00M78o57Q09l45o3J75k97J19K62m55N11kl10Q53o10Q7j48o9K44
2303B89p9o70O07k25J87j87n7K71j79Q1o9j15J00k1k00L15j08m3L54l57L11p0
$$ y = [-223, 56, 95, -379, 259, -397, -115, -50, -373, -37, -16, -252, 205, 210, -114, 558, 75, 191, 35, -265, 293, -22, -135, 387, -272, -17, 133, -265, 52, -339, -190, -36, -375, -338, -15, -186, -84, -149, -283, 323, 16, -97, 59, -124, -69, -272, 11, 211, -232, 460, -18, 53, 306, -35, 182, 338, -116, 301, 103, -97, 248, -262, -8, -21, -470, -132, -571, -311, -12, -352, 96, -45, -229, 76, 243, -139, 30, -181, 5, 264, -216, 304, 156, -51, 450, -57, -125, 356, -296, -99, -61, -38, -258, -127, -183, -66, -357, 261, 66, -155, 196, 50, -114, 52, -301, 117, -118, -116, 416, -69, 474, 380, -66, 184, -166, -137, 398, -332, 146, 150, 104, 482, 196, 100, 178, -70, -96, -196, -411, -178, -93, -293, 185, -472, 337, -8, -71, 104, -193, -74, 188, -267, 244, 242, -68, 785, 175, 262, 114, 45, 289, 210, -460, 147, -78, 109, -78, -135, 136, -43, 38, -31, -146, -46, -67, -267, 48, -60, -103, 251, -106, 205, 135]
2325A35l38M73j00j22j06k07L75J56l50K88K29j35R7o74N85l2m78L68k87J12K8
2346A7j38R3o5j5J70j50j9J33l42O78J10m40J89Q5k56J96k56K34j02p0r6l9L69
2369B86j34k18M56l12j98K34k95n0J00p1J64m2k52M04n7j26n9J60P4k83J53K06
2391A40m77N07r9k07M15k29R7Q8m61K23Q3o9j4k07L30K19m28J80l97M12r3K5O
2414D4N5l64K35l37K00M54m40J09J52k56N13n06j17M50m20M41J5j22J86m03L2
2435g9Q3k77J18J57k78K23l03L04K17l58q1L68m52N53n37L8J79j69M96m40M8L80
2457A90l61J55K04k37P4r1j28M17n12N43k66k67P94n34k02N15m21k38K77l47M76
2478D1k0k37J75j29K93l34nL04k88J15J22j15J46J97k94P5j80J66J37Mk46J46
$$ y = [135, -203, 270, 170, 48, -58, -265, 110, 266, -84, 204, 433, 298, 395, -279, 306, 274, -204, 164, -123, -11, 17, -121, -28, -93, -108, 62, -88, -107, 26, -316, 362, 472, 32, 221, 306, 50, 246, -10, 224, 122, 52, -44, -83, 286, 152, -66, 390, 78, -120, 114, -181, -231, -131, -202, -38, -80, -332, 72, 15, -111, -170, -10, 64, -219, -66, 140, -337, 170, 71, -136, 279, 50, 147, 235, -226, -3, 80, 11, -3, -210, 120, 339, -89, 91, -306, 106, 13, 38, 44, 99, -265, -30, -367, -167, 287, -153, -44, 108, -148, 365, -141, -258, 192, -228, 213, 228, 106, 292, -111, -79, 4, -273, -155, 2, -276, -53, -356, -52, 165, -193, -274, 94, -358, 195, -342, -304, -125, -294, 202, -238, -190, 190, -171, -16, 188, -49, 25, -66, -194, 223, -289, 254, -12, -279, 515, -19, -221, 294, -127, -365, -88, -435, 41, 21, -216, -41, -170, 123, -211, -216, 88, -200, -85, 37, -78, 68, 265, -29, 46, -134, 32, 169, 173, -73, 73]
2500G3k48J60j61R6K06k57L31k35k13L72m00L87L2l11P4K99q1j70%j29L61k49
2522f3M07m48L6K97k22Q2N0j02J62j3K3Q1l26qL45m60N5J1k94M69j52k33M44l42
2546b01L04j21k56K27j46K58p1J69q5P9n6N2k54L67j76j4n3%QK70k62k08K77k20
2570a12J17j02K14m03O6K7M91m03J86j0j20P3k93Q8J87j55M12n70N43P2n20K93
2592H1Q6l29L89n11K15L10j59j17J06k14J96Jj21Q5m68K72M8M1k3L2N6K93n33
2615b64L53j24N6L96m23p9O4M7N8k07K98M8j55N7k07j11O6J73p2J26n04N95j76
2638A5l96M91l50K89J34j76O2o9p1K31k54J40k4P4n1J83l93L00j67j82L70k17
2660f1J16N1k21K57k73L98K5n93L00j58j75K13l10M52j57Q2J86j57J68L1m67K39
$$ y = [73, -175, -15, -176, -80, 126, -131, 200, -35, -248, 124, -276, 111, 143, -168, -94, 205, 124, -46, -46, -175, 186, -63, 344, -104, -68, 229, 7, 89, 139, 37, 199, 186, 209, 290, -36, -44, 301, -159, -104, -93, -387, 82, -70, -303, 141, -201, 103, -18, -274, -47, -193, 65, -6, 163, 78, 157, 101, 153, -101, 266, 90, 76, 23, 23, 31, 301, 39, -169, 108, -112, 5, -97, 117, -286, -220, -193, 298, -105, 81, 71, -49, 24, -269, -181, 6, -149, 263, -307, 236, 308, -212, 81, 167, -162, 227, -284, -69, 241, 82, -35, 71, -143, 53, 54, -67, 18, -450, -178, -130, -89, -112, -80, -24, 269, -264, 89, -35, 21, 417, -6, -85, -21, 26, 84, -123, 175, 223, 68, 125, -82, -193, -127, 46, -26, 100, -404, 191, 15, -381, 110, -240, 49, 183, 7, 69, 0, -71, 160, -94, 46, 22, 96, 45, 228, -165, 135, -32, -214, 156, -61, 55, 106, -115, 142, -131, 267, 292, -301, -1, -159, -334, -121, -431, 21, -136, -54, 132, -25, 143, 174, -293, -54]
2682e4J87j50m6R7j41J45j48L86l12j27K59k21J65O8j34J99k9k50J69j79j13M62
2704B33m87R7P0K90p8k10L08M3k56K83k69j46J80j56O7K15l72L0K53J6pj03k5
2727b4rj05K54j10k40M86m62n0L95j27j29P9k00L15k56R1J37k15M42n8J1J3l15
2750g7L79jl38J26q9n9M25l02J37L4k25J51q4k9k06R8j34L15k45K8L51r2k14l3
2774h4L77k33o4J05r3q1J06j55K78k7o3L20k16m6K23k77l2j12j07M06l37P8j51
2797a85J82m9O4j58J83m27L85J34k00M09q7j38K54l93l8L92k69j07J9j07L27m
2819A87J5K0p0J34R3m89J9JJ9P9l27N61k18K82k52q0J32j62k66M29K6j94J42K4
2843A05QK1rp2j59J65N4k54J66O2j64K00k06J76r0m7K89p8j98n8j05K07Q8k55
$$ y = [-54, 133, -17, -63, 34, -107, 38, -110, 276, -36, -163, 96, -125, 40, 108, -26, 173, 144, -106, 63, -116, -229, 233, -254, -157, -87, 203, 125, -85, 223, 266, 10, 293, 24, -122, 58, -98, -31, 184, -188, -158, 95, 111, 104, 1, -24, -33, -138, 116, 6, -234, 252, -210, -260, 135, 8, -121, -42, -242, 73, -183, -92, 45, -170, 272, 214, 225, 238, -77, 302, 301, -37, 89, 0, -59, 366, 64, 201, 235, 10, 161, 77, 48, -158, -60, -194, 121, -124, -96, 255, 163, -51, -84, 293, 60, -4, 101, 8, -73, 33, -122, 156, 129, 66, 386, 170, 124, 347, 70, 38, -74, -181, 225, -112, -34, -185, -3, -52, 12, -146, 37, -390, -5, 129, -71, 338, 251, 113, 367, -26, -64, 328, 59, -48, -29, -136, 191, 187, 202, 222, 152, 286, 379, -110, -91, -90, -71, 8, -319, 242, 24, 306, 54, -26, 106, -56, -322, 107, 133, -61, 81, 105, 113, 134, 125, 53, -106, 59, 113, -141, 25, 87, -77, 123, -83, 93, 3, -44, 245, 167, -31, -89, -194, 13, 101, -154]
2867a54n6L39k7J14k84J85k4k89P9mL26j49j94L50n2j55Q2k0n6J07j33M2k16K68
2891G9m07K30J18j43K6M8J73l20L25m31J92L5Q5J59k49kJ40q0J05N9m62L56K9
2914F5j86K8J31J21J87l40k65M25k23K11k79o6K09r5K34k86J40L8l45K50J75l99
2936b70J23M69n05L17k21R7k7K03M1L1n13K38j37J81P8j10j03m7R3K39j61q8o7
2959a39nJ43k00L5M30k54J26q0k65L96j70qn9j7kK93m84L12m18M05J18k40N8J31
2983A06l68L66j55p0K59j71Q4L8j67j50M9K14J14m31K53m1n0K5J5J32K24j92n0
3006C4j86J80J55k02O7K09k31J20P0k26J4k19M02p4j93L41j87k02J58qL99k37
3028A84k69J21r6J77L4m36M66q1j82R3l8J78n5j28K60k79K69k68q3nK92k31J26
$$ y = [-154, -210, 129, 102, 216, -68, 117, 93, -196, -117, -121, 205, 56, -138, 212, 160, 5, 87, 67, 11, 118, -15, 27, -189, 79, -328, -98, 20, -123, -97, -49, 124, -196, 129, -302, -110, -75, 10, 169, -80, -82, 58, -22, 83, 142, -320, 36, 65, -121, -93, 38, 159, 346, 6, -259, 166, -57, 154, -125, -191, 18, -77, 157, -129, 11, 49, -296, -46, 129, -270, -147, 322, -183, 134, -87, 10, -17, 186, 227, 258, -255, -17, -154, 27, 105, -5, -108, -155, -62, 177, 16, -72, -139, -144, -1, -201, -166, 264, 10, 136, 56, -209, 187, 17, 9, -50, -67, -69, 224, -260, 52, -366, 39, 157, -83, -25, 106, -262, 104, -51, -121, 138, -33, 51, 89, -78, -228, -179, 35, 149, -282, -29, -70, -120, -95, -80, 52, 276, 84, 34, -152, 28, 183, -19, 48, 257, 26, 146, 216, -10, 4, -215, 187, 113, -80, 261, 74, -128, 30, 22, 421, 184, -85, 36, -60, 117, 151, -285, 181, 100, -82, 11, -27, 151, 96, -32, 228, -51, 218, -50, -133, -138, 154, -77, 49]
3051D9k07J08J11k2k01K64k50JK02k0j30J85Nj71oQ5n2k08M54k89L05j23k73K31
3075D8j26K21K8O6k70J67k17J98j93K15j26q2L26l43K00k70K00j59K83l68J98
3096dR1m5L8r9K84j77j65J03r4J40J70q3j85K13l96O2J86q4P2o6K16n1j45K59
3120B40k42J23J31k71r5J76j51j39J94k0K11j47P6J78k90K37l17J6L1J72j05p9
3142g1J4L8j18J69rl9O8p5j84K53L1l74K46j51J75l33M06L75o06K13J21l44O36
3165D41o26J8M10m43N35l9k36j53Q6K34k54P0j10M4j10l6M80j84L7k58K6J6j38
3188a90L18l50K8J35J44j60Q2p7J87k75K66p6mO8j83k05N94l64N7J40k58K94L0
3211B01j33J71l68M4J64j46o1K97k60R9q6j31J48q5M28m20m8J04J61k08Q0M8J58
$$ y = [49, -158, -50, 61, 39, -162, 102, -148, -147, 55, 35, -95, 90, 95, -76, -82, 3, -49, -257, 197, -92, 213, 90, -183, 48, -78, 143, 171, 237, -33, 134, -83, 115, -78, 137, 11, -71, 255, -88, 112, -158, 42, -117, 166, -202, -4, 87, 42, 80, -19, 265, 88, -77, 26, -68, 72, 242, 159, -26, 187, -209, -147, 39, -45, 27, -39, 177, 126, -19, 240, -2, 121, 252, -19, -114, 62, -89, -228, -34, -54, 157, 10, 86, 264, -26, 211, -106, -90, -59, 113, 8, -71, -57, -19, -137, 32, 23, -16, 52, -23, -207, 46, 77, -297, -51, -202, -27, -360, 46, 421, -185, 28, 149, -195, 441, -185, -167, 243, -200, 335, 296, 60, -93, -7, 227, -27, 43, -67, -23, -133, -169, 311, 127, 164, -94, -68, -52, -190, 128, -222, -194, -59, 85, -75, 7, -70, 117, -158, 108, 32, 28, 96, -87, -292, 302, -62, -5, 135, -123, 171, 201, 68, 239, -129, -85, 79, -67, -128, 169, -91, 8, -78, -209, -61, -146, 282, -138, -186, -82, 79, -129, -49, -1, 157]
3234A57M1k90Q0k20N56l29m4J19J85k11o7J21j69j05L31k98J56j12OoK03j55J37
3257H6m5j4J11j18k83M5k4J04J13n6P1J12nN5J2k01K41n89L22J69k82R9K9k9p
3282h4j13J76p9j69J45M32o18K65J8LL11k09k50L6J63J57j68Q8k00k29N19l24
3304a30j9L00q6J3j49J01j44n7M8K21k40J96J04m82M95l45J12J39k99K21j00J02
3326Ao6K6N6K02k09M6m6J21J8M6k80K34j24J42j25l17M74k93n7J61j94L29j25
3349B0r9J07n5n3L5k54K09ok66L69k02K49J4k1J17k73J12R0k38J35K54k45K31
3372B30l37O3K1m6J28j64J9n9J04m4o4kL30k02L9J05k79j31L17q3K6j02q1J92
3396b0o0J05m1J1o3J07J80K5l96K89J6j14o0n1j05J80O3p4r8J3N4r0o0J72k6O5
$$ y = [157, 198, -92, -12, -232, 324, -5, -49, 70, 255, 44, -23, 98, -71, -176, 155, -143, 13, -99, -93, -99, 104, -51, 86, 41, 27, 138, 20, -263, -218, -242, -138, -25, -81, -10, 102, 97, 152, 164, -37, 204, -385, -63, 106, -176, -77, -48, -77, -84, -197, -21, -100, -269, -124, 308, -310, -45, -27, -24, 287, 78, -172, -136, 27, 184, 16, 104, -96, -325, 194, -130, -149, 151, 65, 78, -71, 30, -114, -171, -123, 98, -142, 54, 158, -324, 171, -174, -62, 77, -222, -1, -101, 1, -65, -39, 17, 219, 10, 56, 10, 131, 149, 195, -85, 149, 25, 167, 42, -275, 199, -94, -151, 10, -184, 145, 20, -79, 28, -27, -80, -45, -299, -90, -96, -362, 7, -195, 54, 68, 47, 164, -109, 3, 93, -145, -10, 244, -1, 230, -107, -44, -23, -69, 59, -105, -86, -145, -41, -85, -149, -151, 179, -23, 16, 121, -158, -289, 28, -55, -29, -131, -212, -20, -80, 25, -16, -5, -68, 39, 219, 244, -152, 137, 153, 39, -21, -72, -177, 3, 66, -8, -106, -93, -39, -129, -189, -17, -43, 22]
3422B2J10j30L6nK31j74r5Q2J07Jl24J65j41J4Q3KO8qp4Q5k26O8L0mL3k17J85
3449g6o8Q2J80p2P6j11qJ18k49n0R2K90k84J88l2K0k2J66j87j86M3J0n7K75Q2
3474B20l87L66l51j96K13j43L70lj91K4M9K1M6p3j12P3j53M66j79J15k07Q6K9
3497H3n3l8J47k15K34k71k46O08j44o4j19k2J64M9M8o4J4l54J21R4j67K22l4K83
3521B76m17M25k15L8J6j43O2r9j25o0L35k1N1l70M7L18l45K68m9o4K15l16N3K62
3545A42j13nM6o4J40KL32o87k24N40R1k07J63r2N0J6J5K0q2r3o0j48m8L70j04
3570@K09k29j66Q3r2K33n4J7k09J65j4o2j13K52m2r4L86k44K03l2l21K65j91J07
3594E7J4p3R0P0j61K42j93K70l13K0J07j94J36j12k1J11k53J53M8J67k46l8L72
$$ y = [22, 132, 2, 38, 33, 264, 90, -5, 77, 184, 185, -139, 26, -115, -101, -18, -16, 52, 44, -30, 55, -171, -103, -73, -77, -44, -261, -76, -144, -62, 118, 46, 122, 11, 3, 121, -128, -178, -86, 204, -80, 108, 76, 96, 74, 240, 53, -133, -90, -80, -137, 138, 220, -167, 199, -152, -348, -135, -278, 92, 89, -102, -78, -29, -8, 38, -35, -147, -74, -227, 239, 60, 175, -32, 54, 83, 30, -8, 139, -76, 158, -113, -359, 249, 105, 41, -78, -100, 64, 113, 161, 97, 111, -243, -122, -28, -195, 27, -7, 276, -141, 284, 69, 107, 123, -20, 42, -57, -182, -242, 93, 72, 123, -247, -200, 118, -227, 41, -8, -72, 143, -173, -120, 142, 29, 24, 70, 6, 146, 148, 480, -207, -431, 109, 200, -7, 156, 64, 114, 130, 145, 165, 83, -10, -70, -218, -266, 104, 0, 209, -20, -186, -103, -195, 38, -16, 1, -208, -43, -57, -119, -232, 20, -22, -116, 270, 26, 229, 197, -124, 141, -50, 57, 71, -2, 88, 158, -3, 239, 46, 316, 3, 23, 130, -64, 72, -40, -61, 50, -203, -50, -2, 165, -81, -119, 253]
3617B53j67m7J03j12K3o2k9R8l2q6r0J75l49L27J40l24J63p2K53j81J69p4P2m7
3641A04k87J24J16k4N2j58k5k5J21Q8r6P9j82K8K5L00L2o7j55R9k1m28K27n9J27
3666eP3r4J78m69K16K48j40j53J28q2PN9NJ53J9r3M0k19J76k39K50j47p5K54r4
3691dp8K12j90q1L11p1l83L16J14r8N8J19k14J61j73J52p1j24J18l33M17k69J49
3714C8l02J60L44J05l27K61l00P1j11J35l00N08m10K22j0k27L10j94O4J11j0j0
3736A28k87R0K2j28K23r9P4r2l34M24j40J09j20m4L72j78Q3k43L02j66K39k27
3758HL9j95K02k11K5K0K05j07m3K18k10J85j79M7j19j53J80N3j34J87q8j69L97
3781A58N7k5m51J64K09j28Rj18L40j19n6J33j54rjk6j6J7O7l22J44K00J11k77
$$ y = [253, 86, 39, 142, 30, 53, -9, -38, 60, 28, -58, -148, 27, -322, 5, 145, -179, -16, -88, 165, -16, 153, 79, 151, 104, -183, -59, 57, 33, 85, -73, -98, -123, -2, 86, -10, 69, -113, -85, -60, 240, 272, 205, 50, 149, 128, -300, -73, -132, -5, 68, -26, 152, -317, -101, 147, 7, -146, -18, -100, -93, -34, -29, 124, 143, 50, 90, -129, 47, -192, 58, -89, -164, 90, -4, -82, 130, -60, -141, 170, 99, -284, 32, 146, 48, 106, 225, 11, 172, -1, 151, 80, -44, 74, -259, 158, -111, 38, -264, -104, 240, 345, 18, 279, -21, 50, -61, 74, -226, 282, -128, 94, 84, -143, 167, -27, 37, 148, 138, 128, -159, -69, -47, -175, 48, -51, 23, -69, -403, 21, -119, -10, -130, -174, 198, 20, 103, -140, 162, -4, 235, 8, 47, -148, 54, -157, -132, -112, 93, -14, -57, 161, -49, 136, -43, 4, -115, -268, -88, -35, -169, 18, -70, -239, 158, 215, 190, -261, -97, 112, -16, -7, -125, 215, 96, 40, 173, 19, 10, 9, -17, -33, -16, 51, -271, -127, 73, 184, -93]
3805i3j71K55Q0k58J83l7P2ol6J06N8k49L59jk87P4m3P1P2k84L13k02%M69n81
3830a36P8K69k83M39p66L49J21L9q1J91pj37k49J15J87L6j87J50L3k19K16j34
3852B4K97k56j13K57m09K81j19K9j6o8J65n1l22J89N6p2J68j22K7j13n7J40q9
3875a74Q3L02m87M74j7j14J8k14J66o9mM1l0M5J9l12M22j32k57K33l6R9J39k45
3899e0K09K0l27j2J12M6k91J08K63l38L10k2P1j84J77J04K63n58J33J36j47j60
3921a37J22j87K57J03j41P9q1N7l0Q2R5k64J26L11m25J68k16J8N7J30m6n2N0J83
3945B59k76j11J20J23j21j25J42P6j97J47K3j39j77m2J57L15m12K14J89k14L2
3966a7j79K19J70r2k35J84l8l3P7l10K09Q4J8j25O7o4P6l8J42J3k64L92m27M71
$$ y = [-93, -264, -9, 71, -187, -4, -41, 31, 25, -11, 95, 153, -96, 263, 262, -25, 49, 6, 77, 149, -135, 178, -24, -24, 445, -136, -58, 211, -72, 367, -399, -50, 71, 110, 29, 220, 213, 76, -173, -58, 129, 165, -22, 128, 161, -58, 158, 24, 321, 65, -48, 209, -200, 81, -38, -9, -25, -93, 72, 21, -301, -112, -56, -128, 40, -82, -55, -168, -225, -85, -174, -91, 211, -276, 198, 181, 67, 85, -129, 37, -32, -36, 5, -25, 20, 39, -273, 149, 17, -240, -7, -43, 56, 195, -50, 159, 179, -148, -160, -48, -2, -293, -185, 78, -260, 50, 28, 99, -85, 92, 196, 459, -99, 34, 170, 23, -137, -15, -202, 55, 158, 17, 96, 15, 72, 42, 124, 219, -45, 81, 392, -33, 135, -81, -63, -6, 124, 78, 26, 76, 259, -17, -128, -8, 115, -6, -131, 11, 87, -110, 37, 60, -79, -256, -298, -141, 174, -238, -24, 165, -49, -17, -196, 23, 193, 101, -134, 50, 12, -21, 56, -254, -45, 39, 57, -68, -1, -65, 11, -27, 115, 128, -136, 256, -171, 300]
3990C00l66K92p5k17j67P9R9K27j3l50J85j45k7K68o4PK7J10j64J1o0J41r1K49
4014B56k53Q2j56J26r5J5K9L13m37J50r5j85K16J29p5R4l02L31k24O7J50k98R2
4037g0J07k00N5K24j91L3N1J8P7J64L1l7m45J20j47K61J47q0m9R9l09K41PJ34
4061B41r9k47K02j68l3r8J38P4l2P3j86J78r2N0R5r1pK00q2kj78L1R8n3l38J98
4087a28L9J38J45p8k43J35J52q8k33M76o45L99l19L4Q7r4K97K16p3j96oj77K20
4110E8k40M11j42l12R3Q8km7m5K17l8j38p2j7J20m9J27n9n8O2k3l4j6J58K38l54
4136g4j75M62l59Q5m7M61n14M97n61R5l7K41O8q1J32k97m9K26j03j77J43N1J10
4159I7kj61Q7pPn6L6J17p1j94R4K5Q4j65R0m8k6J6J62j85j94J74J06J87j57Q4
$$ y = [300, -66, 226, 151, -66, -233, -154, -55, 172, 159, -191, -6, -151, -178, 90, 26, 33, 60, 170, 6, 17, -43, 98, 7, 256, 3, 85, -71, 55, -40, -25, 4, 317, -120, 30, -65, -250, -34, 95, 20, 114, -188, 143, -81, -14, 136, -162, -70, 37, -163, -108, 116, -75, -42, 9, 27, 104, 268, 299, 262, -183, -63, -210, 51, 198, 118, 69, 168, -141, 100, 107, 241, 142, -105, 97, -71, -104, -202, -64, 10, -22, 51, -135, 43, -49, 1, 96, 5, -2, 198, 116, 114, -64, -33, 65, 12, -326, -128, -89, 49, 194, 116, -127, 8, 160, 72, -161, 315, -330, 69, -250, -216, -129, -223, 74, 290, 217, 21, 15, -162, 58, -182, 229, 87, -225, -132, -44, -46, -93, -138, 79, 41, -97, -169, -186, -66, -115, 12, -47, -105, -43, -66, -100, -116, 42, 280, -74, -249, 213, -146, -61, -108, 353, -161, 336, -225, -130, -167, 74, 142, 61, 193, -104, -153, 73, -30, -207, -64, -13, 97, 95, -66, 21, 14, 21, -35, 1, 118, 47, -147, -53, -28, 56, -109, -19, -67, -93, -77, 85, -100, -294, -120, -14, 173, 16, 100]
4185A00jk43L28k5m10M23oj58p4K30m0k59L57k62m3K34L2n1j83Q6K5j69P5j55
4209a89K03k50J03K10k33NJ39n4j84J62J8J44k37j3M18n9j75O8J28j70N3j13j30
4232a56j53K80K48j84J48k70n2L72k10j03L25k14J22qj18j02k4M11j77l9J2m21
4254c13L20J12j39m6r3J23J56jk7k48pK38m3P0mk25J59j22m0K22p5J51%k87J23
4279DQ5j56m3K49n5k53J01j18K16P5N8l47K55kj10m1J79j75K19k84K39L8k43K64
4303A55k68nK67R9k30J03k5k48R6R5j70O1j43K32j22K86l71K14P6n9o4O8j14N5
4327a2K5k05K16k12J45N8l0L12m63L76Q4k77k9j45J77kQ3j17J07r3J75k05K3l3
4351d2J42k20MnQ6l0K7j94L22N6j95J93r3o8K34l57M8J76P3L3p7K5j38M6J92k24
$$ y = [100, 99, -144, 184, 159, -251, 172, 166, 8, -66, 164, 124, -135, 222, -40, -83, 151, 183, 132, -51, 35, 60, -109, -34, -189, 14, -236, -133, 77, -156, -151, -12, -66, -250, -88, -70, 74, -163, -176, 242, 183, 8, 76, 204, 34, 87, -26, -156, -309, -29, 219, 35, 183, -87, -139, 233, 23, -80, 245, 31, 153, 145, 27, -75, -99, 312, 135, 96, 108, -313, 7, 119, -20, -66, -159, -36, 120, 119, 92, -156, -163, 75, 32, 102, 98, -127, 32, -90, -130, 92, 17, 168, 168, -119, 4, 89, -67, -110, 139, 84, -169, -68, -186, 30, 105, 163, -184, 71, 69, -41, -82, 97, -78, 141, -143, 96, 134, -109, 155, -113, -118, 149, 248, 18, 121, 96, -152, -56, 39, -131, -70, -213, 19, -103, 183, -188, 26, 102, 43, -21, 47, -67, -12, 13, -192, 24, -188, -43, 15, -15, 297, -166, 210, 294, 17, -12, -157, 20, 18, 101, -16, 91, -2, 173, -32, -9, -42, 100, -120, -116, -121, -35, -65, -38, -232, 90, 146, -49, 144, 51, -17, 217, -140, -92, 84, 157, 190, 113, 138, 0, 46, 238, 14]
4377A4K41l04j75K86K7n7j6p7k6j27J07K72j78K74m72L75k71J10j98J3J15J88
4399A21j50k0J15l13K46j34L29l06M11k29j7j74K37qk54L64k52L49p8l28L73m03
4421a21M3K24l41K78j32K68k41j30J20j0J01n9k1KJ04K55k19p7o1Q5j11L3L0J5
4445C5K03k30mN7j20q9O2J27n3j28L0J11J69j56K70l82j8N2J09J01j39j21J38
4468B4O2j4j03P3n6j23K09M8j63Q1k01L6N7jJ77j19o9m6J24jJ12j88Q9j23L01
4493A86n7K7j71K02k72J01o4k73K76N1J39j06l00J80L4M3K00m31O5K51q1l20M54
4516A34J87j80k02Q5J07k78K58j48k06J62J24j02K34j34K7l9l32M46j19m0O0k07
4538a63L96k89O8N8J23l24q0J43J84l13L04Pj72K02k65N8J09j06j67K91n7j68
$$ y = [14, 255, -49, -224, 62, 89, 32, 16, -61, -87, -214, -107, 165, -13, 261, -211, 164, -107, 3, -195, -182, -67, 121, -29, -49, 66, -247, -1, -135, 194, -112, 299, 70, 53, -121, 116, 108, -146, 218, -34, 315, 237, -91, 282, -121, -78, 146, -195, 83, -49, 219, -22, -152, -32, -42, 59, 0, -21, -19, 85, 340, 121, 44, -17, 68, -43, -10, 20, 35, 238, 8, 4, 61, -59, -148, -86, 41, -12, -140, -110, 1, 170, 14, 284, -98, -116, -64, 45, 146, 7, -114, 24, 86, 72, -31, 42, -14, -137, 72, 120, -43, 38, -163, -127, -70, -71, 106, -13, -82, -128, -4, -5, 107, -81, 8, -115, 186, 129, 156, -15, 187, -85, 16, -48, -321, -45, 6, 145, 39, -261, -81, -47, -4, 196, -235, -170, 81, 0, -320, 134, 321, 141, -61, 24, 131, -147, 111, -37, -243, -81, 43, -59, 175, 41, 68, 29, -303, 143, 24, -16, 44, -163, 233, -56, 12, 70, 193, -131, -211, -68, 116, -197, 107, 114, -58, 144, -121, -63, 46, -60, -227, 64, 7, -161]
4560a61J34j1J15q6K30L3l25RP2K9j83J00J67J9k90J42J52r4J67l21J7Or2j16
4584b87N06j89K08k93l4L98l40Q7n8j11Q0j61L10L58q18K47J49k64K27n4R2n2
4606Aj35L44l80J44K9Km9P2k53L40K6j80O4M9j82k4K30j01L70l19j32J71J45j38
4630I4OM4k13K61m1m71L25n7J8J05r4R5Q2k29J83k95J10K37r3Mj23J33r0J18j03
4655FK87l56l4J0j71M16j45l8J35k32J25j09n5K83o3p4j02M5K49k15k65M30j4
4678A13j54l5J49r4MM9m9J15l03N31j62j69k91L86r9K67k06q0j69J04J04j42N1
4701h0P1K13qp5k69p1K12L4k62M37k26P2L2k80J23j04O6J92j03J06k15J40j02
4724i7M66k36k15L00n5j21J70j86J33j18j30k62L12j25J62j34J33N8Ql57M19k9
$$ y = [-161, -27, -38, 77, -9, 221, 254, -71, -62, 10, 39, -144, -44, 123, 142, -148, -6, 146, 52, 219, -102, -85, -79, -171, -287, 219, 30, 238, -55, -89, 309, -31, 56, -2, -113, -33, -194, 116, 474, -344, -97, 52, -212, 15, -39, 53, 1, -134, 210, -170, -26, 3, 5, -44, 28, -225, 115, 141, -39, 25, 74, -108, -132, 98, -3, 367, 48, -84, 87, 232, 94, 100, 144, -69, 192, 151, -320, 5, -52, -34, 71, -23, 72, 154, -75, 108, -187, -77, 160, 67, 71, -52, 81, -9, 109, 6, 293, -63, -97, -87, -258, 158, 13, -25, 110, -122, 3, -106, -161, 122, 59, -15, -117, -72, 177, -38, -303, 127, 113, -41, -76, 73, -21, -17, 32, -17, 98, -205, 326, 164, -5, -296, 90, -9, 258, 52, -28, -197, -93, 11, -131, -80, -9, 204, 196, 121, -148, -219, -7, 27, -235, 202, -24, 48, 80, -200, -77, -181, -115, 77, -26, 80, -135, 5, -97, 369, 133, -82, 218, 163, 42, 212, 26, 159, 41, -89, -351, -39, -164, -2, -136, -3, 55, 63, -294, 125, 96]
4746I6q3lJ38k60K74j52k43N42n62O7J75j30L07M2r1j42k2j53q7J73P9J86k22
4769g1L9J01q7j29PL39m86L76j25J14K07j94j76L25j58k65O11m79Q5j06p6O2J86
4792A00kq3K6q7J21k68L70l02R7K2j24N2J79p0j1m0J23q5J22r2r0r8K10J05k29
4817e4P0J27nj4l9J23r4q3K29l09O2J7p4K49l39K24J05l44J43J65j95j73K32k13
4841a90K88j30J14j56L2O2l36M26k49R8N2P5O4j61K83k99j52J62J6Q2l42K35J22
4864I6l3L1l70M89l04K50j99Ql6m0J30O6k20J88N8n9o3l8K6j69O2O4K44k30L09
4889B60l82K39j80J15o6l2J85J1n7j57J23j50j79K85Rl8J49k18K18o5l9j12n0
4912a31K8K20j23J77Kl7O6k51J59J88m38J52j83K84J0J39l56M7j40R1J42nr0j82
$$ y = [96, 13, 10, 148, -112, 162, 10, -233, 309, -253, -186, -11, -141, 166, 208, 117, -25, -47, -200, -287, -114, -35, 151, -71, -32, 69, -18, -147, -140, 199, -287, 89, -36, 78, 285, 91, -85, 240, 82, -183, 428, -51, 34, -72, -148, -86, 100, 98, 15, 41, -46, 75, -193, 177, -125, -28, -6, -130, -78, 101, 31, 20, -20, 103, 18, 140, 48, -42, -140, 70, 175, -54, 16, 143, 138, 124, 85, 208, 114, 31, 260, -49, 13, 30, -44, 205, -134, 90, 195, -149, -6, 159, -36, -209, 23, -190, 98, -32, 82, -74, -42, 20, -316, 110, -139, -41, 11, 86, 150, -11, 272, -27, -179, -17, -1, 81, -261, -26, 96, 63, 94, -276, 213, -91, 159, -40, -32, -68, -108, 22, 88, -132, 56, 114, 55, -8, -46, -20, -189, -127, -63, 181, -49, 260, -122, 117, -63, 52, -14, -46, 139, 150, 93, -64, 59, -91, -270, 15, 24, -14, 135, -83, 135, 70, 31, -81, -131, -103, 117, -6, 171, 173, 136, 202, -49, 110, 298, -140, 12, -171, 113, 123, 262, -94, -47, -187, -96, 46, 41, -49, -231]
4936b31M35k15P6j00l27N29j58L7L4q2J50mO8j82p0P3k0j30l7L73j63p4J98k07
4960b7K22l24J35J25k91L27q9o3K36m18r3L46r4r5J88M8R4q8k55J67q6L67k56
4983G6j32L89l91k4J03J17r8o0J83j5m68M34j60j5L04l6n69M22l7p4J11l44N27
5006B43m7k92O1j40K12K79k48J02R9k94m9N4Q2j55p3K26k13J89p6np4L10k00o6
5030g5j01J21J58j35L2j00N7J63o9o4K34k27R6K6k79K24k30K56J54j57%m7J86
5053B23k36N0j21M3M1L4k8lJ37k83O4J31k0j91J17K60l3k71J51M9o5k5K71l77
5077h2O1J65j20o9L51k88r0R4o1j39L59l33K75j46J11M4L9j1j43j13j29K22k84
5100b87L53J95n26J66M9oJ27l3j24j17K59k4nr2N9J09r5m2J05n6o1Pj34L37J30
$$ y = [-231, 204, -11, 65, -35, -362, 167, 9, 46, 80, -2, 148, 144, 212, 30, -40, 33, 13, -117, -154, 219, 56, -18, 180, -27, 195, -129, 6, 131, -160, 167, 78, 15, 251, -167, -260, 86, -8, -103, 85, 133, 227, 139, -116, 51, -35, 332, 76, -56, 333, -58, -82, 21, 138, 40, -20, 163, 148, -320, 114, -46, -61, 243, 207, -362, 60, 23, -51, 60, -284, 243, 196, -96, -35, -175, 37, 316, 68, 170, 269, -25, -74, -20, 62, -93, -166, 60, -153, 36, -40, -45, -119, 191, -9, -75, -176, -55, 103, -32, 0, -100, -43, 120, 51, -13, 221, -6, 90, 116, -163, 61, -169, 87, 241, 84, 84, 37, 223, -13, 37, -84, -41, 0, 34, 6, 3, 140, -143, -79, 52, 32, -159, -42, 218, 185, -86, 65, 114, 49, 24, 295, -82, -21, 144, 24, -45, 306, 18, -72, 22, -39, -178, 181, -152, 123, -23, 88, 132, 171, 160, 17, -96, -225, -3, -287, 66, 261, -265, -99, -50, -56, 71, 38, -86, -203, 56, 32, 27, -65, -6, 103, 8, -34, 71, 15, -46, -39, -173, 164, 294]
5125B94l60l2l9K15j69J78k16KL65k36j17L57j57o5o8K71j83O0j83j9MM5k75L02
5149b6J23p8j49kj31P0j24L07r1j38N3J6RO1l5J30N0j54p1J70o7l7j5K4J28p2
5175d9L26k95L44l01J71j16j3k41J94M2j3j88J19P8k66J18J7J91P6k5l10J53q4
5198g2o1J56j92Q2L29k53k22K75q0%j08K09k8j5k7o2K46j74r8K21j73K5j31R2
5222f1P0Q7J38K1l08L1l6Rn6J64k66M83m26K08P2Jj25K8ol50J34K62L7j77K22
5247A56j01j49J26j80K4J01j11K99j46Q8j09P1J96m99L53j89J39k62K88j81J59
5268G3k39J55q0J9N2O9J2rK11l15J28m2j15j17P4J02L2q6l8Q0K45k3k29J07j37
5293g1PR1j54K67j15j52P9J16j07J51r7m4j28K28j06K0J58lk58q4L16l21M69j54
$$ y = [294, -66, -98, -137, 78, -91, 87, -129, -127, 238, 2, -115, 242, 85, 20, -48, 223, 40, 100, -83, -102, -98, -53, -328, -26, 97, 19, -130, -132, -263, -193, -317, -10, -101, -239, -186, -170, -161, -100, -135, -5, 45, -109, -180, -10, -77, -114, -129, -105, 23, -49, 277, -18, 326, 25, 196, 80, 67, -174, 20, 62, 49, -139, -20, 58, -208, -90, -73, 118, 194, 169, -141, 12, -72, -133, 23, -169, -87, 242, -11, -233, 42, -38, -38, -146, 63, 35, 20, -7, -69, 177, 3, -95, 126, -47, -22, -153, -61, 9, 96, 234, 255, -53, -22, -58, -49, -105, 59, -207, 276, -150, 58, 130, 131, 6, 34, 28, -322, -188, 74, 111, -66, 156, 55, -94, 32, -148, -124, -23, -134, 165, 19, 107, -2, 69, 265, -234, 119, -70, 69, -193, 95, -86, 73, -166, -11, -91, -72, -20, 49, 61, 52, 263, -52, 76, 34, -81, -198, -124, -22, 10, -76, -114, -34, 211, 188, -41, 66, -71, -64, 27, -127, 140, 25, -127, -48, 68, -39, 112, 15, -29, -157, 71, -35, -15, 143, 140, -118, -202, 114, -207, 262, 108]
5317A08j65p8M5J88j78J2L00r7k02K96o6k38K21k84L30l7l85J28k6Q3K42k97J11
5340A1N2j38J27n5J57k49Q0rj20K14q4o3o9J29R1J2K0j04K10l51J10J92J1l01
5364a27J37J5L3j70J39k07k2L2J83M3j43K36Kk05r1P5j69M6M5k6K16jj52K78j7
5389A50k61J7K17k32L3N0J65j26K1J03j93l9q7R1K62m12L44j36P9q1l2j75K25
5412a7N6j0k28K34J06k21q9J36J9J40J12n19L45k62L25k60K01N1r5K19r3j37K94
5435C07k61l05L44n7j84K59kj69J84j94J70R2j18Jl10M29k83J69l7k7J35l30o1
5458b48L34k9k47R0M2J40M7l2o4J64j71K25k15j72Q0L92m41K4J34l27M14k56K10
5481I4j06j0q2j16K65N8k76L05l03K87j08qK27k08J13k50L25k43q2j19K43p1J27
$$ y = [108, -57, -135, -90, 98, -80, -68, 232, 135, -67, 229, 163, -75, 146, -138, 192, 155, -230, -102, -128, -45, 197, -100, 11, 63, -75, 52, -3, 154, -95, -15, -24, -144, 70, -14, -77, -146, -17, 74, 86, 106, 2, 212, -139, -29, 163, 174, -127, 10, 25, 58, -112, 27, -180, -202, -170, 13, 56, -87, 149, 151, -54, -145, -70, -239, -193, -148, -174, 42, 41, -111, 167, 150, -111, -94, 123, -109, -76, -26, 139, 13, 34, 137, -56, -95, -182, -91, 171, -241, 103, -33, 46, -35, -67, -242, -17, 39, 29, -199, 35, 141, -80, -169, -33, -14, 126, 238, -281, 64, -198, 127, -133, 68, 119, 24, 243, 150, 13, 307, 46, -259, 85, 28, -156, 103, 101, -68, 116, -78, 92, 184, 66, 67, -243, 186, -97, 72, 35, 8, 143, -187, -248, 86, 57, -190, -100, -58, 82, 129, 97, 33, 197, 26, 251, 36, -136, -56, 336, -105, -81, 53, -274, 140, -116, 94, -12, -22, -104, -220, 45, 103, -173, 132, -171, 116, 8, 0, 227, 19, 132, -118, 207, -36, -118, -237, 6, -65, 62]
5504F2o9k4J12k8k40K97m14M78r7L9o9J0j39o9Q0q6K48j80K37k61K42pK4j31K55
5529B70Lk51M9p0R0j92J10K43l05L4j00J4J44R5j40J62k41K34k94J85L31j43l21
5552i3N1J6j37J35M1N5n00N38k3J04l23J0L48k65J4J08K9j79K67k17J66l9k71
5575a65J47k00J29J58j14J93L2j65J64R3k75j70K34l23j5Q8L66k05q3L69k46J65
5597A77k20K00l34K80pJ06k33n9K38k12m9k6K67k00N1Mlj78L7J10JK81j33P9k50
5622g3k84J97K05k02Q7L26m65J68J34k92K63L6j48j15P5p4K02J1K6k01R2J6k06
5645b22M93l59J57R6o2j98K42k70J07l0J15j11P3M5l19M08k39O0j20J67n7M1k
5668A5k09K47J36j12k12K36j44Ln8p0J26J84p2m6J19j69J7N5l2L51m49J14k1P8
$$ y = [62, -7, -31, 81, 53, -187, 110, -304, 174, 77, 116, 47, 57, -82, -151, -71, -157, 91, -89, 148, -113, 129, 122, 146, 15, 270, 273, 22, 71, 1, 91, -101, 9, 252, -53, -19, -119, -105, 39, 134, -6, 156, -85, 149, -145, 40, 371, 228, -93, -42, -26, -163, -28, 13, 68, -432, 106, 83, 187, -136, -126, 222, -43, -29, 79, 108, -71, 196, -21, 145, 106, -165, -18, -218, -89, 69, -45, 148, 180, 15, 179, 272, -3, -173, 61, -262, -277, -189, 177, -28, -111, 258, 12, 177, -43, 157, -177, 103, 96, 202, -31, -90, 148, -64, -113, -139, 128, -72, -21, -17, -20, -198, -161, -51, -50, 231, 98, 177, -73, -357, -160, 45, -157, -70, 256, -209, -41, 93, -199, 64, 100, -48, -163, -88, -162, 40, 51, 77, -124, -32, -16, -222, 271, -88, 69, 165, 103, -95, 147, -123, -16, -46, 69, -42, 31, 76, -243, 165, -74, -14, -134, 33, -24, 17, 15, -194, 53, 189, 77, -135, 101, -43, -40, -98, -168, -42, 142, 70, 24, 143, -26, -9, 46, 14, 365, -84, 30, 9, 87]
5692H7Q5j75K9n7J7K37l29q2J53K2l4J36q0j67J50p1l1K4K41j98j93K56j87L32
5716A65k48%OL97l08j2K43k13lj0j1p0J49K41m29J42j53l68M73J30j44J86k83
5739a20L36k95R4p0K89k76J60j28k23K81j70J17k41L63j39kN7j82K40L1q8P3j24
5762a7QJ69j96j58J27J00J15j21MK32j94k66J43L6J54j98OQ7k19n3K72j1l89J90
5786a79L1L61k48J40J48l95R2K72l78L02Q6l66K08l6j16J34o6k8O6q0K60k01Q7
5809I4j78P3J35J3k60J33O3N5K4j50M1j40J6L19m38J28P0j00k24L19J30l17MJ41
5833d9j30K3K53k09j06J78l91L86K32k91K09k82J06L38j61NRk42J97k5j05pR5
5856C3k0L9p0L52n35M2J91n49M51l2P6l4qN9M9n4J23p1j62KP0KR7k29L1J14k51
$$ y = [87, 172, -3, 26, -31, -14, 223, -106, -188, -35, -13, -47, 89, 9, -158, -8, -79, -110, -86, 155, -43, -236, 20, -167, 165, -83, -83, -77, 320, 12, 0, 243, 30, 27, 17, 6, -64, 85, 326, -103, 39, -114, -482, -9, 121, -23, 163, -120, 216, -79, 15, -55, 234, -42, 118, -10, -233, 48, -122, -5, -246, 117, -22, -24, 33, -149, 91, 122, 34, 107, -17, -9, 160, -36, -194, -67, 33, 148, 27, 31, 263, 69, -197, -54, -18, 136, -62, -56, 31, -188, -241, 31, 20, -369, -179, -148, 213, -35, 105, 253, -142, -50, 222, -156, 146, 232, -134, 74, 38, -78, 56, -10, -38, 28, -52, 208, 7, 94, -84, -11, 124, 137, -123, 10, 73, 128, 152, 2, 43, -97, -81, 238, -200, -72, -2, -102, -326, -7, 123, -194, -190, -49, -179, -156, 97, -112, -218, -40, -431, -45, 187, -104, 105, -177, -71, 267, 106, 111, 120, -122, 75, 50, -55, -62, 33, 13, 52, -18, 334, -201, -159, 32, -517, -66, -98, -22, -56, -64, -5, 44, -10, 113, 42, -120, -118, -48, -46, 51, -178, -147, -33, -284]
5883b84J14K15k62N78k07j1Ml32L67k63J01J53k79J07r3n2L85l88M18k37J13k01
5905e4R9j96K25j90j23N24j98k02Q6o2j26J25NJ67k06J28K9J15j23k76K62M9l7
5928B1j73K32l0k22K01n6l7K94j44k10K29j29k18L66j76J14l2j49L11p8m4k2K7
5951G5j28P9q9K01j99J28j59J31J72k36%pL44Pk86k58M33k58j59n5M78j88P5j23
5975b2M0j29j64L01j57P0J10j78M4J77k58M5K7o2L45j93J98k02m5N7K5r5J9p5
5999a22L70m56n3M52k83J19r6M0J74mk06j77L68j76N0J03j84L97l40K53j54j12
6021c7n2j50L53j44P2p4J48j4m06M70j51j20M9J68p6M0p6J6l3l9n0M2j41K91J82
6046B68k84J99j10m0J05m16L43J17m11N5K83j14Q8l07rJ06K53j72p0O0K57k16
$$ y = [-284, -170, 45, -217, 361, 154, 143, 147, -185, 182, -81, 20, 173, -106, 1, -92, -144, 241, -147, 271, 34, 147, -54, 45, -151, 74, -116, -239, 285, 87, -115, -29, -91, -217, -92, -87, 80, -126, 2, 31, 146, 23, -253, 9, 58, 21, -152, 80, 50, -172, 29, -27, -64, 230, 86, -124, 105, -24, -242, 124, -52, 62, 30, -119, 192, 114, 70, 48, 75, -53, 26, -63, 138, -61, 67, -92, 39, 211, -25, -25, -32, 312, 319, 33, -225, 208, -50, -209, -264, 214, 26, 101, -22, 18, -111, -275, 26, -131, -61, 49, -129, -85, 92, -166, -121, -94, -156, 189, -4, 194, -8, -53, 4, 29, -66, -47, -122, 248, -208, -261, 191, -92, 27, -69, -29, 145, 141, -65, -242, 126, -50, 0, 103, -81, 316, -24, 229, 75, -37, -89, -239, 114, -30, 42, -32, 116, 102, -304, 166, 15, -105, -56, 112, 36, 76, 0, 16, -17, -56, -106, -64, -205, 86, 268, -16, 183, 73, 33, 138, -278, 65, 182, -229, -174, 109, -5, 83, -224, -233, -127, 126, -46, -116, -56, 201, -15]
6068a5O0J7J3j04j51P7onJ40Nk34L90r2lL1j34j44K64j82K59m27K07o9J6l4M3
6094g8J69N8Oj80N0R7j74K37l47J56n1P9J73k78L01k13L3R1j09Q8k0k2R1l60J43
6119f0r9J38K12j96j0J31l9j65K34k45q2K97k83L56j28p6j29N9J62k05l7kK32
6142F5m8K20m29M47n4j90L3j03J9K16k91J56J31p1M3j92q5J63j79J00J23l01j27
6165c54L78r3Q4L8K29k42k4n3J77k14L21l83K71j54m6Q0k93J90J53r7j00K63j58
6188b7m6J35P3p0O8k46j54K00k5O9K47l27J62j47P5J01N9J71k21o9N3j2O4k23
6212i0K36l41q6J49K42l37L33j36j44R1L59l44j6K86n12R8K90J11j38k25OK09
6234D1K06Nq9k82J30j26J53O1o5P9k32P5O3k9j62O3M15o5l01qM39m40o2O8j11
$$ y = [-15, 45, 62, 75, -29, -180, -103, -109, -114, 26, 31, -203, 187, 95, 92, 123, -11, -155, 109, -73, 186, -241, -34, -103, -87, -121, -78, 91, 149, 155, -25, 25, 122, -52, 185, -162, -6, -57, 22, 195, -83, 218, 5, 38, 129, 20, 108, 88, 66, 157, -203, -60, -159, -21, 191, -5, -15, 116, 77, -88, 146, -99, -181, 116, -167, 189, 61, -15, -144, -85, 77, -128, -165, -167, 65, 17, 237, -192, 255, 201, 11, 44, -59, -40, 176, -115, 41, 172, 101, 144, -48, -133, 30, -149, -49, 74, -227, -354, 24, -69, 15, 53, 282, 40, 16, -37, 140, -74, 247, -136, 135, -19, -65, 15, -278, -88, 65, -32, -132, 131, -27, -73, 62, 135, 65, 133, -113, -267, -67, -92, -23, 224, -103, 59, -88, -13, 88, 147, 318, 97, 28, 81, 69, 133, -90, 146, -195, -281, -132, 110, -227, 106, -30, -174, -83, 276, -68, -84, 202, -310, -212, 78, 189, 51, -174, -168, 41, 247, 252, 163, -119, 11, -115, 38, 99, 34, 113, -119, -44, 19, -10, -172, -109, 306, 241, -60, -68, 371, -69, -131, -63, -174]
6259a74K60k11J75J19j06jp9l6J62j33k38M17k37l8K3k2J20m2O8q9r1K20rj35
6283g7L16q8Q3j72j38P0j30J82j19J80l6k08K67j72N1K20l77J31K30j14k12J35
6305B2Q2Jj22k2O4K49l62K35K1j93j74PL63k24J83J8k83j20M15k35M45m67j65
6328b62N65l60J92k77K48k07L28k96K24j8j93m4M3l2L01l52K20j15j0N7M1n8O1
6351E6j54J07j56j5M67j87m03K27n7K9j2J04j74j0p9K95q2L9K70k97R2k3J51j49
6375C9Ln3j66K08O8j76J45J04m50M58l8rm0j0j28K38j61N9k09J5N3J52j49J42
6399I5m22K61k72L20L14m82K43j66K97k32Q1k02pO5J47j67K8R4O4NM3p9O1j64
6423g5K42l20L75j84M8P8l6j47j64K85k52q3Q3L48k09R1k68J61N9j18K6j00K57
$$ y = [-174, 86, -125, 50, 169, 63, 62, -17, -53, 109, -24, -262, 155, -82, -120, -97, -119, 1, -41, 27, -62, -153, 67, 58, -77, 239, 151, 234, 62, -76, -6, -136, 46, -73, 107, 71, -137, 130, -42, 9, 229, -148, -17, 213, 99, -113, 22, 104, 105, -17, -39, 25, 274, -88, 147, 168, -25, -199, -192, 171, -53, 130, 148, -135, -255, 160, -75, 370, -97, -262, 303, -57, 135, -142, 106, -101, 227, -69, 155, 137, -56, -100, -57, -89, 212, -140, 80, -35, -45, 12, 53, -5, 56, -98, 9, -147, -162, 305, 118, -285, -58, -115, -86, -98, 6, -168, -178, -257, 38, -44, -5, 265, -32, 60, 37, 188, 39, 42, -11, -177, 31, 99, -77, 68, 172, -278, 180, 142, 133, 93, 83, -45, 193, 32, 91, -118, -103, -50, 102, -47, 95, -327, -66, -338, -18, 296, -186, 57, -109, 188, -44, 37, -165, -172, -107, 40, -127, -99, -5, 59, 64, 107, 28, 89, -75, 167, -153, 222, 38, 86, 164, 128, -19, -183, 102, -150, -233, -150, 198, -11, 80, -188, -27, 32, -86, -60, -160, 97]
6446I7j59J87p0k94M65n40K51K0k25L79K3j75Q3J92j74n9k3P7o4J51k37M2J57
6469A04j16J84k45R4n1Q1%L1K0p8j16J22l9J91j34Q3n5p3J73j84J15J30k48k9
6493d0j08K4J27k9J29o3j26P4R7Q9L4J6k22O3R8J07k98l9J47J36j93K29l21j01
6517a70M26J5k22n3Rj40K6N6J22k24K27k44J72J5p3K00j98K07j83l1J76J04j95
6540B2r3N5n1L3k7J4J57K42m44J37N8k6j68L92k80j62j1J56J14j75J70o0m9j80
6564a76L67l64J18j8k72M49Lj66Q8Q2j7q7j37k0J50R7j51J79l87L47Kn5R7l05
6588a76J04J36M6%P1k01N8J14k15J96J32k8j08k82K7K45j8J5j30J75p9r7K2k61
6612b54K34kK69k37j97J07K31j42j36J17R3j81j05P5K7J6N9o5J98j21P9q7J11
$$ y = [97, -62, 125, 55, -239, 226, -314, -63, -43, -268, 111, 134, -41, 42, 234, 60, 1, -22, 55, -9, 142, -95, -53, 104, -12, 172, -73, 21, -30, 51, 51, 82, 102, 24, -92, 30, -9, 182, 48, 131, 76, 3, 176, -8, 107, 237, -11, -40, -148, -124, 3, -26, 103, 40, -86, -12, 85, 174, 208, 224, 2, 65, 163, 270, -28, -67, 80, 216, 23, 252, -69, -170, 256, 271, 49, -4, 5, -135, -109, -53, 69, -155, 72, -172, 0, 15, -58, 142, -56, 151, -32, -63, 113, 217, 22, -71, -16, -67, -34, -61, -47, 110, 352, -92, 45, 103, 77, -91, 301, 21, -141, -152, 4, 118, -57, 113, 53, 4, -176, 191, -173, -55, -73, -345, 104, 107, -59, 29, 111, 94, 7, -130, -150, 0, 97, -54, 125, -262, 85, 87, 32, 129, -176, -72, 64, 110, 110, 181, -20, 38, 152, -63, 133, 265, 237, 129, -153, -126, 119, 101, 116, -14, 161, 82, -15, 7, -254, -20, -22, 247, 10, -187, -80, 151, 9, -127, -10, 83, -98, -203, -128, -101, -85, -26, -91, 107, -14, 65, -22, 89]
6635H9l30K92m3K22l56P0L1k73L50q9J29j94J00J15l41K55K86n10J08j64K6K89
6657F2m1j11J50k14K08k26L92k2j66K13m50L85j33P8m4j01N9M5p4nj09J08o4K55
6681A95k79k1J10O8m2q9K53k78J45k04J35Q5k09J33l6P2j7K12q9r8J1j21j3K3
6705e4K96l19J66j05J45N7l11l8K02j41J92o7p0Q4J5j6j21K76J01m26K48k65J71
6728B0l4n5K37j12j50L6J96p5r3K96l39r1J23J54j6q7j81K20k11L07k47oQ5PJ09
6753I3j98J3L29q8l56K55m4O5j19O4J74q8k70L61j5J09l79J86ql05L12Q3n57M77
6777I4m9j84J37K87l97k3K94j52j42l5M06l88J80N4n12N26K05m30J52P2j47P4
6799B2k3Q6j58k8K0K38k2j76o8J04L2N7l3k43K65l96K03R9N1k1k41J92K62L1j99
$$ y = [89, -241, 51, 8, 230, -126, -56, -25, -298, 52, -37, 92, -102, -2, 113, -228, 27, 313, -197, -89, -253, -227, 62, 21, -90, 60, -154, 54, -172, 220, 198, 32, 245, -205, 180, 47, 125, 81, -20, 39, 84, 10, 5, -104, 4, -60, 195, -84, -105, 5, 73, 31, -58, 195, -83, 62, -142, -7, 78, -131, 2, -34, 38, 21, 233, 144, 46, 57, -64, -77, -54, 242, -77, 89, -16, 129, 186, -125, -163, 39, -102, 90, 23, -47, 37, 52, 36, -85, 191, 292, -134, 114, -151, 20, -14, -69, 168, 56, -94, -58, 138, 63, -30, 266, -73, -164, -41, 113, 97, 10, -171, 49, -162, 145, -102, -108, -23, -16, 93, -105, -92, 237, 149, -207, 48, 4, 69, -50, 14, 188, 100, -170, 191, 176, 285, -94, 92, 84, -221, 91, 174, -383, 94, 45, -139, -2, 285, -112, -135, 159, 7, -135, -170, 236, -152, 28, 82, -430, 96, 301, -129, 23, 95, -52, 22, -1, 85, -73, -101, -81, 157, 135, -41, -109, -5, 27, 84, 51, -192, 73, -323, -120, -21, 30, 9, -232, -40, 222, 253, 54]
6824E4l15M07k46J6j08N07k69k29J22OJ78J4j40lk12R4J86n5N8l9j38o6M0N6l
6849h5j46L7Q1p3K22j18K0K07j97J16j68R9R5K4q9j90j3J00J12Q7J13k7o47M82
6873D2L9k84R0l2L07l3R3j53p4J93k0p6Q0l12K86j54n1O8J76k48m5K88n6j96J64
6898I2j4J11j40R6k2K8o4j91K50l06J76j87J12J74p8j30J20q7J05l53L50L5k3
6921E4oqM7o4J5L8j05R1j17N6k45K32o9J22Q7k62K26j8J70l68J95k76J35Q0P9
6946H9o2J66m58M65l02r2L98l17K15l1l7n2K21m06K84O6l5l5K0k4k73J04k31N20
6970A93n26L09j02J28r7m9J69k25K23P2J10o2k88J78J04j03r0J01j07k26L54k32
6992a66Q8r6J98L43j23j71j67j4J49o9l6J13L5j13Q4Q3k76J29j27l0K01O5O0k30
$$ y = [54, -261, 146, -100, -84, -192, 315, 46, -183, -61, -55, 123, 137, -3, -6, -218, -124, 62, 7, 65, 26, -112, -178, -138, -82, -85, -231, -194, -113, -186, 36, -82, -62, 145, -52, 64, -104, -5, 90, 114, 25, -165, -178, -78, 34, 121, 234, 207, -440, 42, 81, -203, -113, -145, 162, 129, 222, 69, -5, 188, 168, 92, 172, -140, 146, -8, -59, 9, 185, -63, -108, 180, 124, -72, 92, 78, 189, 49, 145, 123, 151, 87, -104, 146, -160, 16, -171, -59, 115, 37, -93, 27, -60, 45, -308, 42, 77, 54, 48, 40, 87, 23, 38, 76, -29, 62, -55, 1, -244, -12, -81, 41, 128, -134, 92, 74, 244, -124, 71, -205, -70, 10, 89, 27, 193, -265, 200, -102, -194, 204, -113, 102, 71, 34, -18, 203, -203, 81, 147, 112, 77, 97, 73, -200, -96, -327, 193, -333, -24, -126, 2, -95, -144, 25, -200, 23, 95, 205, 143, -145, 33, 137, 34, -56, 45, -62, -288, 66, -166, -78, -174, 24, 367, 244, 73, -94, -108, 41, -28, -64, 49, 84, -29, 55, 138, -138, -9, -136, -166, 35, 100, 160, -70]
7016g0K39m2%n4L0k07P3m8k01L06l1n4J69j81j55M74l99J61J35j69J74j93P8O8
7040A03j48L1K44l00r4K21O9o9q7O9o5J31K7r2J04k7K1m6j31N1KK1p3K54j63L4
7066H7J87o59M38Q5j18P6j59P0k39L8K11j28L24j85o7O0m6M6J15k32j20K35n27
7089e08M81K91j47r4k19j7K09J00j0j94lj26K42O0j18q2J51o1j3RJ52q0J74l33
7113a36K53j72J3J39j08k00K80j28K2j63J28J68j15k7K6J55l55J96J39J61n35
7134b59L02J18k31m4q2R1p4L03l54m1K26q9K9l60M93M1r0J08N5K3p2r3J38K2m41
7159b81K80J33k1j76L53j98K4K4J2k32M42l99j58K44J00j88j64J50J87k18J4m3
7181a15J07J00j63R2J4j67J15K53k22M7J0j48K25m50L29j05N1j5m9p5K01j5r2
$$ y = [-70, 169, 127, 127, 73, 103, -104, -31, -79, -280, 26, -5, -59, 110, -71, -226, 248, -151, 10, 145, -24, 150, -43, 35, 103, -45, -14, 230, -70, -164, 57, 126, 57, -30, 39, -26, 105, 132, 40, 144, 117, 138, 92, -39, 12, 14, 35, -38, 216, 53, 87, 274, -385, 53, 138, 20, 96, -63, 7, -232, -194, 17, -111, 213, 28, -39, 21, -25, 21, 136, -96, -216, 19, -508, -27, 264, 117, 23, -196, -213, -4, 96, 86, -108, -111, -237, 5, 65, -53, -135, 16, -45, -58, -49, 103, 23, 197, -136, 117, -55, -42, 97, -11, -211, 69, -59, -37, -200, -72, 96, -19, -46, -20, 135, -220, -24, 115, 276, -259, 43, 161, -70, -114, -196, -105, -179, 124, -230, -271, -45, -134, -105, -465, 28, 69, -21, 87, 142, 165, 93, 0, 138, 160, -281, -1, 132, 111, -65, 288, 90, 114, 138, 150, -82, 360, -39, -197, 47, 147, -41, -205, -55, 132, -86, -72, -115, -8, 92, -71, 21, 35, -132, -17, 236, 14, 61, 71, -77, 148, -302, 27, -78, -27, -42, -91, -166, 35, 20, -72]
7204g2m5K53m13K52k5l8L8j16J62J96k18l5N1J42o3j21J76j84J97k80J58J38l14
7227a61J11R3j78J12k75J38PQ3K34k76NJ22J0L7R7k47j8m3J19K16n14N13k12m9
7251g6J35j22L4J6o6J56k04J92k92N83l98L23l38O3J61l70K41p8R2K25k84k71
7273b78M97j50j55N6j1j9p0J28J67j77j01J65o9K34j99J8k11J21K51l67M83l05
7295Hp8n2J19L59j99j39K76j51k08J18q0P2J4pk26J16K01j58J16l75M74k59j21
7318a80J41J5J44j94P9J81j88K03Q4n79R2K94j13J03j16k9K79q2k39R1j35J35
7340a4p9L35n21L7Q8K78j28l40P11m41k7K08K6j59R5k11J47J1J80n70K66J62n2
7363BK0j67P6L0J26J44k12R8K3j6k9o2j19J72q4l8p5O1O6O6j22m2k9M7M21k71
$$ y = [-72, -117, 136, -277, -25, -50, -88, -50, -166, -4, 192, -26, -61, -10, 132, 69, -52, 124, -60, 137, -143, 15, 153, -161, -50, 43, -135, -23, -298, -160, -153, -70, 164, -112, -107, 15, 25, 62, 159, -88, -106, -149, -30, 186, -328, 185, -27, -76, 59, -63, -29, -13, -79, 77, -127, 65, -227, 356, -42, 281, -57, 6, 167, -203, 38, -40, 52, 277, -7, -278, 219, 69, -86, -30, -41, -60, -130, -2, 165, -12, -113, 52, -17, 217, 18, 36, -175, -54, 197, -170, 313, 8, -70, -122, -3, 356, 157, 18, 294, 143, -65, 53, -27, 45, 59, 52, -174, -58, 143, -15, 101, -274, 200, -59, -180, -39, -24, 120, -74, 5, 186, -2, 201, 285, -294, -202, 92, -21, 82, -34, -63, 216, 134, -105, -14, -149, -14, -93, 242, -279, -242, -154, 124, -4, -344, 367, -74, -101, 107, 133, -26, 69, -142, 5, 16, 196, -374, -108, 54, 2, 22, -145, -69, -39, 87, 231, 19, 117, 140, 124, 95, 33, -86, 86, 2, -36, -111, -50, 16, 82, -40, -82, -111, -64, 357, 86]
7389H6j59k00L91j59n0k3J65j70K71N5k23N2k82K99L6k05J92k34R3N2J21j49J40
7412I9rk98J18k69M64j98R4k8l17L91p4K28k82O3k33L82k79J32J73j03J14j14
7434E4J45k33j5J2l7K21k40K84k57q4J13K95l46K67k0j22j42K93k06k47K42l4
7456e7J48k10N5J68J27j26j55O3k22j34K75K92m56M00m09L87k6l92K94J42J34
7477B98j21k01K1J78j85J69j57j19K88j48K44k81L8j56L8J57l6J5k43K24M5J09
7499A77k23j37K70m66L48j33j26K13J04j61J24O8J34m9k36J75j42M7L16m28J99
7520G4J71l46J44k42L48l83L62Kl2j9J01k63J04Q7q1k0K06j38j03J06J65n00K30
7543b7J90l86L01j26M6j52K83j55r3l1M34m83O3K09K07k84K25j81l8J60j00r0
$$ y = [86, -73, -273, 118, -41, -91, -114, 51, -119, 152, 207, -16, 36, -246, 53, 89, -116, 76, -158, -65, -13, 108, -41, 99, 90, -208, -90, -359, 105, -93, 1, -27, -344, 47, -27, 201, -81, -18, -251, 131, -148, -16, 157, 54, 168, 54, 199, -34, -49, -37, -74, 147, -93, 191, -66, -150, -37, 258, -88, 179, 159, 37, -105, 188, -18, -265, -23, -57, 91, -119, -64, 104, 231, 105, -50, 13, -209, -343, -68, 224, -232, 168, -241, 146, 120, -272, 22, 164, 298, 177, -24, -3, 175, -10, 159, 2, -117, 171, 23, 267, -14, 24, -132, -94, 63, 27, 42, -201, 23, 68, 177, -46, -183, 87, -379, -31, -164, -290, -77, 27, -134, -10, 58, 192, 143, -93, 82, -60, -13, 303, -125, 74, 245, -101, 43, -199, 149, -234, 128, 130, 98, 79, 180, -83, 21, 108, 27, 7, 213, 75, -28, 78, 243, -257, -27, 163, -223, 78, -48, -2, -154, 129, -26, -119, -150, 284, -199, -136, 73, 280, -4, 221, 40, 2, 162, 62, -28]
7565b8j78L3L34k62K21j06j65L5n0l3R4n5J62L14j46N9k53J86J64m06J03K04p9
7588A48l59K07j39o4N7L22k34M7M7P9j92J52k41K44l1j06j99K50L30n02K10K5
7610E1j32L6k7k33L06k0kKm7J44k64J05Oq1L37k15K36l44Q8%L96p7j91j0l8P2
7636I8p4N2o0P9m60L86K1l9J05J1l79K12J91k73J29o6J87J98j37P3j2j44q0j92
7660a74K69j57M3J32k05M2K6J82l57m2K58rJ79L0j33KR9q5M2k49K03j11q4L13
7684B14lL1m82K26j47K09Q9k11J66O4k10p1N4k7M4M6K70j76k45M28k50O3j37j12
7708a67K80Q9P5l93J6k09P3J84p8J27J08j51j48M00k44L63k26j46N1k07O0L51
7730B08l63K38j29J36J41j63o8nO5k04K50pm2j83K8j0J45j3j2J21J76j18j99k61
$$ y = [-28, -206, -173, 161, -101, 120, 14, -151, -116, -166, -199, -105, -160, 2, 316, 170, 229, -24, 162, 326, -80, 23, 227, 148, -211, -4, -143, -207, -150, 172, -62, -15, 32, 111, -81, 71, -170, 74, 43, -63, -262, -12, 318, -184, 26, 51, -81, -45, -72, -305, 1, -19, -21, -19, -66, 78, -186, -81, -75, -156, 181, -34, 202, -142, -54, -54, 342, 265, 74, 64, 26, 98, 24, 76, 16, 95, -365, 21, 42, 3, 108, 119, -260, -48, 143, -130, -1, -67, 120, 318, 181, 254, 242, 98, 18, -174, 95, -62, -19, 113, -92, -50, -24, 158, -199, -241, 17, 8, 187, 217, 84, 86, 185, 100, 142, -107, 96, -15, -99, 214, 211, 242, -240, -14, -161, 48, 137, -74, 92, 156, -54, -125, -71, -98, -54, -8, 262, 86, -159, 269, 19, 82, -55, -167, 113, 202, 277, -116, -100, -309, -236, -52, -130, -3, 105, -46, -194, 206, -38, 325, 99, -47, 4, -203, -143, 208, -155, 83, -46, 90, 231, 68, 0, -5, 60, -144, 106, 99, 57, -126, -98, -108, 37, 24, 12, 133, 309, 191, -8, -269]
7754b69J06K09j1j5M2n3k5J61k33J94k3qr5n7K30O4l63K54j82K00r6Q6n1k6j28
7779h9K40r3L1j64L09k38j4j68PK04r9K90j13k45K15J75k22K56j01j68J63j78
7801bk5P7j9p6R2pJ0L52k02l57K73j90l6K10l4m8j46J43j49L22k22k35L34j90
7825a25K55j33q1J44Q1k5j4j01J0J07j44M0O4j65J39j47Q2j59K75p8J8o2L8rj34
7850a24j1M8j22J81k8J22r9O1j78J00l02M49k09K42k41K06l1o6P7j01N6l2Q7j63
7874g8j34L22k62j25O4M43p0j29k64J57l0K37k3Q0m19K00M7j24K39RK4k94L6n8
7898a52J79M1l6k17Q9R4P5l30K52l59K48J05Nj04l5N6K11k32K7R1N0m3N4Q7j23
7923C3R1m64M39l23M13l13J16k4JK3L2M2j9o5k49K43J17K25m43J26J12j04Rj21
$$ y = [-269, -163, 46, 35, 20, 62, 9, -16, 145, -88, 106, 83, 75, -20, -77, 153, 217, -146, 108, -74, 126, 30, 116, 65, 39, -89, 151, 58, 89, -75, 234, -4, -18, -186, -179, 25, -74, 216, 103, -142, 73, 248, 26, 282, 181, 13, 176, -2, -27, 50, 31, -45, 47, 40, 50, 402, 200, -157, 116, -74, -110, 100, 66, 18, -128, 15, -134, 188, -34, -269, 65, -125, 130, -3, -84, 60, 141, 116, 102, 1, 11, 118, -26, 14, 78, -87, 52, -95, -13, -172, 103, 25, 43, -19, 19, 10, -124, -135, -87, -209, -28, -56, 66, -33, 28, -150, -50, -352, 97, -112, 130, -111, 95, 64, -2, 75, -26, 30, -2, 85, -78, -212, 110, -152, -277, -213, 230, 160, 31, -233, -76, -106, 131, 108, 188, -231, -31, 16, -108, 131, 140, 164, -130, -94, -152, 27, 68, 32, -185, -96, -2, 73, -257, -5, -364, -116, -11, -6, -110, -145, -89, 122, -110, -83, 8, 58, 15, 69, 156, 33, 124, -340, 99, -224, 189, -124, -8, -32, -31, -8, 24, 66, 47, -18, -267, -24, 93, 318, -125, 1, 113, 9, 18, -103]
7947a03K98j64J8k28L1Nl1J91oq0O0r6J02k25N30l03LR9k56L88K7m23J60m4j32
7972a79J63j58r7K64o4lk08L36j49j38K00Q4j87K80l03J3L02k79J98j18O4j2m7
7995c8R3j45J18j17J35k88J31K82j70J3N0M9j75K12l54L34Nk36J27M8K5O9l76
8018b08N08j77RJ06j90J38j49k38R6R9j75K07M0J11l18n8J66j27J72Q0J02l30
8040a36J31q4J8L20m60M06k14J75m15J40O2j00J70Q5q6R4j22J0l07L66j97K36
8062I2q3L6j2l6J77j86K82j77k42J65KJ58k00j10k9J35J15k96O2K39%OM3M4j30
8087E5k41Q5K89j41j24J8k27K24J01J02K2k81N2j29J43j15L48k68K03k70J54j21
8109a21j08M50j85j8J53n6J21j87M6P9k53L82j20k92R0O7J48l76M43m20L09m9
$$ y = [-103, 195, 31, 49, -179, -148, -143, -174, 17, 11, -69, -9, -105, -3, -228, 302, -1, 2, 101, -155, 233, 260, -163, -3, -47, -179, -16, -174, -271, -7, -71, -74, -282, 54, -95, -233, -33, 51, -136, 144, -159, -146, 156, -123, 75, -43, 21, 9, -38, 55, -90, 28, -89, 46, -242, -111, 171, 1, 14, 64, 113, -62, 150, -204, 130, 135, -101, 26, 74, 99, 168, -208, 300, 123, 132, 238, 48, 186, 37, -201, -105, -6, -181, 26, 66, 177, -141, -199, -33, -160, 12, 92, 194, -136, -5, -89, -71, 249, -211, 195, -19, 156, -259, -119, -57, -157, 13, 98, 12, 106, -16, -6, -313, 53, -144, 92, 9, 45, 33, -3, 174, -12, 270, 93, -149, 16, 18, 176, -24, -134, -163, -28, 87, -209, -147, 92, 92, 98, 141, 185, 55, -186, -101, 188, 47, -77, -59, -286, -62, 39, 141, 163, -118, -66, -195, -52, -167, 181, -87, 116, -154, 0, -121, -229, 221, 36, 18, 171, 115, 236, 49, 95, 174, -79, 303, 183, -109, -19, 48, 196, -180, 263, -157, 152, 103]
8131A03k39L89m89L30K3j35m8m4R6R7k40J64rP5K1r7L9K5J2m9J05N5j42r5J92
8156A39k47K03K1m1j12J12j72K21j46j01k3K74K7r4K18l85l5K61O7j10k27K04
8178E4o9K36l37Q5K01m1r6m9j00K60m49K92J20
$$ y = [103, -136, 253, -236, 94, 117, -18, -66, -110, -14, 83, -157, 7, -2, 73, 94, -3, 36, 61, 73, 24, 129, 184, 42, -53, 139, -108, 95, 116, 75, -37, 75, -97, 124, -22, -123, -146, 128, 155, 61, 279, -106, -141, 120, 187, 77, -150, 54, -15, 221, -116, -31, 170, 129, 33, -16, -116, 144, -305, -13, 107]
8191A07
$$ Imaginary data points
##PAGE= N=2
##DATA TABLE= (X++(I..I)), XYDATA
0@%%%%%%%%%%%%%%%%%jRj6J6j6J6j6K4l2L2l8M6m9N7o6P4q5R5j06J20j36J52j70
40i0J89k07K30k55K80l09L41l78M17m60N09n59O15o79P50q31R24j031J155j300
60f89J475j690J962k322K814l533M683o815J2013m7300n2109J22395J6218p3119
74b6017J918O8126j4115n8525M1292M3550o7991k0294M5125m217l9401O321L9255
87A5027l0703m6621O0159L1420n9314j5750M1961J3466l1799l374L5225k1916
99a2219k0830L7388J019k3936N761J0532n425j1919K2404J3206l5946N861L4926
112B0822p138j1274K674O172o264r958K0982o231l5063J4064J8606j4844j4450
125b1902P158J6085k1826j3014L4338j412k5287N702J3048R892o237l059J1881
$$ y = [0, 0, 0, 0, 0, 0, 0, 0, 0, 0, 0, 0, 0, 0, 0, 0, 0, 0, -1, 8, -8, 8, -8, 8, -8, 16, -16, 16, -22, 24, -25, 32, -34, 40, -45, 50, -56, 64, -72, 80, -90, 99, -108, 122, -133, 147, -162, 179, -199, 218, -242, 267, -292, 323, -356, 394, -437, 487, -544, 611, -689, 786, -904, 1058, -1264, 1550, -1983, 2700, -4115, 7898, -39402, -91511, 30884, 47102, -26017, -24099, 44027, 29912, -28613, 12679, 56229, -11762, -32056, 13069, 8852, -30549, -24228, 15027, -15676, -62297, -2138, 29282, -30032, -45782, -3821, 9645, -22154, -25528, 9697, -12219, -33049, 4339, 5358, -18578, -12817, -2285, -7710, -19629, 2775, 15981, -19965, -14104, 20822, 13684, 2410, 5084, 11256, 4992, -4966, 16016, 9785, -25278, -11214, 7392, -7452, -21902, -14744, 1341, -20485, -33499, 839, -573, -25860, -20158, -7110, 2782, -3455, -6514, 5367]
138E367p979J656J3714p821o045n645M930J2997j6760o033J5250m832q705l201
152a3107J2532P945k9292l298K8786j059j6979m603J8300P147k3356J0943J8374
165A2333k2959o632J9682N069j7725n909K9079m799k8843K6287K0405k7258j2953
178a4223K2734J7507k6722j3358L2193m583k4030J4605J0714j4376j3731J3386
190A16J1922k7202q58K6359j5259j3871J9860J1913j3901j2223K3775P584k5755
203g540J0122J5415j7450m055J4233M673j8222m762K5660r551k4520J9711R623
216A3337k0362o791J9172R254k5545N19K9292j5139j7579K0025O157j8830q335
229a4825K3006N308l1646R287K7558j7311j4205J6423J2815j5642j4023K4638
$$ y = [5367, -2612, -956, 12758, 4937, -1108, -6753, -1823, 11174, -5586, -11619, 3631, -1201, -9906, -13107, -575, 7370, -21922, -25220, 3566, 2507, -14472, -19075, -775, 6372, -16984, -6041, 12333, -10626, -17258, 2424, 7493, -10232, -16141, 12938, 8139, -20704, 5583, 25988, -1270, -14223, 8511, 26018, -704, -14062, 18131, 13548, -10482, 4123, 14837, 461, -13270, 116, 12038, -15164, -16022, 10337, -4922, -18793, 1067, 12980, -921, -13144, 10631, 18215, -7540, 2582, 17997, 547, -3508, 10725, 15398, -2824, -7586, 18074, 8523, -15997, 3714, 13337, -7025, -13816, 5356, 14610, -10935, -10416, 18876, 3737, -13842, 6183, 12340, -6490, -14825, 8181, 13489, -18157, -8870, 18688, 1377, -12828, 3595, 16410, 768, -13255, 11383]
241A1383N876k5959Q204J6303r310r536O527J1885j5212j1487K0820k644j8078
254a1228O824Q730j901r530L540J4266j1316o209J2340k432l233q62J799M992
268E780p005K292P357q313J754K761l149J385n149K301L061o790L600J758k724
283a081K969m823K966K539q139L634J211l547K879j861L634J33n130Q274j531
298B127o645N493n10j416j940q4P451p503k255J1279n997n123M719J683k025p881
314h627O854P021j3939K329J1193n763n596K530P885n164j1592J3196L785j4847
328a0735N050J0125l479p114L458J2325j0159r785J6324l98j3219L091Q805p44
342C545j2160M748J3436j4225o135J3819j725r464L54R454K28j2504R187J0522
$$ y = [11383, 17259, -8700, -496, 15807, 6497, -3039, 3488, 15373, 161, -11326, 9494, 6850, -11228, -4404, 4326, 2425, -7105, -3565, 10701, -615, -6824, 5516, 3084, -149, -1011, 788, 5780, -1225, 1067, 8424, 111, 1865, 4626, 1477, 2862, -2287, 14, 3075, -3715, -115, 1643, -1081, 1888, -2935, 31, 2570, -5569, -1935, -724, -4271, -1392, -3253, 381, 514, -4616, 3658, 2127, -4518, 975, 465, -951, -2891, -2975, 4476, -3027, -5282, 5997, 0, -5123, -404, 1279, -746, -8627, -1773, 5248, -8691, -6362, 4831, -932, -6528, -3998, 3887, -1277, -12869, 327, 4112, -10735, -5685, 4440, 961, -6153, -2695, 9630, -529, -10314, 6010, 5612, -7607, -4516, 4289, 3545, -8615, -3867, 9569, -4656, -10791, 3028, 1303, -8161, -7807, 1647, 1875, -10629, -1442, 9080]
356I080j3018j11R816j167p079j962J1175l352j2048J0931M625j0063L79M982
370B188J699p551k293J1014o358o958R861M23m916J93M234L010r485K213Q742
385F016q957k752O248l40j756k940O177K351q277M956M989o506L88J703K653j793
401B160m881Q479k9q049M413J799k860l185r75N303m594l607P468j729k562L657
417H08P01K251l679Q22O627n549j093N424r01o57k831K948L901q175R71M114n347
434C35kL47M99N74l600M738J375n755M246R15k617n82j507M812k731o058O943
451A932O31l787J316L85K017k689r73N912m675j152O469k136q33J263J233O90
467E603o031J986M105p092j096J237K35M57m631L776K333n542M528J755m143J538
$$ y = [9080, -3938, -4049, 5767, 4600, -2479, -4441, 6734, 3382, -8666, 2265, 6890, -3173, -2794, 2188, 3887, -3664, -5957, 5057, -1301, -8259, 1602, 2025, -2891, -2698, 1536, 4546, -4939, -2726, 6016, -2941, -5693, 555, 215, -1541, -4481, 1696, 4047, -4230, 726, 5715, -791, -403, 1300, 3953, 2160, -2721, 5758, 5729, -2320, 2093, 3892, 1032, -2153, -3128, 2175, -2419, -6026, 1442, -287, -2849, 808, 1509, 3760, 81, 903, 7530, 1981, 888, 6312, 5411, 4754, 1923, 4871, 8772, 597, 1568, 5682, 335, 333, 680, 1179, 1753, -1847, 2891, 4266, -1489, 2757, 3672, 1055, 473, -1034, 3778, 1047, -5011, 1932, 2563, -1224, 92, 477, 2494, -195, -1168, 4744, 69, -1083, 5386, 3250, 2417, 3680, 4913, 5603, -428, 1558, 5663, -1429, -2525, -1288, -1053, -596, -5227, -1451, 882, -4660, -132, 1623, -2520, -982]
483i82J480K689k236j759P896k667m925N457K59k004k391j244M509l854k250M809
499B787l337o1K719p35L41l573J922L548o546N64M927l522j525k6L260K58o008
516e007L057J575l663L053p59o75J879k87M191j469l305N433q86l223L59m42K109
533A940m823j937O008l574k157K063k364J613l17p53Q56k525L358K819l648J914
549a527J447Q23J025l816L281J667n842J293K017j70K19l010K442O65j995L645
565B164l080k425M257j370m35o16j063L818k350j590K667k027M6j767p66M052
581d85k828j186L142j703K834J693j947O12p28K560Q22m653K723P46k483J943
597A062j680M64R10m037J368N59j606N92k615J118K523j092K413k384r31N485
$$ y = [-982, 498, 3187, 951, -808, 7088, 4421, -504, 4953, 5212, 3208, 817, -427, 4082, 228, -2022, 2787, -550, -611, 2108, 1373, 1714, -1859, 63, 3611, -2935, -2371, 2556, -966, -2491, -2517, 743, 1001, -5007, -1950, -375, -4038, -985, -1744, -2419, -540, -827, 3364, 1895, -1410, 4023, 3137, -86, 273, -169, 1940, -2883, -4820, 1188, -2386, -4543, -2480, -4844, -3231, -3548, -4301, -3445, -5970, -2612, 207, -3441, -1527, -80, 743, 1768, -2048, 1233, 2900, -2942, -1649, 368, 198, 417, -2593, -151, 514, -1481, 2164, -916, -3341, 916, -454, -889, -1505, -2568, 1250, -1100, -2690, -23, -2050, -2004, -3771, -4537, -485, -3313, -4499, -1357, -3060, -226, 1467, -480, 132, -596, 1964, 2786, -1867, 856, 1602, -881, 1062, -618, -154, 756, -3281, -1913, -1354, -2960, -2368, -4983, -3865, -1342, -2434, -21, -2405, -3336, 2149]
613B149k468r81J247j330K066j498k4K953k586M35N48q70L193j953k265J996j396
630g84K443O99l564J480J011K93L88l507K042m47l048K635p46n09J072k059K132
647d69J854j454J207k312R38K524j440N81j196m53M418k230q97J564k467Q98q15
664B51m53J501k858J09J316j377L509j523k818K606q61J181K98l552K181M40J00
681E0J618k013J325N55k373K668o53j601J617k264J503K134j896J017j997Q85
697E75K738k727l5l78j605K784j813q15K271k250R85O14j079J921k688L8J883
714D19j836K300j58k042K543l51P05P54k791J486N5j600J440j600P27O25k141
731a465K947r2k303J385j601O29P15k067J522r11l17K670j768Q1R80j602K003
$$ y = [2149, -319, -1300, -53, -1383, 683, -815, -839, 2114, -472, -37, 511, -359, 2834, 881, -1384, 612, -784, 1659, 2358, -1206, 274, 1285, 1578, 1966, -1541, 501, 54, -2994, -359, -1105, -1614, -542, -2601, -469, 1385, -69, 1138, -1174, -236, 2288, 848, 1429, 233, -220, 4198, 1968, 1071, 2635, 168, 1066, 251, -202, 1299, -1559, -1450, -134, -1511, 1998, 475, -2343, 263, -598, 583, 881, -2671, -490, -50, 50, 1668, -345, 980, 1535, -838, 1830, 1177, -424, 1193, -1071, 432, 2566, 670, 1687, -310, 575, 3313, 586, 551, 173, -1432, 1352, -461, -1276, 995, -1255, -270, 344, -735, 1186, -1502, -1464, 419, -1417, 883, 725, -1317, 1226, 875, 1580, 2334, -457, 1029, 1084, -516, 924, -676, 51, 676, -1465, 1482, 1390, -913, 472, -1129, -500, 215, -1852, -330, -1241, -1558, 1112, -656, -575, 405, -1197, 806]
748H06j409n56K073k262N61J188p84J438j529k92K356k439Q63N11k712J949k78
765e16n2J100j931J758Oj577J634j386j42Q99j943K024l97j315K541j266r7J219
783E59j548R75o55m55J970j831Q0J946j612J342l29n23J362k515N55J097k263
800a845J360k37j22J256j612J321M60k434K454k87j622J724j497J603K17j626
816h87K575j074j366J720j456N75m45j437K109j297k2K188j802N62R95o69Q49
833A118j493QJ298k153J123N37j151J480p34J33O45k298J811l71j540J897n73
850b63L2J138j159K217p60j558K327j650k58N79j045J330j182o37K208j753L74
867f0R27j202P25p04R7J581k156J258J352j651R82j00J9N15k332J311L61k276
$$ y = [806, -603, -1159, 914, -1348, -787, 401, -383, 1055, -474, -766, 1590, -849, 14, 525, -2187, -238, -516, -568, 532, -1399, 359, 365, -1212, 422, -964, -1106, -207, -2150, -126, -523, -1838, 703, -563, -660, 559, -989, -14, -669, -1124, 846, -985, -905, 1041, -571, 771, 442, -81, 1281, -1234, -679, 418, -1845, -485, -722, -844, 412, -1200, 121, 581, -1853, 601, 314, -1308, 416, -1081, 522, 739, -887, 1688, 614, -752, 968, -488, 87, -358, -1795, 314, -983, -1005, 1183, -619, -57, 938, 269, 1118, -375, -367, 931, -1222, -99, 438, -713, 767, 33, 166, 811, -1487, 324, -47, -1587, 310, -263, -231, 907, -252, 1965, 1205, -353, 1974, 324, 66, 645, -400, 930, -252, -889, 1319, -434, -60, 867, -335, 390, -314, -217, 1364, -792, 466, 1818, 167, 1149, 1049, 1068, 1583, -749, 562, 923, -1353]
885a353J941n03n78J223j083J641l82j684K043o99r60J236q11J241l56j042K299
902B173j693n95J310j555M59m03o43J929j965Q66K148k651R89P03l21N90j849
919e08R40Q91k684J968K19r52P61j098J058j03j778J922p65j246J807j37p9J73
937C89o11K557j934n45J914j678j44L66p15J056j150L82J362k212R77O48j419
954g57O79q32R72P01k222J932M61j145Q83k26k28K72j543J739p84j576K005j103
972g72J87J265j158J144p66l31J563j593J23J063j072P77n72PJ803k340L70Q94
990E92j924Q08K5p47P13r46J345M74j570J359K91o15R45j602R30K87j530J417
1008B52R9o06N41j013R09o25o79J632j865l9J658j031L84M60n89J660j736J14
$$ y = [-1353, 588, 85, -493, 730, -353, 1288, 906, -778, 1265, 566, -394, 842, 31, 1272, 916, -126, 2173, 480, -115, 1195, -360, 99, -304, -947, 982, -983, -117, 2031, -620, 369, 1072, 751, 1341, -508, 432, 1323, -1361, 607, 826, -126, 635, -463, 595, 492, -1286, 636, -129, -1375, 432, 295, 216, 389, -222, 2335, 401, -144, 1770, 92, -52, 314, -401, 655, -495, -113, 1249, -963, 14, 662, -757, -78, -910, 62, 763, -1459, 473, 934, -211, 672, 446, 218, 490, -1053, 686, -98, -1674, 331, -772, -585, 680, -478, 666, -100, -431, 1132, -461, -338, 725, -347, 430, -142, -135, 1668, -672, -302, 592, -1332, -524, -499, -1246, -533, -1479, -134, 340, -1230, 129, 420, -195, 750, -852, 78, 365, -1165, 252, 351, -255, 286, -727, 182, -443, -1122, 510, -1355, -1394, 264, -767, -383, 77, -512, 1148, -588, -474]
1026d74J249j674N88o86K33J308j616N62J017j670J197L92j458O82o06J000J0
1043E4j220K044j89j297J509m71l6j12j572J531r91k88J206j066N6R70n70J103
1061F61j345k96K032k390L28J376j033L42k30R30O02j908J318K04k050J697p63
1078e25M3K34r44J884K56j759J296L7o33J01p02J275j037j052K292j113m42J444
1096F55j504O46j70k61R19j857P52J410j182Q22j02Q1Q25j411O49R75j577P23
1114C93m52L7Q50j246Q70n1j307K137j031j262J260q62L98j35n35J304p83j29
1132e44J414j017O34n78r58J524r14k32J479j134L91Q72n49K74q49N08Q31k011
1150h59R56M51j312J225p36M16P39j251N23L9j090J100p34J64J38p23J650o42
$$ y = [-474, 775, -899, -311, -997, -764, 544, -1072, -510, 507, -1163, 34, 426, -1032, -350, -956, 44, 54, -1166, 878, 689, -608, 901, 430, 394, 282, -1290, 241, -750, -1038, 168, -898, -842, 128, -442, 661, -684, -980, 1052, -1338, -1010, 366, -667, -325, -555, 375, 977, -931, 387, 591, -1459, 238, -525, -482, -248, -1192, 692, 948, -811, 485, 522, -111, -10, -712, 563, -474, -1526, 766, -347, -789, 655, -849, -203, -373, -634, 285, -1572, -820, 590, -592, 230, 128, 209, 1034, -377, 272, 1247, -330, 393, -59, -22, 828, -418, 452, 401, -906, 1231, 200, -1062, 198, -664, -266, -401, -936, 368, -415, -544, 870, -147, 487, -91, -1049, 475, -439, -671, 808, -326, 65, 937, 388, 662, -187, 321, 1152, -859, 97, 548, -764, 461, -275, 141, 880, -371, 152, 191, -899, 201, -533, -369, -231, -954, 696, 54]
1168E4r45J856q83l31M72p09J046q25j66J576j363N00R58j352Q94k71l61P27j749
1187h72O20R41j221N71l55N00K86j235J009K2j567J283P6p61P34O9L50k18j50
1206H2J134j318m61J493q72Q8o20J17J187r66R6J369j535M49j52k28N27j281R14
1225B3M21j644J284K32r26M65n35Q06j53j422J277Q5o77R70l45P52n0p96J340
1244A107l54q59J070j039J48K96n30J007j126j49J093j151K4K60r77J128p15p
1262g74Q71j013J032K98p43R08o79j97O84j078R37M4q03J216m00R1K32o79Q19
1281G66o43o20R06m69q6N82n85R75q89o6J207j621j91J040j266N97l65n5J013
1300B30q17M82M57n24P69m38m7P95j297J065K87q54R52l29o08K11p54O68l66r95
$$ y = [54, -891, 965, 82, -249, 223, -486, 560, -265, -431, 1145, -218, 282, 1240, -112, 782, 511, 150, 877, -872, -252, 689, -532, 39, -316, 184, 470, -765, 244, 266, -1301, -18, 58, -703, 31, 100, 450, 232, 82, 1216, -102, -563, 930, 58, 146, -474, -357, 830, -136, -40, 1329, -206, 243, 91, -137, 390, -891, 23, 444, -1200, 84, 316, -610, -145, -680, 126, -27, -1449, -172, -87, -764, 206, -139, 613, 563, -233, 1107, 753, -106, 964, -75, 73, 369, -161, 846, -280, -429, 664, -487, -463, -203, -1180, -52, -767, -774, 97, -916, 116, 414, -329, 579, -100, -297, 387, -691, 246, 290, -513, 703, 303, 394, 626, -53, 766, 123, -497, 409, -60, -146, 436, -149, 826, -63, -129, 1078, -543, -734, 306, -960, -363, -728, -783, 230, -587, -105, 352, -172, 597, 159, 112, 907, -390, 675, 962, 108, 1060, 731, 123, 334, -420, 248, -118, -1113]
1320a113J273p21k65J038p88Q86m51m13J144j210K02P78j158R91J7l42Q72j172
1338d32P64L81q72R3P9j58M51l79O44J15q02J255l36o19R39r18j08P1r15J070
1358C23n05n18J233j167N52L09q01Q40o12n7R74j102O25O59n15Q52n03j95N43
1377I35j029M40J64q50L43m86J80O87j144R86Q6p62P73p34k4M82q61P96jn56J069
1398D94m02j63K38l96J66l3l39R18q22K13O45n06Q34k54j54K90q01K29M18j078
1418e03N53j05j76N95r94O79L53j266Q41m32m4O14m69L71K46o04J194p5n52N77
1438H03n50n0N2o45Q90l68m26Q07r05O24l30l44N52n18m2L00n77M20O20r42R87
1459C58n63j48Q69j066N24l51l88O66k51L83J96o06N09m1k21O32r84L79J64m36
$$ y = [-1113, 160, -561, -826, 212, -576, 310, -141, -554, 590, -620, -418, 360, -798, 193, 210, -132, 740, -432, 332, 713, -159, -66, 13, -145, 306, -73, 571, 686, -116, 1139, 803, 184, 1123, 205, 97, 168, -747, 323, -182, -700, 533, -634, -82, 227, -574, 266, -346, -403, 571, -531, 94, 753, 238, 1090, 587, 392, 935, -94, 346, 510, -340, 3, -483, -303, 384, -760, 226, 312, -450, 323, -411, -435, 47, -814, -18, -19, -575, 494, 92, -71, 167, -229, -63, -96, -435, 483, -339, -126, 519, 13, 847, 593, 439, 729, -72, 157, 575, -503, 50, -55, -231, 364, -630, 49, 402, -864, -23, -455, -499, 115, -354, 17, 263, -341, 853, 778, 226, 803, 253, 203, 255, -390, 500, 132, -294, 513, -392, 232, -98, -442, 110, -408, -450, -150, -727, -307, 313, -629, 358, -205, -353, 516, -550, -26, -377, -765, -99, -350, 33, 229, -377, 132, 91, -130, 502, -482, -103, 61, -375]
1479c75Q06p16m8P13o85J97K49q10N70m82RO58o23M16K8n40J027n1n3N8o01M65
1501B12K90r07P71l56k3K36l78O82n15m09N94o77%K95m32K66K76m85O80k99k87
1522d66M53m62K79k26j69J099j123J05R42o64N85l14k74O47o17Q1j3l91Q23m35
1542a40j58L04l44K71L62q25N86n33l28O34l55N83L6p19J080n93k12Q71j184O64
1562@M78p29O37l64L73J12m96M76j11o17Q10m80m23N74o26J30K28l71M63m94M74
1583D4l39l46O35j28o09Q85p6J03O52p69N32k33k14L96n44P4M37q39Q88m34j44
1604b9Q00r32l2L14l55PJ83o31O80n40M11K98m75O65k71k64N03m73LK6j32R53
1626G09o56n0O66n14N76j79n63R11p60J4N01p96N06l3j78K4l79j90Q05j112L28
$$ y = [-375, 431, -285, -333, 380, -305, -108, 141, -669, -99, -581, -572, 86, -537, -121, -93, -633, 394, 343, 290, 348, -253, 212, 502, -405, 366, 10, -13, 223, -155, 527, 12, -397, 197, -480, -480, -185, -617, -351, -75, -560, 120, -179, -466, -13, -475, -196, -422, -591, 508, -615, -510, 432, -232, 353, 39, -235, 412, -205, -124, -137, -528, 295, -140, -298, 6, -338, -67, 295, -530, 56, -477, -805, -171, -526, 57, 93, -626, 454, -139, -351, 520, -664, 0, 478, -251, 386, 22, 395, 507, 11, 487, 376, -241, 569, 89, -334, 240, -386, -256, -28, -399, 64, -430, 44, -295, -641, -6, -134, -743, 142, 66, 169, 821, 52, 584, 351, 137, 533, -11, 63, 500, -339, 549, 115, -29, 771, -161, -193, 121, -234, -227, -44, -675, 5, -535, -124, 174, -301, 364, 93, -171, 332, -141, -138, -112, -244, 709, 53, 3, 669, 155, 731, 552, -11, 900, 140, 154, 655, -141, 365, 332, 154, 178, -201, -391, 414, -698, -370]
1647c70j20n03R73l03R4P27n63K72J03j16M72o59J88L62p01Q63l39k96P01o41
1667A44j11L09n89L04l96J76J34j04M18k03k91Q47o83o60P60n69M43J26m17L73
1687A1j43j89M75m63O83k32l79O87n05R0N38m84L56j12k09N27q37mJ93m56K91
1708a62l12k99N90k58l9O43p11M69k5l02P82o26L05M51p53P89k43k99P79p57K
1729B4M27n37J78k52P1M49o21L42J65m50L17l28J9K39n26L72K14o77L44q7Q3M12
1751A78n31M29p0n08N26k78J98L92k61J30L06k12M83m04j76o0k20J36k69m09O24
1772Dm15k68O39n64K97j86j72M82l30L11J35l27P17j35Q6K84n53K96M1o07O04
1793C39n61L17O27n52J63J64n72M83q7o30K91m28M08K2n62Q09o18j1N66m81L45
$$ y = [-370, -490, -993, -20, -323, -229, 498, -65, 207, 310, 194, 666, 7, 195, 557, -144, 719, 380, 84, 785, 144, 33, 342, -247, 57, -339, -163, -29, -133, 285, 82, -209, 638, -45, -705, 55, -514, -71, 55, -362, 11, -132, -321, 154, -309, 374, 142, -237, 450, -55, 35, 573, 89, 445, 333, 124, 651, -186, -190, 3, -453, -162, -474, -773, -183, -441, -480, 163, -548, -79, -104, -406, 376, -250, 55, 506, -247, 542, 299, 0, 779, 22, 24, 451, -86, 92, -160, -89, 360, -261, 81, 246, -204, 113, -215, -196, 43, -483, -111, 103, -574, -230, -317, -234, 178, -353, 76, 6, -502, 24, -254, -56, 336, 75, 205, 511, 299, 782, 378, 202, 142, -78, 58, -211, -620, 4, -411, -679, -40, -604, -307, -493, -665, -183, -513, -202, -67, -394, 323, 188, 274, 558, 5, 301, 342, -265, 339, -222, 95, 722, 170, 333, 497, -75, 408, 321, -309, -18, -446, -38, -16, -578, 231, -387, -398, 168, -313, 32]
1814C2l9m14O23m60J76P21q81L59L59l46M69k80q7K72n09K88J4o11P19n31R5K13
1836A82l03L05m65l20N41m26K36M15n01M86n0k39L43j09k93P74n93N68l61k96
1856a06M01k29K42J3m80L67Rm12N06o05K32J47l91P70l30m50M49l17L71n3n35
1877d01L50k78j58P43l42K48l1oQ9L8pJ80p85Q27k3m67N04m56j8L40n37L09l65
1900b46j96L68m76K83J80l75N33k35j63K82j42j43N84r10P17k6m01M86j71o7M46
1921C28k25Q9l24K14K1n53J43K47k12L63lk17N86p43L33k43n18N60j50k51M65
1942i0l48L99o2P1j5j74m3L94k15Q3L49n35N02j94o7J55j69J45m40k96M10j46
1964b86J79o7j29M78l50j97L61k99k18L26j49L41j22k13P20m69J99m6k33J66j6
$$ y = [32, -7, -421, 202, -258, -82, 639, -242, 117, 476, 130, 599, 319, 232, 504, -5, 283, 297, -314, 405, -126, -31, 182, -121, 184, -281, -601, -60, -486, -250, 165, -336, 150, 100, -139, 204, 95, -198, 576, -17, 551, 190, -106, 295, 66, 308, 321, -159, 208, 217, -195, 311, -294, -62, 85, -306, 464, 134, -316, 133, -184, 187, 134, -401, -51, -329, -487, 256, -86, 162, 131, 125, 214, 252, 245, 425, -360, 467, 444, -23, 481, 25, 7, 347, -190, 119, -246, -442, -74, -550, -267, -87, -462, 71, -164, -327, -45, -187, -330, 254, -656, 61, 35, -366, 120, -51, -118, 328, 103, 192, -132, 82, 103, -450, -307, -60, -272, 91, 88, -129, 457, -286, 47, -196, -714, -154, -304, -555, -90, -438, -39, -101, -30, -45, -219, -262, 132, -83, 0, 349, -186, 316, 122, 55, 210, 41, 186, -254, -550, -140, -286, -107, -174, -303, 175, -175, -372, -11, -310, -528, -202, -351, -10, -132, -345, 375, -94, 105, 59, -174, -8, -24]
1985b4k38L03m76L67J45m97N76k31k7M35m70J86k76k80M09j68M6M55m08K96j39
2006a6j22L73m96K17L00n56J65J64j49K05j8O5q2j08M33m33j09K67l13O3K82l33
2028b01K64P5m27P09n28P8j43k30O80k54k62O63n89N67K8l80K93m52j10O00l01
2049H0K2Q8l96N24m3m64M60p39O35m7n96K45K50l67M04m99L62J23m18N56l19P2
2071f7M30p95M15J6n5L73k59j1O9k39M94j54n60M63j92K92L62p94K20K29l17L86
2093C06k37J7j15l81L19j38p9M06l77M96J5m39K71l36N3M94j72K19j32l66N09
2114C33N1k10K17l19j83qn9L23k69j67O88m83K50l5l10L62l56j28L53l79R9K96
2136F6j05M45k53k8j20l9O2p8m17N89j69l67R78q60N63k1n73M07j92L9J02n11
$$ y = [-24, -262, 41, -435, -68, 77, -420, 156, -75, -102, 333, -137, 49, -227, -507, -98, -266, -220, 235, -173, 123, -16, -138, 235, -261, -44, 256, -300, -135, 29, -120, 85, 67, 132, 50, -58, 375, -58, -167, 100, -213, -150, 132, -201, 63, 138, -289, 420, -108, -30, -173, -403, 277, 23, -239, 424, -165, 402, 430, 50, 343, -109, -219, 381, 80, 102, 190, -206, 318, 275, -189, 271, -468, 167, 120, -476, -231, 19, -348, 56, -443, -81, 42, -376, 180, -139, -67, 363, -432, -17, -1, -56, 317, 58, 47, 116, -123, 371, 217, -343, 120, -72, 220, 582, -212, 8, 237, -80, 306, 69, 86, -29, -410, -91, -229, -308, 98, -279, 217, 232, -207, 64, -272, -219, 275, 103, 322, 190, -176, 333, 384, 174, 391, 72, -111, -119, -178, 145, -124, -291, 397, -86, 164, 129, -181, 181, -175, -303, 50, -329, -230, 66, -39, 406, 153, 125, 5, -34, 28, -50, -467, 122, -47, -414, 564, -296, 267, 246, -327, 80, -112, -73, 29, -482]
2158d82M45N2k18J19r7q6L52l51L71m8m07M28k64J29N51n04M71j76l4J07l20J02
2180A40j91p0N7J14k47N7r8K17l2k12L68l26k65O15j87ON9j70K22n2k34O41o56
2203b44M60k38m26K76J27q6N28n37N00P8k76L30n73L67M9l08J84j95j4J53l15
2224a60K87k17o5K64l47r6L65k16J7L69m04N33k10k9J15J00k71L2K6K22j73k10
2246f8L44l90J22Q3k76J52o6p4L05m28J88qK06J45j50q2N3l4m8P7j91K76K4P3
2270B33L8m51N04J19l11K9k28J65Ql21N30j92k06J28J49m8R8m48J88m08N3L57
2292a4m09K22J37K09J17l62J2L14k74L02j45k13O05p04N5N49l23K30j06k74L58
2313B86l91j65N38l96L32M8n92K87J46j50J29l10M18l26j89M28m78K68M84o83
$$ y = [-482, -37, 15, -203, -84, -181, -267, 85, -266, 105, 57, -350, 78, -186, -57, 494, -10, 461, 285, 251, 358, 38, 140, -51, -121, -64, 50, -197, -140, -238, -21, -53, -265, 103, -223, -488, 127, -60, -54, 5, -165, 57, 5, -229, 412, -244, 216, -22, -448, -172, -45, -131, 397, -140, 360, 438, 162, 492, -81, 286, 335, 27, 211, 16, 2, 155, -160, 127, -90, -155, 109, -238, -334, 31, -185, -168, 201, -203, 330, 120, 91, 206, 306, 35, 67, 93, 315, 142, -68, 276, -114, 8, 91, -185, -33, -99, -173, 132, -296, -108, -116, 90, 235, 85, 3, 56, 22, -26, 51, -140, 136, 160, 233, 271, -180, 324, 443, 132, 161, -67, 98, 106, -215, 315, 123, -83, 45, 194, 146, 244, -204, -16, -424, -371, -14, -423, -201, -64, 145, 262, -100, -88, 226, -48, 254, 109, -104, 501, -203, -148, 401, 78, 308, 202, -72, 286, -105, -270, 268, -128, 204, 252, -340, -53, 93, -57, 72, -238, 180, -146, -335, 93, -385, -117, 367, -316]
2333c16O33j05m09M41l05P0J74k53Q1J63LK30l50m5L14n52J66q1j0L23l81J08
2355a01p1l09M97k54R7K57n17L77J02n46P41l47o8M25k59M7P6l23K02j0k89N87
2377C14n70K49K74k25K96n36L01k08k50L38m77J35N46m16Q5L81j54k41j03R1K26
2398E6k34j2K89j82L35M9j65M4m1k31J52k19M4j57P8K96j60j61J04l2Q8k46L20
2421A5J07n70K13O6j52L65Qk95L61k33K25j16o0P2j3j40L69j54J46j20J3L71o31
2444a53J53L64l99L9R5n07N19j92k10L05l21K10P8j4k73L11j27J93k66K54p3M
2466a0K69k53oK4k41N37k54k29M33l73L82m8j42j40L10l63L45l21j73M8J5K13
2488B3j07j65K19%J5J41l11L81k33j3J99j10K15l9j52O4M5l02L34j70n1K73l66
$$ y = [-316, 317, 212, -197, 244, -61, 9, 183, -70, 11, 174, 177, 407, 57, 12, 326, -226, -60, -141, -151, 172, -209, -101, -172, -481, 16, -238, -141, 116, -401, -24, 78, -468, 273, -74, -142, 283, 24, 71, 147, -176, 26, 16, -273, 314, -256, -7, 267, 42, 338, -198, 103, -105, -355, -17, -494, -359, 187, -229, -144, 237, 83, -158, -261, -170, 56, -178, -190, 99, -83, 252, 301, 136, 180, 139, -92, 60, -159, -115, -272, -194, 102, -58, -219, -115, -147, -59, -305, 15, 122, -448, -235, -169, -321, 44, 52, -243, 118, -115, 110, -6, -66, 6, -7, -147, 222, 68, 214, 94, 107, 478, -153, 0, 364, -35, 4, 99, -408, 111, -81, -291, 14, -307, -97, -19, -33, -306, 5, -122, 71, -195, 59, -14, -10, 259, 6, 0, 24, -217, 320, 66, -163, 270, -103, 279, 231, 89, -51, 259, -104, 241, -80, -253, -205, -190, 23, -84, -249, -30, -30, -15, 126, -185, 196, -37, -50, 149, 39, 254, 215, 63, 127, 172, -130, 204, 34, -17, 256, -110]
2511a10L89n48K18K88k15j1r0n6N09m44n6N44m96L93m10j21J88r4J14J54q4j66
2533a04J44o3J45j5l1O0m02K70k8j40J12mP7O0m15K85k7R5K28k49N3M7l22K88
2557F4K9j5L9k83L70j94J52Q3n3j21J81l54J00n9p7L13k95k8K60k82J3J09o6L16
2581B02o34J59N03k71kj30r6L55j83PJ37l10L17%j72K31k20R0J97m75M02J7n07
2604c83N27l54K4K89N8k3k6k87L60l65J21K84l22q3K22k51K31j06J46J94n03O52
2626D05n30n6K14l79M65L1m26K66J97j51J00l00J66R2r1j79K33l07K61m1L3J98
2648B01m97N35j93J24k03O3O0p3O6m3k05P1M42l01j27L9J8K37k50Q3M16n41M00
2671C22R1m77K58k52R2q7l83M88q7j98K48J45j88K07k67J95k99J13N35p34K33
$$ y = [-110, 279, -269, -51, 237, 22, 11, -79, -135, 374, -70, -126, 418, -78, 315, -95, -216, -28, -122, -8, 146, 62, -104, 40, -23, 122, 107, 76, 136, -266, 4, -24, -164, -52, -56, 21, 81, -334, -49, -76, 19, 247, -2, 51, 98, -224, 64, 93, 78, 117, -166, 204, 10, 162, 245, 192, 71, 252, -102, -2, -61, -138, 175, -120, -148, 112, -170, -157, -48, -114, 202, -432, -273, 230, -41, -43, -173, -269, 86, -97, -90, 47, -263, 54, 54, -118, 113, -107, -17, 180, -295, 107, 124, -383, 144, -210, -186, 103, 161, 138, 112, -175, 185, -180, -59, 225, -97, -180, 42, -209, 22, -84, 62, 256, -247, 405, -125, -181, 33, -346, 119, 150, -276, -10, 187, 36, 136, -164, 2, 94, 3, -176, 57, -250, 11, -30, 3, 201, -296, 239, 46, 170, -33, 30, 90, 17, 83, 40, -165, -94, 348, 47, -80, -41, -23, 214, -36, 47, 463, -78, 322, 413, -64, 194, -58, 34, -53, -436, 52, -35, -233, 15, 160, -28, 179, -88, 107, -192, -79, 456, -278, -45]
2692d5L00j71J15j70J87l5l14L19j86NL09l92n7J70J44j31l6J11r7j70l3K58m05
2715c24R5M26n5j83j8O1J29M9j24l34K82J89l44K27K47j85O6j79p4L61m74K08
2737D6j80j50K69k00J97R5l32L36K57m70J66l86J23L87j37Mj1j37L95k57K06k05
2759A6m3K10K12m69L0O5j87J51J57N6j95j18j46J18O5J16j94O0Jj12M05n60M19
2782E7J26k14Mj73p7L56K7K9j15J54J03n7l19K22R2k77J80j72j94K75l36K82Q2
2805E5j91qm5K25j90j73M66k07QK36k30K84k19O8k5k48L96j44k40L49m80L27L7
2828E1m2J11k80J79K07j03r6l06J31J45q8l5M4l7q8L59k75J10j7l01K63j11RK80
2852A10k68J58j68L91j8L1k90Mj76L33j18K11Qj23L7j75j2o9L50k03j0k75J99
$$ y = [-45, 255, 84, 199, 29, 216, 181, -133, 186, 0, 5, 314, -78, -135, 35, 179, 48, 12, 123, 26, -144, -177, 81, -324, -229, 197, 142, -41, -59, 2, 131, 180, 56, -278, 4, 193, -151, 76, 323, 138, 204, 25, -49, 312, -162, 46, -134, -284, -15, -215, -18, 77, -255, 81, 338, -132, 34, -352, -229, 158, 21, 25, 14, -123, 272, 15, 221, 16, -27, 183, 395, -74, -44, 21, -166, -15, 142, 198, 3, -115, -261, -143, -78, 38, -156, -96, -95, -207, 198, -362, 57, 183, -31, -27, -200, -277, 79, 106, 135, 20, 174, 277, 220, -99, 123, 215, -62, 118, -54, -248, 27, -309, -27, 55, -136, -144, -189, 36, -154, -327, 139, -68, -60, 176, -54, 230, 11, 79, 54, -194, 202, 58, -182, 167, -313, 14, 51, 9, 120, -160, 19, 226, 123, 27, -279, -148, -3, -91, -126, -82, -119, -207, 152, -123, -13, -30, -331, -68, -179, -170, 110, -158, 0, -168, 223, 205, 236, -54, -50, -226, 107, -11, 200, 208, 85, 122, -53, -65, -134, 216, 13, 3, -272, -73]
2875g3M0O0J25m43M08l1k70J54j48j4J12M1j44M44k43K52o1k29OK84l17P1j46
2898a22K95k75j90M64l46J38o2j84J93j12P7RJ99m10O17k51L20l34p9J17j19k9
2920h4J80k1k1J6j64M40j34ll46J5K03O1k70J90r8m5J91m3m5j64j0L96l38J51
2944E7Q4k08L07j85O3K24n13K49k2j82K51k63K52J57n22L46j61rM22k39j05J10
2966A13j64j85j21K99P8j28L46l09j92K19j11J0L49k49pQ0j56J27p5R2R5Q3r9
2989I5J04k79L36m83J66M32o42N10p7j96J30r4r1J81j83k6k0k49M82j80J89o1
3011D4m5L04k46j03J45q8j6L5k00J33J51j47J90Lj77M8O5o2k28j4J68M3N1Kp2
3036a6k44N47l58QQ0q4J20j76j34L14l2K42k71m8o3J88j62k55K27K70k60K31n4
$$ y = [-73, -33, 27, 152, -291, 117, 86, -184, -30, -178, -192, -80, -39, -183, 261, 18, 270, 209, -20, -14, 270, -47, 24, -122, 173, -102, -292, 172, -174, -36, -98, -282, -89, -201, -124, -115, 84, -326, 291, 40, 360, 26, -53, 64, -55, -84, 96, 75, 54, 70, -94, 346, 212, 209, -137, -122, 81, 142, -128, 62, -36, -81, 110, 67, 22, -142, -152, 244, -94, 57, 141, -67, 240, 55, 118, 342, -171, 78, 56, -126, 125, -138, 114, 271, -251, 95, -66, -75, 347, 108, 3, 113, -51, -236, -357, -58, 20, -108, 238, -71, -263, -44, -155, -145, 204, -45, -52, 28, -128, -1, -76, 16, 111, 194, 95, 199, -80, 256, -227, -61, 371, -271, 239, 162, -34, 96, 2, -89, 92, -91, -117, -137, -386, 96, -84, 105, 44, -1, 303, 57, -46, 99, 11, -5, 30, -170, -37, 114, -33, 157, 160, -17, 31, 96, 34, -194, -208, -40, 3, 54, 56, -16, -260, 287, -71, -63, 17, -67, 53, -123, -257, 57, 25, 267, -4, -52, -115, 73, -89, -344, -117, 153, -107, 124, 70]
3059G0k28M21l57K75K2n22J31K01o6R7k44J50J67j89n8J92k39N29j22l99J40k33
3081b62N7L45j59L11n9k45p7K3m9L62m24K34j49J55K2j59O3j98J10j82j24K22
3103a83J48j54L48l61J25L16j59n0K2j28K03k45O9P7K21j44k05O8J68o5j19J24
3125G6j01Q8j31k20N20k04q5j30K45oJ17l67L80k75R6J08k23J07l1K18q8k14J72
3148E2M2n5J44j07l11J54N7J37K7k45L03j89j91J06K25j12P6k66l0J21j7K95k76
3171f0K08j90K0K19l76L22O2p6Qo3j13J93R0l35J39M4j30k57P5P8J61j09N58l02
3195A66k98qJ50J26k56k83M09K37k48J26l5J22On2p4O6J2k10q0K01lk2J72l60
3219a36N2J62k57J62q5k77L81j78R0L4K0R8k94M0L59k39J5K13l35L19O4R7l35
$$ y = [70, -158, 263, -94, 181, 203, -319, -188, 13, -53, 44, -200, -50, 117, -72, -130, 62, -177, 352, 230, -169, -29, -262, -205, 140, -19, 292, 233, -12, -89, -66, -115, 247, -177, 57, -92, 63, 85, -74, -11, -209, -99, -281, -405, -183, -35, -189, 159, -202, -77, 239, 80, 30, 52, -76, 127, -118, -49, 28, 249, 105, -100, -32, 136, 71, -48, 76, -25, 63, -68, -288, 232, 28, -57, -187, 58, 52, 169, -198, 182, -93, 3, 111, -112, -5, -36, 182, 94, -120, 52, 94, 39, 183, 76, -235, -81, -24, 113, 140, -105, 198, 9, -182, -76, 149, 37, 113, -153, -183, -62, -79, 216, -60, 148, -42, -22, 197, -179, 143, 205, 129, 137, 74, -39, 154, 244, -91, 48, 92, -38, -295, -220, -142, 19, -90, 468, 166, -132, -140, 10, 136, -120, -403, 6, 243, -5, 121, 86, 208, 214, 162, 88, 154, 166, -44, -124, 77, 74, 52, 224, -136, -84, 78, -179, -17, -102, -379, 2, -176, -86, -52, -32, 66, -228, -188, 171, -68, -53, 160, -175, 144, 208, 305, -30]
3242c0L36L5k19M0O7j94K7j04j13m5J30j32O1j13L39j90J7K35j91k24Q3k3r4K57
3266d5K35n1l91L01K12l19M7lj08J13j33J85l6O2j30L7PM5j83K93l26r3J92J86
3290I7k99L61k22l1J20k09M11l61K29J69k38O1Pk18L44j21k35j6R8q6P4J1J65
3313A11k85N5l9R0L44m19n5J6J73o4K4m0J27j13j23K93j01K2L00m51J48j72N1
3336a08K78j38N7NJ29k4K59n47M83n63J42J6j71K52P2k45P7j50r8J66J21J36j82
3359c3j46L94o08K71J87k65M22j00n14L93k8Q7q0%j5J48k69L74l45lJ82K46p7
3382B21k23j38Q0o5J61K8k62J55P2Mj14J39j40P9O3J48r1R0k02j8N6J11j19l1
3406Dk49k3L21J74j41K6j83K84j26r4J17k68kj5R9J02j53n1N1k07L12Mk6O2N7
$$ y = [-30, 306, 341, 122, 162, 229, 35, 62, -42, -155, -200, -70, -202, -141, -254, 85, -105, -88, 147, -44, -268, -185, -208, -302, -45, 190, 139, -252, 49, 261, -58, -11, -14, -122, -9, -142, 43, 7, 69, -61, -24, -17, 28, -155, 138, -188, -281, -89, 97, -202, 159, -63, -94, 26, -183, 228, -133, 96, 265, 27, 88, 95, -123, 221, 100, -135, -151, -53, -139, -65, -54, 111, -174, -119, -158, -68, 276, -143, -198, -182, -9, -73, -49, -89, 38, -75, -198, 95, -6, 16, 316, -135, 13, -159, -108, 170, 32, 89, 94, 223, 199, 458, -89, 394, -169, -27, -11, -182, 70, 142, -103, -26, -176, -274, -108, 13, 149, -33, -179, 215, -393, -122, 65, -200, 222, 122, -392, 1, -27, 60, -20, -20, -35, 113, -156, 218, -127, -130, 52, 298, 221, -2, -140, -60, -125, 36, 64, -198, -43, 29, 33, -81, 58, -82, -3, 60, 208, 117, 207, 5, -13, 43, 154, 35, 4, -245, -268, 53, 227, 86, 112, -71, 213, 87, -7, 110, -158, -160, -175, -76, 26, -127, -178, -127, -334, -22, -18, -44, 18, 75]
3431G5o1o3j7P1J98n1j52J15R6l14K15R3k26l3K77n08L4K78j31m5R4q6Q7r5J66
3456A7J11k55J20N7M6l95K02L35j54k9k1K7j32J21j02P8lJ69j29p9j41J43q7K21
3480A20j27p4J70k95K2K47m5j12J42l29K42k07N79l13j69K12m1JK80n39M83l22
3502g5J29k59K00m6j3J9J80k9k30K35kl65K38l3l6K69k77J92k94K32j20j96J66
3525a15l7l3K07L7j22J61k55K71J43l59J75j5p2J63k33M78o02L04J4k23o2K74
3547I9j05k4l22J84J73r7k4j4n8M53m43J69r4j22M1m8K74J0n6r6K17k1Q6Q2j70
3572I4Oj60L3Q9j29p5K75j87m2J44l36N63m83P6J85j25R8j30Q2j13%L56J5j91
3596D5k53J92J07J30j31k00K24J22K26p57L65M9k95J65J78k13L61k13l94L41j67
$$ y = [75, 14, -49, -66, 5, 203, 152, 0, 115, 211, -103, 112, 205, -21, -54, 223, -285, -251, 27, -104, -149, -55, -141, -54, -149, 17, 128, -127, -7, 50, 96, -299, -97, 238, 84, 55, 34, 61, -71, 50, -52, 26, 23, 192, 63, -16, -157, -14, -101, 120, -7, -81, 89, -206, -184, 63, 18, -94, 48, -281, -39, -246, 333, 20, -149, 63, 22, 23, 303, -236, 247, -75, 54, -205, -5, -51, -64, -45, 135, 106, -124, 111, 109, -256, -18, -51, -87, 182, -95, 97, -197, 35, -85, -281, -115, -152, -185, 22, 59, -63, 98, -157, 114, 257, -102, 73, 58, -14, 149, -84, 394, -208, 96, 110, -113, -175, 99, -6, -30, -352, -168, 5, -92, -116, -130, -188, 265, -178, -9, -103, -225, -184, -232, 42, 52, -4, -100, 117, 96, 182, 264, 94, 100, -60, -27, 62, -67, -142, 133, -54, -96, 48, -288, 275, -208, -132, 53, -72, 26, -104, -22, -135, -135, 221, 236, 45, -208, -16, 91, 221, 90, -110, 114, 236, 462, -295, 70, 119, -176, -11, 167, -46, 315, 102, -292, 49, -118]
3617a18K98j99O8q4M9J78j57rO8k70J07J86k71K31j23%J84P7l93J78J46L05k36
3640B15l10P8P2j96L00k52J52K33k01J5l62QL28j29R7J49j31L1j60R4l8J37k82
3663a52kK09j11J45j53n6OJ81j25J58j01J87k01Q3n8M3k63L61k05p5j15J79K3
3686d2j59K6j02K75n9K01J1l51L57j61j46K89m62L47j0J05K9m7p6o5k34L62O5
3709A53k85J82j40M6J34nO1l02K9J02j91N18m18Rj65M21o7J19j29j7J15l30M23
3732B63k16m63N33k47j5L36m37Q2J73m01M60j94L6o4J02J30l26K39p0J26j41J87
$$ y = [-118, 180, -19, 49, -35, 14, 192, 35, 26, 94, -176, -69, 117, -154, 77, -46, -46, 138, 215, -178, 0, 146, 451, 215, -95, -17, 55, -141, 159, -93, 59, 292, 91, 106, -256, -248, 80, -49, 48, 197, 66, 97, -63, 31, -7, 130, -152, -154, 55, -56, 89, -64, -120, -114, 67, -58, 100, -1, 186, -15, 68, 10, 53, -210, 151, -54, -129, -244, -65, -42, -201, -175, -277, -2, -61, 140, 151, -200, 157, -4, -150, 139, -323, 24, 14, 119, 148, 101, 25, -40, -274, 88, 153, -132, 50, -90, -44, 90, 85, 146, -156, -127, -25, -216, 302, -116, -107, -272, 149, 82, 201, 72, 55, 170, -160, 263, 47, -416, 117, -130, -145, 191, -246, -164, 9, -392, 68, -126, -90, -154, -52, 78, -248, -9, -79, 47, -94, 93]
$$ [...]
8191a78
##END NTUPLES=NMR FID
##END=
