##TITLE=1H_Ser MEFA
 CDCl3
 8 sc, 
 31.05.2022
##JCAMPDX= 6.0         $$ Bruker NMR JCAMP-DX V2.0
##DATA TYPE= NMR FID
##DATA CLASS= NTUPLES
##ORIGIN= UXNMR, Bruker Analytische Messtechnik GmbH
##OWNER= root
$$ XWIN-NMR		Version 3.5
$$ Tue May 31 16:12:17 2022 Russian Standard Time (UT+4h)  she@DPX200
##.OBSERVE FREQUENCY= 200.1313499996
##.OBSERVE NUCLEUS= ^1H
##.DELAY= (6, 6)
##.ACQUISITION MODE= SIMULTANEOUS
##.ACQUISITION SCHEME= undefined
##.AVERAGES= 8
##.DIGITISER RES= 18
##SPECTROMETER/DATA SYSTEM= spect
##.PULSE SEQUENCE= zg30
##.SOLVENT NAME= CDCl3
##.SHIFT REFERENCE= (INTERNAL, CDCl3, 0, 15.7039)
##AUDIT TRAIL= $$ (NUMBER, WHEN, WHO, WHERE, WHAT)
$$ ##TITLE= Audit trail, XWIN-NMR		Version 3.5
$$ ##JCAMPDX= 5.01
$$ ##ORIGIN= Bruker BioSpin GmbH
$$ ##OWNER= she
$$ F:/spectra/data/she/nmr/H-F/1/audita.txt
$$ ##AUDIT TRAIL=  $$ (NUMBER, WHEN, WHO, WHERE, WHAT)
(   1,<2022-05-31 16:11:15.48 +0400>,<she>,<DPX200>,
      <created by zg, POWCHK disabled, PULCHK disabled
       configuration hash MD5:
       00 E9 B6 7A A2 85 ED C7 34 08 36 98 17 FE 4E 26
       data hash MD5: 16K
       F9 19 1A D1 C4 E7 F0 5D 35 2C 72 00 FF 20 F4 47>)
$$ ##END=
$$ 
$$ hash MD5
$$ 70 C1 72 34 80 B4 EA 0E 84 F7 E0 B8 DC 96 92 04
##$RELAX= 
##$RELAX= 
##$RELAX= 
##$RELAX= 
##$RELAX= 
##$RELAX= 
$$ Bruker specific parameters
$$ --------------------------
##$DU= <F:/spectra>
##$EXPNO= 1
##$NAME= <H-F>
##$PROCNO= 1
##$TYPE= <nmr>
##$USER= <she>
##$AMP= (0..31)
100 100 100 100 100 100 100 100 100 100 100 100 100 100 100 100 100 100 
100 100 100 100 100 100 100 100 100 100 100 100 100 100 
##$AQSEQ= 0
##$AQ_mod= 1
##$AUNM= <au_zg>
##$AUTOPOS= <>
##$BF1= 200.13
##$BF2= 200.13
##$BF3= 200.13
##$BF4= 200.13
##$BF5= 200.13
##$BF6= 200.13
##$BF7= 200.13
##$BF8= 200.13
##$BYTORDA= 1
##$CFDGTYP= 0
##$CFRGTYP= 5
##$CHEMSTR= <none>
##$CNST= (0..31)
1 1 145 1 1 1 1 1 1 1 1 1 1 1 1 1 1 1 1 1 1 1 1 1 1 1 1 1 1 1 1 1 
##$CPDPRG= <>
##$CPDPRG1= <>
##$CPDPRG2= <>
##$CPDPRG3= <>
##$CPDPRG4= <mlev>
##$CPDPRG5= <mlev>
##$CPDPRG6= <mlev>
##$CPDPRG7= <mlev>
##$CPDPRG8= <mlev>
##$CPDPRGB= <>
##$CPDPRGT= <>
##$D= (0..31)
0 1.2 0 0 0 0 0 0 0 0.06 0 0.03 0 0 0 0 0.0002 0 0 0 0 0 0 0 0 0 0 0 0 
0 0 0 
##$DATE= 1653999074
##$DBL= (0..7)
120 120 120 120 120 120 120 120 
##$DBP= (0..7)
150 150 150 150 150 150 150 150 
##$DBP07= 0
##$DBPNAM0= <>
##$DBPNAM1= <>
##$DBPNAM2= <>
##$DBPNAM3= <>
##$DBPNAM4= <>
##$DBPNAM5= <>
##$DBPNAM6= <>
##$DBPNAM7= <>
##$DBPOAL= (0..7)
0.5 0.5 0.5 0.5 0.5 0.5 0.5 0.5 
##$DBPOFFS= (0..7)
0 0 0 0 0 0 0 0 
##$DE= 6
##$DECBNUC= <off>
##$DECIM= 32
##$DECNUC= <off>
##$DECSTAT= 4
##$DIGMOD= 1
##$DIGTYP= 9
##$DL= (0..7)
0 120 120 120 120 120 120 120 
##$DP= (0..7)
150 150 150 150 150 150 150 150 
##$DP07= 0
##$DPNAME0= <>
##$DPNAME1= <>
##$DPNAME2= <>
##$DPNAME3= <>
##$DPNAME4= <>
##$DPNAME5= <>
##$DPNAME6= <>
##$DPNAME7= <>
##$DPOAL= (0..7)
0.5 0.5 0.5 0.5 0.5 0.5 0.5 0.5 
##$DPOFFS= (0..7)
0 0 0 0 0 0 0 0 
##$DQDMODE= 0
##$DR= 18
##$DS= 0
##$DSLIST= <SSSSSSSSSSSSSSS>
$$ [...]
##$SUBNAM2= <"">
##$SUBNAM3= <"">
##$SUBNAM4= <"">
##$SUBNAM5= <"">
##$SUBNAM6= <"">
##$SUBNAM7= <"">
##$SUBNAM8= <"">
##$SUBNAM9= <"">
##$SW= 18.0517283424761
##$SWIBOX= (0..15)
0 0 2 0 0 0 0 0 0 0 0 0 0 0 0 0 
##$SW_h= 3612.71676300578
##$TD= 16384
##$TD0= 1
##$TE= 0
##$TE2= 300
##$TE3= 300
##$TEG= 300
##$TL= (0..7)
0 120 120 120 120 120 120 120 
##$TP= (0..7)
150 150 150 150 150 150 150 150 
##$TP07= 0
##$TPNAME0= <>
##$TPNAME1= <>
##$TPNAME2= <>
##$TPNAME3= <>
##$TPNAME4= <>
##$TPNAME5= <>
##$TPNAME6= <>
##$TPNAME7= <>
##$TPOAL= (0..7)
0.5 0.5 0.5 0.5 0.5 0.5 0.5 0.5 
##$TPOFFS= (0..7)
0 0 0 0 0 0 0 0 
##$TUNHIN= 0
##$TUNHOUT= 0
##$TUNXOUT= 0
##$USERA1= <user>
##$USERA2= <user>
##$USERA3= <user>
##$USERA4= <user>
##$USERA5= <user>
##$V9= 5
##$VALIST= <valist>
##$VCLIST= <CCCCCCCCCCCCCCC>
##$VD= 0
##$VDLIST= <DDDDDDDDDDDDDDD>
##$VPLIST= <PPPPPPPPPPPPPPP>
##$VTLIST= <TTTTTTTTTTTTTTT>
##$WBST= 1024
##$WBSW= 4
##$XGAIN= (0..3)
0 0 0 0 
##$XL= 0
##$YL= 0
##$YMAX_a= 97540
##$YMIN_a= -77632
##$ZGOPTNS= <>
##$ZL1= 120
##$ZL2= 120
##$ZL3= 120
##$ZL4= 120
##$ABSF1= 10
##$ABSF2= 0
##$ABSG= 5
##$ABSL= 3
##$ALPHA= 0
##$AQORDER= 0
##$ASSFAC= 0
##$ASSFACI= 0
##$ASSFACX= 0
##$ASSWID= 0
##$AUNMP= <proc_1d>
##$AZFE= 0.1
##$AZFW= 0.1
##$BCFW= 1
##$BC_mod= 2
##$BYTORDP= 1
##$COROFFS= 0
##$CY= 11.3945322036743
##$DATMOD= 1
##$DC= 2
##$DFILT= <>
##$DTYPP= 0
##$F1P= 2.36226072786647
##$F2P= -0.459571619588291
##$FCOR= 0.5
##$FTSIZE= 0
##$FT_mod= 4
##$GAMMA= 1
##$GB= 0.15
##$INTBC= 1
##$INTSCL= 1
##$ISEN= 128
##$LB= 0.24
##$LEV0= 0
##$LPBIN= 0
##$MAXI= 10000
##$MC2= 0
##$MEAN= 0
##$ME_mod= 0
##$MI= 1.114404
##$NCOEF= 0
##$NC_proc= 0
##$NLEV= 6
##$NOISF1= 3.799351
##$NOISF2= 2.8
##$NSP= 1
##$NTH_PI= 0
##$NZP= 0
##$OFFSET= 15.70392
##$PC= 1
##$PHC0= -18031.17
##$PHC1= 6.00074
##$PH_mod= 1
##$PKNL= yes
##$PPARMOD= 0
##$PSCAL= 0
##$PSIGN= 0
##$REVERSE= no
##$SF= 200.130013532006
##$SI= 16384
##$SIGF1= 3
##$SIGF2= 2
##$SINO= 400
##$SIOLD= 16384
##$SREGLST= <1H.CDCl3>
##$SSB= 0
##$STSI= 0
##$STSR= 0
##$SW_p= 3612.71676300578
##$SYMM= 0
##$S_DEV= 0
##$TDeff= 0
##$TDoff= 0
##$TI= <>
##$TILT= no
##$TM1= 0
##$TM2= 0
##$TOPLEV= 0
##$USERP1= <user>
##$USERP2= <user>
##$USERP3= <user>
##$USERP4= <user>
##$USERP5= <user>
##$WDW= 1
##$XDIM= 8192
##$YMAX_p= 0
##$YMIN_p= 0
$$ End of Bruker specific parameters
$$ ---------------------------------
##NTUPLES= NMR FID
##VAR_NAME=  TIME,          FID/REAL,        FID/IMAG
##SYMBOL=    X,             R,               I
##VAR_TYPE=  INDEPENDENT,   DEPENDENT,       DEPENDENT
##VAR_FORM=  AFFN,          ASDF,            ASDF
##VAR_DIM=   8192,          8192,            8192
##UNITS=     SECONDS,       ARBITRARY UNITS, ARBITRARY UNITS
##FACTOR=    0.0002768,     1,               1
##FIRST=     0,             0,               0
##LAST=      2.2672688,     0,               0
##MIN=       0,             -77632,          0
##MAX=       2.2672688,     97540,           0
$$ Real data points
##PAGE= N=1
##DATA TABLE= (X++(R..R)), XYDATA
0@%%%%%%%%%%%%%%qJ6j6J6j6J8k6L2m0M8n5O3p2Q8j00J10j25J47j68J87k11K40
36A28k72L04l38L77m21M69n21N77o38P05p79Q61r49J044j150J268j396J540j702
55h93J882k085K318k586K902l277L729m298N024n990P352r435J3060k1170P7076
70F3609k1126p0181O5140l8810k574R1718R764j01161J7878L8383o4352r435R2538
83G1391j5416n1250M3967n845r3019K5805Q0672k8441k2397N3300l9079p9258
95e9570M6380M8958m8277J7583N7747n8388n9101M9595N879m3324N1965M6920
107E6367p1228l0604M4313k9553l1013P2645K3004o5136M439K8122n5959j1515
119f6118P5665J439m5911L2467O749o8410J0244O4146j9094j7019M7808j6168
$$ plain form
0 0 0 0 0 0 0 0 0 0 0 0 0 0 0 0 -8 8 -8 8 -8 10 -16 16 -24 24 -31 32 -40 48 -52 58 -67 80 -88 99 -112 128
36 128 -144 160 -178 199 -222 247 -274 303 -335 370 -409 452 -497 547 -603 665 -731 809 -893
55 -893 989 -1096 1222 -1364 1538 -1739 1990 -2308 2716 -3274 4078 -5357 7703 -13467 63609
70 63609 42483 -27698 37442 -1368 -3942 87776 97540 -3621 14257 52640 -11712 -21147 71391
83 71391 55975 4725 48692 42847 -50172 -24367 56305 27864 5467 58767 19688 -59570
95 -59570 -13190 35768 -12509 5074 62821 4433 -54668 -5073 806 -42518 9447 56367
107 56367 -14861 -45465 -1152 -30705 -61718 10927 33931 -31205 -26766 1356 -54603 -66118
119 -66118 9547 10986 -34925 -2458 4291 -64119 -53875 10271 -8823 -25842 21966 5798
131E798o2520K5523L9780l1142R778N1719l4261m6987L4436R965l4607L3157M2092
144D2731m2072k4467L3330j6323k8782M7060K6385m1071P90K4444l5769j5026
156b8770M9180P426k9618K0531J1083m4504j570M1912j0034j4262L2753m540m3182
169a3595J0783K5895k1071J123L4957j6299l4267J8683P952k6658J6037K9524
181C3064k3708j8303K0238q681k2786K4648J9475k4740k195J8141k1502j4817
193b1166K7577N707j9603J1283R872k6066n681K3517n196j2518J8958R09k5333
206a7740L117J4958j2960k079J9625n760j9352R086N941j5361N957J7956j0279
219f891j0525J2661k633j3087J1277J1802j0855j505J1538p977r553J3770M863
$$ plain form
131 5798 -56722 -31199 8581 -22561 -12783 38936 4675 -42312 -7876 2089 -32518 639 42731
144 42731 659 -23808 9522 -6801 -35583 11477 37862 -3209 -2419 22025 -13744 -28770
156 -28770 20410 27836 -1782 18749 29832 -14672 -16242 25670 15636 1374 34127 29587 -13595
169 -13595 -2812 23083 2012 3135 38092 21793 -12474 6209 14161 -12497 3540 33064
181 33064 9356 -8947 11291 2610 -20176 4472 23947 -793 -2988 15153 -6349 -21166
193 -21166 6411 12118 -7485 3798 13670 -12396 -18077 5440 244 -12274 6684 7593 -17740
206 -17740 -14623 335 -12625 -14704 4921 -839 -20191 -11105 -5164 -20525 -14568 3388 -6891
219 -6891 -17416 -4755 -7388 -20475 -9198 2604 -8251 -9756 1782 -6195 -15748 -1978 2885
232B885j0726O426P405j1331l413J1304j173o688Q728L515j1319J064Q562n880
246f41k181R978q99p945M227L980o046Q22Q396l114m387N557Mn737L562M749m140
263F185j017M119k593m047L617J709m508Q68K790m596j908L386j178k976J987
278A838R54l153r20K656j858j683K821J43k638J503J258j804J64K048j68j323
294a62J365P58j717Q39R55r06j93J262p88n80M69K61o92j80O56l11o67J135k03
313A301k94Q55Jp0L12O9J78K85M54K32n51M94N20p35N09j04q40j7k64n08m99o37
335F91j4j120q26L74j381p98M15p72j014l72K3l91q64P63J13j088N31O67j516
354f579N72J427r91m15J139J6j666N94K061j429p22K338j590j688K331O83k144
$$ plain form
232 2885 -7841 -1415 5990 -5341 -8754 2550 1377 -5311 3417 6932 -4387 -3323 5239 -641
246 -641 -2822 7156 6257 -1688 2539 6519 473 1295 9691 6577 2190 7747 7751 2014 5576 10325 6185
263 6185 5168 9287 6694 2647 6264 7973 3465 4333 7123 2527 619 4005 2827 -149 1838
278 1838 2792 -361 -1281 1375 -483 -2166 655 798 -1840 -337 921 -883 -719 1329 1161 -162
294 -162 1203 1961 244 1083 2038 1132 939 2201 1413 833 1302 1563 871 691 1347 1036 369 1504 1301
313 1301 1007 1862 1863 1793 2105 2174 2352 2637 3091 3323 2772 3266 3786 3051 3560 3456 2616 2599 2335 1827 1328 691
335 691 677 -443 -1269 -895 -2276 -3074 -2659 -3431 -4445 -4817 -4794 -5185 -6049 -5286 -5173 -6261 -5730 -5063 -6579
354 -6579 -6007 -4580 -5571 -5986 -4847 -4831 -6497 -5903 -3842 -5271 -5993 -3655 -5245 -6933 -4602 -3919 -6063
371f063J150J993k114j258L149K84k468L333J862l555P71M056k042o80M607J090
387D115m104K197L338l785L8O226j662l981M326N15n695K573N667l937k642N800
403H989k629o962N222M087o245J334N996o174m716O542R32o241N473N193q881
418A920k609P906m065n182R868J644j0090J581N183q471k031J1386j820r520N488
433A188J426j1906K402J0963o158n100Q932l444j3076O962Q673r037J137J0756
447C718r319j0572J0936K315r356Q496R877j3513o219J1716m629q383J4996N943
461F006j5447P77Q926j1979l766J8470N60j3014P680M106j7212K401J8534n610
475D32p046J4714l484j8160Q468J3693r609J304J7169j0067j6120J3058N428j2468
$$ plain form
371 -6063 -4913 -2920 -5034 -6292 -3143 -2859 -5327 -1994 -132 -3687 -2916 1140 -902 -1582 3025 4115
387 4115 11 2208 5546 1761 1799 8025 6363 2382 6708 7223 1528 4101 9768 5831 3189 8989
403 8989 6360 -602 4620 8707 2462 3796 9792 3618 -1098 5444 6376 135 5608 10801 1920
418 1920 -689 7217 3152 -2030 7838 9482 -608 973 6156 -2315 -4346 7040 5220 -4300 1188
433 1188 2614 -9292 -6890 4073 -2085 -7185 1747 -1697 -14773 -7811 862 -8175 -7038 3718
447 3718 -5601 -16173 -5237 -2922 -12278 -3782 6095 -7418 -13637 -1921 -6550 -14933 63 6006
461 6006 -9441 -8664 262 -11717 -15483 2987 3547 -9467 -1787 2319 -14893 -12492 6042 432
475 432 -6614 8100 4616 -13544 -5076 8617 -992 312 17481 7414 -8706 4352 9780 -2688
489b688J0945J5788j6018r722J3392m650j1795J8145J1068j8459j423J1511j5079
502A015p630K2758L447j6152Q060N521k1936j728K2552m080j0321J6267k555k4896
516i678N996J6171j1665n12K0451j0734k2490J0879O780j6611J0534J9480j7492
529A109j4577J3322n538j5868J8526J5242j9671l663J2303j6200j1788K4063O767
542D027j6759Q247P236k3638m279K3602j746r820J7006J123k6715L052J8326j0340
556a0678n96K3034p237k3594R543Q481j5421Q788K3596j3390j5830J4013l486
569b777j7049J7971J8692j6511l837J3767j4215j3964K2765J0492j6005P799J0941
582A8069k2644q167K2417J71j0906J6943M133k5566q21J7383r523l413K2583l888
$$ plain form
489 -2688 8257 24045 8027 -1695 11697 7047 -4748 13397 24465 6006 4583 16094 1015
502 1015 -6615 16143 19590 3438 11498 17019 -4917 -6645 15907 11827 1506 17773 15218 -9678
516 -9678 -3682 12489 824 312 20763 10029 -12461 -1582 5198 -11413 -879 18601 1109
529 1109 -13468 -146 -5684 -21552 -3026 12216 -7455 -11118 1185 -15015 -26803 -2740 4027
542 4027 -12732 -4485 2751 -20887 -25166 -1564 -3310 -13130 3876 4999 -21716 -18664 -338 -10678
556 -10678 -11274 11760 4523 -19071 -9528 -1047 -16468 -7680 15916 2526 -13304 709 -2777
569 -2777 -19826 -1855 16837 326 -3511 10256 -3959 -17923 4842 15334 -671 7128 18069
582 18069 -4575 -12742 9675 9846 -1060 15883 20016 -5550 -6371 11012 1489 -1924 20659 16771
596A6771k2736O056P696j5240N400K2474r508j5897J1284k102j8477J3274J8423
609A7418j3043n150J2498j1923j5285J6494J0686j3154N180J0756j8974j0330
621a4827J7585P06j0472J3520N899k1173l434J4036p724n159J8886N40j9463M142
635f938P252j3623K047J9891n401j2973R312k21j5463P721J6608r190m734J1696
649E984q084j3680J1917R364j0062L404R979j2464r558J2610J898q749J0227O663
663I449j4633l225J0515n035m487J3737K573j3025K443O347r580J07J4615k249
677G552r166O911R70j1129L731J1788n391m012Q514l626j1104O565P195p643J666
692B821P798p391p584P106J699o577N601N903r347l396P123l246m710Q597K653
$$ plain form
596 16771 -5965 91 7787 -7453 -2053 20421 10913 -4984 6300 4198 -14279 -1005 17418
609 17418 4375 -775 11723 -200 -15485 1009 11695 -1459 3721 14477 -4497 -14827
621 -14827 2758 3464 -7008 6512 12411 -8762 -12196 1840 -5884 -11043 7843 8383 -11080 -6938
635 -6938 314 -13309 -11262 8629 3228 -9745 -433 -654 -16117 -8396 8212 -978 -5712 5984
649 5984 -2100 -15780 -3863 5501 -4561 -1157 8822 -3642 -13200 -590 1308 -7441 2786 9449
663 9449 -5184 -8409 2106 -2929 -7416 6321 8894 -4131 -1688 4659 -4921 -4814 9801 7552
677 7552 -1614 5297 6267 -4862 -1131 10657 5266 1254 9768 6142 -4962 1603 8798 1155 2821
692 2821 10619 3228 -4356 2750 4449 -2128 3473 9376 29 -3367 3756 510 -4200 4397 7050
707G050q387O68M649n911j952Q333m93o190L987J435p605R28O728k903k908M627
723B056j233o708K671M445m523n2N393l522m300L913J190l632K525M241m419j718
739c673L882p75k989M199K216l932K54L089l000j368M122J86l262J865J815m047
755a418r6L451j489j783K326l24l069J055J555j471k91K326j045k343J784Q11
771b1j781M56J719j526n64J442j99j767J403O83j599k28J019j060o85R52M0j105
789b821LQ12r11m55J178l33o71P47L86r38O90P54j92oQ78O7k61Q20O37n76Q57
810F65P02l52q2M76M27l23K78O87m34j52N18j83l91N46P6k01K00lK31j26L95o8
832B886m10K72L93n72N99J87m32l2J91L9m78J01L36p66k92L69p20l10K54k02r88
$$ plain form
707 7050 -1337 -669 3980 -1931 -3883 4450 3957 -2233 1754 3189 -4416 -3488 3240 337 -2571 2056
723 2056 823 -5885 -3214 1231 -3292 -3344 2049 -1473 -5773 -1860 -670 -4302 -1777 2464 -1955 -3673
739 -3673 209 -566 -3555 644 2860 -1072 -818 2271 -729 -2097 2025 2211 -1051 814 2629 -1418
755 -1418 -1514 1937 448 -1335 991 667 -2402 -1347 208 -1263 -1554 772 -273 -2616 -832 -21
771 -21 -1802 -1346 373 -1153 -1717 -275 -474 -2241 -838 -155 -1754 -1982 -963 -2023 -2708 -1756 -1716 -2821
789 -2821 -2818 -2006 -2917 -3372 -2194 -2527 -3198 -2451 -2065 -3003 -2313 -1559 -1751 -1757 -879 -812 -1073 -253 384 -192 665
810 665 1367 1015 933 1409 1836 1513 1791 2478 2044 1892 2410 2227 1836 2382 2458 2257 2457 2454 2685 2559 2954 2886
832 2886 2476 2748 3141 2569 3168 3355 2923 2891 3082 3121 2643 2744 3080 2314 2022 2391 1671 1361 1615 1413 425
853D25J67k20n10o63K13j53q49M29J44j211K47N53q56m4J132n28j031R68M33j291
873b645L43J134j091p67J469j43j532J351M25j521m2J147q14j292K098l6j646
890c562Q84J277j902j94K364l97j239K127N63k267P02K496j214m90K972n86k276
907g42J971J155k010P81L105j438k547K880l77k632K666K443k874n51K583j871
923B542k293L328J569l194J066K510l774j343M616p74k244L270N60m805K84L836
939E154k116j643M354o93n812K100K234m219Q28M756l087m308L145k50n116K899
955a774M669m716k006M189l328m497N116K407m746J445L316n767l124O365k2l877
971f350M632J913p680n49N892k535k255P213n38p597K194L566n332R71Q098l057
$$ plain form
853 425 592 372 -138 -801 -588 -741 -1590 -1161 -1017 -2228 -1981 -1428 -2284 -2328 -1196 -1724 -2755 -1787 -1354 -2645
873 -2645 -2302 -1168 -2259 -3026 -1557 -1700 -3232 -1881 -1456 -2977 -3019 -1872 -2686 -3978 -1880 -1916 -3562
890 -3562 -2678 -1401 -3303 -3497 -1133 -1530 -2769 -642 -79 -2346 -1644 852 -362 -852 2120 1534 -742
907 -742 1229 2384 374 1155 4260 2822 275 3155 2778 146 2812 5255 2381 1830 4413 2542
923 2542 249 3577 5146 1952 3018 5528 1754 411 5027 4253 2009 5279 5839 1034 1318 5154
939 5154 3038 1395 5749 5056 -756 1344 3578 -641 187 4943 1856 -2452 693 443 -4673 -1774
955 -1774 2895 -1821 -3827 362 -2966 -7463 -2347 60 -4686 -3241 75 -5692 -8816 -2451 -2473 -6350
971 -6350 -1718 195 -7485 -8034 -2142 -4677 -6932 281 -257 -7854 -5660 -2094 -7426 -6455 1643 -1414
987a414n818M957L38o181M003P705m877k411N962l346o292O863N376n592J912
1002A185N240o448m613P621J981n164N408M256r394j776P144k751l334Q718R30
1017I003r208J127M673o199k96J0261k190p655M858L01q332M022Q661m634l735
1032F57O443l804r126P164O104o685J135O236p536o943P655J628n572N022N097
1047G475r859m098P314k646m364R252K117r841K11N069o300j193J0308o20p753
1062d928M286J052q989K454J0195l737l423O179k765r563N088P141n614O47P343
1077E366o690p498O925K431n828N621N996q548m380O842k077m309Q907L663r549
1092c128N43N009o257j468J0551K13p249L807J735q488J230R653k786l611N893
$$ plain form
987 -1414 -7232 -2275 -1937 -8118 -4115 3590 -1287 -3698 2264 -1082 -7374 -511 4865 -727 1185
1002 1185 6425 -23 -4636 2985 4966 -198 5210 9466 72 -1704 5440 2689 -645 8073 9003
1017 9003 -205 922 5595 -604 -900 9361 7171 -484 4374 4675 -3657 365 9026 4392 657
1032 657 7100 3296 -5830 1334 7438 753 1888 8124 588 -6355 1300 2928 -2644 2378 7475
1047 7475 -2384 -6482 832 -1814 -6178 3074 5191 -4650 -4439 630 -5670 -6863 3445 2825 -4928
1062 -4928 -642 410 -8579 -6125 4070 333 -3090 3089 324 -9239 -4151 2990 -2624 -1977 5366
1077 5366 -1324 -8822 -1897 534 -5294 327 6323 -2225 -6605 237 -1840 -6149 2758 6421 -3128
1092 -3128 -2585 2424 -3833 -5301 5250 5463 -1786 2021 3756 -4732 -3502 6151 3365 -246 5647
1107E647k056q808L772O646m818N25O665m837p786N673K638n552M417O169p043
1122A252m392N755k038m224P201L967p240p02M467n371k674Q740O22o049K715
1137B029J942q145k4P788j772l560M975j164p980K424N213l980m6N934l249o417
1153f032L829K434n009L227N862m969m152M624r20m205N307L870n371q69L960
1168A586l866k773O113J521m566J800K202n610r41N888r70k788L833J31n339J143
1184b636M043k864%M238j400m356K526J826l431J443M739k635l326L301l62l721
1200b615L231K857l564o47K903k662k366L462J160k895R70J943l630j530L991
1215F08o03k135K672O25l571O8K638j174q43L367o11l304J811J022j977O26K534
$$ plain form
1107 5647 3591 -5217 -1445 5201 383 908 7573 2736 -5050 623 3261 -2291 2126 8295 1252
1122 1252 -3140 2615 577 -3647 3554 7521 281 -421 4046 -1325 -3999 4741 5363 -686 2029
1137 2029 3971 -4174 -4198 3590 1818 -1742 3233 2069 -5911 -3487 1726 -2254 -2300 3634 385 -6032
1153 -6032 -2203 231 -4778 -1551 4311 -658 -4810 -186 -1106 -5311 -4 3866 -1505 -2374 1586
1168 1586 -2280 -5053 1060 2581 -1985 -185 2017 -3593 -4534 1354 384 -2404 1429 1560 -3779 -2636
1184 -2636 1407 -1457 -1457 2781 1381 -2975 -449 1377 -2054 -611 4128 1493 -1833 1468 1106 -2615
1200 -2615 616 3473 -91 -738 2165 -497 -2863 599 1759 -1136 -166 1777 -1853 -3383 608
1215 608 5 -2130 542 1167 -2404 -2336 302 -872 -1715 1652 1041 -2263 -452 570 -1407 -781 1753
1232A753j030j764J717Q6k302J295K220j799o63J737j035j564J866J115j874N80
1248C38J529j344r23J803J23j318J470O75j244j96J490n51p18J744j61j696O69
1265A690J031j412J10J142r32p12O00l3j212L34P12q50m37Q00n99q74P39J76r79
1284g06M06N13p94l98Q51j8p16J70M27p15J16J42m23R8J76J81p31j40L78k34l85
1305a802M17p8p08K99M41m49J69Q7k06m1M29N6r0M29Nk35K52M42OLM42K13k67
1328a86L81J44k29J31K42j90j68M74J3l15ML68k31o5L85l2l26O50j86J27J33K77
1350A401j31R6L06j77j28O11k31j94N8M72n98K25J95j03k78l33M34l32p02O47
1370A238k00n66J10m9n42j16M75k74p13O74o0r24M71M12r88Q0O66m35n63P78m07
$$ plain form
1232 1753 723 -1041 676 762 -1540 -245 1975 176 -487 1250 215 -1349 517 1632 -242 338
1248 338 1867 523 -400 1403 1526 208 1678 2353 1109 913 2403 1852 1134 2878 2717 1021 1690
1265 1690 2721 1309 1419 2561 1629 917 1517 1484 272 606 1318 468 31 831 232 -642 97 273 -706
1284 -706 -300 213 -581 -979 -128 -146 -862 -692 -265 -980 -864 -722 -1145 -1047 -871 -690 -1421 -1561 -1183 -1417 -1802
1305 -1802 -1385 -1463 -2171 -1872 -1431 -1880 -1711 -1624 -1830 -1871 -1442 -1386 -1476 -1047 -1042 -1277 -1025 -583 -577 -574 -132 81 -186
1328 -186 195 339 110 241 483 293 125 599 612 297 301 669 438 373 758 726 400 1050 864 991 1124 1401
1350 1401 1270 1366 1672 1495 1367 1978 1747 1553 1611 2083 1485 1710 1905 1802 1524 1191 1625 1293 591 1238
1370 1238 1038 472 582 533 -9 -125 350 76 -637 37 -23 -947 -476 -64 -1052 -972 -306 -741 -1304 -526 -933
1391i33p75L26N92j146j55J028n10p86J019j94j138M05R3q62K33J108k33j086
1409c014P71L36j073K30J705o44o12J493m56r82J311R55j078L14J279p02r97J530
1427C66N20j186J249J030j536l55J598l58r81K067K41k015L95J532j509l54K494
1444C198m04j545J003Q00k196O76K323j140j152K009l03k691J445J650j709n26
1460A438K160j491k298J895L52j991J083J770k822j310K186q50j839K474R83k795
1476a055l24J755j930j025L353k6k909J416Q84k987P1L561j188j618K518o90l350
1493c544J330K560k283JL013k077l102K473Q44k069J582K718l085j789K705o07
1509a330j895L088J883l231j85K493k425j047M128O57l168J302J437l940M19M004
$$ plain form
1391 -933 -1708 -1382 -790 -1936 -2091 -1063 -1573 -2359 -1340 -1534 -2672 -2267 -2174 -3036 -2803 -1695 -1928 -3014
1409 -3014 -2243 -1907 -2980 -2750 -1045 -1689 -2301 -808 -1264 -2246 -935 20 -1058 -744 535 -167 -1164 366
1427 366 886 -300 949 1979 443 88 1686 1328 347 2414 2655 640 1035 2567 1058 704 3198
1444 3198 2794 1249 2252 3052 856 1532 3855 2715 1563 3572 3269 578 2023 3673 1964 1438
1460 1438 3598 2107 -191 1704 2056 65 1148 2918 96 -1214 972 122 -1717 757 1740 -1055
1476 -1055 -1379 376 -1554 -2579 774 748 -2161 -745 139 -2848 -2777 784 -404 -2022 496 -194 -3544
1493 -3544 -2214 346 -1937 -1936 1077 -1000 -4102 -1629 -785 -2854 -1272 1446 -1639 -3428 -723 -1330
1509 -1330 -3225 -137 1746 -1485 -1670 823 -1602 -2649 1479 2136 -1032 270 1707 -2233 -1814 2190
1525B190q02j909K579P8m396J164L146k046k20L634j950l931K234J793k860J795
1541D99L453k991k646L142o52k711L806K301l532q03K234k456j773M509J097l469
1557HQ91J753m041o40M007m16k503K975R6n008J039L175j944m96L746j165m892
1574c415J931J911k721J389L774k471k851K531p16k689K907L182l170j045K606
1589A153k921k037M104J365l081Q31J837m049j107M115l3k160K625P59m595L68
1605b826L384j488j046M079n53m281J484K044k680R30M211j969k558J983l7l039
1621b362K356L238k745q55K357j848k646L247J725k681O25J853l110j485L275
1636I44J91k011K282J239l840n74L400j528q68L340p98k792P03J604k429O41L424
$$ plain form
1525 2190 1388 -521 2058 2136 -2260 -1096 2050 4 -216 3418 1468 -2463 -229 1564 -1296 499
1541 499 3952 961 -1685 1457 805 -1906 1900 4201 669 -134 2100 -356 -2129 2380 3477 8
1557 8 899 2652 -1389 -2029 1978 1562 -941 2034 2130 -2878 -1839 1336 -608 -1104 2642 1477 -3415
1574 -3415 -1484 427 -2294 -905 2869 398 -2453 78 -638 -3327 -420 2762 -408 -1453 1153
1589 1153 -1768 -3805 299 1664 -1417 -586 1251 -2798 -3905 210 177 -1983 642 1401 -3194 -2826
1605 -2826 558 -930 -1976 2103 1550 -2731 -1247 797 -1883 -953 3258 1289 -1269 714 677 -2362
1621 -2362 -6 3232 487 -368 1989 141 -2505 742 2467 -214 411 2264 -846 -2331 944
1636 944 1135 -876 1406 2645 -1195 -1769 1631 103 -765 2575 1777 -1015 -312 1292 -1137 -496 2928
1653B928j606k259J543q2k929J873K979k261j100K064j464k216K095J886k369
1668i18P38J682k451j145K409M53j540J624J099k583l24J987o99j217K725M83
1684B323k606N86J140j872J35K652q15j769Q87O05k070N92K184j274r03J411o85
1701E21j626J439J198j790N23J474j594j248J621J49j350J157R33j950l38J623
1717G42r91o91J563Q9j612J1R33j296j11J331n34j000O38M46j557L54J295n43
1735i33q38J114k83r81Q05Q90n42m53J238r76n09J042J50p39N07Q76j225j51Q98
1754a10j73o44R62K97q15J01N24n00KP48k66l61N96j43n76N48N53k01k22O18J09
1775A047n20J67L71j43O9M68m54k51K45K81n23n1L14m74j75N03j76m53L48k7l7
$$ plain form
1653 2928 1322 -937 606 524 -2405 -532 2447 186 -914 1150 -314 -2530 -435 1451 -918
1668 -918 -180 1502 -949 -2094 315 768 -772 852 1951 -632 -956 1031 332 -885 1840 2323
1684 2323 -283 303 1443 -429 -294 2358 1543 -226 661 1266 -804 -212 1972 698 -205 1206 521
1701 521 -1105 334 1532 -258 265 1739 145 -1103 518 667 -683 474 1407 -543 -881 742
1717 742 -249 -940 623 712 -900 -889 44 -1252 -1363 -32 -566 -1566 -928 -482 -2039 -1685 -390 -933
1735 -933 -1771 -657 -940 -1921 -1116 -226 -768 -1221 17 -959 -1468 -426 -276 -1015 -508 368 -857 -1008 -110
1754 -110 -283 -927 35 332 -483 -382 142 -358 -356 392 126 -235 361 218 -358 190 743 542 320 938 1047
1775 1047 527 694 1065 922 991 1459 1005 754 999 1280 757 706 1020 546 371 874 698 245 593 566 529
1796E29k29J13o3k68L81r9n16L09L71n99J79M53m80m27O72k96m78K44K88j55j95
1817b66J1k77Pj48N3j9j22p0j80o7m9k16L9K13j7q8J29j72J27k6K26n5k0M11o4
1842f40k79J22N03m64J75K05O2o3l27M61k02J17K83L6l76L64J59k68J99J96n8
1863B05J3O08j95j54J27K85l7J38L24j15j07L98l04J18L8N10l40n46R08m76j80
1884A218J42J43l46j2K10m74l64N68j64m91L27j13k73j37L23j29n63M56o5m06
1904a50r4J64m73K20P41q01m13N63j1o34J34L44n06k44Q28o56p10O05lm61N33
1925a024L63o02l44L64M4m25O03O56r23m6P76n96j98R75K27q54N25K72n42m0J045
1946B56k76n88Q43J1j054L53Q58o94N3Q69l09q94N73P45q81L29R88q80o47R78
$$ plain form
1796 529 300 413 350 82 463 364 -152 157 528 -71 108 561 81 -346 326 30 -448 -204 84 -71 -266
1817 -266 -255 -532 -525 -673 -620 -639 -761 -831 -1011 -1078 -1127 -1343 -1304 -1091 -1108 -1196 -1067 -1239 -1112 -1138 -912 -967 -987 -576 -640
1842 -640 -919 -797 -294 -758 -583 -378 -316 -379 -706 -245 -447 -330 -47 -11 -387 -23 136 -132 67 263 205
1863 205 218 826 631 477 604 889 852 990 1314 1199 1092 1490 1186 1304 1342 1852 1512 966 1874 1398 1218
1884 1218 1360 1503 1157 1145 1355 881 517 1085 921 430 757 644 371 234 557 428 -135 321 256 -150
1904 -150 -244 -80 -553 -333 408 -393 -806 -243 -254 -888 -754 -410 -916 -1160 -332 -988 -1698 -1093 -1096 -1557 -1024
1925 -1024 -661 -1263 -1607 -1243 -1199 -1624 -1021 -365 -1288 -1334 -558 -1154 -1352 -377 -150 -1004 -479 -207 -749 -789 256
1946 256 -20 -608 235 246 -808 -455 403 -291 -238 631 322 -572 1 746 -135 194 1182 302 -345 633
1966F33n3q76J232R53j326m12J201r09q10J417L73j303Q54L12j622K32J250j39
1984A007j041R51lj557L72J026p61m21J540p64j239O76P33j070L75J549j573o17
2002h17J248l30r34Q54J334j531l00R76j271p11J386O79j270M62K97j393k65J700
2020A14k28r37J180K36j972J16J577j126J34J768o46j826R72R82j507P94J662
2037A293r27j313J283k95j498J492J169j280l83J210j109j216J939Q39j532N63
2053B35J154k227n75J890j50o85J691N0k061L71J316p13k24J938n04k161Q22Q34
2071A001j273N28J987j277j359J128k00j603J015J757j285o79J231j142j619J869
2087G9J007j344M62R43j786r28J900J78j271J669K99j919j61J348r06k00J797
$$ plain form
1966 633 580 -296 936 1889 563 151 1352 443 -367 1050 1423 120 974 1286 -336 -104 1146 1007
1984 1007 -34 917 914 -643 -271 755 -6 -427 1113 349 -890 -214 519 -551 -176 1373 -200 -817
2002 -817 431 101 -833 21 1355 -176 -476 500 -771 -1482 -96 583 -687 -225 72 -1321 -1586 114
2020 114 -114 -1051 129 365 -1607 -1491 86 -1040 -906 862 216 -1610 -638 344 -1163 -369 1293
2037 1293 366 -947 336 41 -1457 35 1204 -76 -459 751 -358 -1574 365 1204 -328 235
2053 235 1389 -838 -1413 477 327 -358 1333 1383 -678 -307 1009 296 72 2010 1506 -655 167 1001
2071 1001 -272 256 2243 966 -393 735 535 -1068 -53 1704 419 -260 971 -171 -1790 79
2087 79 1086 -258 204 1147 -639 -1567 333 511 -760 909 1208 -711 -872 476 -430 -630 1167
2104A167k64j658O07M48j423N83J766p47j359J064m5j527R92J569j152m44J140
2121G17p88j621J585J082j336L72J193j171j198J658K44j085J281M35j668k38
2137e38J113o74l02J654o1j571K93M87j354J18K104n67j752Q63J83j396M14J500
2155E14o13n51R07o73j383J027J247j133L7J219r62j185J125L85j199J153N96
2172E11j200l94Q61l29n63J229K08j086J35L63p27j85J631k82j140P71M2q96L52
2191f99J362m58k72Q67j46j172P69O74o00K39P89p10q84P50L56j140R91L43o38
2210D21m52O65j80n07O58M36r47L7P57o79l41J031R0q60J66M15p91K97N07k57
2230D66j45K31K01r71K77M52o50K84L62n02l84K44K02o68K91N81o11m87O50k13
$$ plain form
2104 1167 903 -755 -148 300 -1123 -540 1226 479 -880 184 139 -1388 -396 1173 21 -423 717
2121 717 -71 -1692 -107 975 -361 11 1204 33 -1165 493 737 -348 933 1368 -300 -538
2137 -538 575 -99 -401 1253 1192 -379 -86 401 -953 -835 1269 702 -1050 -187 -4 -1400 -986 514
2155 514 -99 -650 257 -416 -1799 -772 475 -658 -621 598 -364 -1549 -424 -39 -1238 -85 511
2172 511 -689 -1083 -222 -551 -1114 115 323 -763 -628 -265 -992 -1177 454 172 -968 -197 -155 -1051 -699
2191 -699 663 205 -67 800 654 -518 251 925 325 564 1353 643 -241 509 865 -275 716 1059 421
2210 421 -31 634 454 -53 605 1041 94 131 888 209 -132 899 989 129 295 710 -81 216 723 466
2230 466 321 552 753 -218 59 511 -139 145 507 5 -379 -135 67 -601 -310 271 -340 -827 -177 -390
2250c90n17O60K94o00%L07m56J47K55J84p07K50M69m11J12K43l7n28L96J90p58
2271h97K66O41o00K36K40j23l07R6O6N7k14J94r4L3K57K00j94L5L01MJ6L16j47
2294C82j97N42N1n36M75J46l12j1L21l90K66j11N8k85J63K75m74p4L29m9l45J61
2316C85K07k47K84J01n8j95n9J23j0J17o4j28K07l18J11n4k56nk97q2K88k98k43
2339d91L64k17j85p3P6k57Q2q4n4J76j06j33L3K45k95j2l8J76J05p5q1k4J4O5
2363g89K09Q5j44J38p0k0q2J81n1j22L47k54R8J47k03j25M66K95k76j5K12l5o6
2386g4M82q2pj05J96K55l43L68M0k14J20OM2k02K38l12k13L29j05K15m8j0j92
2409C84J3J38m25R8%J03n11O80o7k67j03L09l09J94L8n0j0k9j22j06o3M55k14
$$ plain form
2250 -390 -907 -247 47 -553 -553 -246 -702 -555 -300 -116 -823 -573 -104 -515 -403 -160 -197 -725 -329 -139 -897
2271 -897 -631 10 -590 -354 -114 -237 -544 -448 -382 -325 -539 -345 -439 -406 -149 51 -143 -108 193 197 213 529 382
2294 382 185 727 778 242 717 863 551 540 861 471 737 626 684 399 562 837 363 289 618 569 224 385
2316 385 592 345 629 730 672 477 418 541 531 648 584 456 663 345 456 402 146 141 -156 -238 50 -248 -491
2339 -491 -127 -344 -529 -602 -526 -783 -701 -785 -839 -663 -769 -902 -869 -624 -919 -931 -969 -793 -688 -763 -844 -868 -854 -789
2363 -789 -580 -495 -639 -501 -571 -591 -673 -492 -543 -665 -318 -572 -474 -327 -530 -655 -189 106 -170 -185 27 -8 -74
2386 -74 408 326 319 214 410 665 322 690 730 516 636 642 684 482 720 408 195 524 419 634 586 576 384
2409 384 397 535 110 208 208 311 -200 480 413 146 43 352 43 237 275 225 215 186 64 -42 -105 350 136
2432A36m14L60K27q26K50L42n61l5M72k2n76L67K37n26m0N25l73k0N20k58l63
2453e78K11J57l6j32M51j75j58L46O0q02L64N88n87J29L91m07k23M55J89q18M91
2474h4K95p06M5M99r3j65O99k68n85N5P09n01l2Q13k35p49N26L74o65M24M11l25
2496D42m93K79K27n70K95P73o18o08P12o10l33O12M55m85M8N88j141j77J119p4
2516D41o38N85K34r85q5N93j17n0Q31p0j120L79K31o65J8Q38k57p07O31l69o33
2537i15N43N64l09j98M45m66q87Q57Q18p85N6O53j009m41J151J56o25O43M40p71
2557h0n09M35q0j37P76J13q41k5M94o30L8J177l26q64O85k47r31N47Q54l97n49
2578d97R63k54j067O18Q19r23m9J048p29o66Q38J26p38P54N75j154k74P82o31
$$ plain form
2432 136 -278 82 309 -517 -267 75 -486 -521 -49 -71 -647 -280 -43 -569 -609 -84 -457 -477 43 -215 -578
2453 -578 -367 -210 -246 -378 73 -102 -260 86 146 -656 -292 296 -291 -162 229 -178 -401 54 243 -575 -84
2474 -84 211 -495 -450 49 -44 -209 490 222 -363 -308 401 -100 -132 681 446 -303 223 597 -68 356 767 442
2496 442 -51 228 455 -115 180 953 335 -273 439 -171 -504 108 563 78 126 714 -427 -604 515 441
2516 441 -197 388 622 -363 -448 145 28 -22 809 739 -381 -2 229 -436 -418 420 163 -544 87 -282 -915
2537 -915 -372 192 -117 -315 130 -336 -1223 -366 452 -333 -277 376 -633 -1074 77 233 -392 251 691 -80
2557 -80 -589 -154 -234 -371 405 518 -323 -348 146 -484 -446 731 405 -459 226 -21 -952 -405 449 52 -497
2578 -497 466 212 -855 -237 582 -341 -390 658 -71 -737 101 227 -511 243 818 -336 -610 172 -459
2597d59k3M89K81q74J32N66r13m4J012j9o86K48J42p05L95Q56j84n75Q02l21q17
2618f97K06R42n86N73L43p53o89P09L54q36P97M93o71m37O93n61j59Q96Ro85J19
2639F0O18q80k38J343J0o87K90J95p69P8J295o75o49R21m87l49j52P24m13p0R80
2660A145o87p42N89R3q91O80N48r61k60J71L26o55P69L30o35q6L86m63j58P09
2680B08q2n94K40K21l91m35Q78l04j03M94k0j118M21L83k42R3N03o79k88O37K5
2701a53n27P0P73l57n28N98j90j94L16N68o46J70N30o04l6M22J21m1L3j59j59
2722GJ7J52L3k12J58J28m40N6K82p9j1M02l8m49K07K23m20K46L77n06%L11j57
2745B87N1J15K56m46P4K08Q4m31J53Nj15j10mk6j97P8l5N8J34P7l41j27J98n1
$$ plain form
2597 -459 -482 7 288 -586 -454 112 -801 -845 167 148 -538 -290 -148 -853 -458 398 214 -361 441 120 -697
2618 -697 -491 451 -135 438 781 28 -661 48 402 -434 363 856 185 -252 441 -120 -279 617 626 -59 60
2639 60 678 -202 -440 903 913 226 516 711 -58 20 1315 640 -9 912 425 76 -76 648 235 165 1145
2660 1145 458 -284 305 398 -493 187 735 -226 -486 -315 11 -644 125 455 -180 -266 120 -343 -501 208
2680 208 126 -468 -228 -7 -398 -833 45 -259 -362 132 112 -1006 -585 -202 -444 -351 152 -527 -815 -178 -153
2701 -153 -680 -610 163 -194 -722 -124 -314 -508 -192 376 -270 -100 430 -174 -210 212 333 292 325 166 7
2722 7 24 176 209 -3 155 283 -157 -101 181 102 91 493 455 6 213 436 16 262 639 133 133 444 287
2745 287 338 453 709 263 337 545 629 198 351 356 241 131 127 101 -96 -18 -53 5 139 216 -125 -252 -54 -105
2769a05j79K79k40m03K47K58k57O3K26r8j84RK55l14Q6Q0k3j33J10q8k45O2L46
2792b48o02K25L83l11k51N81l93J18M3nJ7J02K05M7n4o3j09J42K27P8q5k19O34
2815D62m53l3J29R9k56K33J87L1j76K43p6j60r2K68j01r4K34j15O4M1L2k43m0
2838A84J63k9R6J13j01J13k21N3K13j54J20k61j29J61pn42O10j99o4q9J72l70
2860a68J22P3j01k10J21K14l26n4J63J46l10J68J10p9p0J65p1J34k00mj42J0L15
2883Fm14K61k43O1M1J72K18k81j79K4m4J11P7O4o1J89p3r3J02K10l13L21J51k32
2907G5n7J16p8l16M95R2j00m65L77K22k82P1K34l07m7J71n3j43J47j93RrJ25k58
2931a74K38J44l89L94j87J29l38K29K42j92K85k96M9M2R9J5l82K47J93l15l41
$$ plain form
2769 -105 -284 -5 -245 -648 -401 -143 -400 -337 -111 -209 -393 -384 -129 -443 -357 -277 -300 -433 -323 -411 -656 -594 -248
2792 -248 -850 -625 -242 -553 -804 -223 -616 -498 -455 -460 -443 -341 -136 -89 -143 -206 -315 -173 54 132 47 -172 462
2815 462 9 -24 105 204 -52 181 368 399 223 466 390 230 138 406 305 211 445 330 394 435 467 224 184
2838 184 347 318 414 527 426 539 318 371 584 430 550 289 160 321 314 -228 382 183 119 30 202 -168
2860 -168 -46 27 -74 -284 -163 51 -275 -329 -166 -20 -330 -162 -52 -131 -201 -36 -107 27 -173 -177 -319 -309 6
2883 6 -408 -147 -390 -329 -288 -116 102 -179 -358 -334 -378 -267 -190 -126 -187 2 -71 -164 -62 148 -165 156 307 75
2907 75 18 134 56 -260 235 327 227 -238 139 361 79 150 384 77 30 201 148 5 152 -41 -32 -41 84 -174
2931 -174 64 208 -181 213 26 155 -183 46 288 96 381 85 134 176 275 290 -92 155 348 33 -308
2952c08L40n3k44L69J32m62j18K71l1q2K54k76K1P0K24l10Q4J75m71K80J37o2
2974f0m9R1L19j78n22M97lk45K91l5j48l86L51m18k9N44r0j92L18j97K4j85L50
2997D8k56OL44j56j13M5M60m13K74N6o3l90L5J61k21K96M30o41r1L8J53k55M61
3020B08O4l69j60L41j07l17L33J31l05K32p1m27K87K70J55p34R29o80j48M17J65
3041B14q0k03M92o31k29J34K31n4J23J83q2m71L65j05k84M74J12l92j64O00n35
3062c02J56M80M7k17M3P1n02K9N69k01J46J21q8r7J33J96m12J26K61m49m52N87
3084B45k4j66j7L78l14k85L18j50k79O66R7m31k62M76k79m27P52j08l94L75p8
3105I3l91J91K48j74j80N64l81n37L54Q1K7k79L68l52j14L06J46l12n2L44k16
$$ plain form
2952 -308 32 -21 -265 104 236 -226 -344 -73 -104 -186 68 -208 -187 -117 107 -203 -119 56 -415 -135 2 -60
2974 -60 -109 -18 301 123 -399 98 95 -150 141 106 -42 -428 -77 -495 -524 20 -70 -262 56 -141 -117 -302 48
2997 48 -208 -202 142 -14 -127 -82 378 -35 239 295 232 -158 -123 38 -183 113 543 -98 -189 -151 2 -253 208
3020 208 272 -97 -257 84 -23 -340 -7 124 -181 51 -20 -447 -160 110 265 -469 460 -220 -368 49 214
3041 214 134 -69 423 -208 -437 -303 -72 -126 -3 180 98 -373 -8 -113 -397 77 189 -203 -367 233 -302
3062 -302 -146 334 381 164 207 278 -224 -195 374 173 319 440 352 255 388 584 172 298 559 110 -342 245
3084 245 221 55 38 416 102 -183 135 -15 -294 372 469 38 -224 252 -27 -454 298 190 -204 171 93
3105 93 -298 -107 141 -33 -213 351 -30 -567 -213 -132 -105 -384 -16 -368 -482 -176 -30 -342 -394 -50 -266
3126b66q4J71l36J29K46K99k01j14l0J38k72M74K77o22P7K89l37j14N45m26j74
3147c31L48J73l23m5K38k13M3M98K00o42O7K98m55J35L34M2k99L46j79l20M44
3168C59K30k54k13J07j95q9L65j81r6J91J98m32k84M36nl67K56J62m25j05M69
3189A27n28M75L79l26l28L09Jk85O3L52K1k57j61L94n18K51K03k65j11J44Om71
3211e25M54K6l31M8Q1q6L3J7M3m2j2L53k52l72L27j29n2L73J09l97J17Q8K5k2
3235a26R8p3N7MJ84j18j22RJ40k06L02p4n3l7J54n6J25P3q6q3j24K81j41l5K94
3260C87p4j80J73K03n87N26K3k22J0p5m4M43l52Nj88J89P5k6P5j64j35p2K06N8
3284B54p9M5N0l65K5%O2j0J51r9l55L34j31J2j46L78k43j30J83j86K03j79o4j48
$$ plain form
3126 -266 -350 -179 -515 -386 -140 159 -42 -156 -186 -48 -320 154 431 -191 -114 175 -162 -276 269 -157 -331
3147 -331 17 190 -133 -178 60 -153 -110 388 588 -54 13 311 -144 -9 325 367 68 414 235 -85 359
3168 359 589 335 122 229 34 -55 310 129 33 224 422 -10 -294 142 137 -230 26 188 -237 -342 127
3189 127 -401 74 453 127 -201 108 109 -176 -113 239 260 3 -158 236 -282 -31 172 -93 -204 -60 -54 -525
3211 -525 -71 -45 -376 -328 -247 -333 -300 -283 -240 -282 -294 59 -193 -565 -238 -367 -419 -46 63 -334 -217 -129 -104 -126
3235 -126 -28 -101 -44 -40 144 26 -96 -87 53 -153 149 75 22 -15 139 83 208 281 195 112 -12 269 128 93 387
3260 387 313 133 306 509 -78 448 471 249 259 184 140 583 231 236 48 237 312 286 361 197 62 -10 196 254
3284 254 175 220 270 -95 -70 -70 -8 -18 133 34 -321 13 -118 -106 -252 126 -117 -247 -64 -250 -47 -226 -290 -438
3308d38K42J9p1j23L52k7l00J40r2l8L54k8r6p0o1Q1p9J40K02J63j43j53p1j16
3332b13J94P4j00K37o5j78P8M2j01J07P4J65k10k16K42J38k73J16l4J31k37J72
3354A43k67K72o3m4J2J45m16K98Q2J45J3k22l63J75Q2L2j31M06l54j9J34k02L15
3377A73j31K36k96m9J5J02pQr9R1K73k91K13j7l17K45Q8k12l2m4J22p6j44QJ07
3402c4j13K93Ln80K99K05k46p6l2L8Q0m8K85l1l57N01m46N1J67o3J02l55N36p7
3426A02P2l57o1K08K68k33J21q9l7J29r6J02j43m2J17R1p1k57J48M8k37R5R8K5
3450Ajj7k76J87L73k68K26r0n3k56J64J86j51m5L42k73J28k57J07k90L07J69l44
3473a31j19O5J59J06k34Q9K52p2j11j22K14j89J5K29o3k45O7K8J56j98j3M59j97
$$ plain form
3308 -438 -196 -177 -248 -371 -19 -46 -346 -206 -298 -336 18 -10 -106 -176 -237 -156 -235 -95 107 270 127 -26 -97 -213
3332 -213 -19 55 -45 192 127 -51 27 69 -32 75 149 314 104 -112 130 268 -5 111 77 208 -29 143
3354 143 -124 148 85 41 53 198 -218 80 162 307 320 98 -265 -90 -8 24 -107 299 -55 -74 60 -142 173
3377 173 42 278 -18 -67 -52 50 43 51 -48 43 316 25 238 221 -96 149 237 25 -7 -51 71 -5 -149 -141 -34
3402 -34 -147 146 149 -431 -132 73 -173 -249 -281 -243 -163 -211 74 43 -314 187 -259 -208 -41 -104 -2 -357 179 102
3426 102 174 -183 -244 -36 232 -1 120 31 -6 123 27 129 -14 -56 61 152 81 -176 -28 20 -217 -122 -24 1
3450 1 0 -17 -293 -106 267 -1 225 135 82 -174 -10 176 25 -20 322 49 177 -80 27 -263 44 213 -131
3473 -131 -250 -185 -26 80 -154 -65 187 115 4 -118 96 -93 -78 151 88 -157 -90 -62 94 -104 -117 342 145
3496A45k78M1L01j67L6mK1k57J32P5k06J51j01Q4K0j61J56j84l9L82k2j69L87
3519C43r8l68O8O18o38K48m8Kl0R9j81J91mK5l12l30L12J72k88N3K92Q9m27l9
3543b51l2J9K74J8j44O8N4k56K40j86K52j04k2M9l31L18M0j69J05K17l04j09J49
3566a05K02l21J60K0l40NN47l48J43L05j82j81k2K99q9NK92n7j93k68P9P4K15
3589B40j29k22K07p4J74j60J20m3k4o6K28n3m18L64j19l37M85j55j28J13R5j50
3611e2p0M50l12L44j68p4j00m1M47k50k84Q5J07j90l9M25k43p9k61j2K01l9J97
3634D2J01k89J45j31J12j41k41L16kL9p0k10L18r4j17M45k57j18J12j1J27j62
3656h6m6J75k72K93J8l55N1K58j93k3M34k49k74K61k9r5n1K29K6n9r9J36L3J08
$$ plain form
3496 145 -133 -92 209 42 78 74 95 -162 -30 45 -161 -10 -111 -27 -7 -168 -12 -196 -235 147 125 -44 343
3519 343 245 -123 -55 563 -75 173 125 127 97 196 15 206 202 227 -85 -415 -103 69 -219 -166 126 215 -212 -251
3543 -251 -283 -264 10 28 -116 -48 6 -250 -10 -196 56 -48 -70 -21 -352 -34 6 -163 -58 159 -145 -254 -105
3566 -105 97 -224 -64 -44 -384 -379 168 -180 -37 268 86 -95 -117 182 93 98 390 333 140 -128 -49 25 240
3589 240 111 -111 96 22 196 36 156 113 89 23 251 198 -220 144 25 -312 173 18 -110 3 98 -52
3611 -52 -122 328 16 360 192 118 18 -23 424 174 -110 -25 82 -108 -147 278 35 -44 -305 -317 -116 -155 42
3634 42 143 -146 -1 -132 -20 -161 -402 -86 -88 -49 -119 -329 -11 -105 -222 223 -34 -152 -40 -51 76 -86
3656 -86 -132 43 -229 64 82 -273 -222 36 -157 -180 254 5 -269 -8 -37 -132 -183 46 72 13 -86 50 83 191
3680A91j5j21O8J51l99J95J01K7k30O0L31k53J01P8j25l89N60j18k24Q0J48p5
3702A42P7r4q8j86K05J79k02K93k59K22l34K77l46m5L5J48k70K30J94k57O8P6
3724F5j24k53m0P3L12k85K04R5j68O0j30L03k93M9m9J69k18K89j28Mj38J94k68
3747b77K55n8j90J85J85j40k87K73k7L5j36O5p1P8J25k9n3J72k9j73K5J56K60
3770C44l28N8M8N7q9p7j16K7Q1n7K42j0j56N7n6J60o7k33k5P0J44N0O5k34L44
3795B99j86j83K2l8l6J68Q2p5k2R1j15JM43l79j92J7R2N4J18k24L29j78J30k05
3819A3K64k85M33j42k38Q5l9j49k59J26K0K75o5p9K96n59K45Qj81L67j35j42J19
3842b2J42l91L64Mj99l0J66k50L60k12O1J56l29K92k58O02l56k09n8m2K08J33
$$ plain form
3680 191 176 55 123 274 -125 70 171 198 -32 28 359 106 207 285 160 -229 331 213 -11 69 217 142
3702 142 219 125 37 -149 56 235 33 326 67 289 -45 232 -114 -159 -124 24 -246 -16 178 -79 -11 65
3724 65 -59 -312 -352 -279 33 -252 -48 47 -121 -61 -191 112 -181 -132 -181 -12 -230 59 -69 -65 -203 -9 -277
3747 -277 -22 -80 -270 -85 100 -40 -327 -54 -81 -46 -182 -117 -188 -110 15 -14 -67 105 76 -97 -72 84 344
3770 344 16 74 122 179 90 13 -103 -76 5 -52 190 180 24 81 25 185 118 -115 -140 -70 74 124 189 -45 299
3795 299 113 -70 -48 -86 -122 46 128 53 31 122 7 8 451 72 -120 -103 -11 43 161 -63 266 88 218 13
3819 13 277 -8 425 283 45 130 91 -58 -317 -191 -171 104 39 -40 256 -303 -58 -50 -231 136 1 -141 -22
3842 -22 120 -271 93 97 -102 -132 34 -216 144 -68 -7 149 -180 112 -146 456 100 -109 -167 -209 -1 132
3864A32m0o0n0J02j14K7o8M3k21M59q8k52K16q2K38j07j65K51r3j76J03m5K50
3887B60j31j08J05j45R2j54M9KK70k18N9J19n9j90K49j85jN5k22k1L4R9J5j55
3911a81K95j35n6N9j52M2P2J62k97K50m6N3k92K2K84j67j63L28k06K00j64K34
3933A42j09j80M51l09M6kJ36k48J13k58K03q6L2p4J68M8p8k25L88K26j6m11k3
3956f6m6Q3J32r1N9J57k05k16J53Oj16J36m6l3k12K43L6J6j31J30k44J38J93j06
3980c0P0j22J13N5l30L2J52m4k28K97np5j03oJ21k49J43L16l46L75l6j32J34j75
4004g3k22K85N9N4N1k91K40j6o0o2P3J24J45l30J02m4k1J19j02o1J23K5K0k49
4028a11J53k37K92p3N8p4K74k91j6J52mj61rm1J49q1J21k34N8J06j67L20r0k04
$$ plain form
3864 132 92 32 -18 84 -30 -3 -71 -28 -249 210 122 -130 86 4 242 135 -30 221 128 -48 55 10 260
3887 260 129 21 126 -19 73 -81 -32 -30 240 22 81 200 141 -49 200 15 14 69 -153 -174 -140 -41 -26 -181
3911 -181 114 -21 -77 -18 -170 -128 -56 106 -191 59 13 66 -226 -204 80 -87 -250 78 -128 72 -92 142
3933 142 33 -147 304 -5 41 39 175 -73 40 -218 -15 -101 -69 -143 25 73 -5 -230 158 384 368 -43 -66
3956 -66 -112 -29 103 12 71 228 23 -193 -40 -34 -150 -14 -60 -93 -305 -62 -26 -10 -141 -11 -255 -117 76 -30
3980 -30 40 -82 31 86 -244 -212 -60 -104 -332 -35 -40 -115 -218 -224 -103 -352 -209 107 -239 136 100 -32 102 -73
4004 -73 -295 -10 49 103 154 -137 103 87 27 -35 38 162 307 -23 79 35 14 133 31 -30 93 118 138 -111
4028 -111 42 -195 97 24 82 8 282 -9 -25 127 123 -38 -47 -88 61 -20 101 -133 -75 31 -136 184 94 -110
4052a10K24j63L1j04J02k25K38k20j5K43Q8m4j96K80k52K03j52J75l03J18o8J25
4074b5k0R9k01q6L38m3p0J33l09o3M21n17L03j44p5J7J50K95m39M70m24J13j50
4097b27nJ18J70j33L0J08j34J98j4k87J72J03J00J28l76Q0pj90J68k3J10k09l35
4120d55K64M00k27m0R1K02m67J62J32K7J37K4j37j09p5K17J6o0qq3K35l44M45
4143C47l68L32l87K33m5k09J02o8L34m68M37l43L1J08L20j92m8j4m44L66l2j07
4165a15o3M0J43P9j38J89k24J58l6o3j08NjJ38l05J96J13J34k1j76j63k3J63o0
4189a38K87p9Mm0j35oJ93l31L67M0j28P2k26J33q5P9N7q4R4l37L75Q1j56P0J38
4214B45j20p9j00J53j77lK73l49K03K2J95k03K10l22Q3O2j98J44o9L50l99j2J34
$$ plain form
4052 -110 114 -49 -18 -122 -20 -245 -7 -227 -242 1 89 45 -151 129 -123 80 -72 103 -200 -82 -150 -25
4074 -25 -45 54 -147 -233 105 62 -8 125 -184 -247 174 -343 -40 -184 -259 -242 -92 203 -236 234 -190 -77 -227
4097 -227 -232 -114 56 -77 -47 61 -73 125 111 -176 -4 99 199 327 -49 31 24 -166 2 -21 89 -120 -455
4120 -455 -191 209 -18 -58 33 235 -232 -70 62 89 226 250 113 4 -71 146 162 102 94 11 246 -98 347
4143 347 -21 311 -76 157 112 -97 5 -63 271 -197 240 -103 -72 36 356 164 116 102 -342 24 -8 -115
4165 -115 -178 -138 5 84 -54 135 -89 69 33 -30 -138 -133 -134 4 -301 -105 8 142 121 -55 -218 -241 -78 -138
4189 -138 149 70 74 34 -101 -107 86 -245 122 162 34 106 -120 13 -72 7 64 -20 74 -263 112 193 37 107 245
4214 245 125 46 -54 99 -78 -81 192 -157 46 68 263 60 270 -52 31 93 -105 39 -30 320 -79 -91 43
4237D3l2J26R4j73J30j53k46K25Lk72K7M04j52K7J62L2j72k09K18O0j53m5j26
4260a82K48j69J01J1J01o0k51M3J37J64k1%j56j41PL02p1l5j94m8Q3Q8Nn9j54
4285b51L41j91J5Q9n9R2Oj49J75j54m5l9K10mJ16j87R9O7M3J42m35M44m45J49
4309B9L75m75J0Q7O9m2o2K87k20K48k58L0m2l1q9N7q1j09K95k2R3j90J07l78L08
4334dq1j52L79m08M28j87J72k99J36m3J15j50J38O9q7P4k98K36k31L64k54N8k76
4357c01L87n7M5l3o2L10j03j80l70J35R0JK7J03p6J67o7J57j13j40J65l40J04
4380a51L18m15M5J66K35l97K01K22j67n7L5nj70M6J33j54P8QrL31n81L5N8J61
4404c4qkrJ5j16Q8M7J97k63L19j79j4J54k90J50j49J19j49J37M7j67J69p8j1J36
$$ plain form
4237 43 11 137 231 58 188 35 -211 14 17 -255 -228 176 24 51 213 245 73 -136 82 142 -11 -56 -182
4260 -182 66 -103 -2 9 110 50 -201 -158 -21 143 122 122 -34 -175 -168 134 63 28 -166 -214 -131 -43 -38 -97 -251
4285 -251 90 -101 -86 3 -56 36 42 -107 68 -86 -131 -170 40 36 152 -35 64 131 174 316 -119 325 -120 29
4309 29 404 -71 -61 26 95 53 -9 278 58 306 48 78 36 5 -84 -27 -108 -217 78 56 149 -41 66 -312 -4
4334 -4 -85 -237 142 -266 162 -25 147 -152 -16 -59 56 -94 44 113 26 100 -198 38 -193 171 -83 -25 -301
4357 -301 86 29 74 41 -21 289 186 6 -364 -229 -139 -138 -111 -8 -84 83 16 173 60 -80 85 -255 -151
4380 -151 167 -248 -203 -37 198 -199 2 224 57 0 35 30 -140 -94 39 -115 -37 -29 -38 293 -288 -253 -195 -34
4404 -34 -42 -44 -53 -38 -154 -66 -19 178 -85 234 55 41 195 -95 55 -94 25 -124 13 60 -107 62 -16 -27 109
4429A09m36K49M9p2R3J64j28J26n5J50k28J91p1l31m8J57L8j51K58L8J2N5k98
4452a29L17l67K44R7j10J50j20R0l14J58M9m8P1j85L2J26m6o9j7J19o6K93j70
4475A05j63J74Q9j90j07O2j13P1J64l6k4N9O0j39l28O15j79k91O7K20O2J35l55
4498d2l6J55j25J10r0l5J01K03k32P1k3k2k97K91j01J56j53l0J53j57r8J1L52
4521A62Kk90n8N6P7J25K01r7l56K72j57p9K67j70j49J70o5J72k70K28j5j74Q9
4544e9p1J88j88K05l60K60O1J84l15J46J66j60l2M5l5p6Q6j04J2K69j27J22k40
4567b3oL24k06j23K28j94J14Q9j74K7N4p7l2N3N3L6n6L8K1m64O44m35K53l33L36
4592A47l22n2L19p7Ll0l9J42k05P0k5J3l4K51k75q8K7O8r9N7K56k00K01p8j58
$$ plain form
4429 109 -327 -78 -29 -101 -8 156 28 154 99 249 21 212 141 -190 -238 -81 -43 -194 64 102 114 169 -129
4452 -129 188 -179 65 162 52 202 82 172 -142 16 65 17 88 -97 -65 61 15 -54 -71 48 -18 275 105
4475 105 -58 116 205 15 -92 -30 -143 -72 92 56 32 91 151 12 -316 299 120 -171 -104 116 178 313 -42
4498 -42 -78 77 -48 62 -28 -63 38 241 9 80 57 35 -262 29 -72 84 -69 -99 54 -103 -201 -190 162
4521 162 164 -126 -184 -128 -51 74 275 178 -178 94 -63 -142 125 -45 -194 -24 -89 83 -187 41 26 -148 -59
4544 -59 -130 58 -130 75 -285 -25 36 220 -95 51 217 57 25 70 35 -41 45 -59 -47 222 95 217 -23
4567 -23 -29 295 89 -34 194 0 114 203 29 56 110 33 1 54 107 143 87 125 146 -318 326 -109 144 -189 147
4592 147 -175 -227 92 15 18 -12 -51 91 -114 -44 -69 -56 -90 161 -114 -202 -175 -107 -206 -149 107 -93 108 30 -128
4617a28m06M18O3pJ44q9kP7m3J59j83o9j92K44N5o5O9n3L4p6n6J16L3q7Q9k13
4643a68R1j5L4j8J17p7Q7r6j43L84k63L10j86M1j98K28r3P5l45L58Q5L3j03J3
4667A51m4J18k04J43k18j4K68l00J83k19j08K79k43Q0L96j74j24K04o7j36km4
4689g5MK9J57o8l8j16P3J08m7j5J23L8j29P6m2j74p3m0L46k09L45n08K84l67M63
4714A45r4p4J49k92j02K40n7J61J07j40J95j0k23n2r8K65j34J35%k06j10J52k46
4737b89M00r2Nj56J1M42l18N4OK02j87jM3m04L31l62M46M0k78J76k09L67n61O30
4761B96n86L70J50m07K10k17L02o7J47Q1l11J23k06jJ87o5Lj87J93n6L6P7N8R5
4785B25l12p2J22K0J00j81N2K5J47k45j37J81N5J77j24J29k65R6m4n4J60j08J48
$$ plain form
4617 -128 -534 -116 -53 -60 84 -5 -7 70 27 186 3 -66 -258 -14 41 -24 45 -8 26 -50 -106 10 43 -44 45 -168
4643 -168 -77 -92 -58 -76 41 -36 51 -45 -188 196 -67 243 57 98 -100 128 35 110 -235 123 208 241 138 151
4667 151 107 225 21 164 -54 -68 200 -100 83 -136 -244 35 -208 -128 268 94 -30 174 107 -29 -31 -75
4689 -75 -71 -42 115 47 9 -107 -34 74 27 12 135 173 44 120 78 -96 -169 -209 137 -72 273 -235 49 -318 145
4714 145 51 -23 126 -166 -268 -28 -85 76 183 43 238 228 5 -47 -145 120 -14 121 121 -85 -195 -43 -289
4737 -289 111 19 24 -132 -121 321 3 57 63 265 78 77 120 -284 47 -315 131 171 -107 69 -140 227 -334 296
4761 296 -290 80 230 -177 33 -184 118 51 198 279 -32 91 -115 -116 71 6 9 -178 15 -41 -5 72 130 225
4785 225 -87 -159 -37 -17 83 -98 -46 -21 126 -119 -256 -75 -20 157 33 162 -103 -7 -51 -105 55 -53 95
4808I5j17P6j92O1K23k34LQ2K07k15j03K09k00L15k73j37K96N4l30M7p9J04O7
4831d1L28m36J47K02l01K13k66K52j25J0J64k47Q8K2j92K60l0j77J70J6k44Qj31
4854c10K40K03j45k01K74J11j01r7n0K45Q1l99p7L35j32m9J36k10J93q0L4L0K35
4877B66l75K07k97K25K5k04L17j88l73N50q3k77K30m5K12P9k24q0Rj6q0N5O9R1
4901I3l0J28l04MK17j29J80q6P7j85O3n0K91j27r2l8r3l2O3Q7l20K36l4K5M0j6
4927c2r7L58m23j7J80J36R9K2k37P0j61L45m21K7j45M00k46K78k78LR6O7j23J78
4951G9j72k94L13J70k63K10J65l79L1M13p6q8k77K30j22J20k16O9P8k0j99P1J25
4974c2J72k13J1J76l4N5j86j71L27N1l76L27P6l22N99l35J09Q3k28n0k02P1j52
$$ plain form
4808 95 -22 54 -138 -77 146 -88 -85 -3 204 -11 -114 95 -105 210 -63 -200 96 150 -180 -133 -212 -108 -41
4831 -41 287 -149 -2 200 -101 112 -154 98 -27 -17 147 -100 -12 10 -182 78 48 -129 41 57 -187 -179 -310
4854 -310 -70 133 -12 -213 61 172 71 -26 -76 169 250 -149 -226 109 -23 -72 64 -146 47 -33 1 31 266
4877 266 -109 98 -199 26 51 -153 164 -24 -397 153 70 -207 23 -22 190 269 45 -35 -26 -42 -122 -67 2 93
4901 93 63 191 -113 -109 108 -21 159 73 150 -35 28 -22 269 142 50 12 -81 -113 -50 37 -283 -47 -81 -56 -16 -32
4927 -32 -129 229 -194 -211 -31 105 204 226 -11 59 -102 243 -178 -151 -296 104 -142 136 -142 -139 -43 24 -99 79
4951 79 -93 -387 -74 96 -167 43 208 -171 -140 273 197 109 -168 62 -60 60 -156 -87 -9 -29 -228 -157 -32
4974 -32 140 -73 -62 114 80 135 -51 -222 105 156 -220 107 183 -139 460 125 234 317 89 39 -163 -92 -244
4997b44K99K3J9L9j73RK5k7l6N2N8J44n2k21m5J56q6K7K21No7l1K9j05Rk41J97
5024a6k28N9J56k43N34l07M5j75K42l02m4r3Q3K0N8R9pK89j97k3L5j71R7o0J86
5049C7m12L68kj98L48j99J3j6K50j04k61K15k25J28J80l36J58J02O7j7j76Q3q8
5072h5K51k99L25j23M9k26J57J05L0k69N4J01k00J37R6q5L6N0P5j88J38p2j21
5095f4J0L6J20J04j41J1k6r0J37j0R8l10K17p5J5q7j84M17j17J25j69N6K41o9
5119B45k40Rr2lK99k33J18l01K92j93J46J2l78K02L4k25K7K72P4k65J88O8k29
5142a73J61j55K10q6j02L14m9j85K43l35J98j54K34k76n1K19k27Q2P2m7N6r1J29
5165a3j79J41qk75M07r3J73j57K9J91l00K20j28Q2j76J38n3k0K25k07J08o2L8
$$ plain form
4997 -244 55 78 97 136 -37 -28 -3 -30 -66 -14 44 188 136 -85 -130 26 -60 -33 188 193 126 95 124 19 28 -213 -16
5024 -16 -244 -185 -29 -272 262 -45 0 -175 67 -235 -279 -372 -289 -269 -211 -112 -119 170 -27 -50 -15 -186 -89 -149 37
5049 37 -375 -7 -9 -207 141 -58 -45 -61 189 85 -176 39 -186 -58 122 -214 -56 46 113 96 -80 3 -85
5072 -85 166 -133 192 69 118 -108 49 154 184 -85 -31 70 -130 7 103 18 54 104 179 -9 129 57 -64
5095 -64 -54 -18 102 206 65 76 50 -40 97 87 185 -125 92 17 32 -55 -239 178 61 186 17 73 314 245
5119 245 5 14 -78 -81 218 -15 103 -198 94 -99 47 59 -319 -117 -83 -308 -281 -9 65 -200 -12 56 -173
5142 -173 -12 -167 43 -43 -145 169 120 -65 178 -157 41 -113 121 -155 -206 13 -214 -132 -60 -107 -51 -142 -13
5165 -13 -192 -51 -59 -334 73 -20 153 -4 25 216 -84 136 8 90 -86 52 -1 -21 204 -3 105 43 81
5188H1j63n7K5K44k15R8%l6l9o4J2J22j69O4Q6j40L80k41J45J35k21r5m7Q0j04
5213a19P5J65k4o0l0P9q0r1J52j9R9N5k65J02J15r9L5N0p7Q2k13j4L65l38J46
5238I1q1M8q8R5p4lO3J39k96K1j12K97k64J48J34k11Lj7J83j88J42J54k11j61
5262a88M74l73J85j22Q1j7j18j09L02q7j17L2Q7P0l8j04k3Q8j79O6L61Ok20m5
5286A2r8q1J62J7j04J02o0m0k8K36j34k32L35pj50R7j24J2J51k42J39J36l78J97
5310h2J60l17K32k39K88K24l17M6n9Q1O1l70L37K0k24L47k76o4J56J59k76K32
5332A19O2J5l63M10k00k05K04j7Q9j47J79q1J19j81O6o8j46N3R5l31L82k78K84
5355F0j59j04K56k7K9j79J11R8m6J05j90J18m7J84Q4l37j1m7Rj02R3O4O1L9M0
$$ plain form
5188 81 -82 -139 -114 130 -85 13 13 -23 -62 -126 -114 8 -161 -97 -11 -151 229 -12 133 268 47 -48 -95 -15 -119
5213 -119 -44 121 97 37 7 86 6 -85 67 48 147 202 -63 39 154 55 90 140 63 145 -68 -82 283 -55 91
5238 91 10 58 -30 65 -9 -12 51 190 -106 -85 -197 100 -164 -16 118 -93 -90 -107 76 -112 30 184 -27 -188
5262 -188 286 -87 98 -24 57 40 -78 -187 115 28 -89 -57 30 100 62 -42 -65 23 -156 -90 271 277 57 12
5286 12 -86 -167 -5 12 -92 10 -50 -90 -118 118 -16 -248 87 80 -70 27 -97 -85 66 -176 -37 99 -279 -82
5310 -82 78 -239 -7 -246 42 266 -51 -5 -64 17 78 -292 45 65 -159 188 -88 -152 4 163 -113 119
5332 119 181 196 -167 243 43 -162 42 25 114 -33 146 65 184 3 69 1 -145 -92 3 -328 54 -224 60
5355 60 -99 -203 53 26 55 -124 -13 85 39 144 -46 72 25 209 293 -44 -55 -102 -93 -195 -102 -38 23 62 102
5380A02j58k4k23J51J90k8L0k82J83J9m7j27J69J25j56L04l67R3P2o8p3K23Kj04
5404Fl9L0MJ3p5L01j92k54m1L62j38j3J66l16K29J17N3o9k86j5L0R3j08J85J90
5429B33o8L6n0N6m7k08J23K4J02n7k9n5j80j3L09k28J0J63p3k03J60J51l14LJ25
5454c0j05O7j04L51k53l9k16L79k15J77k6p7M2r1j6K34J69n44L50l9R9R9k30p8
5478i6O9R9o9n9L55l64J70J75m59j36L98j3q7J79l38K3K33J92k01k3p8j07r4M63
5502B32j50k35M26m10K61r0k21P2K92k55m1R9J1P1j7J61j6k09k8J99j30K6L8o9
5526A7L2J25l32K20n6K53k71K23k09K6J25j31K55m12J75k70L36n9k5k0j03qK94
5549A85j33j47J75k47K33o2o0J89l60J05J25p2J49J32k98J48k08P5q6J00Nl8R0
$$ plain form
5380 102 -56 -80 -303 -152 38 10 40 -242 -59 -40 -87 -214 -45 80 -76 228 -139 -46 26 -42 -115 108 110 6
5404 6 -33 -3 1 14 -61 240 48 -206 -247 115 -23 -36 130 -186 43 160 213 144 -142 -157 -127 -34 -142 43 233
5429 233 165 201 151 207 160 -48 75 99 201 144 115 60 -120 -133 176 -52 -42 121 48 -155 5 156 -158 -155 -30
5454 -30 -135 -68 -172 179 -74 -113 -329 50 -165 12 -14 -91 -49 -140 -156 78 247 -297 53 14 113 212 -18 -96
5478 -96 -27 72 3 -56 299 -65 105 280 -179 -315 83 70 -17 162 -176 -153 80 272 71 48 -30 -137 -231 232
5502 232 82 -153 273 -137 124 34 -187 -115 177 -78 -119 -20 -9 62 45 206 190 -19 -47 152 22 48 86 17
5526 17 49 174 -158 62 6 259 -12 211 2 28 153 22 277 -135 40 -230 106 47 22 2 -101 -109 185
5549 185 52 -95 80 -167 66 4 -56 133 -227 -122 3 -69 80 212 -86 62 -146 -71 -157 -57 -52 -90 0
5572@L5j33J10Q3m4j31P7p9j74J77rj70K49m5J91k94Q8K23m05L64j55K9j12J40
5596A5K02k11K25o0j49n3q1K78pL2Lk04K00m24Q0R4K28k18L8l1OMJl29M11J13
5622A63J17j93K4j27K61p5j86K09o2L8j69J60j50J91k55K16l97M18k28j85J85
5643d5J2l1J97O1m44K0J51O8n1R5P3k48J52n2J33k19K50P4l36OJ4J43n3R2l06
5668b44K46q0J68m3L5K6k20K53k11M4j39Q0J75j20LJ18K8j13k0J43o3K36l32J73
5692A43l42K01K10l07J27j26J19K6q1k43M20j07o7J18K1j31J2j10Q5Lp3K01q1
5715A8k53L03k02J78J24j33k18J54J55MKj76M4R6L2k20O0N4O5l3L0k1N8j74J34
5740H1m9j00J56j58m8J51l1j61M3J44J99j5k29L7k3j08L82k36Q2r1M2K23l82J48
$$ plain form
5572 0 35 -98 12 95 51 -80 -3 -82 -256 -79 -88 -258 -9 -54 137 -157 -69 154 -251 113 -42 -13 -125 15
5596 15 217 6 231 171 22 -31 -112 166 159 191 194 -10 190 -234 -154 -60 168 -50 -12 -43 -37 -33 -32 -361 50 163
5622 163 280 87 111 -16 245 170 -16 193 131 169 0 160 10 201 -54 162 -235 183 -45 -230 -45
5643 -45 -33 -64 133 194 -250 -230 -79 -11 -62 33 106 -142 10 -42 91 -128 122 196 -140 -134 -120 23 -30 62 -244
5668 -244 2 -78 90 47 82 108 -112 141 -70 -26 -165 -85 90 -30 -27 91 119 6 -14 129 66 302 -30 143
5692 143 -199 2 212 -95 32 -94 25 51 -30 -273 147 40 -27 91 112 -19 -7 -117 -32 -29 -102 99 18
5715 18 -235 68 -134 44 168 35 -183 -29 126 130 132 -44 0 96 128 -92 -32 22 87 54 84 63 121 -53 81
5740 81 32 -68 88 -70 -118 33 2 -159 -116 28 227 212 -17 20 -3 -111 271 35 117 26 68 291 -91 57
5764E7L2j72l8O5j75J33K68n3Q5l22J24l2J07J2M3j69K02j85j50K06J38j29R9
5787A46j18j87K41j82J04N5r6o8P3l31M47r5k49L21PM44m43j4k36J80j08J42l81
5810c48%K91K1m8K24j82n7J05j1J55R7j87n8J86k10j49o1L37kl40J49K26j33J99
5834B04l45J35l57N74k60M9J40K8k81L9K12k2J64m80J2K90k2j91P3K05j12j35
5856h0L28j80J37j13j17K8o7m1K47l35K03L3Kj15n8O9j7K43j52p9J81j48L9pj65
5881a64K54p7j54K18J58l39M47k73J0j63K66l12J83k68J99k96L85P0l75K45J41
5902A55k19o4J05o9J56q6q7R2j11k33L34k65L93J5j79k7K46J69m84J53L49n14
5924a71P1l0j06L34k13J21j43j23L86l12J29L59p7l71O2K5J74k61K19k11L72l74
$$ plain form
5764 57 89 -83 -121 -56 -231 -98 170 117 202 -120 4 -28 79 91 134 -35 167 -18 -168 38 176 47 146
5787 146 28 -159 82 -100 4 59 -37 -105 -32 -363 84 -11 -260 61 68 512 69 55 -181 -1 -109 33 -348
5810 -348 -348 -57 -36 -84 140 -42 -99 6 -5 150 247 60 2 188 -22 -171 -232 105 103 -237 -88 138 5 204
5834 204 -141 -6 -363 211 -49 0 140 168 -113 -74 138 116 280 -200 -188 102 80 -111 -38 167 55 -80
5856 -80 248 68 205 92 -25 3 -64 -105 142 -193 10 43 45 -70 -128 -59 -76 167 15 -64 117 -31 8 1 -164
5881 -164 90 13 -141 77 235 -104 343 70 80 -83 183 -129 54 -214 -15 -311 74 144 -231 14 155
5902 155 -64 -128 -23 -92 64 -22 -109 -17 -128 -361 -27 -292 101 116 -63 -90 156 325 -159 -6 343 -171
5924 -171 -100 -130 -236 98 -115 6 -137 -260 126 -186 -57 302 225 -146 -84 -59 115 -146 73 -138 234 -140
5946a40k4j09L17K6m3k9J86m25K15J87k22q6J22P2K12l06qQ2J7M6n1J50k94J54
5970D9M0j67N3L3j32J22J55K2m57J63mJ01p5J72j76rn9M85l06J01l15q7J15N18
5994C42l04j8j0j05J45j31K5kl22L80r5J03L6J2k41K94R6l36j46J76M0J33j11
6017c9O3q4l7J56j92O8J20N9k33J97k79L49m4l00J35j40J62o3j64J57O8r6j11
6040b48L82J1j14R6L12m12p5J20j8J48o6qj99J05Q1k58l4L12NP3j28n5q2J22q4
6065a4k9J77j46K7o3K83l32R6j96K68r4R9K30k52n2k07L63j67M8K3L1J8p0j99
6089a58J80J55j52L12k73j53K64J6j97o2Q5R3J62p9j20J11J97m25J57k66K01r0
6111d2J83j89J35p8M3R1j57p8P2J9J90L1j7k21J40k28J39r0p6O1L09l15R3L7j63
$$ plain form
5946 -140 -164 -273 44 70 27 -2 184 -241 -26 161 -61 -147 -25 47 259 -47 -55 27 44 90 39 189 -105 49
5970 49 89 -78 -25 8 -124 -2 153 175 -282 -119 -123 -22 -97 75 -101 -110 -169 316 10 111 -204 -291 -176 342
5994 342 38 20 10 -95 50 -81 -56 -58 -380 0 -95 8 44 56 -185 109 205 -131 -277 -101 -61 72 -39
6017 -39 24 -60 -97 59 -133 -65 55 114 -119 78 -201 148 104 -196 -61 -201 -39 -102 -266 -109 -41 -137 -248
6040 -248 134 145 31 127 439 27 -48 72 54 202 136 128 -71 34 115 -143 -177 135 140 213 85 30 -52 70 -14
6065 -14 -43 134 -12 15 -48 235 -97 -1 -197 71 -23 76 306 54 2 -205 158 -9 39 62 93 111 41 -158
6089 -158 22 177 25 337 64 -89 175 191 -6 -68 17 110 272 193 73 184 381 -44 113 -153 48 -42
6111 -42 141 -48 87 9 52 143 -14 -92 -20 -1 189 220 203 -18 122 -106 33 -57 -133 -72 237 -78 15 52 -111
6136a11o3pQ5j75N04m28K39K6j45J45j4J21j43P6L5q1j09k19L26J7j37n0J49j28
6160h7P3o3n1L61k60N5l08J87J43MJ46k06p9J08j52J13qM7L4k71K41J27j01p5
6184b2J20p6Qj31J38l0k56M07k07K42j57p4j59O1K29q8p5K92l78J53kj60L96l91
6208a60K35J43m7l05k2L66l21R4l50K80m4J52K7j9J27l25qM4r4J70J4j22L35l0
6232A40k04K9l8J83k61R1O3O8j59M5j70K92j57K3M6J66j56L7j35K8P8n1j2P7k77
6257b54L00p5N5j54K48k1j7k54L69k52j18L02n8j92Q8J9J81k88J03l9K3K89k09
6280D6p6Q8J7J22J21k07J17k89qJ50r3J03j97J40R3m02M61m17L25m3p6j06R6R2
6304E7J65j19J24l6k08p5l4m4n8N01j33j38o7q7K36k17M0j57K74o2PP5j66L01
$$ plain form
6136 -111 -174 -181 -96 -271 233 -195 44 70 -75 70 56 177 34 110 145 64 -45 -264 62 79 -58 -108 41 -87
6160 -87 -14 -77 -128 233 -27 28 -280 -93 50 54 200 -6 -85 23 -129 -16 -24 23 57 -214 27 154 53 -22
6184 -22 98 22 30 -101 37 7 -249 158 -49 193 36 -38 -197 -136 93 5 -70 222 -156 -3 -5 -165 231 -160
6208 -160 75 218 171 -134 -156 210 -111 -17 -367 -87 -131 21 48 29 156 -169 -177 -133 -227 -57 -43 -165 170 140
6232 140 -64 -35 -73 110 -151 -60 3 71 -88 -43 -213 79 -78 -55 -9 157 1 38 -97 -69 9 -42 -54 23 -254
6257 -254 46 -29 26 -128 120 99 82 -172 197 -55 -173 129 71 -121 -33 -14 167 -121 -18 -57 -34 255 46
6280 46 -30 58 75 197 318 111 228 -61 -69 81 -12 91 -106 34 127 -275 186 -231 94 51 -25 -131 -35 57
6304 57 222 103 227 191 -17 -92 -126 -170 -228 273 140 2 -65 -152 84 -133 -93 -250 24 -38 -31 44 -122 179
6328A79j36N8J7j94L7P8j79J02J45k40M1L05k00J6j2k3l9O8K47k32o7R7n8k95
6352b85%R5J78J07k5R2m5k20K47j96J62k09J01j9Q3j06L44l38K26r2K69l63J53
6375A59k55L7J85j26L2Q1Mj62K6KP1j59L08j1k94L2K83k79L91k52j23K16L8Q1
6399B85k74J80j52q6J67l26K17j75P0q5L97q9j19J57r6o8j43L88j81j70K62j1
6421A48l4l76K1J63J96j43P8j59j1j4P1j53QK45J11J07m02K99k18M9m8J71n8K7
6445G8j29k0K5K36N5k89K44j29j14k4J17j12N5j74R5qL36m26J92qj92L79j01o2
6469B4n4N8J33j67Q7m5r8j78P6M20m36K8L21k03J12o4l34N22J81k93j58Q0p7J37
6493G2q5K1O4n2q7K25k71R4K42k38m0j57K70j95J08p0j05J09J00J40k80P6l7J85
$$ plain form
6328 179 43 101 118 -76 -39 39 -140 -38 107 -133 -92 213 13 29 17 -6 -45 23 270 38 -29 68 10 -285
6352 -285 -285 -190 -12 95 70 162 117 -103 144 -52 110 -99 2 -17 66 -40 304 -34 192 100 369 6 159
6375 159 -96 -59 126 0 32 113 117 -45 -19 -17 54 -105 203 192 -102 -70 213 -66 325 73 -50 166 204 285
6399 285 11 191 39 -47 120 -206 11 -164 -94 -179 218 129 10 167 71 3 -140 248 67 -103 159 148
6421 148 114 -262 -241 -78 118 -25 53 -106 -117 -131 -60 -213 -205 40 151 258 -144 155 -63 -14 -62 109 51 78
6445 78 -51 -71 -46 190 245 -44 200 71 -43 -67 50 -62 -7 -181 -86 -94 242 -184 8 0 -192 187 86 24
6469 24 -30 28 161 -6 81 36 -62 -240 -164 256 -180 -152 169 -34 78 14 -320 202 383 90 -68 12 -65 72
6493 72 -13 8 72 20 -67 158 -113 -19 223 -15 -55 -212 58 -137 -29 -99 -204 -95 5 145 -135 -59 -96 89
6517H9o4K5j84p9J96j49k26M99j38N2%r5J90J83k30K8j09M9K8K07l02q7L64m4
6541B03j58m5J34k32J34O7mo7Q5oj77K17m33P3K37L8j35P3l04J37M0J16K3j28
6565a12J27j56L9L08j26j61J73r3n2m8J93j37k5j96J11J27R6ml7Q4k37J0J55j10
6589g1j54L5o7L60j78M2J0Lj27L6P7l54M06J22l3Jk37M9K19m6j61k45M04j07j80
6614a96K79J52j53k47M3j73M50j22J9j79j60L92j34o3PM05m27K6J7m2K75j17J89
6637B41l31J01L9l7lO0r0J48q2J61m6k84J8L7p8P4K67j00K52k57J61l23j36L55
6661A47k95J16l0qj23K74m0l06K51l32J75K54l00K96j3k82J56K84j50j18J5K01
6683A72P1k45J72k49J38j39L9N9l9J17j5o5o7j9j20K38j57K64n7Q8j36j4j0J92
$$ plain form
6517 89 25 50 -134 -213 -17 -166 -392 107 -31 21 21 -74 116 299 69 97 -12 37 65 272 -30 -117 247 203
6541 203 45 0 134 -98 36 103 99 32 117 111 -66 151 -282 -209 28 66 -69 4 -300 -163 -123 -7 16 -112
6565 -112 15 -141 -102 206 80 -81 92 -1 -53 -101 92 -45 -70 -266 -155 -28 68 64 27 111 -126 -116 39 -71
6589 -71 -225 -190 -257 103 -75 -33 -23 -20 -147 -111 -34 -388 18 140 107 108 -129 -80 139 93 -68 -313 91 -16 -196
6614 -196 83 235 82 -165 -122 -295 155 33 52 -127 -287 105 -29 -92 -85 320 -107 -81 -64 -106 169 52 241
6637 241 -90 11 50 13 10 70 -20 128 46 207 161 -123 -105 -68 -146 -72 195 95 347 90 251 -72 -208 147
6661 147 -148 -32 -62 -70 -193 81 41 -265 -14 -346 -171 83 -217 79 66 -216 -60 224 74 -44 -29 172
6683 172 243 -2 170 -79 59 -80 -41 18 -21 96 81 16 -51 -70 -190 48 -109 155 98 186 50 36 26 218
6707B18m58L6J66K36o3L3l02K63k64L30q1L0j1q4R2j53R7J04j84J48N7j09N9m
6731A56j93L16k04P2J6k40n1K59K4o0m4k6Lj68J43M3O7r8J03k28J91j30P0Q0r8
6756COM3J34k13J54p4m22K73K46l89K58o6m1m4J72j92P6L30q9j59j81J33Q4k4
6780A8q5O3l7J94j61L2k06J59j42J38M3J16k05K47j25J19l1j10J47j35J80J89
6802D08j2l50o9k7j61L47O8k15K44j87O1r3RM7j32J64j60p4J91j54l4J60K35j16
6826A50M0l57J64p3MP6j42J34L3P4j21K20l9k57j02M5r3L37q5l82N24j50r2J43
6850E1M8k37L42k1p2l09p9J59N8jk00L22K32n27J32j7J16N8j35M8J98j83m9J32
6874F6j40M8P1L8k43K26k92L28q2R8j71l98M86k01J21Q5r2K37k99m6K79J38k15
$$ plain form
6707 218 -240 -204 -38 198 135 168 -134 129 -135 195 114 144 133 49 141 -12 85 189 5 153 210 101 160 156
6731 156 -37 279 75 147 163 -77 -128 131 155 95 51 25 28 -140 3 46 113 15 118 -110 81 -49 21 101 3
6756 3 9 52 186 -27 127 53 -369 -96 150 -239 19 -47 -88 -132 40 -152 -76 254 165 6 -175 -42 42 18
6780 18 -67 -4 -41 153 -8 24 -182 -23 -165 -27 16 132 -73 174 49 168 137 27 174 39 219 408
6802 408 396 46 -23 -50 -211 136 204 -11 233 46 107 14 23 70 -62 102 -58 -132 59 -95 -129 31 266 150
6826 150 190 -167 -3 -76 -72 4 -138 -4 29 103 -18 202 163 -94 -196 -151 -244 93 8 -374 150 0 -92 51
6850 51 99 -138 204 183 111 -198 -277 -118 -60 -61 -261 61 293 -234 -102 -119 -3 55 -80 -32 166 -17 -66 66
6874 66 -74 -26 45 83 -160 66 -226 102 20 118 -53 -451 35 -166 -45 40 -52 185 -114 -160 119 257 42
6897D2k63L35n9Rj06Lj16RL03K2k05l28K11K50j44j1MK3L69k69J14m06J29M6p2
6922a10K59j99J86j39K00k38J19q0j04l7k0K20j9J28n5j07KK03j60l19l0J68R8
6945c4J39k47k30L20j97QK37j45J53j75l8J78J61j51P5j1j5n9m9J21q9J83q8k40
6969a93J17P2r4nJ93n2M8K20k58l01J27L00l04J40j53K77k74J7J47k85K56M6o4
6992b3J62l7J10j21J81k7k48J15j9l15J73j66K89K22l31QJ27m5l97M93j90J71
7014A32j21J41n9j12j86L37m2l6O9L04l15n02M91l53J89J10l92L47J62L0j92o6
7036f4M9q7O0N0J90k92j07O3L8j77K92K5R1k27K53k26J26j59K38j20j44L19k48
7059e7k5J94k07K74k91K85o8k67J11k7j79J77J2lP8J0Kn4j5M1m5K12k52p9J29
$$ plain form
6897 42 -221 114 55 64 -42 -39 -155 -146 157 179 -26 -354 -143 107 -37 -48 -44 -21 348 79 193 -213 -84 -38 -110
6922 -110 149 -50 136 -3 197 -41 78 -2 -106 -143 -163 57 38 166 111 4 6 209 49 -270 -300 -132 -34
6945 -34 105 -142 -372 -52 -249 -241 -4 -149 4 -171 -209 -31 130 -21 54 43 28 -31 -80 41 -48 135 47 -193
6969 -193 -76 -4 -98 -103 90 38 86 306 48 -253 -126 174 -130 10 -143 134 -140 -123 24 -261 -5 41 -23
6992 -23 139 102 212 91 272 245 -3 112 93 -222 -49 -215 74 296 -35 -27 100 55 -342 151 -39 132
7014 132 11 152 93 -19 -205 132 90 54 123 427 112 -390 101 -252 -63 47 -345 2 164 194 2 -64
7036 -64 -15 -102 -42 8 198 -94 -201 -138 -100 -277 15 40 131 -96 157 -69 57 -102 136 16 -128 191 -57
7059 -57 -82 112 -95 179 -112 173 105 -162 -51 -78 -257 -80 -68 -71 7 17 19 -35 -50 -9 -54 158 -94 -173 -44
7084d4N4J55l21K97o4J0M3l7j14mJ61m8k93J40q7J32m2J60k28rJ53q2J48k11Q6
7109d5P6J01p9j55n4J08L37m02J46j31J92j51NK03k25K43k49P2o7J53j50j13J01
7132h4qj06o9J45J39m3J54k53J10JJ73l31M20j75j12P0j26K8K92k07J24l67K92
7155F7k25K08R4j38J86k48m6J66j90j31J90j00j4J08NM3K61k70O7o2R4n2j91J13
7179f5M6m9r7L0q0M42l95R0K27k90j76K19M2K41rk77j12J75n6N4j22K38k41Q0
7203h5Q6j46J88n7p0L4L59j52J69l97o4M5J95k02J4j0J15M2m9K88m83K88k59M2
7227a09J0M3l8M19l09J30l02J21L74l89j30J98K13m45L2L7NJ05J04n2m0j71J87
7250gj44J16j37K64k5j05j02K40L0K5k25J66j8k66j18L69k5l3rj50K03o9K9M8
$$ plain form
7084 -44 10 165 -156 141 77 87 130 93 -21 -25 136 88 -205 -65 -152 -20 -62 98 -130 -139 14 -68 80 -131 -45
7109 -45 31 132 53 -102 -156 -48 289 -113 33 -98 94 -57 -52 151 -74 169 -80 -8 -75 78 -72 -185 -84
7132 -84 -92 -198 -267 -122 17 -26 128 -125 -15 -14 159 -172 248 73 -39 31 -95 -67 225 18 142 -225 67
7155 67 -158 50 144 6 192 -56 -102 64 -126 -257 -67 -167 -181 -73 -68 -25 236 -34 33 -29 65 13 -178 -65
7179 -65 -19 -68 -165 -135 -215 227 -168 -78 149 -141 -317 -98 -56 185 176 -101 -213 -38 -94 -40 -162 76 -165 -85
7203 -85 1 -145 43 -14 -84 -50 309 157 326 -71 -135 -90 105 -97 -83 -93 22 64 15 303 -180 108 -151 -109
7227 -109 -99 -56 -94 325 16 146 -156 -35 339 -50 -180 18 231 -214 -182 -145 -140 -35 69 17 -23 -194 -7
7250 -7 -151 -35 -172 92 67 -38 -140 100 130 155 -70 96 78 -188 -306 63 38 5 -4 -154 49 -20 9 57
7274E7P0l5Q8l01j0J1N1J6J10J45k13J03j23J54j63K22k18P9J52k9l52L9R0j49
7298b06J75J01m6j67M17k92J80j90R7j52m2m7K73m9R6j15jl00K94J23p0q5j31
7321a37J90J67M1l68j2L80k82J0J7j63K94k55J10o9M5J42j11R7Q5Qk60Qk0N3j26
7346a56J22M63k31l20k1J14n0J10j68L8R1j63L58p9M9j73q4j6J73j49j56K77J66
7369A95j83j33Q9k7Qm5R2j22K13j74K6j78M72l8rk07n8J44j32j91J25j0P1K32
7393A60j23j08qJ72k92M60j92l5j40K13k23L94j97j11K5K4J36j7j55L2O7J9L1
7416A32k19J18J3MM2r0j4J21q1K97m42l8k6J03J03O4j13l0J31k1j09L79m52J91
7440F3j64J68N9j36J5m9j91J26J11L3k90J34J75r6K26l72J70k01J37j48J75K34
$$ plain form
7274 57 127 92 180 -121 -131 -120 -69 -53 57 202 -11 92 -31 123 -40 182 -36 43 195 166 -186 -147 -57 -206
7298 -206 -31 70 24 -143 274 -18 162 -28 69 -83 -125 -172 101 52 148 33 32 -268 26 149 79 -6 -137
7321 -137 53 220 261 -107 -119 261 -21 -11 6 -157 137 -118 -8 -77 -32 110 -1 96 181 189 -71 -63 -83 -30 -156
7346 -156 -34 429 198 -122 -143 -29 -79 31 -137 -99 -8 -171 187 108 157 -16 -100 -116 57 -92 -248 29 195
7369 195 12 -121 -32 -59 -51 -96 -4 -126 87 -87 -61 -239 233 195 186 -21 -79 65 -67 -258 -133 -143 -72 160
7393 160 37 -71 -79 93 -199 261 69 34 -106 107 -116 278 81 -30 -5 19 155 138 -17 15 82 101 132
7416 132 -87 31 44 48 90 0 -14 107 26 323 -119 -157 -183 -80 23 87 -26 -56 75 54 -55 324 -128 63
7440 63 -101 67 126 -10 5 -44 -235 -109 2 35 -255 -121 54 -42 184 -188 -18 -219 -82 -230 -55 179
7462A79O7j78J22r5P4o5o8j62J19k1N2m7p6J31mj0k34L96pj49N0p6j59o2M39m12
7488a96J00K25M4j84ONM6j51K50l13K17j11p8K78r0l98L96j52R2l13J76L04k99
7511a46J56Q3p6N2j46K4j20K26o6l1j2M6j5J00k5j14J40j18J19k9j14J42j13J86
7535A49j39q9n9M8J43j00j9J51j3J9q9K25k21K5j54Q5J30k27R5r8J37K40k05j08
7559g4J59k08q0J80j4p5n0J37j06K71q4J18r1M5k35J7N0R3k3j65J84j13M6j80
7583a98J31j24O2K47k28j7P1pL4j7j4P0j80K67k50M08j65rK8r0K69m1m21L36l3
7608A29J4j48p5J65k66Q1R5n8J59M0k36j91K42J43Q9k09l2Q9J07M8k98j4K9J33
7632C6O1j73J02j1L4M3l48M6J25q8l0K78K69n10R1M8q4O6j75PL75O2l23j11J54
$$ plain form
7462 179 246 68 190 95 169 104 36 -126 -7 -28 24 -23 -99 32 28 18 -216 180 173 24 74 -2 -161 -223 216 -196
7488 -196 -96 129 173 -11 -5 0 46 -105 145 -168 49 -62 -140 138 48 -350 46 -106 -14 -327 -151 153 -146
7511 -146 10 93 17 69 -77 -53 -173 53 -13 -44 -56 -10 -25 75 50 -64 76 -42 77 48 -66 76 -37 149
7535 149 10 -79 -138 -90 53 -47 -66 85 72 91 2 227 6 31 -123 -38 92 -135 -40 -138 -1 239 34 -74
7559 -74 85 -123 -203 -23 -37 -112 -162 -25 -131 140 56 174 83 128 -107 -90 -40 53 30 -135 49 -64 -18 -198
7583 -198 -67 -191 -129 118 -110 -127 -56 -63 -29 -46 -60 10 -170 97 -153 255 90 81 109 19 288 247 -174 162 129
7608 129 143 -5 -80 85 -181 -100 -5 -63 96 136 -100 -291 -49 94 183 -26 -58 31 138 186 -112 -126 -97 36
7632 36 97 -76 26 15 49 92 -256 -210 -85 -173 -203 75 344 -166 -75 -27 -111 -45 -220 -213 162 224 -99 -210 -56
7657e6m8q1L52p3j82m1K84J5k68J44k62N54m90J25q3P7L26l39j67L58j05j77J12
7680b5k3K54j05j82Q6m7R0o1k38L37J30j70J60j77j78J84o0K78k26R6k19J14p
7703A1j90K31k2J09J31k50j5k14K24l8K7J6J53j60q7M3j75N1J20j50K65j17L22
7726B85k11j44L51k94r2J1J49k74N9J01K12k39Q5J39k54K84j60r8n5K20k8K4k22
7749a51K50k44n5L04J82l04L7p5J24Jk8n6j3N1n3J78k60K77R4p9r1p4n9P7n6K27
7775B04k12L5J34j84J21R9j50r4k3n9J35j13J18%M2m5K0J17j41K09k50j15Q0J47
7799G5K7l25J49j5J00o3N9j19K04L4j72k45L89j72j32M13j80j16J83l51K77j97
7821a77j02J12PK83K8q1m9j30Q0NJ30j98K30k34R2K17m69K15J04K45k11j37l2
$$ plain form
7657 -56 -104 -185 167 94 -88 -129 155 170 -98 46 -216 338 -152 -27 -110 -33 293 -46 -213 145 40 -137 -25
7680 -25 -48 206 101 -81 5 -42 48 -13 -251 86 216 46 206 29 -149 35 -25 253 27 123 -96 18 11
7703 11 -179 52 30 139 270 20 5 -209 15 -23 4 20 173 13 -74 -31 -206 -155 -35 -185 80 -37 285
7726 285 74 -70 281 -13 -105 -94 55 -219 -160 -59 153 -86 -1 138 -116 168 8 -90 -145 75 47 71 -151
7749 -151 99 -145 -200 104 286 -18 19 -56 68 69 41 -15 -28 23 -30 148 -112 165 259 180 89 15 -44 33 -23 204
7775 204 -8 27 161 -23 98 197 47 -47 -70 -129 6 -107 11 11 53 8 28 145 4 213 -37 -152 -72 75
7799 75 102 -223 -74 -89 11 -52 7 -112 92 126 -46 -291 98 -74 -206 207 27 -89 94 -257 20 -177
7821 -177 -279 -167 -160 123 151 70 21 -109 -29 -24 106 -92 138 -96 -4 213 -256 -41 63 308 97 -40 -72
7844g2M7j5J47m7m7J2o4R6L0k70L19j6j98p8j9L19j04k51K75p3o6J74p4L7Kj07
7870d3j63J80K71m88PJ84j7K02k88K08r9M33l42j11J53N7k67J09J21j94J34O7
7892A14Q4r7k7P4Km2l76J87JP2Q7n9K8j32J31n1Q1n0K0m0n7MK95k89M9n9J03k07
7920a54K38j11R1q5R2J43n3j01q7J30L8k82J70J21j78k69K55k6R1j29l4J8J84
7943F2j23q5J46K46k56pJ90q2j86K26j65J82k26J94j60o1J05%l2K64j88J47k35
7966d4L87k25j67Q3m06L65Q4j00J80k13J16n4j73K16J11j31N3j85o2N7J54m5R0
7989I1j14q2J76k4j49M02k27j00N3k64J49K80j65j66N3P0j4o1K91k80NK96k22
8012bJ58k72L55k10J27k62P6J72j35k93J93l5K79l17K98K3l02N4J02K0j02O3j01
$$ plain form
7844 -72 -25 -40 107 60 13 25 -39 57 87 -183 136 120 -78 -156 -175 144 40 -211 64 -9 -75 99 25 62 64 -43
7870 -43 -206 -26 245 -243 -236 -52 -69 133 -155 53 -46 387 45 -66 87 144 -123 -14 107 -87 47 114
7892 114 198 101 74 148 150 108 -268 -81 -80 -8 79 20 48 -84 47 -4 77 27 47 7 -50 -46 249 -40 9 -50 53 -154
7920 -154 84 -27 64 -21 71 214 161 60 -27 103 141 -141 29 150 -28 -297 -42 -68 23 -106 -140 -122 62
7943 62 -61 -146 0 246 -10 -17 173 91 -95 131 -34 148 -78 116 -44 -105 0 0 -32 232 44 191 -44
7966 -44 343 118 -49 34 -372 -7 77 -23 157 -56 60 6 -167 49 160 29 82 -103 -165 -108 46 1 91
7989 91 -23 -105 71 47 -102 300 73 -27 26 -238 -89 191 26 -140 -87 -17 -31 -92 199 -81 -76 220 -2
8012 -2 156 -116 239 29 156 -106 -30 142 7 -286 -93 -128 151 -166 132 155 -147 -93 9 29 -73 -10 -111
8035a11K10k31Rj31K38m0Q0J5m1J06k6j33Q2l5l8J29k94L3J10L97l50o0J16J24
8059A59pr6k41j09J83j59L94j17P9k65QL83Mk58J72l7l8J6m12J90L81m12N7k2
8083a47K92j18j71K39J12k07j80K85o7Ll7J06P3o8k52K99j03O3K62l82Qk7r8J16
8107Am0N6j1R4k07RR5p8j03K49k4lj50l03N70o4k47K87M7j28J43j46k21Q7J98
8132A11j34j37m7K18Q0r7j99M83m04K40k20J12j0Q8k51L07j05q9N3k47J73K53
8154A78j74j06N9J37J98j79j29l11K99j93J10K46l03M03l40j48M38j58K9k18K69
8175A07r9m9p7M6J98k56P5K60j93J99j68j04L01k11R8l45
$$ plain form
8035 -111 99 -132 -123 -254 -16 -56 24 39 -2 104 78 -55 27 -8 -46 83 -211 -178 -68 329 -21 -81 35 159
8059 159 152 56 -185 -294 -111 -270 124 7 86 -179 -171 212 216 -42 130 93 55 71 -341 -151 230 -182 -125 -147
8083 -147 145 27 -144 95 207 0 -180 105 38 41 4 110 183 115 -137 162 59 122 384 2 10 -17 -115 1
8107 1 -39 17 6 100 -107 -98 -3 -81 -184 65 41 38 -112 -415 155 91 -156 131 178 50 193 47 -174 -87 111
8132 111 -23 -160 -207 11 91 -6 -205 278 -126 114 -106 6 -4 84 -167 140 35 -54 -1 -248 -75 178
8154 178 4 -102 -43 94 292 113 -16 -327 -28 -221 -111 135 -168 235 -105 -253 185 27 56 -162 107
8175 107 8 -41 -118 -72 126 -130 -55 205 12 211 43 -61 240 29 127 -218
8191b18
$$ Imaginary data points
##PAGE= N=2
##DATA TABLE= (X++(I..I)), XYDATA
0@%%%%%%%%%%%%%%%%%pJ5j6J6j6J6j7K5l2L2l9M7m9N7o8P6q7R7j07J22j38J54
39H1j71J90k12K36k61K88l18L53l89M27m70N17n71O29o94P68q50R44j051J176
59F22j323J499j718J993k351K843l556M687o762J1744m4243m1067R9291j9734
73A925m7751P6711L9454r2666j1211M9703l8570k434J03589p902r1413K0044L0888
86C0367n9719K2950Q6247l1670n1981M6801j0765p5099M1915P2651m0736j2767
98A8194M9375m8382o4640O0762M0183m4505K2427M3513o7906m2831N9077J189
110B6456l7656N5809K7751p6350j6145M3571l2299j7872P1272N943o8127R987
122g660K2576n3899K867P1074j4619m3560L1217l984o0253K2229N6134k6664j4661
$$ plain form
0 0 0 0 0 0 0 0 0 0 0 0 0 0 0 0 0 0 0 -7 8 -8 8 -8 8 -9 16 -16 16 -23 24 -25 32 -36 40 -47 50 -57 65 -73 81
39 81 -90 100 -112 124 -137 151 -167 186 -203 224 -246 271 -300 329 -365 403 -447 497 -554 622
59 622 -701 798 -920 1073 -1278 1565 -1991 2696 -4066 7678 -36565 -77632 21659 1925
73 1925 -45826 30885 70339 -22327 -33538 16165 -22405 -24839 78750 70848 -20565 -521 30367
86 30367 -29352 -6402 79845 48175 -3806 42995 32230 -42869 -954 71697 30961 18194
98 18194 67569 19187 -45453 15309 55492 10987 33414 76927 9021 -33810 25267 26456
110 26456 -11200 44609 72360 -3990 -20135 23436 -8863 -26735 44537 50480 -17647 -7660
122 -7660 14916 -38983 -36116 34958 20339 -23221 7996 4012 -56241 -34012 22122 -4542 -19203
135a9203M1186k6594n4378L6381L1967l2804J4423L9354m2159l7046L8049N171
147e653k9540L5764K9178m7789j5922L2579j9648j8261M7724J2918m1142M998
159a4794J9944l4330m721M8432j644k8221K2115M114m0532R862L8666j3577j0663
172e349K9503j0223l7058J8548K3410k1171O418K9574k2151k6304K2201N004k1149
185h747J8866K2729k6558j2757K1232j0509j6505K6888J1920k4721K149J4472
197A8459k0392p464K6735J801j8322J2052O119k4214O12K1469p960q667J6358
210A6586l271k1724N981J2667j2895l07J6695j0030j6336J0885K769j3827P516
223e291J2562j2138q284J0838l881j1246J2327P397j2404Q16Q518r230n493J2046
$$ plain form
135 -19203 21983 -4611 -58989 -22608 9359 -23445 -9022 30332 -11827 -48873 -10824 -5653
147 -5653 -35193 571 29749 -18040 -33962 -1383 -21031 -39292 8432 21350 -19792 -14794
159 -14794 5150 -29180 -33901 14531 12887 -15334 6781 10895 -29637 -19775 18891 5314 -5349
172 -5349 24154 13931 -23127 -4579 18831 -2340 4078 33652 11501 -14803 7398 12402 -8747
185 -8747 10119 32848 6290 -6467 14765 4256 -12249 14639 26559 1838 3987 18459
197 18459 -1933 -9397 17338 19139 817 12869 18988 -5226 -4614 16855 8895 228 16586
210 16586 13315 -8409 -2428 10239 -2656 -2963 13732 3702 -12634 -1749 1020 -12807 -5291
223 -5291 7271 -4867 -13151 -2313 -6194 -17440 -5113 2284 -10120 -9304 -786 -10016 -15509 -3463
237c463J722q806N192N196j0900j318J0267l262n431Q497N01r606K949N644m724
252g542j029P828j865o662M899L010n653K759O439l683k334N064k09l958M057
267A121M052l805n2M446k642k602M546J36l153J860J622k983j124K359o77k622
283D82J820O29l176N53J359j608o83J552n82j423P40J057j509L49J740j202n09
300d11J638q01l68O78K44n12j86O52mj056P79k54n92O99j29o92K91P1L37K20K00
321H04L60J10K83R22l32N16J164k46M67R14M60J01L70L80N7m62J108l61o08O27
341F634k04j188J12m9n72q17J73j0j834L0N11j750n64J224j006j260O51Q4j438
360a273k19J780j272j675K065n97k595J800R61k939n3J759j866k198K235M64l311
$$ plain form
237 -3463 -1741 -10547 -5355 -159 -11059 -12377 -2110 -5372 -10803 -2306 -1805 -11411 -8462 -2818 -7542
252 -7542 -8571 -743 -2608 -9270 -4371 -1361 -7014 -4255 2184 -1499 -3833 1231 1022 -2936 1121
267 1121 5173 1368 1316 5762 3120 518 5064 5200 2047 3907 5529 2546 1422 3781 3104 482
283 482 2302 2931 -245 308 1667 59 -624 928 346 -1077 -337 720 -789 -440 1300 98 -411
300 -411 1227 426 58 736 980 468 282 934 930 -126 653 399 -193 506 377 -315 -24 47 384 604 804
321 804 1164 1274 1557 2479 2147 2663 3827 3581 4048 4962 5422 5523 5893 6273 6330 5868 6976 6615 6007 6634
341 6634 6430 5242 5354 5305 4733 3916 4089 4079 2245 2275 2786 1036 472 1696 690 -570 81 165 -1273
360 -1273 -1492 288 -984 -2659 -594 -1191 -3786 -1986 -1025 -3964 -4017 -2258 -4124 -6322 -4087 -3623 -6934
377f934J128K034m014j172L651j429k240K945J183m438O63M469k552j333N629
392b410m38n011L572K805m281J632O391k679l911N320L61o063M318N891n638j383
408a524O569l999n656P019L510o379K440N950p740m082R394j29o202P633L893
423A0697j0389k19Q628m426l393J0743M89j1313L914N943r740J119J2289m694
437I648q840O813l4j1376N230J1310q635m633R625o844j1658J0301O964j0574
451b703L033R571j2528r173J2416J528j0070J0442P131j7155l675J2167o589o141
465a1746J6263J818j7352K452Q034j3626q79J9480m386j4027R221O58j7222O036
479a5276J7803q603o642J3381o689j7760J2598J2546j1696L502J4687j3767j3522
$$ plain form
377 -6934 -5806 -3772 -7786 -8958 -5307 -6736 -8976 -6031 -4848 -9286 -8623 -4154 -6706 -8039 -2410
392 -2410 -2848 -7859 -4287 -1482 -5763 -4131 2260 -419 -4330 990 1351 -4712 -394 5497 -141 -1524
408 -1524 5045 1046 -4610 2409 5919 -460 1980 7930 190 -3892 5502 5373 -829 6804 10697
423 10697 308 89 8717 4291 898 11641 12130 817 4731 10674 934 2053 14342 9648
437 9648 808 7621 7587 -3789 1441 12751 4116 -517 9108 2264 -9394 907 7871 -2703
451 -2703 330 9901 -2627 -11800 616 2144 -7926 2516 9647 -7508 -11183 984 -5605 -11746
465 -11746 4517 6335 -11017 -8565 -531 -14157 -15036 4444 58 -13969 -4748 -4090 -21312 -15276
479 -15276 2527 -6076 -12718 663 -6026 -23786 -11188 1358 -10338 -6836 7851 -5916 -19438
492a9438J5278M108j1095J3418J2275j9049p485J5699o258q205K1232O571k0076
505c025J249J0754j5073k619K4869l1j6932J0155L264k1584N178K3288p584p921
519C988J6101o315k2824J1498J6386j2654L061J8350j5536j9605J6073M985j4356
532h48J3415J5638k1095j1849J5174p223j2578K1804R933k2594j201J0608j7747
545h563o228K5122K117j7816Q522L535k4160R10K4396o038r499J6450m576k6059
559b1887Q144J6932j1781J276K0038j2716k2180J3031N973j4684J2317J9115j9059
572e481j2760J4237n523j3596K0560J4273k0007k411J2913j6129q848K5348N465
585H041j6240Q950O629k2067k462K3680k745r333J7056o89k4415M519J6908r996
$$ plain form
492 -19438 -4160 -52 -11147 2271 14546 -4503 -11988 3711 -2547 -10752 10480 17051 -3025
505 -3025 -1776 8978 -6095 -8714 16155 16124 -808 9347 12611 -8973 -3795 19493 11909 3988
519 3988 20089 13774 -9050 2448 18834 6180 9241 27591 12055 -7550 8523 13508 -848
532 -848 12567 28205 7110 -4739 10435 3212 -9366 12438 22371 -223 -1424 9184 -8563
545 -8563 -14791 10331 12448 -5368 3154 6689 -17471 -16561 7835 1797 -7702 8748 4172 -21887
559 -21887 -13743 3189 -8592 -7316 12722 6 -22174 -9143 -3170 -17854 -5537 13578 -5481
572 -5481 -18241 -4004 -9527 -23123 -2563 11710 -8297 -10708 2205 -13924 -22772 2576 8041
585 8041 -8199 751 7380 -14687 -17149 6531 3786 -5547 11509 10820 -13595 -9076 7832 -2164
599b164J08K0198q372k0763R311P324j4243R332J9653j3559j3503J2282l714j4172
613a2282J6551J4885j5572l359J1136j2784j0942J9975P211j4012O803P090j9154
626d454n210J8658j552r176J3621J835k1352R60J3657q837k199J7467m401j8471
640i454O360N855j2165M957J6737q937j1563R297k232j2950J1153J2823j1454
653a573l217R948r289j0791J3748O923j0837M249P332j3795o116J3198k80p277
667g777R612L615j4885j337J0740n941l040J2894p10j2733M404N301r069K431
681f495J2644m228q242P454N2j0021O386J0180p001k436P814m874q303Q359N292
696F581o936K345O469q616n126Q811L82n972O358L762r000j258O486l085k933
$$ plain form
599 -2164 -2056 18142 9770 -10993 -1682 5642 -8601 731 20384 6825 -6678 5604 1890 -12282
613 -12282 4269 19154 3582 223 11359 -1425 -12367 7608 14819 807 7610 14700 -4454
626 -4454 -9664 8994 7442 -1734 11887 13722 -7630 -6670 6987 -1850 -4049 13418 9017 -9454
640 -9454 -3094 2761 -9404 -4447 12290 3353 -8210 1087 -1145 -14095 -2942 9881 -1573
653 -1573 -4790 5158 -4131 -14922 -1174 5749 -5088 -839 6493 -7302 -13418 -220 -500 -7777
667 -7777 1835 5450 -9435 -10772 -32 -5973 -9013 3881 3171 -9562 -5158 143 -8926 -6495
681 -6495 6149 1921 -6321 1133 1185 -8836 -2450 7730 729 -1707 6107 1233 -7070 1289 6581
696 6581 -355 1990 8459 -157 -5283 3528 3910 -2062 4296 8058 -942 -2200 4286 1201 -1732
711a732P785P08p758J959L704n618K91P486k003m918L615P44o184K216N689m016
727A968k177M658k640n201L672K720m199O43L709l848l822M807K16l613K815K702
743B410m116q69L587j792j918M066J155l692P17K529k660k72L661o33k505J855
759A523Q50l209R91K353j389j330K078m11k569J555J264j625j61K115j343j546
775h54J576N60j179N51J271j575n74J805q89j079J256K00j254j72Q98j030m43
792i32O96k45j724Q00J0j386J58L72m41p34L80L37j511M31J120j107J42P19l94
811c309m25P37O1M9J56P27n7j02N55N1l72M82L76n94K99L50J83k13M75Q3j04P3
833e19M99l09J99P57n19K41O51M44m51O63L96n5p2Q16m0j80R53j91m15K71N11
$$ plain form
711 -1732 6053 6761 -997 962 4666 -952 -661 6825 4822 -96 3519 4263 -1921 295 5984 1968
727 1968 -209 4449 1809 -3392 280 3000 -1199 -556 3153 -695 -4517 290 506 -3107 -292 2410
743 2410 -1706 -2575 1012 -780 -2698 1368 2523 -1169 -452 2077 -583 -855 2806 2173 -332 1523
759 1523 2373 -836 155 2508 1119 -211 1867 1456 -1113 442 1706 81 -80 2035 692 -854
775 -854 722 1282 103 654 1925 350 -224 1581 692 -387 869 1069 -185 -357 541 -489 -932
792 -932 -236 -481 -2205 -1405 -1395 -2781 -2623 -2251 -2692 -3426 -3046 -2709 -4220 -3789 -2669 -3776 -3634 -2915 -3309
811 -3309 -3734 -2997 -2936 -2887 -2731 -2004 -2061 -2163 -1608 -1557 -1929 -1447 -1071 -1665 -1366 -1016 -833 -1046 -571 -488 -592 -519
833 -519 -20 -329 -130 627 108 349 1000 1444 993 1656 2052 1997 1925 2741 2701 2521 3474 3283 2868 3139 3650
854C650n58J7L50Rj083O57J23j107J76P94r26o91M47j84j071O55M29r26j47Q40
874A454n77j320J364o2q68N98M44r35o98J038n96j536J401P05k195N4J250j663
892b142j293K091l08k089J082R66k738j57K705j197j274K210j44l153J782K106
908a553j747j36K813j472k560K678J099k755J596L145k962j441L123k32k848L097
924a55K181l400k1L156k773j877M835Q13l776K163K172m158j19N199r30k474L812
941D648L38m912J825M336k799m59N002j940m787L110J853m020J818N275m456l692
957A140M230r56m667M537L715n779r91L958m079l860O414J539n814K415K713p061
973b546j308O988j472l812M751L14q229Q79N915l988j467O727k509p778L151L060
$$ plain form
854 3650 3092 3109 3459 3468 2385 3042 3165 2058 2234 3028 2102 1411 1858 1674 603 1258 1687 761 614 1454
874 1454 877 -443 921 859 -9 589 1033 98 -600 438 -158 -1694 -293 412 -1783 -1729 -479 -2142
892 -2142 -3435 -1344 -1652 -3741 -2659 -1693 -4431 -4588 -1883 -3080 -4354 -2144 -2288 -5441 -3659 -1553
908 -1553 -3300 -3436 -623 -2095 -4655 -1977 -878 -3633 -2037 1108 -1854 -3295 -172 -404 -3252 -155
924 -155 2026 -1374 -1395 1761 -1012 -2889 1946 2759 -1017 1146 3318 -840 -959 4240 3310 836 4648
941 4648 4986 74 1899 6235 3436 2977 7979 6039 1252 4362 6215 2195 4013 9288 4832 1140
957 1140 5370 4414 -253 4284 7999 2220 1229 5187 1108 -2752 3662 5201 -613 1802 4515 -2546
973 -2546 -3854 3134 1662 -2150 2601 2915 -5314 -4435 1480 -2508 -3975 2752 243 -7535 -4384 -1324
989a324n996K127P093m537o033N065o01o395N916O266o554j948N408m202n205
1004a0920Q311L972o585K310M519p466l085R046L41m834O254J993r656K07P357
1019A764l278j719Q979j254r403L031M319o224K186R613m101o723N349j14p734
1034e309O097Q298o039k819O427m992o837Q540N182o697J713N195q102n306Q963
1049D314J035n436O161K840j0739j414O992l257k686R021j06j0390J937M563p056
1064d221J102J0594l380p756M827K06q502M673Q956n118l671O393m297q448P460
1079a182N716o526J654N699q234n580P643J624n563O037L962j0405k302P477l351
1094c331k747R067J138r394J203M446o357O32R931j642o999M587M44q077L472
$$ plain form
989 -1324 -7320 -5193 1900 -2637 -8670 -3605 -4206 -10601 -4685 1581 -4973 -6921 -1513 -5715 -10920
1004 -10920 -2609 1363 -5222 -2912 1607 -5859 -8944 102 443 -4391 1863 3856 -5800 -5593 1764
1019 1764 -1514 -3233 5746 4492 -4911 -1880 2439 -3785 -1599 8014 3913 -2810 2539 2425 -5309
1034 -5309 788 9086 3047 228 6655 1663 -5174 3366 8548 1851 3564 8759 657 -4649 4314
1049 4314 5349 -87 6074 8914 -1825 -3239 3753 496 -2190 6831 6725 -3665 -1728 2835 -4221
1064 -4221 -3119 7475 4095 -3661 1166 1372 -7130 -2457 6499 1381 -2290 4103 -194 -8642 -1182
1079 -1182 4534 -1992 -338 5361 -2873 -8453 -810 814 -4749 1288 5250 -5155 -7457 20 -3331
1094 -3331 -6078 2989 4127 -5267 -4064 382 -5975 -5343 4588 2946 -4053 534 978 -7099 -3627
1109c627Q806l847l133N554l030q115N713N825n344J582N753o706n598O516J673
1124B022m734M995M528p731k981O174k333l120P998K102p797N84M169n410p06
1139b240Q532n15o178L761O73p208J806P343l051k971N000k371o817L564M883
1154D211m482L39N067m490n292M543J556m377L785M267n954k808M667j782l244
1169c994N534K811n843P4L005l999j330N882J03m173J926J457n228M95N159j905
1185b6k293L782j078n152K422L428k602j55M331k641m013L300J235k677K082L336
1201C279l240k047L312j318k204L499K023l762n7K396k341j930L921O1k872J657
1217C77J232l667k92L372q54j975K279O5l394J205K017j856J2K359j019k470J831
$$ plain form
1109 -3627 5179 1332 -1801 3753 723 -7392 -1679 4146 -1198 384 6137 -569 -6167 349 2022
1124 2022 -2712 2283 6811 -920 -3901 2273 -60 -3180 4818 6920 -877 -293 3876 -1534 -2240
1139 -2240 6292 5777 -401 3360 4033 -3175 -1369 5974 2923 -48 4952 2581 -4236 -672 4211
1154 4211 -271 68 5135 645 -4647 -104 1452 -2925 860 5127 -827 -3635 1032 -750 -3994
1169 -3994 1540 4351 -1492 -1418 1587 -2412 -3742 2140 2243 -1930 -4 1453 -3775 -3280 1879 -26
1185 -26 -2319 1463 385 -4767 -2345 1083 -1519 -1674 2657 16 -3997 -697 538 -2139 -57 3279
1201 3279 39 -2008 1304 -14 -2218 1281 3304 -458 -515 1881 -460 -2390 1531 1592 -1280 377
1217 377 1609 -2058 -2350 1022 168 -1807 472 537 -2857 -1652 365 -1491 -1479 880 -139 -2609 -778
1234g78P26j884Q95K001j464j458J909l89j821J474J023j616m18J527p77j548
1250b598K097L82j830J233P92j727J48J423j11q36J178N55j341O95J159q40j64
1267B15J725o59q00P27R45q46O5Q95l19q31J002k24p81M69M87q01o8N97k26p70
1287H02P09N00q62j72N77o48nL97J13l78J66K52m84k60L17j36l36M45j09p55j0
1308A23O53j022j02J68l33j37Q1m76l33K13N1m19j26K23j12Q3K52j92j95J59M74
1329i67n80j1M28K48l78J80K32n52M17K08j61k15K05n1r0K86J38l23p3M91l20
1350h88j96M72K42l52L82N44j73r5M50M8l30O32L97l44L09N05m3m34P62k9m96
1371A363M05K72p10L07M38k82o42O85J18o84K42N82q07n31J091k11q61Q58K07
$$ plain form
1234 -778 -52 -1936 -1041 960 -504 -1962 -53 -442 -2263 -789 234 -1382 -1800 -273 -1050 -2598
1250 -2598 -501 -119 -1949 -716 76 -1651 -1503 -80 -191 -1027 151 706 -635 60 1219 379 215
1267 215 1940 1281 481 1208 2153 1307 1372 2267 1948 1117 2119 1895 1114 1583 2070 1269 1201 1798 1572 802
1287 802 1511 2011 1149 977 1554 906 901 1298 1411 1033 1199 1451 967 707 1024 888 552 997 888 133 123
1308 123 776 -246 -348 -180 -513 -650 -569 -1045 -1378 -1165 -1114 -1533 -1659 -1436 -1548 -1465 -1213 -1405 -1600 -1441 -967
1329 -967 -1547 -1558 -1130 -882 -1260 -1080 -848 -1400 -983 -775 -936 -1151 -946 -997 -1087 -801 -663 -986 -1059 -568 -888
1350 -888 -1084 -612 -370 -722 -340 204 31 -64 386 434 104 736 1133 789 1098 1603 1560 1126 1888 1859 1363
1371 1363 1768 2040 1330 1637 2075 1793 1151 1836 1954 1270 1512 2094 1287 756 1847 1636 775 1633 1840
1390A840p88L8O27o43m49Q74%j059P43K2r65p4P11p64p01R72m23j228L73M57j216
1411a653k83J333p07j395R65n0j249M92J146j165m98J366o19j392J564N40j422
1428c027M50J577j833l85J740O6j136J187R48j985k15J922r47p74K378j54j954
1445b142O14J421j739K19K824n54k166J974L16k084J405K390j319p36J807n80
1461A650j869J616K197j947K40K086k085j854K478L72j785J665J293l117q32K466
1477B574j152j275L081J91l431N16J617k402n0L395m34k970J596N66l454J189
1493d43L540j958j679K499j430l131K446K125k490j06K456k586k716L105N39k243
1509b072J759K077l782j344K780j052j456L509J067l991L52K414l052n9M290m83
$$ plain form
1390 1840 1052 1090 1717 1074 625 1499 1499 440 1183 1205 240 166 877 113 -588 384 -39 -1267 -894 -437 -1653
1411 -1653 -1936 -603 -1310 -2705 -1740 -1790 -3039 -2547 -1401 -2566 -3064 -1698 -2317 -3709 -2145 -1605 -3027
1428 -3027 -2577 -1000 -2833 -3218 -1478 -1412 -2548 -1361 -413 -2398 -2613 -691 -1638 -2412 -34 -188 -2142
1445 -2142 -1528 -107 -1846 -1627 1197 643 -1523 451 767 -1317 88 2478 1159 423 2230 1650
1461 1650 -219 1397 3594 1647 1887 3973 1888 34 2512 2884 1099 2764 4057 940 108 2574
1477 2574 1422 147 3228 3419 -12 504 2121 -281 -331 3064 2630 -340 1256 1822 -1632 -443
1493 -443 3097 1139 -540 1959 529 -2602 -156 1969 -521 -627 1829 -757 -3473 -368 171 -2072
1509 -2072 -313 1764 -2018 -3362 -582 -1634 -3090 419 1486 -2505 -2153 261 -2791 -2850 1440 957
1525I57l343J966P76l611P51M479j311k223K892j062m060K422K968k660M7L527
1541B515k657l202L167J093k786K207L138l925j744L026q77j921L942J542l781
1556b63l67K522k765q31M897J41l495J660P95l710K45M327j030k180K741o39m769
1573b721J875L462k741L31L095k349l823K673J527k708J881L372l693j996K801
1588I86q47k077L420J933l529p01K109k411j792M542O97l612J422J433m441r3
1604b961M200j047k105K758j20m308Q45L178k113J25L113j319l318J836J388k273
1620b121J515L297k550k476K374m51k404L083K630l180q05K216k297j588L411
1635F54J210k705Q99J464l395q22L819m40j777K550m1l506L03K879j425l20K792
$$ plain form
1525 957 -2386 -420 356 -3255 -2504 1975 664 -1559 1333 271 -3789 -1367 1601 -1059 -1012 2515
1541 2515 -142 -3344 -177 916 -1870 337 3475 -450 -2194 832 -45 -1966 1976 3518 -263
1556 -263 -630 1892 -873 -1704 3193 3334 -161 1499 2294 -1416 -1171 3156 2126 -54 2687 2048 -2721
1573 -2721 -846 2616 -125 206 3301 952 -2871 -198 1329 -1379 502 3874 181 -1815 986
1588 986 139 -1938 1482 3415 -114 -815 1294 -1117 -2909 1633 2330 -1282 140 1573 -2868 -2961
1604 -2961 1239 192 -1913 845 725 -3583 -2738 440 -1673 -1548 1565 246 -3072 -1236 152 -2121
1620 -2121 -606 2691 141 -2335 39 -412 -2816 267 2897 -283 -1088 1128 -1169 -2757 654
1635 654 1864 -841 58 1522 -1873 -2695 1124 684 -1093 1457 1416 -2090 -1787 1092 -333 -653 2139
1652B139n79l308J337J371k027P45K962j923k002K181p11j991J756K351k238j023
1668i60J969j621j998K726O87j762N97J318k339q08K651k95j270J809M65k809
1684a640K18K222r80m31K021q0k531J113J032j592N30K150j009j978K010l22j601
1701h68J133J823j756k50J205j060j273J909O97j661Q71R46j545o85J807K06r99
1718E00Q52O83j954NJ400q62k80J635n17j603Q12K62j178J08J228o97j365J205
1736B34j01j441O12J304j195n4P47n41p94N46O73j296O31P72q69m86R69m6o06
1755i41M28N80j109l20J278n56o24P40k5j029O57L65n38l23O91j3n75P34k90l44
1775a214M17P35n15J37N00j10k76K59L60m10J81K12J71m49M21J27l68J95M75l28
$$ plain form
1652 2139 1560 -1748 -411 960 -1067 -322 2640 717 -1285 896 185 -1806 -50 2301 63 -960
1668 -960 1009 -612 -2610 116 803 -959 -362 956 -1383 -2191 460 165 -1105 704 1169 -1640
1684 -1640 -1422 800 -180 -611 1410 1330 -1201 -88 944 -648 -118 2032 1023 -955 1055 733 -868
1701 -868 265 2088 332 82 1287 227 -1046 863 1560 -101 770 1716 171 -514 1293 1499 500
1718 500 1352 2035 81 86 1486 624 344 1979 1462 -141 671 933 -245 -137 1091 394 -971 234
1736 234 133 -1308 -696 608 -587 -641 106 -435 -1229 -683 -10 -1306 -675 97 -772 -1258 -289 -335 -941
1755 -941 -513 67 -1042 -1362 -84 -640 -1264 -524 -549 -1578 -921 -556 -1094 -1417 -726 -739 -1314 -580 -870 -1214
1775 -1214 -797 -62 -577 -440 60 -50 -326 -67 293 -117 64 276 447 -2 419 546 178 373 848 520
1795E20l38N56q8m54L78M28o13J11L55l00j24N90k68n93N81M8m7j3K29k22K4L74
1817A134k62k33K00O0k65J9L23j03n44K54m4l44j38J75n85J90K21l01o1o1J8j34
1839d81j28kj17k04M78k37j89m1J28l4k14M44j82l17K2O3j82J03J27k40p2L92
1861h83l35k56M68n7m05M40J1j24J3K03o9J14L62k58j29L86N52m46M03K94J15
1882C99k87K27K62o9J1L02n6l55P71J7k58J50K39n39P4L91l57j37N00j46j15j32
1904H92L14k20m14R46r9p03O48J75o96K1P68k37l67K54m3r04L36N53p20k15O37
1925I26j007m76P85o1n13M00M62j106j54M75j82p82J093K1r00J02N89o25j58R64
1945a47Q4r43K77N67r45q4J073o24j85O03j17j101O40P40o19l15R69l83j020R53
$$ plain form
1795 520 182 738 650 196 574 1002 389 500 855 555 431 1021 753 160 741 789 742 729 958 736 760 1134
1817 1134 872 639 839 899 634 653 976 873 329 583 539 195 57 232 -353 -163 58 -243 -304 -365 -347 -481
1839 -481 -609 -611 -728 -932 -454 -691 -880 -921 -793 -827 -1041 -597 -779 -1096 -1074 -1011 -1193 -1090 -963 -1203 -1275 -883
1861 -883 -1218 -1474 -1006 -1063 -1468 -1028 -1017 -1141 -1128 -925 -994 -880 -518 -776 -905 -519 33 -413 -10 284 399
1882 399 112 339 601 532 543 845 789 434 1205 1222 964 1114 1353 814 888 1279 922 785 1285 1139 1024 892
1904 892 1206 986 572 1518 1419 716 1364 1539 843 864 1632 1395 1028 1282 1239 335 671 1224 504 289 926
1925 926 -81 -557 228 167 -346 54 516 -590 -744 -269 -451 -1233 -140 -119 -1019 -917 -328 -953 -1111 -147
1945 -147 -63 -1006 -729 -162 -1107 -1191 -118 -742 -927 -324 -441 -1542 -902 -162 -781 -1096 -127 -510 -1530 -577
1965e77M81r65Q10R53j502l17J174l33p10J225O11j153l4Q50q28j32J602j01j007
1984D7N07N45j281L7J262l73p11J152m74j646R06J310r80j01R84m89j646J129
2002A78L21r62R59J390j785n55J200n15p97J202J170j623l03J018j000o01K055
2019A352l00j188O51L01k108L11J577m34r37J509n96j796M94J541j200P0J549
2036G96n95j898R94R43j411Q25J368j223j185J193k66j251J681J157j625m57J398
2053D44j309o46J932J97j569Q31N96j831k81K018m14q83J690l19j845M52J467
2070E30p48j93J564m37j954P85J109j029O20J791j407j171J151l18j444J589J201
2087A639j418k46Q18j279q24J723Q23j601M37R00k075l22K327m81q81J379pk008
$$ plain form
1965 -577 -96 -1061 -251 702 -800 -1117 57 -276 -986 239 850 -303 -337 513 -315 -447 1155 1054 47
1984 47 554 1099 -182 -145 1117 744 33 1185 711 -935 -29 1281 301 200 1184 695 -951 178
2002 178 499 -463 496 1886 101 -454 746 231 -566 636 1806 183 -120 898 -102 -703 1352
2019 1352 1052 -136 515 816 -1292 -981 596 162 -775 734 138 -1658 -1164 377 -823 -753 796
2036 796 201 -1697 -703 240 -1171 -346 1022 -201 -1386 -193 -459 -1710 -29 1128 -497 -954 444
2053 444 -865 -1511 421 618 -951 -120 476 -1355 -1636 382 -32 -915 775 456 -1389 -937 530
2070 530 -218 -411 1153 716 -1238 -453 656 -373 247 2038 631 -540 611 293 -1151 438 1639
2087 1639 221 -25 793 -486 -1310 413 1236 -365 72 972 -1103 -1425 902 421 -460 919 912 -1096
2105a096K08J677r64n5J982p37j836P04O06j261O39J645j145r73Q51m09j336J581
2123H1J199j361m17R96p77j392K117L34j306O09J111j738n66J898l11n64J391
2140A304K28j990J78J095n64l55J582q4j696P47M12j116L16J536j033q94P89k50
2158B05j155Q32J429j285k45P94q07j154J536P02j398O85N98j218o58J315j85
2175ir09J097M64j385n07J130n64m16J251p1j426M73N88q62L6J388n98j017N55
2194g82K05q96O34J111r89j76J077l99j180R76O14p08K09O52p58l72R64o5n59
2213d42P33K86q76k20Q86l94l81P74R3o83J96N60p33K74N77Q3n71K20K99n38J46
2234B89N42l63j73O61k29m79L06L07n10K31M16m33n22N83J79o67K46L33m44j65
$$ plain form
2105 -1096 -888 789 -175 -230 1752 1015 -821 -117 489 -772 -133 1512 367 -606 245 -164 -1500 81
2123 81 1280 -81 -498 498 -279 -1671 446 780 -526 83 1194 -544 -1110 788 477 -87 1304
2140 1304 1532 -458 -280 815 251 -104 1478 1394 -302 445 857 -259 57 1593 560 -334 455 205
2158 205 -950 -118 1311 26 -219 575 -232 -1386 150 852 -546 139 737 -481 -1139 176 -9
2175 -9 -918 179 643 -742 -1249 -119 -683 -1099 152 81 -1345 -872 -284 -1146 -1110 278 -320 -1337 -782
2194 -782 -577 -1473 -839 272 -717 -893 184 -215 -1395 -419 195 -513 -304 348 -410 -782 182 117 -442
2213 -442 291 577 -299 -519 367 -27 -408 366 459 -224 -28 532 -201 73 650 733 162 382 681 143 289
2234 289 831 468 295 956 727 248 554 861 351 582 998 565 43 626 805 138 384 717 273 108
2254A08K03m8m65J77K56k14P9L13n89o0M55j19l50J40K87m71j75O78k89m23M85
2275b2k43m01K44K13m69%J23J4m16J34J56l34O43m74m5K5P4J62l60L92J72m37
2297h49J14L55l39K63K36J30o37O53j04j36J34N32l15j36N4j35K5N01K2k53RK24
2319C48j5j6O9J12j47J19M22q7Q0j76L41k80N70m41j95J37L26K6l01L45l36k24
2341F77K01N8k25K44k76j19k33J27j88q2K13k62K0M6N2k01k66Q2J58j55k93j53
2363e75K83MJ15j57k37K28j14k67R9K00k19J32k54L0M0Nm8J05j14J53l91J47J81
2386f54J37k41J10K29k01r1K99J58m47M13K3j75P2K36j37M8J93K75m22L35L4j56
2408C8J02M3M9m76N15o9j51O8K24j26p0Q4j05O1O0K51m03K91J89j92j79J75L8
$$ plain form
2254 108 311 263 -202 -25 231 17 96 409 -180 -240 215 96 -254 -114 173 -298 -473 205 -84 -507 -22
2275 -22 -265 -666 -422 -209 -678 -678 -555 -541 -957 -823 -667 -1001 -358 -832 -877 -852 -778 -616 -976 -584 -412 -849
2297 -849 -735 -380 -719 -456 -220 -90 -727 -74 -178 -314 -180 352 37 -99 -45 -180 -155 346 368 115 124 348
2319 348 333 317 386 498 351 470 892 805 885 709 1050 770 1340 899 704 841 1167 1193 892 1237 901 677
2341 677 878 936 711 955 679 560 327 454 266 184 397 135 155 201 253 52 -214 -132 26 -129 -422 -575
2363 -575 -292 -288 -173 -330 -567 -339 -453 -720 -621 -421 -640 -508 -762 -732 -692 -687 -735 -630 -744 -591 -982 -835 -654
2386 -654 -517 -758 -648 -419 -620 -711 -412 -254 -701 -288 -265 -440 -368 -132 -269 -221 -28 247 -175 160 194 38
2408 38 140 183 232 -244 271 202 51 119 343 217 147 231 126 187 247 498 95 386 575 383 204 379 417
2431D17k81L99K78k69l12L00m06j23P09m03k66J90m0l13J69K07k61j64K79m6m14
2452c50K1N66n68M27K46k88m79L04J14l64M74K92o39n1K35K4o01O63K95n36J1
2473b04L03n05m59N90M0j88K61J32p28L0O22J7n61N18N25j015L0Q55o37J63N05
2494B94J8j000O41K50o42M93P13m67m26O45l21o97P94L09o09N1M05q96r3Q72L96
2515G30r62N77J46o64k60P03M4l30Q94j15j027L5Q26l56j86P38o3q85M70Kn14
2536a97J68J031q07n82N05j8p50M83R08o63k58O19n86p40J023L75p89L79L24j093
2556f68j28J168l08m13P15M98j480K88O49n52k0P45l0p81K05L80p10L18R49o19
2576B06k79O9l4p31Q20N23m57k99Q59n83q66P58O07m87kN64r57j97Q14J2o17P55
$$ plain form
2431 417 136 535 813 544 232 532 126 3 712 309 43 233 193 -120 49 256 -5 -169 110 64 -350
2452 -350 -329 237 -331 96 342 54 -425 -121 -7 -371 103 395 -244 -295 -60 -36 -637 26 321 -215 -204
2473 -204 99 -406 -865 -275 -235 -423 -162 -30 -758 -728 -106 -89 -650 -132 393 -622 -592 263 -374 -211 294
2494 294 312 -688 -47 203 -439 54 767 300 -126 519 198 -499 295 604 -5 46 451 -445 -538 334 730
2515 730 -232 345 491 -173 -433 270 314 -16 878 763 -264 -229 597 241 55 793 730 -155 315 317 -197
2536 -197 -29 1002 195 -387 118 100 -650 -167 741 78 -180 439 -147 -887 136 511 -278 101 425 -668
2556 -668 -796 372 64 -349 366 864 -616 -328 321 -231 -251 494 464 -317 -112 268 -442 -124 825 206
2576 206 -73 -4 -38 -769 51 574 117 -182 677 94 -772 -14 593 106 104 668 -289 -486 328 340 -277 478
2598D78K03r10l1N77n46j25R97q9j220K97L12o83K60M05m1n15L35n3q23M34J066
2619C28n28k95O65n77n89O63M09j98j65P40q49p47R97Q7o58R28Q2m56n47R84m85
2640b11n08J105j61p48K14K13k72R5P93k02n30L49J38n29J96R56k58n33N07k00
2660D14o61Q68K03n69K90L63n39m9J42L3n32N04O84r29l76L08j68l26R66j56n77
2681a07L35K43p89R1R06k76m99M09qp19M87M27q9n36P36m81l81L4N32o94J1O41
2703B73o47l92Q01j85l98M74l9m42k17L76j26l23P27J27n27J71L91m11k47N17
2723i7K02n94K89J4m86L45M83l91j84M80j26m11J86J98j07m8L11j12k33L80M9
2744A48l69K76L73k77n6J09R3k89M42K46m23J43K21k56K29o6Q2l35L42k20L2l10
$$ plain form
2598 478 681 -229 -260 317 -229 -354 643 554 -666 -369 -57 -740 -480 -75 -116 -631 -296 -349 -1172 -738 328
2619 328 -200 -495 170 -407 -996 -333 76 -122 -287 453 -396 -1143 -146 -59 -717 211 293 -163 -710 274 -211
2640 -211 -719 386 225 -523 -309 -96 -368 -273 520 318 -212 137 275 -254 -58 898 640 107 614 414
2660 414 -247 621 824 255 545 908 369 320 462 495 -37 467 1151 222 -154 154 -14 -340 626 470 -107
2681 -107 228 471 -318 -227 679 403 -96 313 305 -414 73 500 411 -125 611 130 -251 -217 315 -379 -368 273
2703 273 -374 -766 35 -150 -548 -74 -113 -555 -772 -396 -522 -845 -118 9 -518 -347 44 -367 -614 -97
2723 -97 105 -489 -200 -186 -672 -327 156 -235 -419 61 -65 -476 -290 -92 -199 -247 64 -48 -281 99 148
2744 148 -221 55 428 151 95 204 297 8 450 696 273 416 637 381 610 544 626 291 633 413 445 135
2766A35L97Q2m26K97k32J44k82L71l63K25j99J73k03KQ8p5J80j2j38m6k1K71n35
2789a67L09J01l42J25k9l6l31J31rj17J26p4j39J8lo3j17J97q5Q5j82m1J10k9
2813e62R7j62K45j86L66l52J91L3l3Q3Q7J97k70o2J21J39j65k4K81m64L60Q5J12
2836A17J74l91M2K8L6P6j03K32N5j17J43M9j04KL33K1j71J19L6k1QJ64l82k64
2860H2K72J03j57J2K5k39j8J61k43L08j79J35k61M1l8J51N9p9J06l59L31j69j63
2883a19M02k6j43k46K04J34%k38k03L27l04J12k14K79k91L73k0k85N6k1k58J97
2905b84K91n02L44j21j37K36M8kM7jQ0j96J28j09J34J10K40l14j04K76L6n06K02
2928a04R9j03O6m5J14k1K2K02n52L33K12l02K27K97n49J73k5n1N7k5RJ05J91J85
$$ plain form
2766 135 532 614 188 485 253 397 115 486 123 348 149 322 119 121 209 134 314 302 164 118 97 368 -167
2789 -167 142 243 -99 26 -3 -39 -370 -239 -248 -365 -239 -313 -452 -434 -437 -500 -617 -420 -505 -420 -602 -643 -533 -562
2813 -562 -465 -627 -382 -568 -202 -554 -363 -330 -363 -280 -193 4 -266 -328 -207 -68 -233 -257 24 -440 -80 5 117
2836 117 291 -100 -58 -30 6 82 -21 211 266 149 292 341 237 239 572 593 422 541 577 556 564 728 346 82
2860 82 354 457 300 312 337 98 80 241 -2 306 127 262 1 42 4 155 214 135 241 -118 213 44 -119
2883 -119 283 257 114 -132 72 206 206 -32 -235 92 -212 -100 -314 -35 -326 47 27 -258 -202 -223 -481 -284
2905 -284 7 -495 -151 -272 -409 -173 -125 -127 -80 -81 -1 -197 -69 -178 -44 66 306 -8 -112 164 200 -306 -104
2928 -104 -5 -108 -42 -87 27 6 28 230 -322 11 223 -79 148 445 -104 69 44 -7 50 25 34 139 330 515
2952E15k11l72L52N4j62l9J54k30L1k2K23j84J04j20q3J18O3k44j88K86K20j97
2974F8K0K08l28l8J02J21k50J18M27o92J1K87k30O8L78k31q5p0J54m02j50M53
2996f1J1k28K79j41p3M4L10j41k1K3q7k91L88J60n33M25L06m72j54M54j38j82
3018a22L25K97o08n1K57L9j11K02j97k36KL84m79%N69n1n21J78L03n92K66L00
3040A54k96L5J83r1m49L70K37l28O0K92k45l11M45R3j69m3L99l59m08L26p1j53
$$ plain form
2952 515 304 -68 284 338 176 137 291 61 92 70 293 109 213 93 10 128 191 -53 -241 45 265 68
2974 68 88 296 -32 -70 32 153 -97 21 448 -244 -233 54 -176 -108 270 39 -46 -116 38 -364 -514 -61
2996 -61 -50 -278 1 -140 -213 -169 141 0 -21 2 -85 -376 12 172 -361 64 370 -102 -256 198 60 -122
3018 -122 203 500 -108 -159 98 137 26 228 31 -205 -203 181 -298 -298 271 220 -301 -123 180 -412 -146 154
3040 154 -142 -107 76 -15 -464 -94 143 -185 -125 167 -78 -389 56 149 -20 -63 336 -23 -431 -105 -176 -329
$$ [...]
8191F9
##END NTUPLES=NMR FID
##END=
