##TITLE=1H_Ser NEA
 200.13MHz, DMSO,
 8 sc
 
 28.4.2025
##JCAMPDX= 6.0         $$ Bruker NMR JCAMP-DX V2.0
##DATA TYPE= NMR FID
##DATA CLASS= NTUPLES
##ORIGIN= UXNMR, Bruker Analytische Messtechnik GmbH
##OWNER= pz
$$ XWIN-NMR		Version 3.5
$$ Mon Apr 28 15:34:18 2025 Russian Standard Time (UT+4h)  she@DPX200
##.OBSERVE FREQUENCY= 200.1313
##.OBSERVE NUCLEUS= ^1H
##.DELAY= (6, 6)
##.ACQUISITION MODE= SIMULTANEOUS
##.ACQUISITION SCHEME= undefined
##.AVERAGES= 8
##.DIGITISER RES= 18
##SPECTROMETER/DATA SYSTEM= spect
##.PULSE SEQUENCE= zg30
##.SOLVENT NAME= DMSO
##.SHIFT REFERENCE= (INTERNAL, DMSO, 0, 14.3821)
##AUDIT TRAIL= $$ (NUMBER, WHEN, WHO, WHERE, WHAT)
$$ ##TITLE= Audit trail, XWIN-NMR		Version 3.5
$$ ##JCAMPDX= 5.01
$$ ##ORIGIN= Bruker BioSpin GmbH
$$ ##OWNER= she
$$ F:/spectra/data/she/nmr/H-C/1/audita.txt
$$ ##AUDIT TRAIL=  $$ (NUMBER, WHEN, WHO, WHERE, WHAT)
(   1,<2025-04-28 15:33:07.07 +0400>,<she>,<DPX200>,
      <created by zg, POWCHK disabled, PULCHK disabled
       configuration hash MD5:
       00 E9 B6 7A A2 85 ED C7 34 08 36 98 17 FE 4E 26
       data hash MD5: 16K
       7F 14 E9 56 70 E9 F0 BC 0D 13 C4 12 86 AF 4D 0C>)
$$ ##END=
$$ 
$$ hash MD5
$$ E3 65 14 B2 94 85 D5 48 51 CA 86 55 49 3F CE 41
##$RELAX= 
##$RELAX= 
##$RELAX= 
##$RELAX= 
##$RELAX= 
##$RELAX= 
$$ Bruker specific parameters
$$ --------------------------
##$DU= <F:/spectra>
##$EXPNO= 1
##$NAME= <H-C>
##$PROCNO= 1
##$TYPE= <nmr>
##$USER= <she>
##$AMP= (0..31)
100 100 100 100 100 100 100 100 100 100 100 100 100 100 100 100 100 100 
100 100 100 100 100 100 100 100 100 100 100 100 100 100 
##$AQSEQ= 0
##$AQ_mod= 1
##$AUNM= <au_zg>
##$AUTOPOS= <>
##$BF1= 200.13
##$BF2= 200.13
##$BF3= 200.13
##$BF4= 200.13
##$BF5= 200.13
##$BF6= 200.13
##$BF7= 200.13
##$BF8= 200.13
##$BYTORDA= 1
##$CFDGTYP= 0
##$CFRGTYP= 5
##$CHEMSTR= <none>
##$CNST= (0..31)
1 1 145 1 1 1 1 1 1 1 1 1 1 1 1 1 1 1 1 1 1 1 1 1 1 1 1 1 1 1 1 1 
##$CPDPRG= <>
##$CPDPRG1= <>
##$CPDPRG2= <>
##$CPDPRG3= <>
##$CPDPRG4= <mlev>
##$CPDPRG5= <mlev>
##$CPDPRG6= <mlev>
##$CPDPRG7= <mlev>
##$CPDPRG8= <mlev>
##$CPDPRGB= <>
##$CPDPRGT= <>
##$D= (0..31)
0 0.7 0 0 0 0 0 0 0 0 0 0.03 0 0 0 0 0 0 0 0 0 0 0 0 0 0 0 0 0 0 0 0 
##$DATE= 1745839986
##$DBL= (0..7)
120 120 120 120 120 120 120 120 
##$DBP= (0..7)
150 150 150 150 150 150 150 150 
##$DBP07= 0
##$DBPNAM0= <>
##$DBPNAM1= <>
##$DBPNAM2= <>
##$DBPNAM3= <>
##$DBPNAM4= <>
##$DBPNAM5= <>
##$DBPNAM6= <>
##$DBPNAM7= <>
##$DBPOAL= (0..7)
0.5 0.5 0.5 0.5 0.5 0.5 0.5 0.5 
##$DBPOFFS= (0..7)
0 0 0 0 0 0 0 0 
##$DE= 6
##$DECBNUC= <off>
##$DECIM= 32
##$DECNUC= <off>
##$DECSTAT= 4
##$DIGMOD= 1
##$DIGTYP= 9
##$DL= (0..7)
0 120 120 120 120 120 120 120 
##$DP= (0..7)
150 150 150 150 150 150 150 150 
##$DP07= 0
##$DPNAME0= <>
##$DPNAME1= <>
##$DPNAME2= <>
##$DPNAME3= <>
##$DPNAME4= <>
##$DPNAME5= <>
##$DPNAME6= <>
##$DPNAME7= <>
##$DPOAL= (0..7)
0.5 0.5 0.5 0.5 0.5 0.5 0.5 0.5 
##$DPOFFS= (0..7)
0 0 0 0 0 0 0 0 
##$DQDMODE= 0
##$DR= 18
##$DS= 0
##$DSLIST= <SSSSSSSSSSSSSSS>
$$ [...]
##$SUBNAM0= <"">
##$SUBNAM1= <"">
##$SUBNAM2= <"">
##$SUBNAM3= <"">
##$SUBNAM4= <"">
##$SUBNAM5= <"">
##$SUBNAM6= <"">
##$SUBNAM7= <"">
##$SUBNAM8= <"">
##$SUBNAM9= <"">
##$SW= 18.0517328524113
##$SWIBOX= (0..15)
0 0 2 0 0 0 0 0 0 0 0 0 0 0 0 0 
##$SW_h= 3612.71676300578
##$TD= 16384
##$TD0= 1
##$TE= 0
##$TE2= 300
##$TE3= 300
##$TEG= 300
##$TL= (0..7)
0 120 120 120 120 120 120 120 
##$TP= (0..7)
150 150 150 150 150 150 150 150 
##$TP07= 0
##$TPNAME0= <>
##$TPNAME1= <>
##$TPNAME2= <>
##$TPNAME3= <>
##$TPNAME4= <>
##$TPNAME5= <>
##$TPNAME6= <>
##$TPNAME7= <>
##$TPOAL= (0..7)
0.5 0.5 0.5 0.5 0.5 0.5 0.5 0.5 
##$TPOFFS= (0..7)
0 0 0 0 0 0 0 0 
##$TUNHIN= 0
##$TUNHOUT= 0
##$TUNXOUT= 0
##$USERA1= <user>
##$USERA2= <user>
##$USERA3= <user>
##$USERA4= <user>
##$USERA5= <user>
##$V9= 5
##$VALIST= <valist>
##$VCLIST= <CCCCCCCCCCCCCCC>
##$VD= 0
##$VDLIST= <DDDDDDDDDDDDDDD>
##$VPLIST= <PPPPPPPPPPPPPPP>
##$VTLIST= <TTTTTTTTTTTTTTT>
##$WBST= 1024
##$WBSW= 4
##$XGAIN= (0..3)
0 0 0 0 
##$XL= 0
##$YL= 0
##$YMAX_a= 35388
##$YMIN_a= -39165
##$ZGOPTNS= <>
##$ZL1= 120
##$ZL2= 120
##$ZL3= 120
##$ZL4= 120
##$ABSF1= 10
##$ABSF2= 0
##$ABSG= 5
##$ABSL= 3
##$ALPHA= 0
##$AQORDER= 0
##$ASSFAC= 0
##$ASSFACI= 0
##$ASSFACX= 0
##$ASSWID= 0
##$AUNMP= <proc_1d>
##$AZFE= 0.1
##$AZFW= 0.1
##$BCFW= 1
##$BC_mod= 2
##$BYTORDP= 1
##$COROFFS= 0
##$CY= -3
##$DATMOD= 1
##$DC= 2
##$DFILT= <>
##$DTYPP= 0
##$F1P= 0
##$F2P= 0
##$FCOR= 0.5
##$FTSIZE= 0
##$FT_mod= 4
##$GAMMA= 1
##$GB= 0.15
##$INTBC= 1
##$INTSCL= 1
##$ISEN= 128
##$LB= 0.25
##$LEV0= 0
##$LPBIN= 0
##$MAXI= 10000
##$MC2= 0
##$MEAN= 0
##$ME_mod= 0
##$MI= 1.114404
##$NCOEF= 0
##$NC_proc= 0
##$NLEV= 6
##$NOISF1= 3.799351
##$NOISF2= 2.8
##$NSP= 1
##$NTH_PI= 0
##$NZP= 0
##$OFFSET= 14.38212
##$PC= 1
##$PHC0= -1191.311
##$PHC1= 15.79221
##$PH_mod= 1
##$PKNL= yes
##$PPARMOD= 0
##$PSCAL= 0
##$PSIGN= 0
##$REVERSE= no
##$SF= 200.129724274929
##$SI= 16384
##$SIGF1= 3
##$SIGF2= 2
##$SINO= 400
##$SIOLD= 16384
##$SREGLST= <1H.CDCl3>
##$SSB= 0
##$STSI= 0
##$STSR= 0
##$SW_p= 3205.1282051282
##$SYMM= 0
##$S_DEV= 0
##$TDeff= 0
##$TDoff= 0
##$TI= <>
##$TILT= no
##$TM1= 0
##$TM2= 0
##$TOPLEV= 0
##$USERP1= <user>
##$USERP2= <user>
##$USERP3= <user>
##$USERP4= <user>
##$USERP5= <user>
##$WDW= 1
##$XDIM= 8192
##$YMAX_p= 0
##$YMIN_p= 0
$$ End of Bruker specific parameters
$$ ---------------------------------
##NTUPLES= NMR FID
##VAR_NAME=  TIME,          FID/REAL,        FID/IMAG
##SYMBOL=    X,             R,               I
##VAR_TYPE=  INDEPENDENT,   DEPENDENT,       DEPENDENT
##VAR_FORM=  AFFN,          ASDF,            ASDF
##VAR_DIM=   8192,          8192,            8192
##UNITS=     SECONDS,       ARBITRARY UNITS, ARBITRARY UNITS
##FACTOR=    0.0002768,     1,               1
##FIRST=     0,             0,               0
##LAST=      2.2672688,     0,               0
##MIN=       0,             -39165,          0
##MAX=       2.2672688,     35388,           0
$$ Real data points
##PAGE= N=1
##DATA TABLE= (X++(R..R)), XYDATA
0@%%%%%%%%%%%%%%%%%%%%%%%%%%KrJ5j6J6j6J6j6J6k2K9l0L1l5M2m6M6n3O1o6
$$ 0 0 0 0 0 0 0 0 0 0 0 0 0 0 0 0 0 0 0 0 0 0 0 0 0 0 0 2 -7 8 -8 8 -8 8 -8 8 -14 15 -15 16 -19 23 -23 23 -30 31 -35
46c5P4q1Q8r8J09j18J30j45J60j77J96k19K44k76L14l59M17m92N98p51R98j467
$$ -35 39 -42 46 -52 57 -61 69 -76 84 -93 103 -116 128 -148 166 -193 224 -268 330 -421 577 -890
68h90K652j1931k2309J9561L3859J2957k0626k6153m243J5666R418o236j4752
$$ -890 1762 -10169 -32478 -12917 20942 33899 13273 -12880 -17123 -1457 7961 1725 -13027
81a3027n009R946J7706J4167j238j9903j8276J439J5601P292j5077j8668Q156
$$ -13027 -18036 -8090 9616 23783 22545 2642 -15634 -14195 1406 8698 -6379 -25047 -16891
94a6891L1227K1052j1958k9816j2639J2502J1674n863j5425l008J6388J9660P044
$$ -16891 14336 35388 23430 -6386 -19025 -6523 5151 -712 -16137 -19145 -2757 16903 23947
107B3947o430j5059j3486l649N989P818j787q658K481K0183J8262n444k7022k0134
$$ 23947 17517 2458 -11028 -14677 -8688 -870 -2657 -11315 -8834 11349 29611 24167 -2855 -22989
121b2989O457J6142L297j1065m716J4064J9053L013j3429j5884p839J433M030
$$ -22989 -16532 -390 2907 -8158 -12874 1190 20243 23256 9827 -6057 -13896 -12463 -8433
134h433M834M277J039Q13O352O785k327j6142j7278L26J5874J1574l517p714M336
$$ -8433 -3599 678 1717 2530 8882 15667 13340 -2802 -20080 -19754 -3880 7694 4177 -3537 799
149G99J3289K647j3715j5716l673Q387P573J375J531L759J319j444l321k805m569
$$ 799 14088 16735 3020 -12696 -16369 -7982 -409 966 2497 6256 7575 6131 2810 5 -4564
164d564o718j346R567J1322K978p219n573M067L903o591j0544k309R339J0501
$$ -4564 -11282 -12628 -3061 8261 11239 4020 -1553 2514 6417 -174 -10718 -13027 -3688 6813
178F813m5m373J00K339j360o904m591L060L713O63O91L775L640k290p431l165
$$ 6813 6768 2395 2495 4834 3474 -3430 -8021 -4961 -1248 -585 106 3881 7521 5231 -2200 -5365
194e365K914J585k143j660M522P205J03o421l526J711K048l319m812L164Q321
$$ -5365 -2451 -866 -3009 -4669 -147 7058 7161 740 -2786 -1075 973 -2346 -7158 -3994 4327
209D327L013m165n005P76L739k213n665p42M818M871J60k535L37O17l160l124
$$ 4327 7340 3175 -1830 -1054 2685 472 -5193 -5935 -1117 3754 3914 1379 1716 2333 -827 -3951
225c951N22L334J053k989k8O026L768m368q587k249O375N052l404m700J288O934
$$ -3951 -3429 -95 958 -2031 -2059 3967 7735 3367 -5220 -7469 -1094 3958 554 -4146 -2858 4076
241D076L687m844o151j192J976J694L81M49J582l67j066J686J685k252o048l080
$$ 4076 7763 2919 -3232 -4424 -2448 -754 -373 76 1658 1291 225 1911 3596 1344 -4704 -7784
257g784N356P981m2o285l500M228O324k032q458l766M516O290J636l485j807J044
$$ -7784 -2428 5553 5511 -774 -4274 -46 6278 4246 -4212 -7978 -3462 2828 4464 979 -828 216
273B16O23l1o74j262j596j502L011N769J736n301n424R51O149J974o122n447K660
$$ 216 839 808 134 -1128 -2724 -4226 -1215 4554 6290 989 -4435 -3484 2665 4639 -1483 -6930 -4270
290d270P943L708m724o261L76L560J918j833k927J1J939J674J925J17k846l603
$$ -4270 3673 7381 2657 -3604 -3228 332 2250 417 -2510 -2499 -560 1114 3039 3156 310 -3293
306c293m39M060L695k598n334J00N517M775l065p351j758N175M473j484m605j191
$$ -3293 -3732 328 4023 1425 -3909 -3809 1708 6483 3418 -3933 -5691 -516 3957 2473 -2132 -3323
322c323L436K798m84k194k007l7P38J178K075o25k992j207K553L719m22n398k727
$$ -3323 113 2911 2427 233 -1774 -1811 -1073 105 2180 1555 -1437 -2644 -91 3628 3206 -2192 -4919
339d919L493N118L32n045l338K985M514k03l532k374J252L154J79r56j229m36
$$ -4919 -1426 3692 4024 -1021 -4359 -1374 3140 2937 -595 -2969 -1717 1437 1616 660 -569 -1005
355a005J86P08J571N59k658k000J608K984R17l029l710J618M769J059l258l517
$$ -1005 -819 -111 1460 2019 -639 -2639 -1031 1953 2870 -159 -3869 -2251 2518 3577 319 -3198
371c198R51M102J054k910k316J68K930J150q59j380m03k46O05R80M73j241j808
$$ -3198 -2247 1855 2909 -1 -2317 -2149 781 1931 1072 -308 -711 -957 -352 628 1101 -140 -1948
388a948K68L518J189k165l270o07L692K377k195l525J83L478K434k121l070m82
$$ -1948 -1680 1838 3027 862 -2408 -3015 677 3054 859 -2666 -2483 995 3429 1308 -1762 -2244
404b244J704J731m24j250k18j8R37J217K11j684j865m35K645K222j304k713j015
$$ -2244 -540 1191 767 -483 -701 -719 218 1435 1646 -38 -1903 -2338 307 2529 1225 -1488 -2503
421b503K698L033j357l964j156K327L034L3k868j132J416J667L65j404j535j93
$$ -2503 195 3228 1871 -2093 -3249 -922 2112 2145 -723 -1855 -439 1228 1593 189 -1346 -1539
437a539N30J658J460r95k016q77J543K228l23l235j427J903L283P54k899k478
$$ -1539 -1009 649 2109 1114 -902 -1779 -236 1992 1669 -1566 -2993 -1090 2193 2947 48 -2430
453b430J083K572N93j864k059L66K214J114q5j351j220q7J018J126J33j915r69
$$ -2430 -1347 1225 1818 -46 -2105 -1739 475 1589 1504 153 -1067 -1154 -136 990 1123 -792 -1761
470a761J184K143R86k172k740L77K699J324j438k457J00K436J516j092j915q92
$$ -1761 -577 1566 2552 380 -2360 -1983 716 2040 602 -1855 -1755 681 2197 1105 -810 -1702
486a702J099J116M48m69j276j41R80J008K92j336j804L04J753J379p83k176n18
$$ -1702 -603 513 961 492 -784 -925 55 1063 1355 19 -1785 -1481 272 1651 868 -1308 -1826
503a826K077J651p22k061r27J362J835j50j251r98J66J459J06l73q75m62M04J213
$$ -1826 251 1902 1180 -881 -1808 -446 1389 1239 -12 -1010 -844 615 721 348 -527 -989 -585 628
521F28N05o58j382o74J734J292n71j683o36J124J771k01j759r27N66J718M28j175
$$ 628 1133 475 -907 -1581 153 1445 874 -809 -1445 -321 1450 1249 -510 -1437 -871 847 1275 100
539A00j026J04Q65P80k39j233j79K65R61R66q13r70n53O53J412k49j438q92Q85
$$ 100 -926 -822 43 823 584 -649 -828 -563 398 1364 551 -419 -972 -319 1093 844 -594 -1486 -601
558f01J826M85j527j333J58J213Q33p76j261nJ061J048J0j304r46J88P18J000
$$ -601 1225 1710 183 -1150 -992 221 1054 278 -983 -988 73 1121 1131 -173 -1119 -931 -213 787
576G87l96r22l35P35J402L50j745j435m3J722R69m08j517Q2J236J003l66j621
$$ 787 391 -531 -866 -131 1271 1621 -124 -1559 -1602 120 1089 681 -836 -754 482 1485 1119 -502
594e02j338P03J351Q32j49j083m16R68P79l84j353j353O33J937J155o11j362p01
$$ -502 -1840 -1137 214 1046 897 -186 -602 366 1145 761 -592 -1945 -1312 625 1780 1169 -193 -894
612h94R25R50l62j600j144R31K076Q23m18j697l90O59M39oj288n07P91J914P67
$$ -894 31 981 619 -981 -2125 -1194 882 1705 1287 -410 -800 -141 298 292 -996 -1503 -712 1202 1969
631A969n04j706j210O90R94p0p65o60J023J621O84r67j871q52Q66P44j9j51n77
$$ 1969 1465 -241 -1451 -761 233 163 -602 -1262 -239 1382 2066 1099 -772 -1624 -758 -14 -33 -184 -761
650g61R18J321K94r57j725r89O10J370M23r6m45K30J025K66j155j592r15J026
$$ -761 157 1478 1772 815 -910 -1899 -1289 81 504 408 -37 193 1218 1484 329 -1263 -2178 -1152
668a152J471M39J7o11K96N40l71r96j080l72R24J532O09p3p31l97K0J97j010o61
$$ -1152 319 758 775 164 460 1000 629 -367 -1447 -1819 -895 637 1246 1173 442 45 65 262 -748 -1409
688a409jJ014J431M44k80p18p20l6p8m11n19K41J030J246L40m94q26r93j21R8
$$ -1409 -1410 -396 1035 1479 1199 481 -239 -275 -353 -764 -1283 -1042 -12 1234 1574 1080 254 -739 -860 -762
708g62j12K32N04N10J016k13n07q73r83j16M80J90N50M11M56O52m03q39q15o17
$$ -762 -874 -642 -138 372 1388 1175 668 -205 -1188 -1304 -824 -634 -84 327 783 1435 1032 193 -622 -1239
728a239j99Q67N00O27O60j64j84m97o67m19m79n4R01P22N62N44p01l65o41p20
$$ -1239 -1438 -571 -71 556 1216 1052 868 371 -296 -715 -1194 -1248 -347 375 937 1481 780 415 -226 -946
748i46l2k09M96O08P45P13M6p92q47o99k11L38O9M91N66N04N06k43q25j243m12
$$ -946 -978 -1187 -691 -83 662 1375 1421 629 -218 -917 -1128 -790 -721 -230 336 840 1346 1103 278 -965 -1377
769a377P2O99P05R8L45L38K44l67r32j148l22O90R73Q89j93r3K35k19j96r74j176
$$ -1377 -1305 -606 99 197 542 880 1124 757 -175 -1323 -1645 -955 18 907 714 621 856 637 441 -533 -1709
790a709K22R22J018O78n7p32n5j19k40n11o81m2J073J271N76m06j134l48n7M8
$$ -1709 -1487 -565 453 1131 1074 342 287 168 -72 -583 -1264 -1306 -233 1038 1614 1208 74 -274 -331 -283
810b83k43o34K67J184Q41N47j025j025m33p9M04Q0l71M93Q53P99N5q80j459k71
$$ -283 -526 -1160 -893 291 1132 1679 654 -371 -804 -883 -479 -399 -770 -277 576 1375 1430 550 -909 -1180
830a180K95N74K65j10R8O94N18N4r58j175l65M86P80M69k07k48N24M16l38p08
$$ -1180 -885 -311 -46 -156 -58 636 1154 1208 250 -925 -1290 -804 -24 445 238 -10 514 930 592 -116
850a16j119q4Q18R53J09n7l12J61K05k68o65q86J5R92Q75L22k90p81O1P3J31n97
$$ -116 -1235 -1319 -501 452 561 504 192 353 558 290 -375 -1261 -1246 -254 621 943 653 -128 -67 6 137 -460
872d60o52L93P72Q15J83n17o31k33J41O6k91m22J76J048O19R9o49q12k40J81K66
$$ -460 -1112 -719 53 868 1051 534 -97 -330 -189 -123 -414 -836 -660 388 1007 1106 457 -355 -595 -414 -148
893a48r2k92M11N92L29r2n31q00r3M58L2L39n0K2L45L60k63o67o70L0P02N5J81
$$ -148 -240 -532 -121 471 800 708 177 -623 -716 -258 -226 113 63 85 430 790 527 -140 -810 -780 -78 -23 158
916A58j84J06M78q0l75j86n84lM93K37L22rn39M28j11k62o8k54J2N25K31L4j36
$$ 158 -26 80 558 478 103 -83 -667 -670 -177 60 382 373 -166 262 151 -111 -179 -433 -421 104 335 369 233
939B33k30K65j08l11j39n0J87L62N9N3k92j45j10J53q6p1J00j30N10K70m32k6
$$ 233 3 268 160 -151 -290 -340 -153 209 268 321 29 -116 -226 -73 -159 -230 -130 -260 250 520 88 62
961F2k19K9J47k30j4K49R3J69r9k14R6r9j55J03JrO4K19j20j2L3r4K6j06K45j79
$$ 62 -157 -128 19 -211 -225 24 117 286 187 -27 69 -30 -185 -82 -81 -90 -26 193 73 61 94 0 26 -80 165 -14
987a4j01J83P7j28R7l28n8K98N1P1o7k15K69j4q3k7r0K62j57j5J38j21k04R2J47
$$ -14 -115 68 145 17 114 -214 -272 26 77 148 81 -134 135 121 38 11 -79 183 26 11 149 28 -176 -84 63
1012F3J1J17j89r9J34J25k88K8k27K20L97j36p2k1j59Q1M0j33o9p2p1M25Kr5J42
$$ 63 74 191 2 -97 37 162 -126 -98 -325 -105 292 156 84 63 -96 -15 25 -108 -177 -249 -320 105 107 12 154
1037A54r6J23j70j84Q0q2O6K80R8j72j13l28K73o8k30K35R3J20K42n9j64J73m76
$$ 154 58 181 11 -173 -93 -175 -109 171 269 97 -16 -344 -71 -139 -369 -134 -41 79 321 262 98 271 -205
1060b05J41k7j75J55K51l95N53J25n84J3j79O4K87J07r6J65J1J41j71m11L7K3
$$ -205 -64 -91 -266 -111 140 -255 298 423 -161 -148 -327 -263 24 131 35 200 211 352 181 -230 -193 -170
1082a70j40J89R4K08J21k11J64k35p2j26L3K5J16LJ04K12j18l10K7k82J34PM7
$$ -170 -310 -121 -27 181 302 91 255 20 -52 -178 -145 -120 -4 -1 103 315 197 -113 -86 -368 -234 -227 -180
1105a80L10J6J63j7j71k11j2m9R3j18N4K22J56K1j08j27l44J75k28Q9L66Q6j33
$$ -180 130 146 309 292 121 -90 -102 -151 -58 -176 -122 100 256 277 169 42 -302 -127 -355 -266 100 186 53
1128E3J64j53R4j63l52l5J28L50R5L1j81J33p0l9j78k56L20p2J92K59Rj24j79
$$ 53 217 64 158 -5 -357 -392 -264 86 181 212 31 164 94 55 -123 -379 -59 -131 61 320 329 205 26
1151B6l16J35p2q9J00L16J07l3J2l31O1j44j06J20r4L03M4J49P8k05k54Q5n4R0
$$ 26 -290 -155 -227 -316 -216 100 207 174 186 -145 -84 -228 -334 -214 -308 -5 39 188 266 61 -193 -108 -162 -72
1175g2pj29K36J83P1j15j45l26K08r8Q3K05o7J68j11J69n8l94j04J15J99MK51
$$ -72 -79 -208 28 211 282 167 22 -304 -96 -194 -111 94 27 195 84 253 195 -199 -303 -188 11 15 266
1198B66j54N8n0j8J03j02k69j34K76M0K03l8k15k8K58k79R8k86m2J34K71m6J75
$$ 266 112 170 120 102 205 103 -166 -300 -24 16 219 181 -34 -62 196 -83 15 -271 -313 -179 92 46 221
1221B21J08n03J62j38K42j34k0K67p1qk1j07k16J91O9k37J59PJ72n9k4j96l3J41
$$ 221 329 -174 -12 -150 92 -42 -62 205 134 126 105 -2 -218 -27 42 -195 -36 -29 143 84 60 -136 -169 -28
1245b8n5M4J93k44M5K68j4l77J28k57J76K01r3J46j44r7J76P0j34K9J9n5n0J82
$$ -28 -83 -39 154 -90 -45 223 209 -168 -40 -297 -121 80 -13 133 -11 -108 68 138 4 33 52 -3 -53 129
1269A29r6n3J45j61m0p7Q6K17r8qO8j35o3k1P7O3L3j98K32p0Q9J41m47J81m4R2
$$ 129 33 -20 125 -36 -76 -153 -67 150 52 44 112 -23 -86 -107 -30 33 66 -132 100 30 119 260 -187 -6 -50 42
1295D2N1k62R3J63jj33L8O5j48kQ4L65l42o0K42j31k08Q2n5J01o2L7J10J54l00
$$ 42 93 -169 -76 87 86 -47 -9 56 -92 -94 -10 355 13 -47 195 64 -144 -62 -117 -16 -78 -41 69 223 -77
1320g7J10j95J70K2j63K40K9Q8j14J8q2j08k4M0p1J22o6J60n8j21J10J3j04p5
$$ -77 33 -162 8 30 -133 107 136 224 110 128 46 -62 -86 -46 -117 5 -61 99 41 -80 30 43 -61 -136
1344a36NK4J08J90k9J08m1l77L7QJ50k11l8K84m7L14j97o4j12k72K34R2n3K5R1
$$ -136 -131 -107 1 191 162 270 229 -148 -111 -103 47 -164 -202 82 35 349 152 88 -24 -296 -62 30 -23 2 93
1369I3qp7J69j95j84o0K67k0J04J3NO6j36M2j91l5k63L35rL04kO8l33M3lk59K09
$$ 93 85 8 177 -18 -202 -262 5 -15 89 102 107 173 37 79 -112 -147 -410 -75 -84 220 218 286 -47 -4 -7 -266 -57
1396e7M7J47J10j74J60j49j02J5j03m8n7K06j09L20P7J0k00l13J7n8J24J09K20
$$ -57 -10 137 247 73 233 84 -18 -3 -106 -154 -211 -5 -114 206 283 293 93 -220 -203 -261 -137 -28 192
1419A92q2m1m4m6L6l06p0K74N9J42P1K8j4n9k96J25k07J9J91Q5J59L7J1n3K8m32
$$ 192 110 69 25 -21 15 -291 -361 -87 -28 114 185 213 199 140 -156 -31 -238 -219 -28 57 216 253 264 211 239 -193
1445a93R6j27O7K18Q4P6Lr6Pk86R5k1k5q2J87Q9L0J0k8k03o3p8j2L18j48K39k1
$$ -193 -97 -224 -157 61 145 221 224 128 135 -151 -56 -77 -102 -184 3 92 122 132 104 -99 -162 -240 -252 66 -82 157 136
1472A36j59L33l10j34m8K13o9J02J54j48J72P3l95p2j69J75n3J92J54J7m8m6j97
$$ 136 -23 310 0 -134 -182 31 -38 64 218 70 242 315 -80 -152 -321 -146 -199 -7 147 164 116 70 -127
1495a27K9k38Q0J40J76N4L07j47m41K57j39j49p9QJ37K04r4K04r9M2k83o2K85
$$ -127 -98 -336 -256 -116 60 114 421 274 -167 90 -49 -198 -277 -269 -132 72 -22 182 83 125 -158 -220 65
1518F5k31L6P2K78j70K00k81oKr1K4j04P5J58J80o9j09n2J1rk8q7P0jJ40J6j5
$$ 65 -166 -130 -58 220 50 250 -31 -37 -35 -126 -102 -206 -131 27 207 138 29 -23 -12 -21 -49 -136 -66 -67 73 89 74
1545G4L9j59j34kJ71P6j31L7J35J50j03j69p0j32r3J54J49J86j8K8l10K62rk21
$$ 74 113 -46 -180 -182 -11 65 -66 -29 106 256 153 -16 -86 -218 -311 -157 -8 178 160 188 -122 140 131 -90
1569i0m6J60q6J25J87j56J25k13J3j26l6P7J51l5pJ24l3j44O8j20l8J11j32j87
$$ -90 -136 24 -62 63 250 94 219 6 19 -107 -143 -66 85 50 43 167 134 -10 58 -62 -100 11 -121 -308
1593c08M15Nj00J24j90O3M2j45n2L1j12J51K50o2l4l27K26l0oP9J19j90K24k60
$$ -308 107 112 12 136 -54 9 51 -94 -146 -115 -227 -76 174 112 78 -249 -23 -53 -59 20 139 -51 173 -87
1617h7K36L0k68j33J02K04k22K19j86J21Q0k75L5O8J50Ll71K72O5m2r4R7j85K00
$$ -87 149 179 -89 -222 -120 84 -138 81 -105 16 96 -179 -144 -76 74 77 -294 -22 43 1 -93 4 -181 19
1641A9j4n0J31nj22L2l13K60K47k86J56j80J56o4oN2p0J34q3J19l31K00R0j08
$$ 19 5 -45 86 81 -41 -9 -322 -62 185 -101 55 -125 31 -33 -39 13 -57 77 -6 113 -218 -18 72 -36
1665c6Nj5r3K40j21jqJ16j67nj9J16K21m38J48P3j0J68k09m8J70r0m5o3Q7R4j
$$ -36 -31 -46 -139 101 -20 -21 -29 87 -80 -85 -104 12 233 -205 -57 16 6 174 -35 -83 87 -3 -48 -111 -24 70 69
1692F9j62N4K2n1k1Q9j5NJ52j91Q1L8K2j05j39J01J38q1Q8j8M7j2Lk63K20r9j85
$$ 69 -93 -39 -17 -68 -89 0 -15 -10 142 -49 32 70 92 -13 -152 -51 87 6 94 76 123 111 114 -149 71 -28 -213
1719b13J82MJ06o6J01M9j03j05M6k28L6K67R7L6k45J11n0l5j46l1j11M25R6j61
$$ -213 -31 -27 79 13 114 163 60 -45 1 -227 -191 76 173 209 -36 75 25 -10 -156 -187 -298 127 223 62
1743F2j29N6J72j68j39O5m8M4J40N8j18K18k50j16M5R9k7l6R7M8j49K9nM7NJ28
$$ 62 -67 -11 161 -7 -146 -81 -129 -85 55 113 -5 213 -37 -153 -108 -9 -36 -72 25 73 -76 -47 -52 -5 0 128
1769A28m67K37p7K44J27j57j46R0K5j72l8K66n4m4j3O8L44o8m08L4r9K50j2k02
$$ 128 -339 -102 -179 65 192 35 -111 -21 4 -168 -206 60 6 -38 -51 17 361 293 -115 -81 -180 70 58 -144
1793a44J65J52jp6j90o5K37M4k78rK88J18n9k01O3m6l6j42n3J19L44j88j2J11
$$ -144 21 173 172 96 -94 -159 78 122 -156 -165 123 241 182 -19 44 -2 -38 -180 -233 -114 230 42 30 141
1817A41o5j10l5j95N5K67l9O3M6m5M4k94N4r6L8K54Pj09J39J11j57j60K6J98j44
$$ 141 76 -34 -69 -264 -209 58 19 82 128 83 127 -167 -113 -209 -171 83 90 -19 120 231 74 -86 -60 138 -6
1842fj91J85p2K07r8J11k02j23K25Kj05R2Q0Nk13K01K0p2k74J54Q2O1k6r1k2L14
$$ -6 -197 -12 -84 123 25 136 -66 -189 36 38 -67 25 105 110 -103 98 118 46 -228 -74 8 69 43 -48 -70 244
1868B44j48j33M0k40J05J75k77K83J03j30r2k51K71L42k21L7o4R3J11l04r0Q5
$$ 244 96 -37 3 -237 -132 43 -234 49 152 22 -70 -321 -50 292 71 108 44 137 248 -56 -146 -61
1890f1J14p4q2Q8N3K13j07j81K18k69Q0j03J30%J00j45M5K22M4lm49M4P9Q9J3
$$ -61 53 -21 -103 -15 38 251 144 -37 181 -88 -8 -111 19 19 119 -26 19 241 285 282 -167 -123 -44 45 58
1915E8k98N6L47k6l13J5L05r4o3l63N10L2q6q0r6J25oJ3k95K82j11J71k0o0N8
$$ 58 -240 -184 163 137 -176 -161 144 50 -13 -376 134 166 80 0 -96 29 23 36 -259 23 -88 83 63 3 61
1940F1m5l0K23l02K02q1q2K5J33M2n6k34l1L13j23l0o4K5K08Q0m12K83j37J56
$$ 61 16 -14 209 -93 109 28 -54 -29 104 146 90 -144 -175 138 15 -15 -79 -54 154 234 -178 105 -32 124
1964A24k16r0K01o9R5j31J7J9O2j55R0p8J91J26r0j84O9O4l9K0r1J40O9o0k01
$$ 124 -92 -182 19 -50 45 -86 -69 -50 12 -143 -53 -131 60 186 96 -88 -19 45 6 26 -65 75 144 84 -117
1989a17J30N5j09n6oP3J2j61J08OJ20M4k38K11m2N0k49J34m9K90o7j81M5j70J41
$$ -117 13 68 -41 -97 -103 -30 -18 -179 -71 -65 55 99 -139 72 30 80 -169 -35 -84 206 139 -42 3 -167 -26
2014b6P8j7j50R3J13j33L9Q3J3k31j1l7L28j21Q6q6k4l7LN1j83L10j74J00j8k42
$$ -26 52 35 -115 -22 91 -42 -3 80 93 -138 -149 -186 142 21 107 21 -3 -40 -37 14 -169 141 -33 67 49 -193
2040a93J66r6P6j82L67K3p6j79J18m8J96j64J8r4M5J34j20q1J37J43l49R9o6K36
$$ -193 -27 -123 -47 -229 138 161 85 -94 24 -24 172 8 26 -68 -23 111 -9 -90 47 190 -159 -60 -126 110
2064A10rk22Q3J46l5k53J30J24O6j39K7j37K89k21m9J02Q9j27m3J05q%q3p3l5
$$ 110 101 -121 -38 108 73 -180 -50 74 140 1 28 -109 180 -41 -90 12 101 -26 -69 36 28 28 -55 -128 -163
2089a63j1J33m4p6N9R5J24j26O7n7J3N4k9j89J86J52o0jl8J1M5k09j02P7P3J05
$$ -163 -174 -41 -85 -161 -102 -7 117 -9 58 1 14 68 39 -150 36 188 128 127 89 100 145 -64 -166 -89 -16 89
2115H9j36r0K62j55n6O6Q2r0O6j37J43K02j14j76J01j0n3j44J15J6o3J2P2l5Q4
$$ 89 -47 -137 125 -30 -86 -20 62 -28 38 -99 44 246 132 -44 57 47 -6 -150 -35 -19 -82 -70 2 -33 51
2140E1o7k8k22J69N8q7J08N4J73k06O2NL8j29M2j64J16l3J26p0K4j86J87M5j95
$$ 51 -16 -44 -266 -97 -39 -126 -18 36 209 3 65 70 108 -21 21 -143 -27 -60 66 -4 20 -166 21 66 -129
2165a29L9R0lK2J38l30J72l2n8P4KJ21P6k52K6K8O0r5n8J66j26K9jR3L6K58l39
$$ -129 -90 0 -3 19 157 -173 -1 -33 -91 -17 -15 106 182 -70 -44 -16 44 -51 -109 57 -69 -40 -41 52 88 346 7
2192Gj56P5J47r7J12j75K9M1J06J60l19LJ29M6k79K17P3q8N5n3Q4P0k47j9J09
$$ 7 -149 -74 73 -24 88 -87 -58 -17 89 249 -70 -67 62 108 -171 46 119 31 86 33 117 187 -60 -79 30
2217C0j11N5o1J25j67K19Rk18L6k6J16KJ04j24M4K2j86O9N2m5M4o4pJ91J4q1o8
$$ 30 -81 -26 -87 38 -129 90 99 -119 -83 -109 7 9 113 -11 33 55 -131 -62 -10 -55 -11 -75 -82 109 123 42 -26
2244b6m9p5N5K5k4K42m6j35K34q4p0o1j47J28J76j07o5Q7k00J57n8O0l2j8j47
$$ -26 -75 -150 -95 -70 -94 148 102 -33 201 117 47 -14 -161 -33 143 36 -29 58 -142 15 -43 17 -15 -33 -180
2269a80L37j96J04J73l15L2M5Q0Nj1o0N9q2q0J06p5J84p2j13J22k97M73k37L9
$$ -180 157 -39 65 238 -77 -45 0 80 85 74 14 73 -9 -89 17 -58 126 54 -59 63 -234 239 2 41
2293D1l8p3J10k62R3qJ72l3j1J45j01Q2j1k37J67K4L3k13K16l4M3j43J15r5r4
$$ 41 3 -70 40 -222 -129 -137 35 2 -9 136 35 117 106 -131 36 60 93 -120 96 62 105 -38 77 -18 -112
2318a12N6J66j22J20j11K7o9J00n7L2kq6K0P7q5k8jQ7j02J20j58J53P9j14Q6l7
$$ -112 -56 110 -12 108 -3 24 -45 55 -2 30 28 -58 -38 39 -46 -74 -75 12 -90 30 -128 25 104 -10 76 39
2344C9K7j09K7j74J96o1k3J46rj05K06k70J25M3Kp3o5J97j51m5O9J14j58nK41
$$ 39 66 -43 -16 -190 6 -55 -78 68 59 -46 160 -110 15 58 60 -13 -78 119 -32 -77 -8 106 -52 -57 184
2369A84j95K7r7J04L4j81K0L8R7j09n1J78o4N5k12J53M9j3j32L1L9O2O5j13j85
$$ 184 -11 16 -81 23 57 -124 -104 -66 31 -78 -129 49 -15 40 -172 -19 30 17 -115 -84 -45 17 82 -31 -216
2394b16K94j44o4J37K2L6j19J36m7p7MJ12N6q4j7O9k21K18q7m2K60o3l04KJ97
$$ -216 78 -66 -130 7 29 65 -54 82 35 -42 -38 74 130 46 29 98 -123 95 8 -34 226 163 -141 -139 58
2419E8k2k27K28k9R9o1p8q1Q5m3J02p5J30j1j07L05k63j09m8K80k70L22k03N5
$$ 58 36 -191 37 8 107 46 -32 -113 -28 -71 31 -44 86 75 -32 273 10 -99 -147 133 -137 185 -18 37
2443C7k1RK9o0m2J25k18J43K99k79Q8j35J1j2Q5m4o4k8rj6J28J7J4m3R5l6k47
$$ 37 16 25 54 -6 -48 77 -141 2 301 22 110 -25 -14 -26 59 15 -49 -77 -86 -102 26 43 57 14 109 73 -174
2470a74K00p2K28k70k0mP3M5j36J89j10q8J61m7J77j45k9J05N6j98l4R5pL1N9
$$ -174 26 -46 182 -88 -108 -112 -39 6 -130 59 -51 -139 22 -25 152 7 -22 83 139 -59 -93 2 -5 26 85
2495H5jl10K86j17J23j76J40j40K75O8m38L06j35rrJ86j58p5jQ8O0qm1N0j12o1
$$ 85 84 -226 60 -57 66 -110 30 -110 165 233 -205 101 -34 -43 -52 134 -24 -99 -100 -12 48 40 -1 49 -63 -124
2521a24J83K1q2j09J1J14L0j70L9K52j96N6LM4p2n2j2Kj0N1J9M7j56P1lK6M7k7
$$ -124 59 80 -2 -111 -100 14 44 -126 -87 165 -31 25 28 72 0 -52 -64 -62 -72 -21 -2 45 -111 -40 -43 -17 30 3
2549Cm1l7K2j41J82J5ml5R3j41j20L8J43j42K15j28J23k31J30L2k30K75J6j30
$$ 3 -38 -75 -53 -194 -12 3 -1 -36 57 -84 -204 -166 -23 -165 50 -78 45 -186 -56 -24 -254 21 37 -93
2573i3J24P1p1J2p2J68j19r2O2j04nO2J71l0%p8N1O9n8P2j07K5j69R0j5M1K4r4
$$ -93 31 102 31 43 -29 139 20 -72 -10 -114 -119 -57 114 84 84 6 57 126 68 140 33 58 -111 -21 -36 5 29 -65
2601f5J5N4M2k8k1j6J23J20k35L08l09j04n2Q1J50j83J4J96j22J5R6k1L6k14J06
$$ -65 -50 4 46 18 -3 -19 104 224 -11 297 -12 -116 -168 -87 63 -120 -106 90 -32 -17 79 58 94 -120 -14
2626a4o9K09q1j44J09L0j9K04p9j94K2O8q1L4j17O9R8J0P0l33K55R9k25J7M1n2
$$ -14 -83 126 45 -99 10 40 21 225 146 -48 -26 42 -39 -5 -122 -53 45 55 125 -208 47 146 -79 -62 -21 -73
2652g3N1m5J53O8q7Qk16N1M7J32m8pj01j2n1J97Jk25K56k01K20l9j42N8j72R6
$$ -73 -22 -67 86 154 67 75 -141 -90 -43 89 41 34 -67 -79 -130 67 68 -157 99 -102 118 79 -63 -5 -177 -81
2678h1K2J34k3j92P4m7j24L35j53L1m3L2j44L04j73R4j11M7n2j03M2J24J15k73
$$ -81 -59 75 52 -140 -66 -113 -237 98 -55 -24 -67 -35 -179 125 -48 46 -65 -18 -70 -173 -131 -7 108 -165
2702a65K36J9j18N4k75M48O6j93K17j78j69L9K2L0P9j04M7K7j86Q5L0J02j16P
$$ -165 71 90 -28 26 -249 199 265 72 289 111 -58 -19 3 33 112 8 55 82 -104 -19 11 113 -3 4
2726Dq9K40q6K1p7J07o2p5P2M3j30P3n4q9Q1J79j3K5j96N5m4J7J32o3j8r5K4p
$$ 4 -85 155 69 90 13 120 58 -17 55 98 -32 41 -13 -102 -21 158 145 170 -26 29 -15 2 134 71 53 -42 -18 -25
2754b5O8j10J60m3j04J00j06q8P3N9Q6o4m4J02p4l2J00k31k4K18K3l5M4%J06j77
$$ -25 43 -67 93 50 -54 46 -60 -148 -75 -16 70 6 -38 64 -10 -42 58 -173 -197 21 44 9 53 53 159 -18
2780a8m1K13k31J28o0mo5K1k8J12j2j2P8O2m0o4n3p4P1J3p2N2l4J6L4L0J08j6
$$ -18 -59 154 -77 51 -9 -13 -78 -57 -85 27 15 3 81 143 103 39 -14 -88 -17 -4 -76 -24 -58 -42 -8 22 130 114
2808A14k4j31J87k17P6Rj02K01j86K4O4K72m27J62O1j33J33Mj04m2K58j83J33
$$ 114 90 -41 146 -71 5 14 -88 113 -73 -49 15 287 -140 22 83 -50 83 87 -17 -59 199 16 149
2831A49j39j09L1J56j26J56l5j55P4J19j89onK25k25l1J31n9J2JN6m8l6J06n3
$$ 149 10 -99 -68 88 -38 118 83 -72 2 121 -68 -74 -79 146 -79 -110 21 -38 -26 -25 31 -17 -53 53 0
2856@j43J07J18j3j38Qj13J99p1K5L5j26L39l14J16j57P2K68k32P1l1j80R2K28
$$ 0 -143 -36 82 69 -69 -61 -174 25 -46 -21 14 -112 227 -87 29 -128 -56 212 -20 51 20 -160 -68 160
2880A60j69qL5K8j03Q5j10J08o3Rj08P2kK25j88J11k4J64l05J35j45O0J14j73
$$ 160 -9 -17 18 46 -57 28 -82 26 -37 -28 -136 -64 -66 159 -29 82 58 222 -83 52 -93 -33 81 -92
2904i2J19k0j09J30m1r0P6L3j23Q9K00j45r3K9J6J03K2j10J9K54k05j15k3J26
$$ -92 27 7 -102 28 -13 -103 -27 6 -117 -28 172 27 -66 -37 -21 82 104 -6 13 267 62 -53 -76 50
2928E0jM9k75Q0K32k56J70m6P0l0J6j5k2m7L9j19Q6j0J62k48nO5j5M9%J0J81k88
$$ 50 49 98 -177 -97 135 -121 49 3 73 43 59 44 22 -25 14 -105 -19 -29 133 -115 -120 -55 -70 -21 -21 -11 170 -118
2956a18J36L4K20j29j53K39k24L4r0N7J22k14N8Km1k6K56k50R4j83K67j74k2J55
$$ -118 18 52 272 143 -10 229 5 39 -51 6 128 -86 -28 -26 -67 -93 163 -87 7 -176 91 -83 -105 50
2980E0r2k6J2j8L1m9Q3n3J22K9j29R0M5j68O8OM8j79J72j13p9K69n0j37J7J40
$$ 50 -42 -68 -56 -74 -43 -92 -9 -62 60 89 -40 50 95 -73 -5 1 49 -130 42 -71 -150 119 69 -68 -51 89
3006H9m7P5o4M9R8k12n4P9O5j38N3k9R7k1l8j40J36M8n9J36o9l6j07o0J69O1J95
$$ 89 42 117 53 102 200 -12 -66 13 78 -60 -7 -36 61 40 2 -138 -2 46 -13 123 54 18 -89 -149 20 81 276
3033B76k29K3k7j70J14n5J32j69JJ21L6j59J31Q6n7o0K6j03O5N1J33k92J21L0
$$ 276 47 70 43 -127 -13 -68 64 -105 -104 17 53 -106 25 111 54 -6 20 -83 -18 33 166 -126 -5 25
3057B5q9J13nJ1J16k18p3K32k22J06j8R5O4j72J26Ln9J4M3l8M1k63J50KR9k04
$$ 25 -64 49 44 55 171 -47 -120 112 -110 -4 -22 73 137 -35 91 94 35 49 92 54 95 -168 -18 -16 83 -121
3083a21J06L3l0P2j57K15K6j7q5j3n2L6O5l6O8p2J97l23J41o6Q4j00O4j95J66
$$ -121 -15 18 -12 60 -97 118 144 127 42 29 -23 13 78 42 110 38 235 -88 53 -13 71 -29 35 -160 6
3108Fmo4O9n5K03l17J08M2O2j14M9m0N6r6R8R5j21K5L4n0k3J3n4K31k48J48J85
$$ 6 2 -62 7 -48 155 -162 -54 -12 50 -64 -15 -55 1 -95 3 98 -23 2 36 -14 -37 -24 -78 153 -95 53 238
3135B38k27j7Pk6KO1k4m4J99L1j16J21k91Qo6J93j41LJ61Lp9K9R6j72J5P4k6n6
$$ 238 11 -6 1 -25 -23 38 14 -30 169 200 84 205 -86 -78 -144 49 -92 -89 72 75 -4 25 121 -51 -36 38 12 -44
3163d4l3O1J40pj29K9J39n7K7j78J75lj49N7j92L0J24P5o9o4J33p8l5K23j75J58
$$ -44 -77 -16 124 117 -12 17 156 99 126 -52 123 120 -29 28 -164 -134 -10 65 -4 -68 65 -13 -48 175 0 158
3189A58k10LK1N8j24j3J09O3KJ3R3k25j16R7m6J33m0n7R1J72k35J69o7lj40J45
$$ 158 -52 -49 -28 30 -94 -107 2 65 67 80 173 -52 -168 -71 -117 16 -24 -81 10 182 -53 116 49 46 -94 51
3215E1k27J65o3J32q6J4J01J7j30k7K49k44N9nQ0J5k55Q2J67j23j78J99n5N1O3
$$ 51 -176 -11 -74 58 -28 -14 87 104 -26 -53 196 -48 11 6 86 101 -154 -72 95 -28 -206 -7 -62 -11 52
3240E2l9k00K74j32R1L3j23l6J70p1oj09J46J2j28P7J5j05J26j2j6J59k01m3P2
$$ 52 13 -187 87 -45 46 79 -44 -80 90 19 13 -96 50 62 -66 11 26 -79 47 35 19 178 -23 -66 6
3265FJ18j74nP5j42J61n5j13M3l5K1P8J17j81K32k06p5N2j82J68K76j18k4p9l5
$$ 6 124 -50 -55 20 -122 39 -16 -129 -86 -121 -100 -22 95 -86 146 -60 -135 -83 -265 -97 179 61 37 -42 -77
3290g7J36j4r3lN3j43K1R4J1O2p1Ro8N4j40K73j92J48n3M1j53J2O1J38k35J4J29
$$ -77 59 45 -48 -51 2 -141 -120 -26 -15 47 -24 -15 -83 -29 -169 104 -88 60 7 48 -105 -93 -32 106 -129 -115 14
3317A4p2J22M5m3j24J62j06j61K84j55nJ06l41L00J2q8O6Rm3j2M2n2OJ80j53j00
$$ 14 -58 64 109 66 -58 104 -2 -163 121 -34 -39 67 -274 26 38 -50 16 25 -18 -30 12 -40 -34 146 -7 -107
3343a07J58r8J23o0N7j46J32j49N4J56J9r9j43P8K1Jj44P5j68J43Q2n4J15J12
$$ -107 51 -47 76 16 73 -73 59 -90 -36 120 139 40 -103 -25 -4 -3 -147 -72 -240 -97 -15 -69 46 158
3367A58m8j85M0L4n3J20p6q5J93o7K1p7N4j32R5qj15R0l2m0J66j27j01K56J49
$$ 158 110 -75 -35 -1 -54 66 -10 -95 98 31 52 -25 29 -103 -8 -16 -131 -41 -73 -113 53 -74 -175 81 230
3392B30k55K04k08J00J56j80J73l8l15K25m9j14N9l6j40K77pk65Q1J34r0R1J12
$$ 230 -25 179 -29 71 227 47 220 182 -133 92 43 -71 -12 -48 -188 89 82 -183 -102 32 -58 33 145
3415A45r2k9o4K19o7j68P5N2k16L04L5j71o7L0j70r6K64J7Q3j52Q6m5l3K21l8
$$ 145 53 24 -40 179 112 -56 19 71 -145 159 194 23 -44 -14 -184 -280 -16 1 84 -68 18 -27 -60 161 123
3440A23k63o9K50r5O3L2o6Lj56K59j40M7N1Nj6k06K04j10k7L6M0K2L2j62L51k72
$$ 123 -140 -209 41 -54 9 41 -25 -22 -178 81 -59 -12 39 44 28 -178 26 -84 -111 -75 -35 -13 19 -143 208 -64
3466f4N6N1J1j31L5l3O4K1MO4k33J98k6N8m7N7j7n1n2rO0r2j9J49P3J5j37j39
$$ -64 -8 43 54 -77 -42 -75 -11 10 14 78 -155 43 17 75 28 85 68 17 -35 -44 16 -76 -95 54 127 142 5 -134
3494a34J23jN2q7K2n6l7R0K4m5J57r2J35j04rJ06j48J90nj95lm4J66O0j88O5n2
$$ -134 -11 -12 40 -47 -25 -81 -118 -28 -4 -49 108 16 151 47 38 144 -4 186 181 -14 -17 -61 105 165 -23 42 -10
3521a0q5R4M5j05k9M9j0J67j73k9L08j99j65N3l0K72j19o6Q6j17L4P2J0j09R3
$$ -10 -95 -1 44 -61 -90 -41 -51 116 -57 -86 222 23 -142 -89 -119 153 34 -32 54 -63 -29 43 53 -56 37
3546C7m8N8j42J71Ok2oK5j19m3K36j69N0p0J22pn2j18J22M0J02k79K70j16K6r6
$$ 37 -11 47 -95 76 82 60 54 79 -40 -83 153 -16 34 -36 86 79 27 -91 31 71 173 -106 164 48 74 -22
3572b2r6J94p8K7j02J09k0M0j17J17j61J24N9j65j16K62M7l3O1k75K19j66K39
$$ -22 -118 76 -2 25 -77 32 12 52 -65 52 -109 15 74 -91 -207 55 102 69 130 -145 74 -92 147
3595A47j36m3j14L34o0k70J67j53K34k23N9M7J00p3Qj37K32K0j93K03k57J40j75
$$ 147 11 -32 -146 188 128 -142 25 -128 106 -117 -58 -11 89 16 24 -113 119 139 -54 149 -108 32 -143
3618a43M7R0j2q5P5J28o6J0n1m8J78k44K31j27Q5j33r4K53j68J36o6j0J01j0j61
$$ -143 -96 -6 -18 -103 -28 100 34 44 -7 -55 123 -121 110 -17 68 -65 -159 94 -74 62 -4 -14 87 77 -84
3643h4M4L6Q6j03o6L0J51k12J76q8j9k8J0N9l7L2K2k57J96R8j16j25J77l2k7J71
$$ -84 -40 -4 82 -21 -87 -57 94 -118 58 -30 -49 -77 -67 -8 -45 -13 9 -248 -52 46 -70 -195 -18 -50 -77 94
3669I4j02J7K5J3p1Q5j76J82r5O7N4o4l7J85q7j7q6J7O2pn4m4J12j77K05p5j9
$$ 94 -8 9 34 47 -24 61 -115 67 -28 39 93 29 -8 177 90 73 -13 4 66 59 5 -39 73 -104 101 26 7
3696GP8mj82j3J54j16QJ21P9q5l03J70K8N8N2k9j1k1J3p0j4P7P3j92qJ25J14r8
$$ 7 85 81 -101 -114 40 -76 -68 53 132 47 -256 -86 -58 0 52 23 12 -9 4 -66 -80 -3 70 -122 -130 -5 109 11
3724A1J8Ol5L6J63k81k3M4N0M9o3Pp5O4pm2P1K3j3jpl4P8j27P2O8p5n5J3L2J35
$$ 11 29 35 0 36 199 -82 -105 -61 -11 38 -25 -18 -93 -29 -36 -78 -7 16 3 2 -5 -39 39 -88 -16 52 -23 -78 -65 -33 102
3755A02j95J13p6K05p6o1j66J82L7j06P0N6j34K16j47L0m3k2m0K7J70j10J17J
$$ 102 -93 20 -56 149 73 12 -154 28 65 -41 29 85 -49 167 20 50 7 -15 -55 -28 142 32 149 150
3779A50j45r2P4m9J41j38Q7R2M4k29K12k83P7j1J36r2J13k53L3J13J02o5Rj44
$$ 150 5 -87 -13 -62 79 -59 28 120 164 -65 147 -136 -59 -70 66 -26 87 -166 -133 -20 82 17 26 -118
3803a18K75k14KM1j42J83J1k6N9p5J7o9Q9J14j36J11k41K11q4K8n3n4n1N1K9J9
$$ -118 157 -57 -55 -14 -156 27 38 12 71 -4 13 -56 33 147 11 122 -119 92 8 36 -17 -71 -122 -71 -42 -23
3829b3J51k17m0Q9j25K32j99K55k00J88M3j04p0mJ6J30r4P6j39P7q3m9K2L5L2
$$ -23 128 -89 -129 -40 -165 67 -132 123 -77 111 154 50 -20 -24 -8 122 28 104 -35 42 -41 -90 -68 -33 -1
3854aj12L09m5r3J4j82J38Lk0M7N2k1j17j7J51J04k57RM9J33j38J78k81J52o0
$$ -1 -113 196 151 58 72 -110 28 31 11 58 110 89 -28 -45 106 210 -47 -38 11 144 6 184 -97 55 -5
3879eJ26j04N2j89J09o8Q2KL0J8k4j88O2K18k00J31k6j27L98k85R6j3k08lR4r9
$$ -5 121 17 69 -120 -11 -79 3 5 35 53 29 -159 -97 121 -79 52 26 -101 297 12 108 95 -113 -116 -22 -121
3905a21Q9K4R6l0m1k11L88k12m0r4L4Q1n4N1mj97K72rP1K3L0j35L7p9p2R1m2J56
$$ -121 -32 -8 88 58 17 -194 194 -18 -58 -152 -118 -37 -91 -40 -44 -241 31 22 93 116 146 11 48 -31 -103 -12 -54 102
3933A02k12k5J69j00R9k2p8P5j23L7P4J85k27n5m3N3J76p2K3j54P0K2j63L61l93
$$ 102 -110 -135 34 -66 33 11 -67 8 -115 -78 -4 181 -46 -101 -144 -91 85 13 36 -118 -48 -26 -189 172 -221
3958b21M22j63q1qJ05r7q8J15M9j18K0R5r9Q1k41L26o9j42P1p5K24p8L5r6j26
$$ -221 201 38 -43 -51 54 -43 -131 -16 33 -85 -65 30 -69 12 -229 97 28 -114 -43 -118 106 28 63 -33 -159
3983a59J90N5L9j87J27r1J30k33J77O0q6j26J03O3r4Q7J6j26J64m2j53J11q3M4
$$ -159 31 86 125 -62 65 -26 104 -129 48 108 22 -104 -1 62 -32 55 71 -55 109 67 -86 25 -58 -14
4007a4J37j59j12J80J5K11j38n0j99K72o5j29J96j42r1L5O0j47R5%j7J16L7j08
$$ -14 123 -36 -148 32 47 258 120 70 -129 143 78 -51 145 3 -88 -53 7 -140 -45 -45 -62 54 91 -17
4031a7K5k2k8J06o7O0m3N8L8k27J8Q9qnO5%K1j61K48k23J31p3j90J62K5J04o3
$$ -17 8 -14 -42 64 -3 57 14 72 110 -117 -99 -10 -18 -23 42 42 63 -98 150 -73 58 -15 -205 -43 -18 86 23
4058B3J9rK2q1J39j22j94J75P5r7j42L1J75J68j76o7J8N1N2J12j72n4N1mkM0q3
$$ 23 42 33 55 -26 113 -9 -203 -28 47 -50 -192 -161 14 182 6 -61 -43 8 60 172 0 -54 -3 -7 -9 31 -52
4085e2J81k32m4J54j8J28k71N5J62%n5j49K19Nk06J25J7L6Oj33K1J36j12J9J1
$$ -52 129 -103 -147 7 -11 117 -154 -99 63 63 8 -141 78 83 -123 2 19 55 61 -72 -51 85 -27 -8 3
4110Cl3LQ9p7Q4n8j88O8J34k8J19j35J3no1L4J04j41J04k8l1o7J48k00P9J1N6
$$ 3 -30 -27 62 -15 69 11 -177 -109 25 -3 116 -19 -6 -11 -72 -38 66 -75 29 1 -30 -97 51 -149 -70 -59 -3
4137cJ36j50j52J54K05j67k7k32K49N1j23J17k55K44J32j21nm5q4J87j51K13j57
$$ -3 133 -17 -169 -15 190 23 -4 -236 13 64 -59 58 -197 47 179 58 53 8 -76 111 -40 173 16
4160A6j33K05P8j74J61J3j25k02J91j25J89r0K0O6J2p5J46k12J62p8j4j96R6J34
$$ 16 -117 88 166 -8 153 166 41 -161 30 -95 94 4 24 90 102 27 173 -39 123 45 31 -165 -69 65
4184F5k02J42J04j94J19J02q1j09rK3j1jm1J09K3n4m2J1j02K64K0j63K7J76j15
$$ 65 -137 5 109 -85 34 136 55 -54 -63 -40 -51 -52 -93 16 39 -15 -57 -46 -148 116 136 -27 0 176 61
4209F1k8j31J05M1j71L62k25N8j3j71J94k6pJj64P7J40k24j6K10o5p2R9k47N8
$$ 61 33 -98 7 48 -123 239 14 72 59 -112 82 56 49 50 -114 -37 103 -121 -137 73 8 -64 35 -212 -154
4234a54J84j00J75nq1%p7j68J56J21j54m3J31K32l30j14J60J14j2J37j60j59J20
$$ -154 30 -70 105 100 19 19 -58 -226 -70 51 -103 -146 -15 217 -113 -227 -67 47 35 172 12 -147 -27
4257b7k2M3J74r1j74MJ73j9j27n7K24n7n2P2lM6q1Pj56K05O6q0L8np6q9L4J26
$$ -27 -49 -6 168 77 -97 -93 80 61 -66 -123 101 44 -8 64 61 107 26 33 -123 82 148 68 106 101 25 -64 -30 96
4285I6nj28J05j40Q5J15k28M6mK05k30K00j97K13j07o6R2j20M2J65j0j73mpM2
$$ 96 91 -37 68 -72 13 128 -100 -54 -58 147 -83 117 -80 133 26 -40 52 -68 -26 139 129 -44 -48 -55 -13
4310a3n7J88MP0j63m9k0J12o8k2Mj2J1J04l8j07J51l36M13k40m8NP1JJ01q2M6
$$ -13 -70 118 122 192 29 -20 -40 72 4 -18 -14 -26 -15 89 51 -56 95 -241 172 -68 -116 -111 -40 -39 62 -20 26
4337B6j29K7J38P4j63Q6j1n9j10O3J89Lj38J8j2J10j19K9o0J52N1q8j32P7j3M4
$$ 26 -103 -76 62 136 -27 59 48 -11 -121 -58 131 134 -4 14 2 112 -7 22 -38 114 165 77 -55 22 9 53
4363E3K7j27J21j58Jk7J40l6n0N7J01j36mJ71m8l4J7p7R8m6l5K5M4m8o5O2l7j30
$$ 53 80 -47 74 -84 -83 -110 30 -6 -56 1 102 -34 -38 133 85 51 68 -9 89 43 8 33 77 29 -36 26 -11 -141
4391a41N3K21K9j60MM1q9J31m9J42j66j83J8J45k6J09k35P2j8K15j2j43J83o1
$$ -141 -88 133 162 2 6 47 -42 89 40 182 16 -167 -149 -4 -30 79 -156 -84 -102 113 101 -42 141 80
4415H0k14J37m6J95l32K30k00M5N1J15j28P2p4J1J77j10K4rj36J56j11J68r2l9
$$ 80 -134 3 -43 152 -180 50 -150 -105 -54 61 -67 5 -69 -58 119 9 33 24 -112 44 -67 101 9 -30
4439c0R6q0J53j45p6J45k22Q9J45j46k71M87j37%q6l9J72k8R6k42J71k31J63L8
$$ -30 66 -14 139 -6 -82 63 -159 -70 75 -71 -342 145 8 8 -78 -117 55 27 123 -119 52 -179 -16 22
4463B2n8rK4r8K60r2Q4k48j47L58o3j15J2K4M9J12l00K14n3kk4R9r5k0R7%l4n7
$$ 22 -36 -45 -21 -119 141 49 133 -115 -262 96 33 -82 -70 -46 3 115 -185 29 -24 -26 -50 49 -46 -66 31 31 -3 -60
4491f0L4P8j40O1j66L19k8k6K42k46N1j29jm7J07q5k7p6J53j22J95j6j41M3j17
$$ -60 -26 52 -88 -27 -193 126 98 72 314 68 119 -10 -11 -58 49 -36 -63 -139 14 -108 87 71 -70 -27 -144
4516a44N3J66j40J99j51Ro9r7K00J97l06Q9Nj26K28l4j21m4k1N5Pk1R0j19J05
$$ -144 -91 75 -65 134 -17 -8 -77 -174 26 223 -83 6 11 -115 113 79 -42 -86 -107 -52 -45 -66 24 -95 10
4541A0L2j51J6LQ3n5K65k27K42k41J82k71K59j75%P8j3P3m5J26j88k5m6j8P6m7
$$ 10 42 -109 -93 -90 -7 -62 203 -24 218 -23 159 -112 147 -28 -28 50 37 110 65 191 3 -22 -68 -86 -10 -57
4567e7R8q7K5J54J7j50L0O8n9j83NK47k29J72j3j35J84k54J00Q1k1m2J75j23N5
$$ -57 41 -46 -21 133 150 0 30 98 39 -144 -139 108 -121 51 38 -97 87 -167 -67 14 -7 -49 126 3 58
4592E8p6K0k9J2RK8q2J27L9j31J19j21R4l28L14j92K29J0j1rj09J54j51n9J36
$$ 58 -18 2 -27 -15 -6 22 -60 67 106 -25 94 -27 67 -261 53 -139 90 100 89 80 -29 125 -26 -85 51
4617E1j48O5M3K4M8j88J91Q7j23O1j33j13Q9K99l80k6K51k07j0M8J02K5L1Q7k51
$$ 51 -97 -32 11 35 83 -105 86 173 50 111 -22 -135 -46 253 -127 -153 98 -109 -119 -71 31 56 87 174 -77
4642g7J33k2k8J31o6jj19m3R5l3L1o0O0O2j12K6j4J12j43J51j51N8J80k33J10
$$ -77 56 34 6 137 71 70 -49 -92 3 -30 1 -59 1 63 -49 -23 -37 75 -68 83 -68 -10 170 -63 47
4667D7m4k6m3j52K41j15R2J9O9m4k5k16J83o6J57j84j32K89o5l2K00j14j1j62
$$ 47 3 -23 -66 -218 23 -92 0 19 88 44 19 -197 -14 -80 77 -107 -239 50 -15 -47 153 39 28 -134
4691a34K48n5j67J67j36M5J0j25J18P2j26J69o1J7J1q5j04Q1N9r3J18r2J65o1
$$ -134 114 59 -108 59 -77 -32 -22 -147 -29 43 -83 86 25 42 53 -32 -136 -55 4 -89 29 -63 102 41
4715D1j24J29r7j37R5N5j24L9N0l4J16lr2J20r0L4J47k2j30J3J65j6k52Q5o7J89
$$ 41 -83 46 -51 -188 -93 -38 -162 -123 -73 -107 9 6 -86 34 -56 -22 125 103 -27 -14 151 135 -117 -32 -99 90
4741I0J8j87J22R1j67j09K31r4Q6j52L7J79k87K71j58j16M7J50J26j09Lol3l2
$$ 90 108 -79 43 134 -33 -142 89 -5 81 -71 -34 145 -142 129 -29 -145 -98 52 178 69 72 66 33 1
4765Ak8J2P4j20N5J39kk06O0L6J2j27J47q7j9n4J55J01k28P8Q1j0p0r1K22k46
$$ 1 -27 -15 59 -61 -6 133 131 -75 -15 21 33 -94 53 -34 -53 -107 48 149 -79 -1 80 70 0 -91 131 -115
4791a15N1J75k35R9lK12o2k22K12j31M8k9J1j77K3J68K4j19J28m8l9k0p5J01P5
$$ -115 -64 111 -124 -25 -28 184 122 -100 112 -19 29 0 11 -166 -143 25 49 -70 58 10 -29 -49 -124 -23 52
4816E2J05j54kqP6L6K4j89J63p3N2l49L99Q4o5o0p7K5n7mk8J02j72O3q9N7r0R0
$$ 52 157 3 1 -7 69 105 129 -60 103 30 82 -267 132 216 151 91 14 39 -18 -22 -50 52 -120 -57 -146 -89 -179 -89
4844h9K19o9j0j87J46NRM3j53J24k25J21mK19p6o6L1K00j85j59J18J24j61l2M0
$$ -89 130 61 51 -136 10 15 24 67 -86 38 -187 -66 -70 149 73 7 38 238 53 -106 12 136 -25 -57 -17
4869a7J44k43J47O2J3k40J60J1q4l7L0J41j12N9l15L41l5o3L4n6Q0L2k65J75J2
$$ -17 127 -116 31 93 106 -134 26 37 -47 -84 -54 87 -25 34 -281 60 25 -38 -4 -60 20 52 -213 -38 -26
4894b6pJ4O0K0j27J08n3J0Q7j42L3J25j3j91OJ68m7JR8j46r0O7J2J24j32J35j26
$$ -26 -33 -19 41 61 -66 42 -11 -1 86 -56 -23 102 89 -102 -96 72 25 26 124 -22 -112 -45 -33 91 -41 94 -32
4921c2L8l4p2J49j9j06N4J03J2p7n7LP5R3k06J69n0p4m1Q0J0j34J14j14m9K93
$$ -32 6 -28 -100 49 30 -76 -22 81 93 16 -41 -38 37 130 -76 93 43 -31 -72 8 18 -116 -2 -116 -165 128
4947A28m4j77K01rl13K50j57J89M9m7J46l36Q6M7J09k92J37j49J44J73Lk05P0
$$ 128 84 -93 108 99 -214 36 -121 68 117 70 216 -120 -34 13 122 -170 -33 -182 -38 135 138 -67 3
4970Cj73J13O3l0M1l4n0J43q7k7J21q1Q8j6q8j73K43k43K35Jl3N6j97R9r3K03
$$ 3 -170 -57 6 -24 17 -17 -67 76 -11 -38 83 2 90 74 -14 -187 56 -187 48 49 16 72 -125 -26 -119 84
4996H4PJ4j04k1m2N5q3L03k46j3p5L4J45j69R3m0R7j7k29K96o7m5J4K3R3j49j03
$$ 84 91 105 1 -20 -62 -7 -90 213 -33 -46 -121 -87 58 -111 -18 -58 39 22 -207 89 22 -23 -9 14 107 -42 -145
5023a45L15j39j5j2j77K97j48l3j3M5J46j46L7j5N4K4j26R9O9k7j90J92l8p3L29
$$ -145 170 31 16 4 -173 124 -24 -57 -70 -25 121 -25 12 -3 51 75 -51 48 117 90 -100 92 54 -19 310
5048C10l84Ml1K92k73O5j54J67j08l2J41m0R3r2n2Q4r3K49k60J50M7J41j31q5
$$ 310 -74 -70 -101 191 -82 -17 -171 -4 -112 -144 -3 -43 50 -42 -94 -10 -103 146 -114 36 83 224 93 8
5072Hp6l9J86k40K38Qj54O3J90o1j66j14K32r6J2q9R7p3J4P9q0J90j06L1Qj99
$$ 8 -68 -107 79 -161 77 85 -69 -6 184 123 -43 -157 75 -21 -9 -98 -1 -74 -60 19 -61 129 23 54 62 -137
5098a37J07Q1r3R2L8k09K94j75j5j5m2M5l0J16O7k01Q1M1j4j06j8N3k3RMJ94j5
$$ -137 -30 51 -42 50 88 -121 173 -2 -17 -32 -74 -29 -59 57 124 -77 4 45 31 -75 -93 -40 -63 -54 -50 144 129
5125A29k09M8J16k26J01J40j76K36k10J36k76K33O0k94J98l6J38j95K58r7o2k1
$$ 129 -80 -32 84 -142 -41 99 -77 159 -51 85 -191 42 102 -192 6 -30 108 -87 171 74 12 -9
5147iM0P0j28q5J9J08K00k77oK99o0o2k10J06j77L53O4j33j44n3O7p0j0K61j32
$$ -9 31 101 -27 -112 -93 15 215 -62 -68 231 171 109 -101 5 -172 181 245 112 -32 -85 -18 -88 -98 163 31
5172C1O7j6k24L3P6P1m0n1j2J31q0o1K8J18o2o9o0J41K6J4q2O0L6m7K8L2O6k21
$$ 31 98 82 -142 -109 -33 38 -2 -53 -65 66 -14 -75 -47 71 9 -60 -120 21 47 61 -21 39 75 28 56 88 154 -67
5200f7l3K17l33L9K04Jj7J9o9m1J44j66q9J11K30j13j58J51Q3k57R5J84n7o1j76
$$ -67 -100 117 -216 -177 27 28 11 30 -39 -80 64 -102 -191 -80 150 37 -121 30 113 -144 -49 135 78 17 -159
5225a59P8O3P3m2k9J33o3j17P4O2l4j9j30l3Q0Q5Q8r5N2J0q1p4O5K6O0pj23Jl3
$$ -159 -81 -18 55 13 -16 117 54 -63 11 73 39 20 -110 -143 -63 22 110 15 67 77 -4 -78 -13 13 73 66 -57 -56 -89
5254h9nJ3N6No9N1m6K90j40q7J6L5m1o9J60j76J42p1l4p3J37Q1k07L52k49J9n5
$$ -89 -94 -81 -25 -20 -89 -38 -84 206 66 -21 -5 30 -11 -80 80 -96 46 -25 -59 -132 5 86 -121 231 -18 1 -54
5281e4n0Q6j3J0l4QR7l5j41k9J72Oj50J11m0Q8K8n8k7J33r7j3O9j42L5K1j02K50
$$ -54 -104 -18 -31 -21 -55 -47 50 15 -126 -155 17 23 -127 -16 -56 32 60 2 -25 108 11 -2 67 -75 -40 -19 -121 129
5309A29j97L8Q8p7J52j02J95k34N3j23M1k2o2Q2Q3k13J85m2J46j94Q7K00k50n
$$ 129 -68 -30 58 -19 133 31 226 -8 45 -78 -37 -59 -121 -39 44 -169 16 -26 120 -74 13 213 -37 -42
5333d2P5q4k6%N5Q5j0J65k45p6J69l6O2k45J46M6j94J61r6J7J6J32p0j33J10M1
$$ -42 33 -51 -77 -77 -22 63 53 218 -27 -103 66 30 92 -153 -7 39 -155 6 -90 -73 -57 75 5 -128 -18 23
5359B3j08J01j10K11j51J14PR9j50r9K10k03krJ07N2n5P5n0N0p4j73J15Q6l7n7
$$ 23 -85 16 -94 117 -34 80 87 186 36 -63 147 -56 -58 -67 40 92 37 112 62 112 38 -135 -20 66 29 -28
5385b8O9n9r8J29j74J66N7L7j93o3J76K1J24q7K6j11M8O6n2q3N7N9j37l0J90j85
$$ -28 41 -18 -116 13 -161 5 62 99 -94 -157 19 40 164 77 103 -8 40 106 54 -29 28 87 -50 -80 110 -75
5411g5K20j66O3n4Q1m7j64Q2k9K03l1m3J50j31NJ1j8j12J6j2J88j33K33j20k17
$$ -75 145 -21 42 -12 69 22 -142 -60 -89 114 83 40 190 59 64 75 57 -55 -39 -51 137 4 237 117 -100
5436a00m6R3L8J8n0K5L6%R0r9J19m9j01j47L11k26N2J19J39l40K27k00J00L3k7
$$ -100 -146 -53 -15 3 -47 -22 14 14 104 5 124 75 -26 -173 138 -88 -36 83 222 -118 109 -91 9 42 15
5461A5Q4o4k6j24Q6L0L6k06M1L7J03J94j36m0j6J5j59n4K94n8j16P7j30J95j98
$$ 15 99 35 9 -115 -29 1 37 -169 -128 -91 12 206 70 30 14 29 -130 -184 110 52 -64 13 -117 78 -120
5486a20J25J8j00J88p1j42K8K22j46j86L01j37m8J45r5R7Lj56p0K42j91J75k69
$$ -120 5 23 -77 111 40 -102 -74 148 2 -184 117 -20 -68 77 -18 79 82 -74 -144 98 -93 82 -187
5509a87P6K29j09j81K49r7P0O5k28J67J6r8l9m3J01j9J51n3j65J60R6j45J8j15
$$ -187 -111 118 9 -172 77 -20 50 115 -113 54 70 -28 -67 -110 -9 -28 123 70 -95 65 161 16 34 -81
5533h1J18R5M6j06j5Q9j15jM1r6J42k06J81k16PJ18J3M4j44J8N9J48k41K9J09
$$ -81 37 132 178 72 57 146 31 30 71 -25 117 -89 92 -124 -117 1 14 58 -86 -68 -9 139 -102 -73 36
5558C6j03J4J32l6N8L7j49P7l4l7q7J0l2P2J67q3Mr5l5K33r0j41J63j54j7K5K9
$$ 36 -67 -53 79 43 101 138 -11 66 32 -5 -92 -82 -114 -42 125 42 46 -49 -84 149 59 -82 81 -73 -90 -65 -36
5585c6m8J18m4M7J38k66K02j90Q8O0j32J4j69J56n1J04N6n6J10Ro0k19J62Rj88
$$ -36 -84 34 -10 37 175 -91 111 -79 9 69 -63 -49 -218 -62 -113 -9 47 -9 101 110 50 -169 -7 2 -186
5610a86K12p8R6p9j4K59j31j00Lk1J2N1L5m2J7L1j28O0J11q3o1Q7Q0k49m5J75
$$ -186 26 -52 44 -35 -49 210 79 -21 -18 -39 -27 24 59 17 34 65 -63 -3 108 25 -36 51 131 -118 -163 12
5636A2k1j17J74l2j42J30o8J1l1K22j91J47o0p2k0p3oJ37n3M2P7j64J23l6Q3j34
$$ 12 -9 -126 48 16 -126 4 -64 -53 -84 138 -53 94 34 -38 -58 -131 -137 0 -53 -11 66 -98 25 -11 72 -62
5662f2j40K60j39K24k31K78j88m3K0j5K00k14M8j7R3k44L25k87K69k32Q7l8j13
$$ -62 -202 58 -81 143 -88 190 2 -41 -21 -36 164 -50 -2 -19 74 -170 155 -132 137 -95 -8 -46 -159
5685a59J53o6j13K00P1k33K20j37O1P9k46J32j08J83j64J34lJ0P1r2J44l09K20
$$ -159 -6 -72 -185 15 86 -147 73 -64 -3 76 -170 -38 -146 37 -127 7 4 14 85 -7 137 -172 48
5708D8j50Q1m7Q9J6L5j90J38m5o4L2Q5m6M4j57L5J63Lj00P1m0m4J3r7J44mm4N2
$$ 48 -102 -21 -68 21 37 72 -118 20 -25 -89 -57 28 -18 26 -131 -96 67 70 -30 41 1 -43 -30 -127 17 13 -31 21
5736B1n6kL7M7j1m0m8j22L18j79l0J08n7O8o9P4p8J26k75J54N8Q2j1j77J70mj07
$$ 21 -35 -37 0 47 36 -4 -52 -174 144 -35 -65 43 -14 54 -15 59 -19 107 -168 -14 44 126 115 -62 108 104 -3
5763cM1j69R9M3J18j56J87p0mK2k37K9N1J70j67q8o7K03j38R0l5Q3J47n6l6j04
$$ -3 38 -131 -32 11 129 -27 160 90 86 108 -129 -100 -49 121 -46 -134 -201 2 -136 -46 -81 2 149 93 57 -47
5789d7j5J51J3J27k46N2k0j11P6P9n3n4Pj17P9J47q8m9j39K11MJ85k05j2Lo9Q9
$$ -47 -62 89 102 229 -17 35 15 -96 -20 59 6 -48 -41 -158 -79 68 -20 -69 -208 3 7 192 -13 -25 -22 -91 -2
5816bj27K0L5K0j2o7L66l26R2J24j79N4o6n3J09MJ14j23k2K13j91jM1J47k56J21
$$ -2 -129 -109 -74 -54 -66 -133 233 -93 -1 123 -56 -2 -68 -121 -12 -8 106 -17 -39 174 -17 -18 23 170 -86 35
5842C5n5J65m9lj29J28j00o5P3Q4j35N1OJ7q3m7J48k35K28r0M6l5j4R0J32q8j98
$$ 35 -20 145 96 93 -36 92 -8 -73 0 84 -51 0 6 23 -60 -107 41 -194 34 -56 -10 -45 -59 31 163 75 -123
5869a23N4P8j94K22j4l0L19k57L7n4r8n4J01P1q8np0Q8j24J62J40j76J08o5n2
$$ -123 -69 9 -185 37 23 -7 312 55 92 38 -60 -114 -13 58 -30 -35 -105 -17 -141 21 161 -15 93 28 -24
5894b4J9J71o7l7j15J76m4n1P8jj96K09k14P0j11J43R6j98K10o3r6K7J01M1j74
$$ -24 -5 166 99 62 -53 123 79 28 106 105 -91 118 -96 -26 -137 6 102 -96 114 51 -45 -18 83 124 -50
5919e0R3j1pl8n7K09K03m17K5J32J7lK8m5r0J4q7l9N0J37m9m9Q2j33J10k6N4m3
$$ -50 43 32 25 -13 -70 139 342 -75 -50 82 99 96 124 79 -11 3 -84 -123 -73 64 15 -34 48 -85 25 -1 53 10
5947A0j23p3K95l9k17K53j05K4l3l9N8L6J10k15J46j10J00J3k13K30n5K4j54P7
$$ 10 -113 -186 109 70 -147 106 1 25 -8 -47 11 47 157 -58 88 -22 78 91 -122 108 53 77 -77 0
5971@J23j68R4r7K32k20J09k7o9l0o2J55l7J46q6O4j10l2n5q8oJ53j11J3J9J46
$$ 0 123 -45 49 -48 184 -36 73 46 -23 -53 -115 40 3 149 63 127 17 -15 -70 -158 -164 -11 -122 -109 -90 56
5997E6j02j94J21K68j83k2K9j69J20p1J62K35k84o2Q0l8j6Q9j2o4J15n4N4R7k31
$$ 56 -46 -240 -119 149 -34 -56 -27 -196 -76 -147 15 250 -34 -96 -16 -54 -70 19 7 -57 58 4 58 155 -76
6022g6o1K10j82J40q9J21n2J17o8lrJ12k5Q7n47L72j8j80K31m8JL7j24l5R7j39
$$ -76 -137 73 -109 31 -58 63 11 128 60 57 48 160 135 222 -325 47 29 -151 80 32 33 70 -54 -89 8 -131
6048a31K50l43K52M1j87Q9J03j12k1K0J77k31R0R8j03N0q7K1R4q8l3k68L49J12
$$ -131 119 -224 28 69 -118 -29 74 -38 -59 -39 138 -93 -3 95 -8 42 -45 -24 70 -18 -51 -319 30 142
6072A42k08RR7j8j5J25j37R7n9M1r8QM1k7J08r4j8l7J26n3j25J64j28L7J12j96
$$ 142 -66 -57 40 22 7 132 -5 92 33 74 -24 -16 25 -2 106 12 -6 -43 83 30 -95 69 -59 -22 90 -106
6098a06J55Q6j32N6j14M6r3J94o8Rq5O2m1P1j83K17j7m6J07j40M8j5L4p8K82k55
$$ -106 49 135 3 59 -55 -9 -102 92 24 33 -52 10 -31 40 -143 74 57 11 118 -22 26 11 45 -33 249 -6
6124fR4j25J75p5j55K22K1j57J91j24j80K07j57J6J44o8j57nP8J49k75K38k57
$$ -6 88 -37 138 63 -92 130 151 -6 185 61 -119 88 -69 -53 91 23 -134 -139 -61 88 -187 51 -206
6147b06J61R6J19l92J42R2j69K95k21J60J1L6k98N9J02j23K1K30P8j98J31j84
$$ -206 -45 51 170 -222 -80 12 -157 138 -83 77 88 124 -174 -115 -13 -136 -115 115 193 -5 126 -58
6169e8J7j57K75Q4k05P3M7Jk30J91m5J12k36K2J21Q5k05L1N5R1j49k5J59r8M2
$$ -58 -41 -198 77 161 -44 29 76 77 -153 38 -7 105 -131 -109 12 97 -108 -77 -22 69 -80 -105 54 -44 -2
6194bJ43k73J42M3lj16P2o4J77j91K09j47rK03k61J70L4p2k47K62P8j30k7j3N9
$$ -2 141 -132 10 53 50 -66 6 -58 119 -72 137 -10 -19 184 -77 93 127 55 -192 70 148 18 -9 -22 37
6219C7Nk0r3k8L16j95jk2J49k36J56n0j08L2J53o9O8j32p9J60J5J47j50q2K4p3
$$ 37 42 22 -71 -99 217 22 21 -1 148 -88 68 18 -90 -58 95 26 94 -38 -117 43 58 205 55 -27 -3 -76
6245g6L6L5N9N3j5n6k6O7j11P0L2j56K20N3n6l25K27O7n6J02j30j16J20L7n8O6
$$ -76 -40 -5 54 107 92 36 10 77 -34 36 68 -88 132 185 129 -196 31 98 42 144 14 -102 18 55 -3 63
6271F3M4k61M9J07l3J11j69P9j2J45n1R8k16m6J24O8j85K1J1O4M8k0r1%L3Q8K6
$$ 63 107 -154 -105 2 -31 80 -89 -10 -22 123 72 170 -46 -92 32 100 -85 -64 -53 11 59 39 -52 -52 -19 69 95
6298I5n2m3k3J73r2n9LN9k0k2j19J03J17k61J15K11j05o8n8m2N3Lp0J57L7n2J9
$$ 95 43 0 -23 150 58 -1 2 61 41 19 -100 3 120 -141 -26 185 80 12 -46 -88 -35 -32 -102 55 92 40 59
6325E9jk9j08L1m6R3o1R0N2j34Q3k9j07l6J39j4J18K2k99J02M5J63k90P8J95j60
$$ 59 58 29 -79 -48 -94 -1 -62 28 80 -54 29 0 -107 -143 -4 -18 100 122 -177 -75 -30 133 -157 -79 116 -44
6351d4j30R4J76r6J01j75J5J2J5M2O7k41J50q7K1Q3O7j52JK18j82K0o3L6J15M
$$ -44 -174 -80 96 0 101 -74 -59 -47 -32 10 77 -164 -14 -101 -80 3 70 -82 -81 137 -45 -25 -88 -52 63 67
6377F7j52RJ48J8j74K51n9q9O3m4L9j09M5l1rJ28j33k9L9K03k91M5N0J38k27R8
$$ 67 -85 -76 72 90 -84 167 108 19 82 38 77 -32 13 -18 -27 101 -32 -61 -22 181 -110 -65 -15 123 -104 -6
6403fM4j32J17k14J41J54k28j18K11j07j10K39l5r2J30j32J24P3l0j33J58Pj61
$$ -6 38 -94 23 -191 -50 104 -124 -242 -31 -138 -248 -9 -44 -136 -6 -138 -14 59 29 -104 54 61 -100
6426a00J08J13n8R0j44j31K17j12n5O1L2j4p4M5Q1k03J03LJ49j29Oj08P1L6O5
$$ -100 8 121 63 153 9 -122 95 -17 -72 -11 21 7 -67 -22 59 -144 -41 -38 111 -18 -12 -120 -49 -13 52
6451E2Q8m8j24O6o7l9j17K98j51k6M4M4r2Q7n4p1L2oK20j21P5n8lJ3q5L8oK7l2
$$ 52 140 92 -32 34 -33 -72 -189 109 -42 -68 -24 20 -72 15 -39 -110 -78 -84 136 15 90 32 29 42 -43 -5 -11 16 -16
6480a6p0K06o8k5j66P0K11j28q7Q3J08j57K0L6J49q4j75n7J60R4P3j40k09L28
$$ -16 -86 120 52 27 -139 -69 142 14 -73 10 118 -39 -19 17 166 82 -93 -150 10 104 177 37 -172 156
6504A56j99J1Q2j24j53J69R6j43J65j02J47rj46P9N9j22J09ro2J19p7j53J38j70
$$ 156 -43 -32 50 -74 -227 -58 38 -105 60 -42 105 96 -50 29 88 -34 75 66 4 123 46 -107 31 -139
6528a39M1Q1r9R9O1m4k9k5pl9K43j49m7J15j17J56K4j00p6Q3K9Q8j11l5%k7m1
$$ -139 -98 -17 -116 -17 44 0 -29 -54 -61 -100 143 -6 -53 62 -55 101 125 25 -51 32 61 149 38 3 3 -24 -65
6555f5R3r5J27j46J99m6L8k00K60n3j33J55l72L32j4%M1k22J71j61K94r9r0J04
$$ -65 28 -67 60 -86 113 67 105 -95 165 112 -21 134 -238 94 80 80 121 -101 70 -91 203 104 14 118
6579A18m3N1q9n7j02J67p3lK36j48p9l2j53K01jj08K8K07q4P2j5j96L22j64kP1
$$ 118 75 126 37 -20 -122 45 -28 -31 205 57 -22 -54 -207 -6 -7 -115 -87 120 36 108 93 -103 219 55 53 124
6605A24nj78qJ41j26K9o3M0R3j13K7n3J17R1j70o3M0J48l9M2j46L1J71r9k04J29
$$ 124 119 -59 -67 74 -52 -23 -86 -46 47 -66 -39 -92 25 116 -54 -117 -77 71 32 74 -72 -41 130 31 -173 -44
6631d4O7j39P7j70N2K76j62r6J29Q5m2j44m6K48k39K74p2o2J33k08K20j49P0k
$$ -44 23 -116 -39 -209 -157 119 -43 -139 -10 75 33 -111 -157 91 -148 126 54 -8 125 -83 137 -12 58 56
6655E6j12K00r8j46n6j2R9P1J6kj01K4m1J79k10J61q9%J4O2O1j0k26j9J68K05
$$ 56 -56 144 46 -100 -156 -168 -69 2 18 16 -85 -61 -102 77 -133 28 -61 -61 -47 15 76 66 -160 -179 -11 194
6681A94j59K6n4nl4P3k40K20o0p5J54j24J81k03J50j22J14n8p0J74L0j65N1l8
$$ 194 35 61 7 2 -32 41 -199 21 -39 -114 40 -84 97 -106 44 -78 36 -22 -92 82 112 -53 -2 -40
6705d0n5R8L4q5J08J7n6M1j55Q7OJ07j31j4J43r1k77J93J48Lo8M8L3k06K8J01
$$ -40 -95 3 37 -48 60 77 21 62 -93 -6 0 107 -24 -38 105 14 -263 -70 78 81 13 61 94 -112 -84 17
6731A7k6ll3k6n2K33j38L0n5m8J23m3Q0M2k54J15K2j3j15J89o0l0j30k6K59J9
$$ 17 -9 -12 -45 -71 -123 110 -28 2 -53 -101 22 -21 59 101 -153 -38 -16 -29 -144 45 -15 -45 -175 -201 58 77
6757G7K3r2n5L6J97k54m4J6j1l8J49j04r5J88J2j26K37k49K97j55j54K67j20j47
$$ 77 100 8 -47 -11 186 -68 -112 -96 -107 -145 4 -100 -195 -7 5 -121 116 -133 164 9 -145 122 2 -145
6781a45K41j79K29j90j11K88p5n5k10Q8J97q2r5kK6L7O4l0j83L91j53n0m7J43
$$ -145 96 -83 146 -44 -155 133 58 3 -207 -119 78 -4 -99 -101 -75 -38 26 -4 -187 204 51 1 -46 97
6805I7p5o5K3n2m3K37j65r1J86j72K18P0j71KK23k61J41nKKj8j06J61k03J82j07
$$ 97 22 -43 -20 -72 -115 122 -43 -134 52 -120 98 168 -3 -1 222 -39 102 97 99 101 83 -23 138 -65 117 10
6831A0O1p3j41R5jm4R8j38J77J03j93J06l3k8N7j68L8J20j05J66m1o4P2q0j6J39
$$ 10 71 -2 -143 -48 -49 -93 5 -133 44 147 -46 60 27 -1 56 -112 -74 46 -59 107 66 2 74 -6 -22 117
6857A17j93j1J39p1n3J31p1R2m3K2m7K0M0j03j50J49jJ04j44K28k95L07k50K5
$$ 117 -76 -87 52 -19 -72 59 -12 80 37 59 12 32 72 -31 -181 -32 -33 71 -73 155 -140 167 -83 -58
6881e8J37j29Ln1J00p2mK00O8k96lJ80q9j5L7j4M0L9m3M3j25j85L57k4l5J9J9
$$ -58 79 -50 -47 -98 2 -70 -74 126 194 -102 -105 75 -14 -29 8 -6 34 73 30 73 -52 -237 120 96 61 80 99
6908I9j26J30j35P4r3kK17j11j68J48l5o1m8K04o3p9n9R1oK21k45mJ91l2P1j75
$$ 99 -27 103 -32 42 -51 -53 164 53 -115 33 -2 -63 -111 93 30 -49 -108 -17 -23 198 -47 -51 140 108 179 4
6934DRK0n1Q4j26pNK0qN1j2K09j59k37K82j03J03J4R2k23Q6k20R6kJ22j75J55
$$ 4 13 33 -18 66 -60 -67 -62 -42 -50 1 -11 198 39 -198 84 -19 84 98 190 -33 53 -167 -71 -73 49 -126 29
6961B9p1j01J99j21j7M8J35j30L2P7N6n9k5n2Q3K3n8k9j00J37l7JR8o7J9q5l4
$$ 29 -42 -143 56 -65 -82 -34 101 -29 3 80 136 77 52 0 83 106 48 19 -81 56 19 20 118 51 70 -15 -49
6988d9J49o0j54M8J46j33k27K02L2m7p5J71L5m3N7j23K37k62q4K06P2q7j20J36
$$ -49 100 40 -114 -66 80 -53 -280 -78 -46 -93 -168 3 38 -5 52 -71 166 -96 -180 26 98 11 -109 27
7012B7N1k96J20JJ97j26k3J20k3j4j36r3L26j87o2J84Q2%j96k3J4R1l0J92k94
$$ 27 78 -218 -98 -97 100 -26 -49 71 48 34 -102 -195 131 -56 -118 66 148 148 -48 -71 -57 34 4 196 -98
7037i8J40l9R2o8j0R8P0r7N2j24m2l0J31k8n7J3j37J26p1K65j44L9o8O4k37O5
$$ -98 42 3 95 27 17 115 185 88 140 16 -26 -56 75 47 -10 3 -134 -8 -79 186 42 81 13 77 -160 -95
7063i5Q2j2PR8l3j29J0J06kq9J22J28k31lkr4K26j54j02L29m6L3r7r0R5j84K07
$$ -95 -13 -25 -18 80 47 -82 -72 34 32 -57 65 193 -38 -41 -43 -137 89 -65 -167 162 116 149 52 -38 57 -127 80
7090H0m7J8M1j53J06n6q6R3J43k10j6J75j14J40j27J54j84J43k60K83k65J76J17
$$ 80 33 51 92 -61 45 -11 -97 -4 139 -71 -87 88 -26 114 -13 141 -43 100 -160 123 -142 34 151
7113A51k21J23J22j01k41N0K51j72n5m1K56n4o3r3J22K9Lq4J80j47L5j06J0M5
$$ 151 -70 53 175 74 -167 -117 134 -38 -93 -134 122 68 5 -88 34 63 66 -18 162 15 50 -56 -46 -1
7137aP2J06l46J4K13r9N6J19k16M4k39J93J31k6l5L7j53K19j97r0K69J24p3M6
$$ -1 71 177 -169 -155 58 -41 15 134 -82 -38 -277 -84 47 21 -14 23 -130 89 -108 -198 71 195 122 168
7161A68j99j1n8K60k04R8l8J0q2j17J44k8Q2o6K01k54J42n6Pj21P8N9Q4r8k11
$$ 168 -31 -42 -100 160 -44 54 16 26 -56 -173 -29 -57 25 -41 160 -94 48 -8 -1 -122 -44 15 99 1 -210
7186b10K68K7Q1j47p8P9j18Q5KO8j37J28j5kJ15k37K43j11P9k61J56q2J54j0j68
$$ -210 58 85 166 19 -59 20 -98 -13 -11 57 -80 48 33 31 146 -91 152 41 120 -141 15 -67 87 77 -91
7211i1K06k4k0j71K53o3r0j42L2k9R0N8L5j29K16nj99K12l75K19R0lj75J39k38
$$ -91 115 91 71 -100 153 90 0 -142 -110 -139 -49 9 44 -85 131 126 -73 139 -236 -17 73 70 -105 34 -204
7236b04J75m3R5J02j87k67K51M7p9K06j49O5m9P2l8P7k90K39n5M5j04K9J33q5
$$ -204 -29 -72 23 125 -62 -329 -78 -31 -110 96 -53 12 -37 35 -3 74 -216 23 -32 13 -91 -62 71 -14
7260a4q2K27O1k17J8J84l02m6K12j03n6K39r2p2J11jm4m1n6O1q0k4J07rK2k0J8
$$ -14 -96 131 192 -25 -7 177 -125 -171 41 -62 -118 121 29 -43 68 67 23 -18 -74 -13 -93 -117 -10 -19 3 -17 1
7287AN3r8K4j15J43P1r6K39k36K8Pn1j36J30R9l7p1K36l53K14k4Ok3l7o5J02P5
$$ 1 54 -44 -20 -135 8 79 -17 222 -14 14 21 -30 -166 -36 63 26 -45 191 -162 52 28 34 11 -26 -91 11 86
7314H6j6K9J02r5k52K12k79K38j41N6l3R5J3j47K39m7j38J13N5m8L9j60K63J3
$$ 86 70 99 201 106 -146 66 -213 25 -116 -60 -93 2 15 -132 107 60 -78 35 90 42 81 -79 184 197
7338A97k40J11j80J7Q1P8q5p0R2J44m2j9j29J5k6N0J9j54O6o1J02J22Km5q7q3
$$ 197 -43 68 -112 -95 -14 64 -21 -91 1 145 103 84 -45 -30 -56 -6 13 -141 -75 -136 -34 88 90 45 -42 -125
7364a25J57j14K5M5Jm1P3J16j92J30q4Pr6K07n3j96K43j66r1K2J33J15j16j31
$$ -125 32 -82 -57 -12 -11 -52 21 137 -55 75 -9 -2 -98 109 56 -140 103 -63 -154 -132 1 116 0 -131
7388a31K6K35k61J38k3j10P6n6O8J69r8k6p9J03p9j73J98J03j87Q8O6r7R4K6j
$$ -131 -105 130 -131 7 -16 -126 -50 -106 -38 131 33 7 -72 31 -48 -221 -23 80 -107 -19 47 -50 44 70 69
7413F9j39J7j05R3lL5J27q5P5j25K31k80J62q6R9j90J92M6j51K1n6M6M5j41M7
$$ 69 -70 -53 -158 -65 -68 -33 94 9 84 -41 190 -90 72 -14 85 -105 87 133 -18 3 -53 -7 38 -103 -56
7438e6J63K4j16l0Llk8O7lj0n4O0K9p4j4J28J4r9K0L5j75P5l0M4Q5M3j19J24l8
$$ -56 107 131 15 -15 -12 -15 -43 24 21 11 -43 17 46 -28 -42 86 100 1 21 56 -119 -44 -74 -30 55 98 -21 103 65
7467F5p3j4j21K50r8J42Q4k50J36j21%K0N9P1j09l3k01K61o9J28j37O8k68K47
$$ 65 -8 -22 -143 107 9 151 235 -15 121 0 0 20 79 150 41 8 -193 68 -1 127 -10 58 -210 37
7491C7o3n1J07j77K00J2%j65J85k3%j60J40p9N5lKJ1j19L8M1k0P6j28o7j3j24
$$ 37 -26 -77 30 -147 53 65 65 -100 85 62 62 -98 42 -37 18 15 17 28 -91 -53 -12 -32 44 -84 -151 -164 -288
7518b88L71j84J03n%O4m6r4p8J21O9o4k6l6J86mq0j53Q2J04m8n3J36j05J54k5
$$ -288 83 -101 2 -3 -3 61 15 -79 -157 -36 33 -31 -57 -93 93 89 9 -144 -62 42 -6 -59 77 -28 126 101
7544A01m6j11N4j21J0K11l9qj49J22j53q9K60j12P5J04j51J5l9J22j27N6M8j68
$$ 101 55 -56 -2 -123 -113 98 59 51 -98 24 -129 -218 42 -70 5 109 -42 -27 -66 56 -71 -15 33 -135
7568a35K03j8j12m9K53j71k7J91j27n3p7K22P0j77J27j20j39m0J75r1K37m6l3
$$ -135 68 50 -62 -111 142 -29 -56 135 8 -45 -122 100 170 -7 120 0 -139 -179 -4 -95 142 96 63
7591F3j37k7L4j1n3J16k1K4o9m9P7J0l2p1J53m6j8P2j8p7q8J07L7j2Q1M1j18P8
$$ 63 -74 -101 -67 -78 -131 -15 -36 -12 -81 -130 -53 -43 -75 -146 7 -39 -57 15 -3 -80 -168 -61 -24 -36 45 86 -32 46
7619D6QP4j17Mk02K10m3nJ1k5J83l07L1J76k82J92N3j87J50j07J38j78J92O5O
$$ 46 54 128 11 15 -187 23 -20 -25 -14 -39 144 -163 -132 44 -238 -46 7 -180 -30 -137 1 -177 15 80 86
7644H6l0o6P3j47K25j96P3Q1M0j69KQ5J49j61j71J12J04p0j06J21k1j15K66j07
$$ 86 56 -10 63 -84 141 -55 18 99 139 -30 -28 57 206 45 -126 -14 90 20 -86 35 14 -101 165 58
7668E8j40J20R8k33P1k7L3K4L0r1K17l9j06L9j22M2Q3j54K3P2m4Q8l8j3r3J77
$$ 58 -82 38 136 -97 -26 -53 -20 4 34 -57 160 121 15 54 -68 -26 57 -97 -74 -2 -46 42 4 -9 -102 75
7694G5n7m8j06K00j91j4J46O6q9j44K00p1J82j24J9j47K10j54M2j02J62J02j65
$$ 75 18 -30 -136 64 -127 -141 5 71 -18 -162 38 -33 149 25 44 -103 107 -47 -5 -107 55 157 -8
7717hJ10j64m2K04j27MJ27j66K39k08J21m2K4kq4J4L7N5l0Q0k03K74j85j89J90
$$ -8 102 -62 -104 100 -27 -23 104 -62 177 -31 90 48 72 70 -14 0 37 92 62 142 -61 213 28 -161 29
7742B9j49J01j95J47J48P5L3r2j04l0k7J7n5J48p9P6l8p4J91j69J72j99J9mJ33
$$ 29 -120 -19 -214 -67 81 156 189 97 -7 -37 -64 -47 -102 46 -33 43 5 -69 122 -47 125 -74 -55 -59 74
7767G4o7j19Q2O6R9p8j0n6J8m9r6Q2L9k9k6L2O5l3j15J6O0J82j50J1J7J33j86
$$ 74 7 -112 -30 36 135 57 47 -9 9 -40 -136 -54 -15 -44 -70 -38 27 -6 -121 -105 -45 137 -13 -2 15 148 -38
7794c8o4K55k02o4J31K18N3l58J79p1K1j2l7p2J81k10J56j27J6r3P6J40j2j33
$$ -38 -102 153 -49 -113 18 236 289 -69 110 39 60 48 11 -61 120 -90 66 -61 -45 -138 -62 78 66 -67
7818f7JR8k5O4k16n2K32j06k7Q9J03j7pl7J01j25p0J57j84J3J13j48K48j11J11
$$ -67 -66 32 7 71 -145 -197 35 -71 -98 -9 94 77 70 33 134 9 -61 96 -88 -75 38 -110 138 27 138
7843A38k85K10rL8l0Qj39Q9k87K32qQ0o8l2J01l0R2j53J38k14OJ07M6j24J62k46
$$ 138 -147 63 54 92 62 70 -69 20 -267 -35 -43 37 -31 -63 38 8 100 -53 85 -129 -123 -16 30 -94 68 -178
7869a78J2J65n3j9K15n0l2q4j9l6Q4m6L5MJj2l0o2K49k24Q1J27m6j42j35K63m8
$$ -178 -166 -1 -54 -73 142 92 60 -24 -43 -79 5 -41 -6 -2 -1 -13 -43 -105 144 -80 1 128 82 -60 -195 68 20
7896B0J1j17J8j0j5R6l1K43k3m2j71m2R3r0L7JP9j51L5N6m8LJ20j30L6K2j01K8
$$ 20 31 -86 -68 -78 -93 3 -28 215 192 150 -21 -63 30 -60 -23 -22 57 -94 -59 -3 -51 -48 72 -58 -22 0 -101 -73
7924g3J59L6j80J6n9J11Lj14K9M3j0P8o8O6J8n1J14j15l5PR8k07p7J31K50q4n5
$$ -73 86 122 -58 -42 -101 10 13 -101 -72 -29 -39 39 -29 37 55 4 118 3 -32 -25 73 -134 -211 -80 170 86 31
7951C1l1O3J16k24K22k25O2O2l3J7r0J9L0Q8ol09R1N2k1r7J87J17n7j65jM9n3
$$ 31 0 63 179 -45 177 -48 14 76 43 60 -30 -11 19 107 101 -208 -117 -65 -86 -183 4 121 64 -101 -102 -53 -106
7978a06J36m5N8J45l02J34Q8j62J71j01N8j83J73q6J43k01J31o7j55K4R6K28N9
$$ -106 30 -15 43 188 -114 20 108 -54 117 16 74 -109 64 -22 121 -80 51 -16 -171 -147 -51 177 236
8001B36l07p9J63p5K97k15l2R5n2p8p2J15k2P9j81K02k72J38K13j45j23K8%M6
$$ 236 -71 -150 13 -62 235 20 -12 83 31 -47 -119 -4 -26 53 -128 74 -198 -60 153 8 -115 -87 -87 -41
8025d1M5l4O7r7J43K4l00J61K1P3M1J04j44n4J30j50J0J1RJ13j91K87k99OJ92
$$ -41 4 -30 37 -60 83 107 -193 -32 -11 62 103 207 63 9 139 -11 -1 10 19 132 -59 228 -71 -65 127
8050A27j22o9O0J05k14kl6J38N8k4j21q6K70j73J4q0J12lj8J10K5J16j55j06N
$$ 127 5 -64 -4 101 -113 -115 -151 -13 45 21 -100 -186 84 -89 -75 -155 -43 -46 -64 46 71 187 32 -74 -69
8075f9J32k82K58k2J0R2j78J07l28K28N7J51n8j40PQ6k60J90P0r5J46j47l7K2
$$ -69 63 -219 39 17 27 119 -59 48 -280 -52 5 156 98 -42 -35 51 -209 -19 51 -44 102 -45 -82 -60
8099f0J3P3j44k0J05NJ7J29pj20K4J06p9l4kO6j67O7N2M1j18K09j92RJ46j66J00
$$ -60 -47 26 -118 -138 -33 -28 -11 118 111 -9 15 121 42 8 6 72 -95 -28 24 65 -53 156 -36 -27 119 -47 53
8126E3m5J85k85P1k6p4j00J29O2R0p0J00L6k01P0m4j8l6q5K38m9m2r2j6J31j28
$$ 53 8 193 -92 -21 -47 -121 -221 -92 -30 60 -10 90 126 -75 -5 -49 -67 -103 -188 50 1 -41 -133 -149 -18 -146
8152a46M6J33j21O4R1nq3k8N2O1j1j59J03l3M4j14R4j4K7n3M2O4j20J61j2k06
$$ -146 -100 33 -88 -24 67 62 -21 -49 3 64 53 -106 -3 -36 8 -106 -12 -26 1 -52 -10 54 -66 95 83 -123
8178a23J9K29j05rM4r3N2N7K1j36L3N8K1
$$ -123 -104 125 20 11 55 -38 14 71 92 -44 -11 47 68
8191F8
$$ Imaginary data points
##PAGE= N=2
##DATA TABLE= (X++(I..I)), XYDATA
0@%%%%%%%%%%%%%%%%%%Qj6J6j6J6j6K4l2L2l8M6n0N8o7P5q8J00j09J21j36J54
$$ 0 0 0 0 0 0 0 0 0 0 0 0 0 0 0 0 0 0 0 8 -8 8 -8 8 -8 16 -16 16 -22 24 -26 32 -35 40 -48 52 -57 64 -72 82
39H2j74J94k16K40k66K92l20L57l96M35m80N29n83O42p06P79q62R56j064J187
$$ 82 -92 102 -114 126 -140 152 -168 189 -207 228 -252 277 -306 336 -370 409 -453 503 -561 626
59F26j333J508j719J981k318K771l414M407o172J0259m0720n041N3928Q755p792
$$ 626 -707 801 -918 1063 -1255 1516 -1898 2509 -3663 6596 -34124 -39165 14763 23518 15726
74A5726j4528J2105J2332m763k9009k4120o077J8675K3457J7458P60j1193j0199
$$ 15726 1198 13303 25635 20872 -8137 -32257 -38334 -19659 3798 21256 22016 10823 624
87F24N361N904q724k5659j5927J6890L6301J7415j4107k3488j762J6057M641j8388
$$ 624 5985 11889 3165 -22494 -38421 -21531 14770 32185 18078 -5410 -7172 8885 13526 -4862
101d862k0079J09K0788K0001L287q615j0079n981K028M365j21p920r041O120K0811
$$ -4862 -24941 -24832 -4044 15957 19244 10629 550 -5431 -3403 962 841 -7079 -16120 -10000 10811
116A0811J3543j0071k3425r387J4673J4965n210j6538m528J5224J6711k133j5116
$$ 10811 24354 14283 -9142 -18529 -3856 11109 5899 -10639 -15167 57 16768 14635 -481
129d81r811J496P631M227m93j661k850k27N210N112l113j1613q497Q299J6292
$$ -481 -10292 -8796 -1165 3062 2569 908 -1942 -2169 3041 8153 5040 -6573 -15070 -6771 9521
144I521L890j1536j0556M073J2176O17j2628q937N456J2709N429n006m757n9p76
$$ 9521 13411 1875 -8681 -4608 7568 8185 -4443 -13380 -7924 4785 10214 5208 451 392 -384
159c84j912r71L49M28j094K106Q369N058n478j1468n000O548O131l938n869L281
$$ -384 -2296 -3267 -2918 -2490 -3584 -1478 6891 11949 6471 -4997 -9997 -3449 2682 -1256 -7125 -3844
175c844J0583O188o792r571j645K440J53l082L39O598N364j518k160l17q08m292
$$ -3844 6739 12927 6135 -3436 -5081 -2641 -2488 -5570 -5231 1367 6731 5213 3053 2736 1928 -2364
191b364o193L26P252M409r49j091L112L155m279q763l000M235M074p18j724M787
$$ -2364 -8557 -8231 -979 3430 2481 1390 4502 7657 3378 -5385 -8385 -4150 -76 -794 -2518 2269
207B269O843r78q072n768J017L854r09l585K556O787L739k279n072j611j48k512
$$ 2269 9112 8134 62 -5706 -4689 -835 -1744 -5329 -2773 4014 7753 5474 402 -1209 -1357 -3869
223c869j766K671M470J766k145k8M151M05o769p491O83Q327M669l892m047K696
$$ -3869 -5635 -2964 1506 3272 1127 1099 5250 5655 -1114 -8605 -7922 405 5074 1182 -2865 -169
239a69O108P66p128o366J069M098K313M58K11Q24k76j425N03L07l004m388J56
$$ -169 5939 6705 -423 -6789 -5720 -1622 691 1149 1360 2184 1908 483 986 1293 -1711 -6099 -5943
256e943O768O470k229p236j886M905M689l961q021j058P396N887p56n214j854
$$ -5943 825 7295 5066 -2170 -4056 849 5538 1577 -6444 -7502 -106 5781 5025 -189 -2043
271b043J853J029p06q80j172k69L82K970M123q19o110l844K997N980O27o753l684
$$ -2043 -190 839 133 -747 -1919 -2188 -1806 1164 5287 4468 -1642 -5486 -2489 3491 4118 -2635 -6319
288f319N076P239O15o804n678K374N171J020k753k289Q03K559J275k5j227k758
$$ -6319 -1243 5996 6611 -193 -5871 -3497 1674 2694 -59 -2348 -1545 1014 2289 2264 1037 -1721
304a721j915J399L846K504l398m753J405N663K491m667o769R43O554L288k898
$$ -1721 -3636 -2237 1609 4113 715 -4038 -2633 3030 5521 854 -5915 -4972 1582 4870 1972
319A972n026mM207K122k152k485j116J107J652J028N96r63l041j7K762K589j722
$$ 1972 -3054 -3058 1149 3271 1119 -1366 -2482 -1375 277 1305 1901 938 -2103 -2120 642 3231 1509
336A509m694j197N012L885j734n184j911M093M001j574m235j192K608L240o33
$$ 1509 -3185 -4382 630 4515 2781 -2403 -4314 -221 3780 2206 -2029 -3221 -613 2627 1994
351A994k376p94k2R35Q63O19k37k063j268K120K831k89l448k500K506M533l23
$$ 1994 -382 -1176 -1198 -263 600 1219 982 -1081 -2349 -229 2602 2313 -1135 -3635 -1129 3404 3081
368C081m158k498J969M272K24l855j861J703K602P84j978j393K76K86R12O21m69
$$ 3081 -1077 -3575 -1606 2666 2890 -965 -2826 -1123 1479 2263 285 -1108 -832 -546 366 987 518
385E18j016j217J112K722K72l099k470J174L881J346l319k789J219L569J263k997
$$ 518 -498 -1715 -603 2119 2391 -708 -3178 -2004 1877 3223 -96 -2885 -1666 1903 3166 169
401A69l014P62K568J296p01j868j34R01N10P46o51j576j089P97K456J622k190
$$ 169 -2845 -2083 485 1781 1080 -788 -922 -21 489 1235 584 -992 -2081 -1284 1172 2794 604
418F04k726J99K930J896k297l678L44L284K448r22l115q39J861J627o06j790q89
$$ 604 -2122 -1923 1007 2903 606 -3072 -2728 556 3004 2082 -1033 -1872 -11 1616 1010 -780 -1669
435a669P42J377J040K66j345k195K78J769J440p48l061l88K985K541p70l488j659
$$ -1669 -927 450 1490 1756 411 -1784 -1506 263 1703 955 -2106 -2494 491 3032 2262 -1226 -2885
452b885J923K634n1k233j536J324K304O67j391j539q47R11J046O96n21j402n96
$$ -2885 -962 1672 1621 -612 -2148 -824 1480 2147 756 -783 -1630 -719 327 1023 502 -900 -1496
469a496J888J631j49k454k252J386K803P33k070j880O65K742N87k083j705j85
$$ -1496 392 2023 1874 -580 -2832 -1446 1357 2090 20 -1860 -1195 1547 2134 51 -1654 -1839
485a839J585J394p2r57q36M7J196N75n65j114r90N24K278N25j316j835J08K123
$$ -1839 -254 1140 1068 111 -725 -678 518 1093 528 -586 -1576 -1052 1226 1751 435 -1400 -1292 831
503H31R77j480j842k47K096J272o20j821j61P14J155O1r58q81j9Q97J070Nj120
$$ 831 1808 328 -1514 -1761 335 1607 987 -834 -995 -281 874 935 -23 -904 -923 -26 1044 1049 -71
522g1j007q3J680J099j391j440o1J592J419q98j951m20J272J577k7j626p86P15
$$ -71 -1078 -1161 519 1618 227 -1213 -1274 318 1737 839 -1112 -1532 -260 1317 1290 -336 -1122 -407
540d07R08K87o35p65j25N83P55N21j009j101J59P51J185m18j580l44J207J464
$$ -407 501 788 153 -612 -737 -154 601 1122 113 -988 -829 -78 1107 689 -891 -1235 -28 1436
558A436n9j835q85O01J379M66r62j151L79J364N38o89j418n22N93J246N11n67
$$ 1436 1377 -458 -1343 -742 637 1103 141 -1010 -631 733 1271 582 -836 -1358 -765 481 992 425
576D25j041p3J289N09l74j580j096Q97J878O95j143j166O4J555L48r57j617l13
$$ 425 -616 -689 600 1109 735 -845 -1941 -1044 834 1529 386 -780 -716 839 1187 230 -1387 -1700
594a700J374J371L40o10j212m34J140L34m32j197p84J551J689M29j136j568m39
$$ -1700 -326 1045 1385 775 -437 -871 269 603 171 -1026 -1810 -259 1430 1859 723 -845 -1284
611a284J349N41o28j162l04J532J816j7j511j317l03J228N24m33o40l04J202J698
$$ -1284 65 606 -22 -1184 -1488 44 1860 1843 332 -985 -1288 -60 464 31 -609 -913 289 1987
629A987k91j435j686l53J230J059j14q26k5R34J355m67j547j395j97J383J103
$$ 1987 1696 261 -1425 -1778 -548 511 397 -429 -454 480 1835 1368 -179 -1574 -1771 -388 715
646G15m9m92k46M81R42m83j464j194N3J335J328K46o80n74M35N83m16j404r89
$$ 715 666 174 -72 409 1351 868 -596 -1790 -1737 -402 926 1172 492 -82 353 936 520 -884 -1873
665a873K62J556J535o9q29n10j46M31m42j086k41L10J474J326o2r77r59m48L63
$$ -1873 -1611 -55 1480 1411 582 72 -74 357 -85 -1171 -1412 -1102 372 1698 1636 659 -300 -748 -385
684c85P2p40O7N16J215J057k84j086r83n43K60L19k9J51N78Q87O05m48j214r28
$$ -385 -313 -1053 -986 -470 745 1802 1518 432 -551 -1094 -834 -515 -544 -393 185 1072 1677 1229 15 -913
704i13m06L51O97J46L04L34N21J55o95j072o06j75N09R37L74M44K96l20j94p29
$$ -913 -1319 -968 -271 -125 179 513 1034 1189 494 -578 -1184 -1359 -850 87 461 905 1201 881 687 -42
724d2p99l46o1N62J148N04J32o9o68m01m78n79J72L14L16Q63N77J26m96q16n82
$$ -42 -841 -1187 -1248 -686 462 966 1098 1029 361 -40 -518 -1097 -925 -611 -295 568 1145 1271 775 -41 -623
745f23m35k2L36O55M20O20K13n0l72j317p46J90L74O16M93L15K06J88k61p53j206
$$ -623 -1058 -1080 -744 -89 331 951 1164 1114 742 -575 -1321 -1131 -757 -141 352 667 873 1061 800 47 -1159
766a159n49M09R22R18O11m10j53J46n13n94o99n10O04J100J108J28o27o64o2j57
$$ -1159 -1708 -1299 -377 541 1152 742 589 735 222 -372 -1071 -1581 -977 123 1231 1359 732 68 6 -151
786a51m66l27l70O03J248J075j49j034n45m24m9J61k01k90O39J329N70k75j232
$$ -151 -617 -944 -1314 -711 537 1612 1463 429 -116 -540 -589 -428 -629 -919 -280 1049 1619 1344 112
805A12r89l19N52L38p1k2O14R83J22l32j231j267K28Q46N16K22j57K98N34L10
$$ 112 -877 -1196 -644 -306 -377 -399 215 1198 1320 988 -243 -1510 -1282 -436 80 302 145 443 977 1287
825A287p54j085j144L29J130P33J10k01q5L94J6o66r52o64K79J388O88J55m98
$$ 1287 533 -552 -1696 -1367 -237 496 606 405 320 714 730 64 -888 -1552 -1273 115 803 958 460
844D60m71L31r9k84r25l93P05J008Q66p7p47n80l5L29l58n28l23O33J141N36k93
$$ 460 -11 320 221 -63 -988 -1381 -676 332 1198 1121 374 -206 -241 88 -270 -798 -1121 -488 653 1189 896
865H96o85p24P4K31j5k85j37N15R69L44m87o88p79n4N38L20m19J63L86N13K39
$$ 896 211 -513 -439 -208 -223 -508 -645 -130 839 1183 696 8 -771 -825 -287 33 -386 -223 163 676 915
886I15m27r13m73J74M93K52P8l1J53K67K09n85p72k19N4Q34K63N7j39k9K91Q9
$$ 915 488 -425 -898 -724 -231 21 99 68 221 488 697 112 -660 -879 -825 9 272 329 190 161 452 541
908E41p60m06k17L91O22K97m9j18l62K50N2l68m19L4K40N89M95n24Om42J07M9
$$ 541 -219 -625 -842 -451 171 468 419 301 -61 189 241 -127 -546 -512 -272 317 812 288 294 -148 -41 8
930Hl83j20O0M08L50p0r8k01j77MP5k86j2M38J16K60q6l15o4M1M1j20r5Q1K11
$$ 8 -375 -495 -435 -27 323 253 155 -46 -223 -219 -144 -430 -442 -4 112 372 286 -29 -93 -52 -11 -131 -226 -145 66
955F6J82q9K23k67l18p7J20J91j43j4K94P8Q7l22j16r3J13Q1jl9p0K27J38j21
$$ 66 248 159 382 115 -203 -280 -160 31 -112 -126 168 246 333 11 -105 -198 -85 -4 -5 -44 -114 113 251 130
979A30j68Rj96L49j83K18j29k38L05KP2j06j53J23Q3nr1k1k10K94J04k75p8J69
$$ 130 -38 -29 -225 124 -59 159 30 -208 97 99 171 65 -88 35 118 113 22 1 -209 85 189 -86 -164 5
1003El6K52j07j76J11N3j49K26Jk03J03l36L83O6j93j20j69L31K55j64k1k07J07
$$ 5 -31 221 114 -62 49 102 -47 179 180 -23 80 -256 127 193 0 -120 -289 42 297 133 112 -95 12
1026A2K8j9j23L7k8P5N4j65J17Q5j36j90K76j65j32J35K14M56m55k9k80R3N3L2
$$ 12 40 21 -102 -65 -93 -18 36 -129 -12 73 -63 -253 23 -142 -274 -139 75 531 76 47 -233 -140 -87 -55
1050e5n6j25L38R6j8j28j02j56p1n1K65J33J76p5j98K71k1m31k48K88J07K17J5
$$ -55 -111 -236 102 198 180 52 -50 -206 -277 -328 -63 70 246 171 -27 244 223 -208 -456 -168 -61 156 171
1073A71q5j05O3O7j59k48Q7N6Q5O1K26q8J17j46l29Q7n6L3k5J61M22p1k44n7j13
$$ 171 86 -19 44 111 -48 -296 -209 -153 -68 -7 219 131 248 102 -227 -140 -196 -163 -188 -27 395 324 80 23 -90
1098i0M4j13j18J69M38k94L34l8l01rJ5l91J07M3R8K72lJ72j02o3j95k46OK50
$$ -90 -46 -159 -277 -108 330 36 370 332 31 22 37 -354 -247 -204 -106 166 163 335 233 170 -25 -271 -265 -15
1122a5k7N3Q8R2j25J1j53M6q0j65L12p5L41m6j56j26J94l37K2q4J7K82K96K0q0
$$ -15 -42 11 99 191 66 77 -76 -30 -110 -275 37 -38 303 257 101 -25 169 -168 -146 -230 -213 69 365 385 305
1147C05k27k53Q7k00P0J89m3M4M91k01j2k56l52J09rK36j98K14R7K53o2m13J3
$$ 305 78 -175 -88 -288 -218 -29 -72 -28 463 262 250 -6 -358 -249 -258 -22 -220 -6 91 344 282 -131 -118
1170a18j46J99j79L90K0ORJ33j55j62q1j02p2J36J38K36k01J14N6j69k95J54q7
$$ -118 -264 -65 -244 146 166 172 181 314 159 -3 -84 -186 -258 -122 16 252 51 165 221 52 -243 -89 -176
1193a76K8K70k0J29j07k25N7l1m2n8Q9P3K2L58j00o1k90j9k2P1q2n6J60L08k34
$$ -176 -148 122 102 231 124 -101 -44 -75 -117 -175 -86 -13 9 367 267 206 -84 -103 -125 -54 -136 -192 -32 276 42
1218D2O7J5k05m7J03k30K73j20J98q5J76p3o0k35J30J25k13M9O0J45n8O0m8j22
$$ 42 109 124 -81 -128 -25 -255 18 -102 96 11 187 114 54 -181 -51 74 -139 -90 -30 115 57 117 69 -53
1242e3k7j05L24j88O2n2J1J00k4r0mJ29p2J5J97m43K58j09J17r4j50J03L6J02
$$ -53 -80 -185 139 -49 13 -39 -28 72 48 -42 -46 83 11 26 223 -220 38 -71 46 -48 -198 -95 -59 43
1266D3mM6k6j22j50K02J10k42P4N4q4O9O1l4o3J4J23mk1J05j71J16j20J40j74
$$ 43 39 85 59 -63 -213 -11 99 -143 -69 -15 -99 -30 31 -3 -66 -52 71 67 46 151 -20 96 -24 116 -58
1291e8J07M0Mnj58j7L43j20n7j77N6O6R4r8N4l1j10J92j16j85J39m8K4J34O4r8
$$ -58 49 89 93 88 -70 -87 256 136 79 -98 -42 24 118 20 74 43 -67 125 9 -176 -37 -85 -61 73 137 39
1317C9J1k55J95n9q7P8NJ63p6O4P2k11J01O9J0j71J25N0O2r0M4k46J41k59P7M4
$$ 39 50 -205 -10 -69 -156 -78 -73 90 14 78 150 -61 40 109 119 -52 73 123 185 95 139 -107 34 -225 -148 -104
1343a04K4J06k4Q2J88k49o0j69J25J22n0k5K01r5j35K27j96j22k25K82p1K26N5
$$ -104 -80 26 2 84 272 23 -37 -206 -81 41 -9 -34 167 72 -63 164 -32 -154 -379 -97 -168 58 113
1366A13q1J16q9q4j68O6l4K4K81o6J09j72J15l19L5l3J38k00J69K11K09j57l6
$$ 113 32 148 59 -25 -193 -127 -161 -137 144 78 187 15 130 -189 -154 -187 -49 -249 -80 131 340 183 147
1389A47k76RQ3Rj24m0K74j13K03L8k48m9r4k2L2j61L55J29k3k2O4k19j57R9k10
$$ 147 -129 -120 -37 -28 -152 -192 82 -31 172 210 -38 -87 -181 -203 -171 -332 23 152 129 107 171 -48 -205 -106 -316
1414c16L92j63J59J56j04N3m2m11J16j42J62K46q9K13j21o3P1j34k97J13R0r6
$$ -316 76 -87 72 228 124 177 135 -276 -160 -302 -140 106 17 230 109 46 117 -17 -314 -201 -111 -207
1436b07K21J68J3J00j76l47L68l48J47j31J98J83K9q7M1j52k66J96m10L48K27
$$ -207 14 182 195 295 119 -228 140 -208 -61 -192 6 189 218 131 172 20 -246 -50 -460 -112 115
1457A15N5J75q8j00k51R8k26M7M6O9J50j32L53l21N6l4j44j58K17J55j11NK23
$$ 115 170 345 257 157 -94 4 -222 -175 -129 -60 90 -42 311 -10 46 12 -132 -290 -73 82 -29 -24 199
1480A99j48M0j22k09J12m3j13L39L95k15j72J50k53j8k4j23j0J09K89l5J20l53
$$ 199 51 91 -31 -240 -128 -171 -284 55 450 235 63 213 -40 -58 -82 -205 -215 -106 183 148 268 -85
1502h5J06k61J59o3P6q5K32R4j50p1R4k53q3J51qJ38r9RJ85K6o5p1o7j50K93l79
$$ -85 21 -240 -81 -144 -68 -153 79 173 23 -48 46 -207 -290 -139 -147 -9 -108 -99 86 112 47 -24 -91 -241 52 -327
1528c27L04J89j28K15l16J54k01q6j03K44pJ40j27K33j4N9j78j12l04J31L95p8
$$ -327 -23 166 38 253 -63 91 -110 -196 -299 -55 -62 78 -49 184 170 229 51 -61 -365 -234 161 83
1550H3m5K30l30P0L1k15Q2J27n0J2K79j60Nk57P3n6M5J1N8l9J77Q2j17j98J84
$$ 83 38 268 -62 8 39 -176 -94 33 -17 -5 274 114 119 -138 -65 -121 -76 -65 -7 -46 131 213 96 -102 82
1575H2k04K0m7R9M7P5lQ4o1q2j3O2j96N4OJ99m4J34k70J4j0pP5m5J12j59J69J23
$$ 82 -122 -102 -149 -50 -3 72 69 153 92 10 -3 59 -137 -83 -77 122 78 212 -58 -44 -54 -61 14 -31 81 -78 91 214
1603B14Qj8l11J48j68J17J73l86L53j87j7J87lj52Ok1j13K62k3j11J37l4M6j33
$$ 214 222 204 -107 41 -127 -10 163 -223 130 -57 -74 113 110 -42 -36 -57 -170 92 69 -42 95 61 107 -26
1627b6j60J20J12O2j89J88j9l4J82k38n6k9N9J7p7K59N5k51K07k13J00j80J52
$$ -26 -186 -66 46 108 -81 107 88 54 236 -2 -58 -87 -28 -11 -88 171 226 -25 182 -31 69 -111 41
1650D1m9j83J69RJ75j93j29J26J78k30j5R9j27J29k0P2oj42J01l0O0J28l15J48
$$ 41 -8 -191 -22 -13 162 -31 -160 -34 144 -86 -101 -2 -129 0 -20 52 46 -96 5 -25 35 163 -152 -4
1674dj66K09n3j79K15J82j17j31j57J57J27j56M4M7q7J82j94j8j96K50J10l5p1
$$ -4 -170 39 -14 -193 22 204 87 -44 -201 -44 83 -73 -29 18 -69 113 -81 -99 -295 -45 65 30 -41
1697d1k6K85p2j58L1J36q3j57j08J74J63k23j25J33P2K17j73q8KQ8j2Q8j44J38
$$ -41 -67 218 146 -12 19 155 72 -85 -193 -19 144 -79 -204 -71 1 218 45 -43 -41 47 35 123 -21 117
1721A17j38n8O5M6J18k02oOJ39N0Kj90j06L49k60P4j86KK35O5j23j40K02j06n3
$$ 117 -21 -79 -14 32 150 -52 -58 -52 87 137 139 -51 -157 192 -68 6 -180 -178 57 122 -1 -141 61 -45 -98
1746i8JmO6J61j97J30n5j9n5r0R0P9q0j02K02J73P3k01k06M0K26q3k80L03p1O4
$$ -98 -97 -101 -35 126 -71 59 4 -15 -70 -160 -70 9 -71 -173 29 202 275 74 -132 -92 134 51 -229 74 3 67
1772F7r5K2n0j4J20j33k3J74J10j3j27K1k1m9j09o7J55Q5n1L6j9K0J98k60k19
$$ 67 -28 -6 -56 -70 50 -83 -106 68 178 165 38 59 38 -11 -120 -187 -32 53 2 38 19 39 237 -23 -242
1797b42J31J68KL3N6j34P6k00n5J02K11m18K42lJ26Q7J17l49j8J1M1k01J13J79
$$ -242 -111 57 59 92 148 14 90 -110 -165 -63 148 -270 -28 -31 95 182 299 -50 -68 -57 -16 -217 -104 75
1821G5p2J94k45R5J07l28j02k4K98R5L4j65m1j02L54k38K4m3k0K78J0k79J48K1
$$ 75 3 197 -48 47 154 -174 -276 -300 -2 93 127 -38 -79 -181 173 -65 -41 -84 -104 174 184 -95 53 74
1845G4J0k10j76K15j08J58j75O06l41n5j30O0l5j4j0%K56P0o5q5J09k06k6j41
$$ 74 84 -126 -302 -87 -195 -37 -212 394 53 -2 -132 -72 -107 -121 -131 -131 125 195 130 45 154 -52 -78 -219
1869b19N7M6K78j69J56j88J14P5k81k6J17kJ37j67J23K0K11k37j24Q9j6M8j54
$$ -219 -162 -116 162 -7 149 -39 75 150 -131 -157 -40 -42 95 -72 51 71 282 45 -79 10 -6 42 -112
1892a12R4J41J27l03j03J19Q0Nk29K24Q3O5j25r0j22L20j74k65K39l3J68m6j27
$$ -112 -18 123 250 -53 -156 -37 43 48 -181 43 126 191 66 -24 -146 174 0 -265 -26 -59 109 63 -64
1915f4J10K83k84P8o3j16K03j14j61L20P5k3l21m8rR5l6p2l4K42j30J03j58J78
$$ -64 46 329 45 123 60 -56 147 33 -128 192 267 244 -77 -125 -134 -39 -75 -147 -181 61 -69 34 -124 54
1939E4K0q7m0o8J97J01k77j59J88J42K2j59N4J8Nj81o5K10J76P9k44j35J91J21
$$ 54 74 -13 -53 -121 76 177 -100 -259 -71 71 93 -66 -12 6 11 -170 -235 -25 151 230 -14 -149 42 163
1963A63m6k84O8J76J8j13Mj12K09l7k19O2K48P5j85o5P6J7K20m83J46N6J40j9
$$ 163 117 -167 -99 77 95 -18 -14 -126 83 46 -173 -111 137 212 27 -38 38 55 275 -208 -62 -6 134 115
1987A15k71L13L7j26k06M8m0N2O0o0J30j4J0n2j30J65j19n9K00M7k18J91j74l0
$$ 115 -156 157 194 68 -138 -90 -130 -78 -18 -78 52 38 48 -4 -134 31 -88 -147 53 100 -118 73 -101 -131
2011a31J55p3N2q3r0L25L0k77L8J06o4j02P8Q7j00Q1j05l7K14k35K72k19Q4J47
$$ -131 24 -49 3 -80 -170 155 185 -92 -54 52 -12 -114 -36 51 -49 32 -73 -110 104 -131 141 -78 6 153
2035A53lk32k6J19mO5j99J12K5k9kn6N2j4J54j96rJ95k11J01r3K15P2j24n4j13
$$ 153 150 -82 -108 11 7 72 -127 -15 10 -19 -21 -77 -25 -39 115 -81 -90 105 -106 -5 -98 117 189 65 11 -102
2061a02P5J05j50J57p2oO1k7q3j41N4J13N9J98k18o1J54j85K57k20j3j2N4K6J1
$$ -102 -27 78 -72 85 13 7 68 41 -42 -183 -129 -16 43 241 23 -38 116 -69 188 -32 -45 -57 -3 23 34
2086C4j20n8K28k36J37k6N8j0l7j61L0J76nP5j64j53J24L03m41J62K12k29K10
$$ 34 -86 -144 84 -152 -15 -41 17 7 -30 -191 -161 15 10 85 -79 -232 -108 195 -246 -84 128 -101 109
2109A09k17J70J32j75J08l19M04l7j45J7j94J11R3M9j71L6L3K72k85q4J30pj37
$$ 109 -108 62 194 19 127 -192 212 175 30 47 -147 -36 57 106 -65 -29 4 276 -9 -93 37 30 -107
2132a07J90k44L26o3o5j31R3J56p4j10q4Q6K17j24j19k2J76r4j16K04j36J17r0
$$ -107 83 -161 165 102 37 -94 -1 155 81 -29 -113 -27 190 66 -53 -75 101 7 -109 95 -41 76 -14
2155a4Q7L7N3j15l2J72j51R7j15m1P2j24J58O6k43N7R2l7p2o1K41m3l7j60J68
$$ -14 73 110 163 48 16 188 37 134 19 -22 50 -74 84 150 -93 -36 56 19 -53 -114 127 84 47 -113 55
2180E5m4o9j58J1L22j28L0l5J88l27j9J33j06K84k45K19p3j7r7J53p6l83K46O6
$$ 55 11 -58 -216 -205 117 -11 19 -16 172 -155 -174 -41 -147 137 -108 111 38 21 -76 77 1 -382 -136 -70
2204g0m3M2J15K26k59o2pj3J23n7K3j85J63L06k78J5k3n3l5r9R6J32J9Ll7o0n9
$$ -70 -113 -71 44 270 11 -51 -58 -71 52 -5 18 -167 -4 302 24 39 16 -37 -72 -171 -75 57 76 79 42 -18 -77
2231g7Q9m9m8J42p3k5J97q7p9O5n2n8M5j7K2pJ2K4L0Q4r5n4k26J61J22n0J76j06
$$ -77 12 -37 -85 57 -16 -41 156 69 -10 55 3 -55 -10 -27 -5 -12 0 24 54 138 43 -11 -237 -76 46 -4 172 66
2259F6J6j56k2J52j41j05J71J70j04p5m6l3rK01k06O7qJ79r5j08K43j68J07o8
$$ 66 82 -74 -96 56 -85 -190 -19 151 47 -28 -74 -107 -116 85 -121 -54 -62 117 22 -86 157 -11 96 28
2283B8L8p8Q6j23Q1nJ70k07n2J38mj54O9o0N9L0q0J0K9lj31PK3K12j43J58j79
$$ 28 66 -12 74 -49 32 27 197 -10 -62 76 72 -82 -13 -73 -14 16 -64 -54 -25 -28 -159 -152 -129 83 -60 98 -81
2310h1N7J2k3O1j87K33j50K36j56j03Q3K02k75O8o1J76rQj02J20O3p4J12q5m7
$$ -81 -24 -12 -35 26 -161 72 -78 158 2 -101 -18 184 -91 -23 -84 92 83 91 -11 109 172 98 210 125 78
2335G8j51N5k18J74K06o2m4J58k35l7J40k36j8K85Q6k47J45q7j61K90j50j5q9
$$ 78 -73 -18 -236 -62 144 82 38 196 -39 -76 64 -172 -190 95 181 -66 79 -8 -169 121 -29 -44 -133
2358a33J04J5k9J41n9K2r2K03k57o3P5K31j54k1j17m5L30j97j02J80j0p3J03r7
$$ -133 -29 -14 -43 98 39 61 -31 172 -85 -148 -73 158 4 -17 -134 -179 151 -46 -148 32 22 -51 52 -45
2382d5l4J64m9J04j22%J2%j1j12J31j39O1j78J86j4P7j76K17l2M5O6Q1j87p7P
$$ -45 -79 85 36 140 18 18 30 30 19 -93 38 -101 -40 -218 -32 -46 31 -145 72 40 85 151 232 45 -32 -25
2408b5J47k00J53j31J53j45j3N2M1k24J48n8K71n0j82k2O0N8j37O5j3R5pK8J04
$$ -25 122 -78 75 -56 97 -48 -61 -9 32 -192 -44 -102 169 119 -63 -85 -25 33 -104 -39 -52 43 36 64 168
2433A68j53j29J05qP7o7J32j08N9n1N5J6j85K7J79j27k6P8l3n8J14N0k61J6J76
$$ 168 15 -114 -9 -17 60 -7 125 17 76 25 80 96 -89 -62 117 -10 -36 42 9 -49 65 115 -146 -130 46
2458D6L1k01k1K2J32l4n5J13q3J75k78J92m4k0J27j67J76j1O6j45R9j38j6O7J2
$$ 46 77 -124 -145 -123 9 -25 -80 33 -50 125 -153 39 -5 -25 102 -65 111 100 166 21 120 -18 -34 33 45
2483D5q3j1k8n7J35n2R0J9N1j32J02j07l1J60L4o7q1n8N1J8j1j19N4O8q6J20j00
$$ 45 -38 -49 -77 -134 1 -51 39 58 109 -23 79 -28 -59 101 135 68 -13 -71 -20 -2 -13 -132 -78 -10 -96 24 -76
2510g6j4J48q1K3Ln8j63R0Q1J26L5j70J86k94K29mn9j17J0K87j75Kk08M55k21
$$ -76 -90 58 -23 0 3 -55 -218 -128 -47 79 114 -56 130 -164 65 61 2 -115 -105 182 7 9 -199 256 35
2535C5p8O6J17j90J76O2j78J27j33OJ38N5j84M9j08K5M1J12k17J04k6p2M2K1K47
$$ 35 -43 23 140 -50 126 188 10 137 4 10 148 203 19 68 -40 -15 26 138 -79 25 -1 -73 -31 -10 237
2560B37l21N5j06J73J43k39n6LKj9J06Kj23J10L8O3K3r7j6Qk5J26K01k93K6k53
$$ 237 -84 -29 -135 38 181 -58 -114 -111 -109 -128 -22 -20 -143 -33 5 68 91 -6 -22 -14 -39 87 288 -5 21 -232
2586b32J98K9J02o3l5M5k9L8m8k3o9J6J48J30j01n8k1O5R8k34k9J43j09j17J24
$$ -232 -34 -5 97 34 -1 44 15 53 5 -18 -87 -71 77 207 106 48 27 92 190 -44 -73 70 -39 -156 -32
2611c2m1J73q4j45K45J0r9k43J08K13l5pn0J34L0j10p4n4j2J10Kj5k8L9j61J19
$$ -32 -73 100 16 -129 116 126 27 -216 -108 105 70 63 13 147 177 67 -7 -61 -73 37 39 24 -4 35 -126 -7
2637gJ5O8O9j3j25j34P6J34p0o8J65j05nk0rK3l8m1K03j54l5O4po4LL0%Q4m9r9
$$ -7 8 76 145 132 7 -127 -51 83 13 -55 110 5 0 -20 -29 -6 -44 -85 118 -36 -71 -7 -14 -78 -75 -45 -45 39 -10 -109
2667a09K66k69l8K16j92K57l7j34K41k11op1J28J32l4j20N4j28l4J51l9P2j85
$$ -109 157 -112 -150 66 -126 131 94 -40 201 -10 -16 -87 41 173 139 19 73 -55 -89 62 23 95 -90
2690i0M3J25O5j51OR5j4l16J22J31N2j07r3J04j1L94m29m2K06o4L9r7J23j42o4
$$ -90 -47 78 143 -8 -2 93 79 -237 -115 16 68 -39 -132 -28 -39 355 -74 -116 90 26 65 -32 91 -51 -115
2715a15J01L8o4JO4k1O2m5O0j55j0j84J90O9J9J15j38J6l2k8p3J10jR2p5P9k01
$$ -115 -14 24 -40 -39 25 4 66 21 81 -74 -84 -268 -78 -9 10 125 -13 3 -29 -57 -130 -20 -21 71 -4 75 -126
2742a26J84k23P1Q4m9q6K70o8j94K81j22o4k4n2J16q9jJ6J28j75P3L0K4j18j8
$$ -126 58 -165 -94 -10 -59 -145 125 57 -137 144 22 -42 -66 -118 -2 -91 -92 -76 52 -123 -50 -20 4 -114 -132
2767a32J89j07J01j39M3J05O2k05j10J08L57l76l4J42M6k6O6k02J65j7p0q0L44
$$ -132 57 -50 51 -88 -45 60 122 -83 -193 -85 272 -104 -138 4 50 24 90 -112 53 36 -34 -114 230
2790B30k40o7O0M5Qj4k7j3j2m4j35lJ81J67k68Q3j5J10m4L8j8K02j89jj40P2L2
$$ 230 -10 -77 -17 28 36 22 -5 -18 -30 -74 -209 -212 -31 136 -132 -49 -64 46 2 40 22 224 35 34 -106 -34 -2
2817bj34P8R8O9q7K8j36J26n8J39j11j0N3Q0j17Q7j96L4J13k9Q6q6j48P0J10j4
$$ -2 -136 -58 40 109 22 50 -86 40 -18 121 10 0 53 133 16 103 -93 -59 54 25 111 25 -123 -53 57 43
2843D3p6M6O1L1P5L8k46j8Qj4Q5r4K23j97J33qo2o1J8J58k91J99N5P3j97l7J34
$$ 43 -33 13 74 105 180 218 -28 -46 -38 -52 33 -61 162 -35 98 90 28 -33 -15 143 -148 51 106 179 -18 -55 79
2870G9J6k25J33j10O2J60P6l21J21QpP2L3j37p9k6R1q5J96m4q8J91l12R7M5L1
$$ 79 95 -130 3 -107 -45 115 191 -130 -9 -1 -8 64 97 -40 -119 -145 -54 -139 57 13 -75 116 -196 -99 -54 -23
2896b3J2R3m3l39K46M7M6q1J25J46j08j11q7J49o5p9J68n4P5j65n3K9N2K6L1J16
$$ -23 -11 82 39 -300 -54 -7 39 -42 83 229 121 10 -77 72 7 -72 96 42 117 -48 -101 -72 -20 6 37 153
2922A53j96J02q0j17L61l69LJ98rj33J12j2n4j6O8r7K06k3m3j09L8J60n7j63K9
$$ 153 -43 59 -21 -138 223 -146 -143 55 46 -87 25 13 -41 -57 11 -86 120 97 54 -55 -17 143 86 -77 -48
2947d8OJ16QOk3j42K2P6m4L3J30k55Q0r6J96p8m6L5R3m8M9m9m1KN5m0o9M7l5r3
$$ -48 -42 74 82 88 65 -77 -55 21 -23 10 140 -115 -35 -131 65 -13 -59 -24 69 21 70 21 -20 -18 37 -3 -72 -25 -60 -153
2977a53n4J77l0j34K54k15l2K19m2p5L5r6J50l1r5Q6J46j69jk0M1o8J91%k7np0
$$ -153 -207 -30 -60 -194 60 -155 -187 32 -10 -85 -50 -146 4 -27 -122 -36 110 -59 -60 -80 -39 -107 84 84 57 52 -18
3004a8m2Q8om7J82p5jk15J76j81K53J2q7n9J71p3Op7m6k2J76k31J36j6n1j8J98
$$ -18 -60 28 22 -25 157 82 81 -134 42 -139 114 126 39 -20 151 78 84 7 -39 -61 115 -116 20 4 -47 -65 133
3031A33q8k7J12k52lL3J29J63k37mkq4Q7k16K70p7o6P2j1J04J36r1r8J02k01N9
$$ 133 45 18 130 -122 -125 -92 37 200 -37 -41 -43 -127 -40 -256 14 -63 -129 -57 -68 36 172 81 -17 85 -116 -57
3057e7J00j4m5q1J25qk3n1J51r8J00R5k16O1l2J16j96L4K1m9Q6j36Q8P4l6j32
$$ -57 43 29 -16 -97 28 20 -3 -54 97 -1 99 194 -22 39 7 123 -73 -39 -18 -67 19 -117 -29 45 9 -123
3083a23L20k09O7j80K6K15j85K86Jj02N7j95J67j95K69k81J1J76k96K61j23l7
$$ -123 197 -12 55 -125 -99 116 -69 217 218 116 173 -22 145 -50 219 -62 -51 125 -171 90 -33 -70
3105g0M6J30m0Ol6Rj58R6k3j5K8j64%J24Q4J17j58j64L8J76O8j44r4J59j44J58
$$ -70 -24 106 66 72 36 45 -113 -17 -40 -55 -27 -191 -191 -67 17 134 -24 -188 -150 26 94 -50 -144 15 -129 29
3131B9N8j29O1M5Rl1P3m9M0M8o6j97Q3M9K15j34r6k1P3q0j12O7N7K46j89K0m5
$$ 29 87 -42 19 64 73 42 115 66 106 154 88 -109 -26 23 238 104 8 -13 60 -20 -132 -65 -8 238 49 69 24
3158B4J50k42K26j03o7p8L1N0q4J24N9N0k71K69r7o7pnJ40l7L0j77k1O3kN4j52
$$ 24 174 -68 158 55 -12 -90 -59 -9 -93 31 90 140 -131 138 41 -26 -33 -38 102 65 95 -82 -103 -40 -42 12 -140
3185a40O6mn5K03k89K60m2p6J31j8j8o8j6Q5j01J60Jj8j81r1K49k7lM0k1q3j14
$$ -140 -74 -78 -133 70 -219 41 -1 -77 54 36 18 -50 -66 19 -82 78 79 61 -120 -211 38 11 8 48 27 -56 -170
3212a70M22l56P9J4m8L6K6J35j47j08J64k74J53J49K7lk8j10M4m3J67l6o5k0O
$$ -170 252 -104 -25 -11 -59 -23 3 138 -9 -117 47 -227 -74 75 102 99 71 -39 5 -38 129 93 28 8 14
3237A4O9k67K29j70K13q3j06L08j68O2k42J30JP3n5j64J50j98J40R3j47L4J38
$$ 14 83 -184 45 -125 88 5 -101 207 39 101 -141 -11 -10 63 8 -156 -6 -204 -64 29 -118 -84 54
3260E4l0m3L0l6O2J07k31Q2q8J33j24J14r4J1q2J19Jo0J07lo6j4K9j1l4q3J29
$$ 54 24 -19 11 -25 37 144 -87 -5 -93 40 -84 30 -64 -53 -135 -16 -15 -75 32 29 -37 -51 -22 -33 -67 -150 -21
3287b1K70k17R7k16nL8R3K6o0J12k77J96l8r8Q1n2J35j02Q8j24l5J45j2k7M2M6
$$ -21 249 32 129 -87 -92 -54 39 65 5 117 -160 36 -2 -100 -19 -71 64 -38 50 -74 -109 36 24 -3 39 85
3313H5M0k04j10J97j04k4J85k36R2Q9j35K14j27J78K4k33J86j1M2k58K24n8j52
$$ 85 125 -79 -189 8 -96 -120 65 -171 -79 10 -125 89 -38 140 164 -69 117 106 148 -110 114 56 -96
3336i6Q0K22l46J82nM8j39l4L82j71q7Jl7L9n3jJ4o3m0J61j01P0n0J26j98P3M3
$$ -96 -16 206 -140 42 37 85 -54 -88 294 123 36 37 0 39 -14 -15 -1 -64 -104 57 -44 26 -24 102 -96 -23 20
3363B0k14K79j57J41j75K09r0M2j00m3J91o1p0K52j73j2j35J61j89J89j44N4o5
$$ 20 -194 85 -72 69 -106 103 13 55 -45 -88 103 42 -28 224 51 39 -96 65 -124 65 -79 -25 -90
3386i0J39m5n8J19m9r4m8J13L3L2j35P4l2N9j25K18k81J0J61j40J7L3R3k5j65
$$ -90 49 4 -54 65 16 -78 -126 -13 20 52 -83 -9 -41 18 -107 111 -170 -160 1 -139 -122 -89 4 -21 -186
3411a86K21L9j38N4J50j0Nk62J06j3m1o7J73m9l1JLM7O7Kj03l1l8j6O2K26k92
$$ -186 35 74 -64 -10 140 130 135 -127 -21 -34 -75 -142 31 -18 -49 -48 -45 2 69 71 -32 -63 -101 -117 -55 171 -121
3438a21j1J45j15O6R5m3M2j42K3l2M9m9M8L6N8r3K4l1J26Nl26J35J44K9j01J4
$$ -121 -132 13 -102 -36 59 16 58 -84 -61 -93 -44 -93 -45 -9 49 -44 -20 -51 75 80 -246 -111 33 62 -39 -25
3464b5J36j80J48j61J93j53jmL36r8j86J76j72j34J9m4K42j10j3J02M0j60nJ9
$$ -25 111 -69 79 -82 111 -42 -43 -47 289 191 5 181 9 -125 -106 -150 92 -18 -31 71 111 -49 -54 -35
3488c5l9K6o0J03M7P8l07J15j2J36j15RJ0J5k58M03j47R1K1j46MO6j0M5R6j73
$$ -35 -74 -48 -108 -5 42 120 -187 -72 -84 52 -63 -54 -44 -29 -287 116 -31 60 81 -65 -61 5 -5 40 136 -37
3514c7j6J19j01O9k11J82n3p1P2J26N7j47J21j74K63j97K0m0L9J06r6J02k03J31
$$ -37 -53 66 -35 34 -177 5 -48 -119 -47 79 136 -11 110 -64 199 2 22 -18 21 127 31 133 -70 61
3538F1j31l4k2J53M8j28Q4l56L60j36O4r8J79M8j37R1j42n5N7P2p0O9k1j73K02
$$ 61 -70 -104 -126 27 75 -53 31 -325 35 -101 -37 -135 44 92 -45 46 -96 -151 -94 -22 -92 -23 -44 -217 -15
3563a5j5j54L00j45p3J20n3j60J39O4n4p7K0J3N9J45j25J08O5k50LK88l75J79
$$ -15 -30 -184 116 -29 -102 18 -35 -195 -56 8 -46 -123 -103 -90 -31 114 -11 97 162 -88 -85 203 -172 7
3587GJ09j94j48L06j69R5n6q4Q6q3R4n0P3j05J78j37P6J6n7l4J26j16P1L1J4o0
$$ 7 116 -78 -226 80 -89 6 -50 -134 -48 -131 -37 -87 -14 -119 59 -78 -2 14 -43 -77 49 -67 4 35 49 -11
3613a1j6K78l59J24M2R9J2k98J62L6O3q2j58J70j50O7p0O7P5j01K04j48J03N4
$$ -11 -27 251 -108 16 58 157 169 -129 33 69 132 50 -108 62 -88 -21 -91 -24 51 -50 154 6 109 163
3637A63k58J77j73K01j55n2J13q8J03p4qJ05j25M4lkm6N1N9p2O8Kn1PN5O6l58
$$ 163 -95 82 -91 110 -45 -97 16 -72 31 -43 -51 54 -71 -27 -30 -32 -78 -27 32 -40 28 30 -21 -14 41 107 -251
3664b51L37m0J08k03J04j24L2J42j97J86L4j33m8K54k12M3j3j67J69m9Q6l0j30
$$ -251 86 46 154 -49 55 -69 -37 105 -92 94 128 -5 -53 201 -11 32 19 -148 21 -28 58 28 -102
3687a02M8ml5P6O4P9k10P1O1J1j03o1O3L9k5J2k3j02J87m5K16k15k62K18O2N5
$$ -102 -54 -58 -93 -17 47 126 -84 -13 48 59 -44 -105 -42 -3 -28 -16 -39 -141 46 1 217 2 -260 -42 20 75
3713G5jR8k55N6j25P6k6J77j01KN4k0j11m3L4L8j77L36L6j02N2J5k48J58o9L0
$$ 75 74 172 -83 -27 -152 -76 -102 75 -26 -24 30 10 -101 -144 -110 -72 -249 87 123 21 73 88 -160 -2 -71 -41
3739d1KN8rj88J42j49J08J63j8j3qK7r0O0J49j04J35j79J67j53j04j61L82j95
$$ -41 -39 19 10 -178 -36 -185 -77 86 68 55 47 74 -16 44 193 89 224 45 212 59 -45 -206 176 -19
3763a9n3Kq1J68K5r8J3J42j73R2k6j5k40K04M2Q5k22K77j04k20K14rQ3p8K6J1
$$ -19 -72 -70 -151 17 42 -56 -43 99 -74 18 -8 -23 -263 -59 -17 68 -154 123 19 -201 13 4 87 9 35 46
3789D6lj08pJ16o7N2k2M9J14j9n4J04j83L5o2mJ8j3k3qR1m2O4k27P2j18N2nK91
$$ 46 43 -65 -72 44 -23 29 7 56 170 151 97 201 18 53 -9 -13 5 -8 -31 -39 52 10 74 -153 -81 -199 -147 -152 139
3818A39j72P8r9j11K37k14K78o4N4M3p6j51j5lP5N5L5j17k9P2J14r7p3j21J34
$$ 139 -33 45 -54 -165 72 -142 136 72 126 169 93 -58 -73 -76 -1 54 89 -28 -57 15 129 32 -41 -162 -28
3843b8P9j53K92j53r8R5k03m0K11j22J34p0m3J6K04k35J8J27M9q8L3P3j48J17
$$ -28 51 -102 190 37 -61 34 -169 -209 2 -120 14 -56 -99 -83 121 -114 -96 31 80 -8 25 98 -50 67
3867F7o1K14o7k8K5j37n5j4J42j85J31k9P8k6O3j00k0j40J04n6J25k6m6M0Q9n6
$$ 67 6 220 153 125 150 13 -42 -56 86 -99 32 3 81 55 118 18 -2 -142 -38 -94 31 5 -41 -1 88 32
3893C2N0j09k4J61k05J94k0j40Q4J8k13K17P4j46k2J41l9j29J91j09k8J54l4q5
$$ 32 82 -27 -51 110 -95 99 79 -61 23 41 -172 45 119 -27 -49 92 53 -76 115 6 -22 132 98 13
3917A3r7K13k11K0P6J0n2Q0m2P2J2r9K8Q3o2j04J01k22J90q0L5P2j3n3J98k91
$$ 13 -84 129 -82 -62 14 24 -28 52 10 82 94 -5 23 106 44 -60 41 -181 9 -71 -36 36 23 -30 168 -123
3943a23J08J60j87n1Q9M8j77P1J01J56j23j72J43jl6r5J3M0J75k13j0J12j43J98
$$ -123 -15 145 -42 -93 -4 44 -133 -62 39 195 72 -100 43 42 6 -89 -76 -36 139 -74 -84 28 -115 83
3967H3J4j59O2j88J99J26q5p9Jj87K76P9r0%o4R3p2J34k51K24j87J22MJ15j85
$$ 83 97 -62 0 -188 11 137 52 -27 -26 -213 63 142 52 52 -12 81 9 143 -108 116 -71 51 55 170 -15
3992a5J34p3p0K0m6J94J7j15j05J01lk38J80OP7j13K8N8L9j20kJ05m8K8k0j5%
$$ -15 119 46 -24 -4 -50 144 161 46 -59 42 39 -199 -19 -13 64 -49 -21 37 76 -44 -46 59 11 39 19 4 4
4019DJ12j62O9p2N5j3J18j48q4qK10j14P6N8l2j30K4N1m2j6J49p9j3j1Q5k18m1
$$ 4 116 -46 23 -49 6 -7 111 -37 -121 -129 81 -33 43 101 69 -61 -37 14 -28 -44 105 26 13 2 87 -131 -172
4046a72J99l2K4j77K25k17K26o1l0M9J52k96K38j82J91k15J2m5L7JJ66p3j39J44
$$ -172 27 -5 19 -158 67 -150 76 15 -15 34 186 -110 128 -54 137 -78 -66 -111 -74 -73 93 20 -119 25
4070B5Q2L5j28J33q6j76J35N5J3q8L3M7r4P6l8K8j15M8K09l45O9J12N3j47J77
$$ 25 107 142 14 147 61 -115 20 75 88 0 33 80 -14 62 24 52 -63 -15 194 -151 -82 30 83 -64 113
4095A13j27N5j3j49J42J9m7O9L2L0l3K2j77J33lk47K14j12R3J11k02M2n6J77m3
$$ 113 -14 41 28 -121 21 40 -7 62 94 124 91 113 -64 69 66 -181 33 -79 14 125 -77 -35 -91 86 43
4120D3O5j74J06l0J02k22l6l6K41n6J35L9r8N8k13R3j4p4K9L7L9k11J94q2J13
$$ 43 108 -66 40 10 112 -110 -146 -182 59 3 138 177 79 137 -76 17 3 -71 -42 -5 34 -177 17 -65 48
4145D8Q5k11J0J19n4L3L7q4r6M1J19r1J85q1l8L7p7Nr1J17j27P3J79j23o1M8k7
$$ 48 133 -78 -68 51 -3 30 67 -17 -113 -72 47 -44 141 60 22 59 -18 -13 -104 13 -114 -41 138 15 -46 2 -25
4172b5J01p6j26N6K03o4j45K5R8j38K00q4Nj17Q8N1m4K3k55K75M5o4O1m9J1R4
$$ -25 76 0 -126 -70 133 69 -76 -51 47 -91 109 25 30 -87 1 52 8 31 -224 51 96 32 93 44 55 149
4198A49m6j10l6J91r2OK3r6k9J23k21K1L6NP7j25L4K3J49J1j58M3k3J19j78J0
$$ 149 103 -7 -43 148 56 62 85 -11 -40 83 -138 -117 -81 -76 1 -124 -90 -67 82 93 -65 -22 -45 74 -104 -94
4224i4J06M9L8k10j27J28J33j09n3j1N3J64r7P0m3j93J48k7J10Jj11Q3Nj6J8Q1
$$ -94 12 61 99 -111 -238 -110 23 -86 -139 -150 -97 67 -30 40 -3 -196 -48 -75 35 36 -75 8 13 -3 15 96
4250I6r2j3J16p1pj26J66k03P4m4J11J9q4j3j5R3m1K73q2k3j27m3j05J52J12n9
$$ 96 4 -9 107 36 29 -97 69 -134 -60 -104 7 26 -58 -71 -86 7 -34 239 157 134 7 -36 -141 11 123 64
4276F4j40J29q2P5l0r1L5n4R1qJ01j40Rp8J48Q7j3p0n5M0j08K30j71QK37k49l
$$ 64 -76 53 -29 46 16 -75 -40 -94 -3 -11 90 -50 -41 -119 29 116 103 33 -22 18 -90 140 -31 -23 214 -35 -38
4303c8N5j1j00J44p6R1j20nN2q1J9N6R2J22k20k3j00J81j67K05j65J49n0J1j29
$$ -38 17 6 -94 50 -26 65 -55 -60 -8 -89 -70 -14 78 200 -20 -43 -143 38 -129 76 -89 60 10 21 -108
4328a08M4K91l22J45j05j54J00J62N5J45l02L5K42j21j39n0o6J87k20J38l2j60
$$ -108 -64 227 -95 50 -55 -209 -109 53 108 253 -49 -14 228 107 -32 -82 -148 39 -181 -43 -75 -235
4350b35J54J41J7j19J18q3j01K42k26J73j32J08J8j02J01L9j16n4j9K01J3N9j87
$$ -235 -81 60 77 -42 76 -7 -108 134 -92 81 -51 57 75 -27 74 113 -3 -57 -76 125 138 197 10
4373A0j13R3p2m7J45j91K04Oj57O8m8J6N7l7O0J64O9k11p9J38J9j20k9J86o4r8
$$ 10 -103 -10 -82 -129 16 -175 29 35 -122 -54 -102 -86 -29 -66 -6 158 227 16 -63 75 94 -26 -55 131 67 -31
4399c1J52j94Q6Q2k16J90j47L01k58O3j10R7Q7k20J06J59j57P7o1J0pJ08n4j0
$$ -31 121 -73 13 95 -121 69 -78 223 -35 28 -82 15 102 -118 -12 147 -10 67 6 16 9 117 63 53
4423E3j50P1K06p4p3O9j52K7O4J35j95pqj14J61L3J75k77O7N2M7k02J76n0M0k50
$$ 53 -97 -26 180 106 33 102 -50 -23 41 176 -19 -26 -34 -148 13 46 221 -56 11 63 110 -92 84 34 74 -176
4449a76K67j31J2j5L6J4n8m0K00j43J06l2J0J3p8Q3l8o2Q2q0R2j28n1J34j32M8
$$ -176 91 -40 -28 -43 -7 7 -51 -91 109 -34 72 40 50 63 -15 68 30 -32 50 -30 62 -66 -117 17 -115 -67
4475f7Q3Q6k05J5J9N5P2j57J93j54Q6J79j71j51K07j84O7j4j6P3p8N3N2Rl9r9
$$ -67 16 102 -103 -88 -69 -14 58 -99 94 -60 26 205 34 -117 90 -94 -27 -41 -57 16 -62 -9 43 52 13 -86
4501h6N5J00n5M3K4r3J10k0o9p7o8o3K52j15K21r3q3J39j67J67j16J4m4M5n5J67
$$ -86 -31 69 14 57 81 -12 98 78 9 -68 -136 -199 53 -62 159 66 -17 122 -45 122 6 20 -24 21 -34 133
4527A33k04N3J41k91J22R0j35J86l4j02j16P4J30j6R5lj23K5j54P8N3M0m8P7k18
$$ 133 -71 -18 123 -168 -46 44 -91 95 61 -41 -157 -83 47 31 126 123 0 25 -129 -51 2 42 -6 71 -147
4552a47J66j58J39j0N4o1N9k0L0j44K0J13k5N9j91l9J18J9R0J34k27j40J42M7
$$ -147 19 -139 0 -10 44 -17 42 22 52 -92 -72 41 16 75 -116 -155 -37 -18 72 206 -21 -161 -19 28
4576B8N1k7j41P5o9M4O9j8j20k2J03J25j40J17k46J60L9j59J00%O8j81Q9p7N0
$$ 28 79 52 -89 -14 -83 -39 30 12 -108 -130 -27 98 -42 75 -171 -11 28 -131 -31 -31 37 -144 -55 -132 -82
4601h2m6J24k23K61Pk62L10j54m8O4L8J08j17N7o0J75j29J3Mp5PJ55n8r6k3J4
$$ -82 -128 -4 -227 34 41 -221 89 -65 -113 -49 -11 97 -20 37 -23 152 23 36 40 -35 -28 127 69 -27 -50 -36
4627c6k07L72j13j37J51m2J98k00p1K46l2j54L1j96Q1K39k4j93J63R2k47J3J21
$$ -36 -243 129 16 -121 30 -12 186 -14 -85 161 129 -25 6 -190 -109 130 106 -87 76 168 -79 -66 55
4650E5j76K32k1j44N7J3n3K2r4M8q8L09l5mq8k37K53q8J40N2kj69r3K46j54m1
$$ 55 -121 111 90 -54 3 16 -37 -15 -109 -61 -149 160 125 121 33 -204 49 -39 101 153 151 -18 -111 135 -19 -60
4676f0K7J69k0q9j7R3O5o5j59J07n5O0j98P1OM0O2J3j68k8K12j58J06N6k8Jk0
$$ -60 -33 136 116 27 10 103 168 103 -56 51 -4 56 -142 -71 -65 -25 37 50 -118 -146 66 -92 14 70 42 43 23
4703B3j88J91l7j31L5nKJ38j07J25q4M0P2O8k79J54J09o2J24j76Q4j89K42j75
$$ 23 -165 26 -11 -142 -107 -112 -110 28 -79 46 -38 2 74 142 -137 17 126 64 188 12 96 -93 149 -26
4727b6M2J14k26J18N7p9j73O7J71k40M5J99j58J74j23P6J6N2j28j57J24J42p9
$$ -26 16 130 -96 22 79 0 -173 -106 65 -175 -130 69 -89 85 -38 38 54 106 -22 -179 -55 87 8
4750HOkK2j02M5N7M0k14Q6QJ1J98k74P9J1m0p4J47R0j54j07N8J54n4l13J35J29
$$ 8 14 12 34 -68 -23 34 74 -140 -54 -46 -35 163 -111 -32 -21 -61 -135 12 102 -52 -159 -101 53 -1 -314 -179 -50
4777e0J41n4j40j9J21R4L8o9j5j00p4J84q3j7J57k65J24K07l60J94pL3k1m7J11
$$ -50 91 37 -103 -122 -1 93 131 62 47 -53 -127 57 -26 -43 114 -151 -27 180 -180 14 7 40 19 -28 83
4802H3j13k3K18K3j44n5j60K55j49P1k4j4P7Mk23J36k1K6M0m7LJ03j10M8pm1M2
$$ 83 -30 -53 165 188 44 -11 -171 84 -65 6 -18 -32 45 49 -174 -38 -59 -33 7 -40 -37 66 -44 4 -3 -44 -2
4829bJ04P6j84j34p5K75q7K38l07K29j22k0m4P8n7j7N1q8J06Mk4q7J18q8J88p
$$ -2 102 178 -6 -140 -215 60 -27 211 -96 133 11 -9 -53 25 -32 -49 2 -86 20 24 0 -87 31 -57 131 124
4855A24q1p2Lm1m5R0j6K38k20K33j08j6J7n7J86l95J85J11k31l6K88r0j1k67Q9
$$ 124 43 -29 -26 -67 -112 -22 -38 200 -20 213 105 89 106 49 235 -160 25 136 -95 -131 157 67 56 -211 -122
4880a22K06j30K6Q5r5j4J4J03r2m1K35j20kN1j01k4J42j45J19j24L1o1n5J42j18
$$ -122 84 -46 -20 65 -30 -44 -30 73 -19 -60 175 55 53 104 3 -21 121 -24 95 -29 2 -59 -114 28 -90
4905i0J9Mk3R2l7QN1R8p4j89J25k1N7o0kJ9lr1K36O3j78Q8k4j6m1P8k0l7j1K9
$$ -90 -71 -67 -90 2 -35 -27 24 122 48 -141 -16 -37 20 -40 -42 -23 -26 -117 119 182 4 92 68 52 11 89 69 32 21 50
4935E0j65qJ43J43j35L1n8N4N7l3j42K2j05K98q1j6j89J89n8j00J49j32J04j23
$$ 50 -115 -123 20 163 28 59 1 55 112 79 -63 -41 -146 152 71 55 -134 55 -3 -103 46 -86 18 -105
4959a05K6QM1p7J54o0L5p1l6P6j98N5L09k1Lj16j61J75l5K8K4m7k3q8N1L9j29
$$ -105 -79 -71 -30 -107 47 -13 22 -49 -85 -9 -207 -152 157 136 139 23 -138 37 2 30 54 7 -16 -104 -53 -14 -143
$$ [...]
8191H8
##END NTUPLES=NMR FID
##END=
