##TITLE=1H_Ser NCO-2
 CDCl3
 8 sc, 
 1.11.2024
##JCAMPDX= 6.0         $$ Bruker NMR JCAMP-DX V2.0
##DATA TYPE= NMR FID
##DATA CLASS= NTUPLES
##ORIGIN= UXNMR, Bruker Analytische Messtechnik GmbH
##OWNER= root
$$ XWIN-NMR		Version 3.5
$$ Fri Nov  1 14:21:36 2024 Russian Standard Time (UT+4h)  she@DPX200
##.OBSERVE FREQUENCY= 200.1318
##.OBSERVE NUCLEUS= ^1H
##.DELAY= (6, 6)
##.ACQUISITION MODE= SIMULTANEOUS
##.ACQUISITION SCHEME= undefined
##.AVERAGES= 8
##.DIGITISER RES= 18
##SPECTROMETER/DATA SYSTEM= spect
##.PULSE SEQUENCE= zg30
##.SOLVENT NAME= CDCl3
##.SHIFT REFERENCE= (INTERNAL, CDCl3, 0, 15.7039)
##AUDIT TRAIL= $$ (NUMBER, WHEN, WHO, WHERE, WHAT)
$$ ##TITLE= Audit trail, XWIN-NMR		Version 3.5
$$ ##JCAMPDX= 5.01
$$ ##ORIGIN= Bruker BioSpin GmbH
$$ ##OWNER= she
$$ F:/spectra/data/she/nmr/H-F/1/audita.txt
$$ ##AUDIT TRAIL=  $$ (NUMBER, WHEN, WHO, WHERE, WHAT)
(   1,<2024-11-01 14:19:25.18 +0400>,<she>,<DPX200>,
      <created by zg, POWCHK disabled, PULCHK disabled
       configuration hash MD5:
       00 E9 B6 7A A2 85 ED C7 34 08 36 98 17 FE 4E 26
       data hash MD5: 16K
       8F 61 0D C5 96 04 EB 6A 1F E3 CF 42 DB 28 27 91>)
$$ ##END=
$$ 
$$ hash MD5
$$ D4 8D F9 17 A0 CC CE A7 DD 0B F6 E5 56 62 58 88
##$RELAX= 
##$RELAX= 
##$RELAX= 
##$RELAX= 
##$RELAX= 
##$RELAX= 
$$ Bruker specific parameters
$$ --------------------------
##$DU= <F:/spectra>
##$EXPNO= 1
##$NAME= <H-F>
##$PROCNO= 1
##$TYPE= <nmr>
##$USER= <she>
##$AMP= (0..31)
100 100 100 100 100 100 100 100 100 100 100 100 100 100 100 100 100 100 
100 100 100 100 100 100 100 100 100 100 100 100 100 100 
##$AQSEQ= 0
##$AQ_mod= 1
##$AUNM= <au_zg>
##$AUTOPOS= <>
##$BF1= 200.13
##$BF2= 200.13
##$BF3= 200.13
##$BF4= 200.13
##$BF5= 200.13
##$BF6= 200.13
##$BF7= 200.13
##$BF8= 200.13
##$BYTORDA= 1
##$CFDGTYP= 0
##$CFRGTYP= 5
##$CHEMSTR= <none>
##$CNST= (0..31)
1 1 145 1 1 1 1 1 1 1 1 1 1 1 1 1 1 1 1 1 1 1 1 1 1 1 1 1 1 1 1 1 
##$CPDPRG= <>
##$CPDPRG1= <>
##$CPDPRG2= <>
##$CPDPRG3= <>
##$CPDPRG4= <mlev>
##$CPDPRG5= <mlev>
##$CPDPRG6= <mlev>
##$CPDPRG7= <mlev>
##$CPDPRG8= <mlev>
##$CPDPRGB= <>
##$CPDPRGT= <>
##$D= (0..31)
0 1.2 0 0 0 0 0 0 0 0.06 0 0.03 0 0 0 0 0.0002 0 0 0 0 0 0 0 0 0 0 0 0 
0 0 0 
##$DATE= 1730456364
##$DBL= (0..7)
120 120 120 120 120 120 120 120 
##$DBP= (0..7)
150 150 150 150 150 150 150 150 
##$DBP07= 0
##$DBPNAM0= <>
##$DBPNAM1= <>
##$DBPNAM2= <>
##$DBPNAM3= <>
##$DBPNAM4= <>
##$DBPNAM5= <>
##$DBPNAM6= <>
##$DBPNAM7= <>
##$DBPOAL= (0..7)
0.5 0.5 0.5 0.5 0.5 0.5 0.5 0.5 
##$DBPOFFS= (0..7)
0 0 0 0 0 0 0 0 
##$DE= 6
##$DECBNUC= <off>
##$DECIM= 24
##$DECNUC= <off>
##$DECSTAT= 4
##$DIGMOD= 1
##$DIGTYP= 9
##$DL= (0..7)
0 120 120 120 120 120 120 120 
##$DP= (0..7)
150 150 150 150 150 150 150 150 
##$DP07= 0
##$DPNAME0= <>
##$DPNAME1= <>
##$DPNAME2= <>
##$DPNAME3= <>
##$DPNAME4= <>
##$DPNAME5= <>
##$DPNAME6= <>
##$DPNAME7= <>
##$DPOAL= (0..7)
0.5 0.5 0.5 0.5 0.5 0.5 0.5 0.5 
##$DPOFFS= (0..7)
0 0 0 0 0 0 0 0 
##$DQDMODE= 0
##$DR= 18
##$DS= 0
##$DSLIST= <SSSSSSSSSSSSSSS>
$$ [...]
##$SUBNAM2= <"">
##$SUBNAM3= <"">
##$SUBNAM4= <"">
##$SUBNAM5= <"">
##$SUBNAM6= <"">
##$SUBNAM7= <"">
##$SUBNAM8= <"">
##$SUBNAM9= <"">
##$SW= 24.0689170037331
##$SWIBOX= (0..15)
0 0 2 0 0 0 0 0 0 0 0 0 0 0 0 0 
##$SW_h= 4816.95568400771
##$TD= 16384
##$TD0= 1
##$TE= 0
##$TE2= 300
##$TE3= 300
##$TEG= 300
##$TL= (0..7)
0 120 120 120 120 120 120 120 
##$TP= (0..7)
150 150 150 150 150 150 150 150 
##$TP07= 0
##$TPNAME0= <>
##$TPNAME1= <>
##$TPNAME2= <>
##$TPNAME3= <>
##$TPNAME4= <>
##$TPNAME5= <>
##$TPNAME6= <>
##$TPNAME7= <>
##$TPOAL= (0..7)
0.5 0.5 0.5 0.5 0.5 0.5 0.5 0.5 
##$TPOFFS= (0..7)
0 0 0 0 0 0 0 0 
##$TUNHIN= 0
##$TUNHOUT= 0
##$TUNXOUT= 0
##$USERA1= <user>
##$USERA2= <user>
##$USERA3= <user>
##$USERA4= <user>
##$USERA5= <user>
##$V9= 5
##$VALIST= <valist>
##$VCLIST= <CCCCCCCCCCCCCCC>
##$VD= 0
##$VDLIST= <DDDDDDDDDDDDDDD>
##$VPLIST= <PPPPPPPPPPPPPPP>
##$VTLIST= <TTTTTTTTTTTTTTT>
##$WBST= 1024
##$WBSW= 4
##$XGAIN= (0..3)
0 0 0 0 
##$XL= 0
##$YL= 0
##$YMAX_a= 507848
##$YMIN_a= -397019
##$ZGOPTNS= <>
##$ZL1= 120
##$ZL2= 120
##$ZL3= 120
##$ZL4= 120
##$ABSF1= 10
##$ABSF2= 0
##$ABSG= 5
##$ABSL= 3
##$ALPHA= 0
##$AQORDER= 0
##$ASSFAC= 0
##$ASSFACI= 0
##$ASSFACX= 0
##$ASSWID= 0
##$AUNMP= <proc_1d>
##$AZFE= 0.1
##$AZFW= 0.1
##$BCFW= 1
##$BC_mod= 2
##$BYTORDP= 1
##$COROFFS= 0
##$CY= 11.3945322036743
##$DATMOD= 1
##$DC= 2
##$DFILT= <>
##$DTYPP= 0
##$F1P= 15.6554695791079
##$F2P= 12.8336369535428
##$FCOR= 0.5
##$FTSIZE= 0
##$FT_mod= 4
##$GAMMA= 1
##$GB= 0.15
##$INTBC= 1
##$INTSCL= 1
##$ISEN= 128
##$LB= 0.24
##$LEV0= 0
##$LPBIN= 0
##$MAXI= 10000
##$MC2= 0
##$MEAN= 0
##$ME_mod= 0
##$MI= 1.114404
##$NCOEF= 0
##$NC_proc= 0
##$NLEV= 6
##$NOISF1= 3.799351
##$NOISF2= 2.8
##$NSP= 1
##$NTH_PI= 0
##$NZP= 0
##$OFFSET= 15.70392
##$PC= 1
##$PHC0= -26510.2
##$PHC1= 14.18743
##$PH_mod= 1
##$PKNL= yes
##$PPARMOD= 0
##$PSCAL= 0
##$PSIGN= 0
##$REVERSE= no
##$SF= 200.130013532006
##$SI= 16384
##$SIGF1= 3
##$SIGF2= 2
##$SINO= 400
##$SIOLD= 16384
##$SREGLST= <1H.CDCl3>
##$SSB= 0
##$STSI= 0
##$STSR= 0
##$SW_p= 3612.71676300578
##$SYMM= 0
##$S_DEV= 0
##$TDeff= 0
##$TDoff= 0
##$TI= <>
##$TILT= no
##$TM1= 0
##$TM2= 0
##$TOPLEV= 0
##$USERP1= <user>
##$USERP2= <user>
##$USERP3= <user>
##$USERP4= <user>
##$USERP5= <user>
##$WDW= 1
##$XDIM= 8192
##$YMAX_p= 0
##$YMIN_p= 0
$$ End of Bruker specific parameters
$$ ---------------------------------
##NTUPLES= NMR FID
##VAR_NAME=  TIME,          FID/REAL,        FID/IMAG
##SYMBOL=    X,             R,               I
##VAR_TYPE=  INDEPENDENT,   DEPENDENT,       DEPENDENT
##VAR_FORM=  AFFN,          ASDF,            ASDF
##VAR_DIM=   8192,          8192,            8192
##UNITS=     SECONDS,       ARBITRARY UNITS, ARBITRARY UNITS
##FACTOR=    0.0002076,     1,               1
##FIRST=     0,             0,               0
##LAST=      1.7004516,     0,               0
##MIN=       0,             -397019,         0
##MAX=       1.7004516,     507848,          0
$$ Real data points
##PAGE= N=1
##DATA TABLE= (X++(R..R)), XYDATA
0 0 0 0 0 0 8 -8 8 -8 16 -24 31 -37 48 -56 64 -80 100 -120 143 -164 193 -228 267 -308 355 -404 460 -524
28 -524 597 -678 761 -857 961 -1076 1204 -1343 1494 -1660 1842 -2044 2263 -2506 2774 -3069
44 -3069 3399 -3771 4185 -4653 5188 -5809 6531 -7393 8434 -9726 11375 -13565 16632
57 16632 -21256 29078 -45650 146637 -331135 -217680 507848 -96212 -236985 120144 -29592
68 -29592 -12153 70251 -275096 100534 331827 -312230 -133389 463771 -88312 -294199 212796
79 212796 52142 -154768 30184 -95237 31190 187134 -212167 -63632 367807 -106886
89 -106886 -251114 253032 40817 -220448 72028 -1048 -54389 125092 -125330 -71371 294000
100 294000 -86116 -238782 267565 68619 -268137 87970 84651 -128973 59212 -30923
110 -30923 -78705 211371 -46249 -213840 251849 85781 -304235 95582 163605 -196345
120 -196345 3127 86850 -93370 99426 23288 -179333 171996 119372 -283712 55277
130 55277 230658 -199493 -86576 169414 -51091 -38642 47863 -67667 88469 72528 -192821
141 -192821 54848 186731 -190238 -86383 190679 -47927 -96997 74440 -3593 27103
151 27103 31985 -124150 64644 134388 -188858 -46301 207537 -89896 -126680 136911 6444
162 6444 -63062 52695 -41704 17051 93846 -132661 -35381 179937 -98006 -134081 165076
173 165076 12414 -122864 79432 24951 -47286 60064 -52720 -46047 124042 -63171 -118651
184 -118651 146344 21568 -143971 76450 66295 -82233 28142 14024 -43397 66961
194 66961 -27310 -90536 103332 20996 -131056 63927 81335 -89421 5116 53861 -33414
205 -33414 15029 -9425 -48773 68738 2311 -99103 68164 62841 -98507 13047 71852
216 71852 -50765 -5649 27100 -34469 30346 9147 -71054 48915 47894 -90856 16324
227 16324 79256 -60251 -16843 56362 -33174 -7187 28890 -44891 15299 46309 -62583 1115
239 1115 72927 -48894 -31758 62393 -18892 -31882 34756 -14429 -8831 32404 -32763 -8399
251 -8399 52399 -31702 -30765 55183 -7653 -39688 31171 2866 -23073 18405 -8660 -9402 31758
264 31758 -16271 -20696 39120 -6902 -34023 26305 4713 -24582 16018 922 -11746 22333
276 22333 -9093 -18617 31417 -3567 -30996 25453 8967 -28805 12067 8678 -17515 12351
288 12351 1826 -15526 22164 2698 -26525 19877 11616 -31449 7275 18304 -20359 1231
300 1231 14825 -11123 4121 8494 -14069 6498 10244 -18110 2544 14895 -15275 -3999 13946
313 13946 -8033 -4172 10177 -3979 -564 7390 -6310 -1388 6418 -7672 -3107 7152 -4294
326 -4294 -1918 6598 -2927 -925 4632 -4466 -787 4901 -4504 -1211 5029 -3860 -1988 4045 -3391
341 -3391 -1015 4754 -3079 -652 5539 -3696 -2830 5038 -2886 -3845 4717 -450 -3206 3504 -4 -3266
357 -3266 2087 -216 -2741 2517 754 -2190 2267 956 -2941 604 962 -2453 -109 1853 -882
372 -882 -850 1495 18 -1303 598 880 -503 102 845 -480 -917 -33 -795 -972 848 457 -252 1603
390 1603 964 -1068 238 378 -1525 -628 725 -589 -438 856 -411 -386 1209 -285 -463 2055 250
407 250 -1654 1078 603 -2858 -495 1683 -1380 -368 2418 61 -93 1220 -929 -97 945 -1934
423 -1934 -177 2303 -1885 -1251 2705 -1102 -1677 2707 -85 -852 2496 -988 -1290 2367 -2163 -2219 3133
440 3133 -1206 -1937 3782 -616 -1835 3694 -1728 -2397 4850 -1891 -3862 5950 -692 -5696 4710
455 4710 408 -4977 4137 324 -3657 5825 -1021 -5955 7540 151 -9559 6740 3901 -9384
469 -9384 3947 4639 -6770 3361 1999 -6731 6838 2191 -10805 7631 6552 -13551 2779
482 2779 9390 -10143 -99 7111 -6630 3373 4296 -10546 6734 8177 -15945 3019 14543
495 14543 -13721 -3741 13509 -7610 -3529 7848 -7921 2945 9241 -14740 2710 17234 -16624
508 -16624 -6423 19908 -9007 -10663 13829 -4158 -4322 9915 -10399 -288 16960 -15997 -7589
521 -7589 24344 -9850 -16683 19728 -1235 -14075 11700 -3193 -6062 15328 -10761 -9619 24797
534 24797 -8237 -21479 23269 3310 -22391 12392 5588 -12461 10510 -3741 -10951 21140
546 21140 -5709 -22523 25250 6534 -29260 13458 14000 -19843 5473 5575 -12097 15137 -1519
559 -1519 -22328 24286 9050 -34818 14727 23418 -28087 -448 18868 -13606 2924 4906 -17377
572 -17377 17913 9394 -33781 15410 28199 -34186 -4098 31030 -16676 -9377 14663 -10970
584 -10970 6941 9304 -28057 14049 27943 -38180 -4472 42005 -21864 -21144 28663 -5238 -10598
597 -10598 12257 -15276 5751 23080 -32766 -4005 44228 -25044 -27751 39670 -1249 -27311
609 -27311 16613 188 -5516 14645 -21453 -2672 37755 -26486 -26541 47176 -3071 -39594 26203
622 26203 11789 -22305 10595 -4396 -7508 27338 -19607 -24447 46005 -3089 -46535 32404
634 32404 21087 -37252 7866 14929 -14237 12575 -7731 -19047 36251 -3334 -44591 35099
646 35099 24138 -46970 8489 29645 -23056 593 7030 -15444 22959 -722 -38860 33392
658 33392 24304 -53129 9246 42770 -32203 -11271 25493 -11963 3115 5979 -26407 22699
670 22699 20729 -48136 9307 46424 -37178 -18458 39580 -9681 -15529 13169 -11527 9802
682 9802 14865 -37764 9142 43043 -40056 -19838 50387 -12043 -30957 25651 1102 -9522
694 -9522 11957 -20003 3640 33927 -35052 -18813 53159 -13343 -41459 35227 11284 -27980
706 -27980 10544 611 -4485 19936 -23395 -13684 45921 -15977 -42216 42489 14099 -42774 13842
719 13842 18223 -16588 8126 -6558 -11243 32726 -12952 -37010 42179 13447 -50578 17717
731 17717 30978 -29416 -1241 13399 -10849 14327 -4792 -26735 32875 10813 -47800 18980
743 18980 34802 -36692 -5603 27867 -12739 -1497 5192 -16282 20326 8429 -39547 18293
755 18293 33189 -40450 -6841 38440 -16660 -14807 17686 -7312 3472 8365 -25498 12513
767 12513 26947 -36566 -6482 41162 -18768 -23053 26958 -900 -11857 9864 -10393 4160
779 4160 18693 -27096 -4750 37087 -19812 -25266 32827 1391 -23851 13149 2446 -5752 11666
792 11666 -14851 -4724 28974 -17045 -23260 33538 1642 -30839 16677 11833 -16306 5863
804 5863 -539 -5719 17549 -10926 -17899 28661 713 -31050 18422 15449 -23337 3746 10689
817 10689 -9348 7252 -2193 -12918 20000 1107 -27087 17613 16373 -26989 2179 18798
829 18798 -12885 -1416 7012 -8782 9247 3398 -19672 12972 14426 -25216 1508 21957 -14873
842 -14873 -7309 13824 -5472 -571 5188 -11523 7569 11295 -20216 1481 21084 -15545 -9491
855 -9491 18121 -4528 -8264 8223 -4321 852 8158 -13159 799 17225 -13975 -9013 19214
868 19214 -4544 -12672 10976 151 -5625 6357 -5586 -1403 12099 -9799 -7295 16837 -4179
881 -4179 -13391 12027 2231 -10095 5838 382 -4422 7646 -4486 -6240 12531 -2602 -12019
894 -12019 10984 3550 -11818 4912 4491 -6554 3551 329 -5159 7545 -455 -9154 8324
907 8324 3748 -11051 3960 6351 -7592 700 3774 -4258 2833 1281 -6159 5258 3432 -8721
921 -8721 3067 6425 -7350 -502 5577 -4087 -367 2938 -3806 2052 3168 -6027 1796 5693 -6066
936 -6066 -1235 6107 -3351 -2256 3848 -2156 -523 2910 -3437 337 4471 -4168 -1337 5496 -2589
951 -2589 -3066 4193 -839 -2420 2558 -1230 -1086 3048 -2013 -1417 4029 -1469 -2737 3520 -290 -2806
967 -2806 2181 56 -1878 1816 -451 -1555 2383 -407 -1893 2452 197 -2206 1528 488 -1892
982 -1892 979 266 -1433 1209 144 -1424 1389 543 -1672 1105 790 -1457 519 621 -1268 344
998 344 449 -1122 620 564 -1056 558 902 -1024 217 787 -879 -53 526 -758 -8 477 -685 105
1016 105 645 -485 92 797 -428 -152 477 -335 -339 259 -248 -237 365 -97 -19 461 -213 -15 343 -181 -177
1037 -177 294 -277 -280 297 -162 -217 209 -95 38 312 -48 -47 404 -310 -302 289 -232 -307 208 -38 -202 280 -97
1060 -97 -75 419 -99 -191 559 -58 -510 359 12 -519 205 78 -320 353 18 -219 584 -53 -656 549 118
1081 118 -900 414 296 -732 299 301 -494 516 186 -738 853 358 -1112 504 580 -1250 185 534
1099 534 -1021 458 539 -1186 805 891 -1586 538 1359 -1576 -103 1346 -1192 -175 1014 -1255
1115 -1255 402 1318 -1802 354 2087 -2006 -574 2368 -1346 -1075 1737 -967 -518 1515 -1630 -89
1131 -89 2494 -2051 -979 3336 -1328 -2101 2669 -414 -1863 1748 -752 -804 2360 -1706 -1208 3792
1147 3792 -1396 -2910 3724 92 -3369 2172 522 -2041 1887 -928 -1716 3659 -1246 -3507 4592
1162 4592 609 -4853 2964 2071 -3786 1473 897 -2558 2724 -392 -3793 4420 1037 -5896 3474
1177 3474 3362 -5460 1074 3172 -3467 1120 1182 -3706 3392 1494 -6148 3496 4485 -6749 594 5557
1193 5557 -4265 -834 3321 -3124 1256 2153 -5327 2725 4820 -7187 149 7408 -4969 -2742 5653
1208 5653 -2281 -1409 2814 -3732 1381 4287 -6842 67 8272 -5903 -4037 8120 -1903 -4483
1222 -4483 4405 -1435 -1071 3946 -5253 -568 8286 -6140 -5054 10166 -1673 -7744 6395 1314
1236 1314 -4546 3296 -1764 -1728 6387 -4977 -5025 10465 -1683 -9619 8103 3417 -8056 3002
1250 3002 2211 -3495 3967 -2517 -4571 9100 -1694 -10373 9123 4603 -11278 3265 6492 -6006
1264 -6006 1017 1538 -3974 5740 -694 -9103 8587 4678 -12864 3757 9415 -8688 -1357 6056
1278 6056 -3684 1589 1018 -6797 6815 4045 -12902 4371 10908 -11263 -2594 10660 -4589 -3067
1292 -3067 4501 -4024 2763 3895 -10485 3604 10929 -12123 -3602 13918 -5208 -7346 7967
1305 7967 -1040 -2305 3750 -5985 1920 8600 -10844 -3010 14497 -6369 -9664 11137 627 -7125
1319 -7125 4473 -1328 -773 6228 -8017 -2676 13463 -6747 -10563 13525 1315 -11669 6066
1332 6066 3474 -4817 3600 -2953 -2493 9957 -5809 -9369 13537 1011 -14029 7498 6630 -8904
1346 -8904 1840 2487 -3211 5527 -3242 -7257 11743 611 -14514 8529 8534 -12548 665 7988
1360 7988 -5041 692 1277 -5000 7143 1139 -12057 7605 8657 -13677 -99 11461 -6500
1373 -6500 -3505 5276 -2653 2110 1565 -8124 5982 6994 -12992 571 12686 -8333 -5688 9168
1387 9168 -1877 -2827 3168 -4337 3027 5565 -10703 752 12547 -9268 -6711 12273 -1958
1400 -1958 -7600 5653 -323 -1338 3942 -6378 388 10223 -8715 -6283 13315 -2459 -10401 7880
1414 7880 2403 -5856 3294 -1307 -1338 6841 -6008 -5015 12121 -2712 -11242 9383 4000 -9637
1428 -9637 2955 3344 -3604 3172 -2089 -3749 8711 -2036 -9676 9045 3976 -11082 3105 6270
1442 6270 -5693 459 1655 -2790 4960 -1142 -7319 7927 3293 -11052 3765 7563 -7751 -876
1456 -876 5099 -3231 1109 1054 -4985 5348 2908 -9538 3585 7823 -8595 -1636 7697 -3667
1470 -3667 -2242 3401 -2808 1834 2693 -6669 2719 6807 -8034 -1727 8773 -4067 -4468 5279 -1120
1485 -1120 -1677 2696 -3477 956 5050 -6076 -1460 8180 -3868 -5238 6540 -103 -4222 2883
1499 2883 -513 -853 3254 -3614 -1231 6419 -3370 -4694 6663 110 -5685 3386 1400 -2869 1996
1514 1996 -1047 -1424 4390 -2314 -3873 5994 199 -6057 3762 2550 -4415 1271 1376 -2295 2210
1529 2210 -566 -3081 4353 450 -5421 3460 3085 -5057 764 3126 -2744 334 1145 -2316 2205
1544 2205 877 -3996 2548 2726 -4623 576 3713 -2857 -789 2234 -1550 336 1048 -2570 1469
1559 1469 2197 -3628 487 3565 -2720 -1098 2968 -1349 -915 1558 -1538 338 1737 -2536 169
1574 169 3074 -2398 -1161 3145 -1094 -1715 1994 -638 -864 1498 -1294 -399 2285 -1643 -1274 2820
1590 2820 -736 -2056 2075 145 -1631 1231 -126 -955 1331 -645 -1129 2010 -244 -1774 1737
1605 1737 568 -1715 846 540 -1128 602 34 -879 1063 -62 -1264 1158 457 -1400 777 703
1621 703 -1131 297 343 -747 518 132 -952 846 396 -1082 654 756 -1045 247 664 -777 170
1638 170 438 -767 279 432 -1001 354 779 -815 81 782 -567 -73 584 -468 -110 433 -524 -41
1656 -41 571 -492 -185 696 -229 -289 564 -121 -322 390 -122 -277 276 -212 -244 367 -114 -206 429 -57 -218
1677 -218 337 -13 -242 113 -85 -195 198 -165 -185 262 -14 -227 340 62 -156 226 -66 -236 156 -49
1697 -49 -336 221 -65 -289 225 100 -252 304 135 -333 210 99 -347 134 163 -383 59 140 -278 99 234
1718 234 -313 202 261 -306 -12 230 -314 -93 191 -179 40 186 -224 124 300 -293 135 289 -332 -88
1738 -88 285 -276 -84 224 -317 128 348 -443 44 532 -395 -103 526 -352 -209 347 -356 -105 429 -505
1758 -505 -21 758 -454 -245 850 -377 -457 717 -231 -401 535 -398 -232 788 -539 -500 1060 -220
1776 -220 -830 938 39 -854 583 -82 -598 659 -347 -587 1112 -231 -1015 1095 241 -1103 675
1793 675 336 -841 507 -88 -745 1013 -178 -1158 1274 368 -1593 915 939 -1287 377 570 -960
1810 -960 600 137 -1278 1146 523 -1915 910 1441 -1793 151 1394 -1028 76 690 -1165 661
1826 661 714 -2013 787 1707 -2156 -166 2142 -1270 -665 1416 -882 -62 956 -1723 424 1802
1842 1802 -2293 -379 2759 -1497 -1414 2167 -530 -984 1308 -971 -47 1704 -2185 -498 3008 -1807
1858 -1807 -1958 3040 -339 -2096 1830 -26 -954 1579 -1342 -742 2928 -1720 -2340 3572 -164 -3261
1874 -3261 2269 992 -2043 1186 -10 -1075 2223 -1221 -2228 3455 -54 -3848 2686 1744 -3339
1889 -3339 950 1520 -1694 1180 -179 -2025 2914 158 -4066 2875 2266 -4302 671 2922 -2352
1904 -2352 -50 1331 -1630 1644 432 -3477 2567 2391 -4795 722 4016 -3170 -1120 2810 -1311
1919 -1311 94 1113 -2534 1844 2201 -4574 762 4602 -3885 -1858 4346 -1311 -1896 2126 -1098
1934 -1098 378 1941 -3499 488 4416 -3994 -2262 5348 -1424 -3610 3083 174 -1483 1707 -1764
1949 -1764 50 3536 -3454 -2081 5638 -1611 -4627 4221 1118 -3623 1657 386 -1074 2430 -2112
1964 -2112 -1973 5044 -1418 -4994 4747 1680 -5256 1767 2429 -2451 981 -180 -1571 3561 -1065
1979 -1065 -4399 4646 1704 -6116 2106 3775 -3852 -69 1933 -1715 1656 -148 -3475 4002 1589
1994 1589 -6132 2364 4589 -5124 -768 4115 -2023 -511 1319 -2162 2314 1389 -5049 2207 4527
2009 4527 -5525 -1030 5422 -2434 -2332 2830 -1046 150 1375 -3338 1643 3870 -5218 -869 6102
2024 6102 -2988 -3599 4367 -197 -2286 1704 -1361 289 2859 -3786 -849 5668 -2967 -4022 5236
2039 5236 304 -4235 2237 785 -1313 1678 -1906 -742 4488 -2605 -3756 5490 243 -5280 2716
2054 2716 2074 -3024 982 224 -1134 2885 -1664 -2958 4918 116 -5562 3295 2933 -4350 518 2182
2070 2182 -1851 975 -185 -2161 3503 201 -4754 3240 2964 -5102 451 3748 -2584 -530 1478
2085 1478 -1535 1591 447 -3601 2806 2624 -5011 519 4434 -3252 -1534 3076 -1104 -403 1082
2100 1082 -2177 1473 2130 -4122 503 4404 -3308 -2083 4050 -1008 -2082 1776 -742 48 1566
2115 1566 -2666 273 3659 -3139 -1925 4414 -1021 -3028 2507 287 -1455 1304 -1116 -261 2627
2130 2627 -2332 -1621 4164 -1089 -3306 3005 861 -2641 1144 368 -1011 1497 -1162 -1340 3134 -898
2146 -898 -3029 3052 1052 -3224 1263 1474 -1710 649 58 -1183 1978 -394 -2443 2644 998 -3312
2162 -3312 1374 2163 -2320 140 1293 -1113 671 198 -1824 1687 860 -2829 1109 2232 -2390 -251
2178 -251 2039 -1152 -401 859 -1085 678 770 -2092 768 1891 -2325 -334 2385 -1107 -920 1417
2194 1417 -577 -285 874 -1200 224 1529 -1729 -454 2233 -1070 -1336 1800 -288 -930 932 -446
2210 -446 -351 1094 -1104 -483 1840 -910 -1275 1873 -25 -1360 983 153 -737 704 -397 -567 1216
2227 1216 -626 -1110 1485 -16 -1434 999 478 -1090 493 262 -676 638 -188 -885 1000 65 -1287
2244 -1287 846 528 -1151 327 567 -688 266 248 -645 632 158 -1000 632 607 -1041 184 848
2261 848 -692 13 587 -413 94 312 -683 219 507 -824 38 723 -590 -269 640 -271 -136 363 -247
2280 -247 11 507 -517 -26 614 -427 -277 595 -147 -260 441 -114 -188 346 -260 -175 429 -283 -261 500
2300 500 -178 -348 399 22 -279 257 -13 -247 314 -72 -262 338 -163 -377 316 71 -377 205 129 -211
2320 -211 179 -12 -259 180 -29 -249 249 44 -311 181 139 -232 133 150 -165 88 153 -229 41 120 -291
2341 -291 14 199 -176 44 214 -94 -3 197 -181 -22 144 -217 12 188 -126 -64 150 -196 -103 201 -86
2362 -86 -59 281 -179 -63 191 -167 -56 185 -137 -90 220 -143 -30 232 -131 -125 285 -107 -121 158 -153 -136
2384 -136 111 -143 -146 266 -92 -216 310 10 -201 170 -20 -136 162 -71 -173 190 -61 -273 270 39 -281
2405 -281 238 94 -252 152 12 -264 247 -28 -350 301 78 -376 343 194 -335 92 171 -308 98 -32
2425 -32 -386 320 112 -515 319 344 -565 144 397 -405 43 210 -372 214 148 -613 213 342 -654 160 560
2446 560 -517 -115 488 -308 -29 284 -516 132 454 -721 84 689 -700 -234 661 -209 -217 499 -380 -51
2466 -51 504 -648 -38 891 -740 -400 922 -272 -576 671 -179 -280 588 -489 -157 849 -651 -591
2484 -591 1142 -282 -927 854 154 -708 485 -15 -308 696 -443 -573 1164 -300 -1168 1087 350
2501 350 -1164 570 475 -619 524 -86 -598 991 -95 -1351 1117 464 -1485 561 858 -953 182
2518 182 408 -610 674 46 -1215 1059 561 -1763 562 1286 -1371 -114 1071 -779 85 460 -1009
2535 -1009 720 701 -1823 570 1536 -1733 -459 1626 -779 -577 866 -562 209 693 -1360 434
2551 434 1618 -1784 -566 1978 -935 -1143 1344 -228 -575 770 -798 62 1386 -1560 -559 2249
2567 2249 -1008 -1709 1868 109 -1324 872 -34 -456 1053 -952 -596 2052 -937 -1771 2218 256
2583 256 -2099 1072 669 -1109 628 -169 -615 1639 -680 -1613 2284 343 -2592 1326 1343 -1812 338
2600 338 776 -852 869 -275 -1323 1942 372 -2619 1410 1638 -2405 15 1608 -1037 -41 421
2616 421 -959 1130 319 -2254 1512 1697 -2714 6 2408 -1480 -827 1299 -654 192 554 -1653
2632 -1653 1001 1571 -2642 9 2753 -1814 -1370 2151 -435 -974 872 -742 320 1249 -2025 32
2648 32 2710 -1884 -1538 2776 -340 -1872 1352 77 -665 908 -1114 -145 2260 -1703 -1485 2987
2664 2987 -308 -2485 1757 756 -1595 713 -16 -531 1457 -1103 -1245 2688 -353 -2700 2166 1141
2680 1141 -2378 638 962 -913 644 -402 -1025 2100 -330 -2452 2220 1232 -2849 667 1865 -1629
2696 -1629 -3 699 -844 960 -53 -1943 1821 1212 -2833 745 2304 -1923 -579 1737 -756
2711 -756 -133 422 -1190 1119 936 -2453 697 2309 -2202 -721 2289 -796 -1045 997 -549 172
2727 172 766 -1729 424 2076 -2141 -787 2662 -849 -1570 1586 20 -808 713 -803 88 1454
2743 1454 -1612 -662 2495 -912 -1800 2003 306 -1557 800 130 -430 956 -1036 -552 2060 -848
2759 -848 -1834 2127 391 -2063 1050 809 -1071 441 38 -677 1347 -554 -1531 1897 400 -2209
2775 -2209 1050 1251 -1518 155 764 -726 530 -38 -1024 1339 337 -1963 971 1336 -1824 2
2791 2 1388 -844 -141 506 -759 615 350 -1526 756 1228 -1774 -116 1674 -961 -595 1046 -427
2808 -427 -102 516 -886 395 1000 -1459 -72 1654 -989 -854 1376 -246 -626 655 -460 -61 681
2825 681 -1018 -170 1411 -895 -812 1428 -150 -1052 806 59 -481 562 -416 -273 938 -596 -759
2842 -759 1293 -132 -1145 791 339 -804 428 155 -404 606 -282 -611 979 -122 -1067 855 460
2859 460 -963 305 505 -502 259 78 -477 613 97 -845 627 449 -1063 249 643 -628 1
2876 1 364 -308 232 246 -642 379 363 -846 225 762 -635 -191 606 -317 -132 345 -305 91 346 -575
2896 -575 56 610 -571 -275 686 -212 -298 394 -99 -144 324 -293 -27 455 -341 -256 489 -251 -341 475 5
2917 5 -246 264 -103 -129 327 -197 -144 484 -132 -385 427 24 -428 238 179 -203 197 -45 -192 288 -48 -319
2939 -319 300 89 -425 174 244 -267 83 113 -173 136 93 -229 98 86 -323 89 213 -247 14 232 -162
2960 -162 39 153 -144 34 139 -230 80 183 -204 -5 180 -161 -48 153 -135 -52 181 -152 26 130
2980 130 -172 -48 209 -161 -98 173 -86 -127 108 -44 -24 254 -125 -81 83 -92 -132 186 -29 -117 149 25
3002 25 -149 175 46 -174 166 -23 -135 131 -67 -168 113 -3 -109 109 -31 -154 93 115 -79 81 66
3023 66 -175 74 78 -166 72 72 -105 96 113 -121 72 61 -98 62 52 -138 23 24 -133 75 119 -143 -21 139
3047 139 -103 79 107 -139 4 58 -178 -5 165 -179 -22 192 -89 10 132 -143 7 161 -90 41 105
3068 105 -185 22 132 -200 -89 214 -64 -51 224 -46 -112 126 -92 -96 185 -88 -151 236 -45 -113 159 37
3090 37 -108 159 -53 -70 167 -137 -144 318 -98 -249 249 30 -257 196 15 -153 151 -119 -145 317 -41 -314
3112 -314 258 152 -344 114 74 -246 173 36 -239 318 0 -421 371 78 -462 228 243 -350 41 144 -218
3133 -218 181 85 -385 276 159 -489 166 380 -437 -90 324 -227 90 173 -283 226 220 -497 145 431 -576
3154 -576 -101 542 -349 -218 284 -179 101 318 -401 85 455 -513 -113 649 -338 -341 452 -140 -246 270 -274
3175 -274 -34 461 -449 -117 736 -344 -374 586 -15 -477 372 -61 -202 360 -255 -118 609 -315 -615 732
3195 732 3 -708 398 206 -401 282 -113 -196 511 -251 -553 723 1 -839 525 375 -642 132 197
3214 197 -324 302 -81 -482 603 54 -831 573 554 -884 109 601 -488 4 229 -408 366 195 -782
3233 -782 525 569 -1001 42 834 -649 -240 560 -227 33 233 -576 321 562 -942 20 971 -640
3251 -640 -347 833 -228 -334 356 -276 61 499 -780 82 985 -733 -497 1131 -178 -700 563 -46
3269 -46 -213 378 -426 -79 783 -637 -530 1136 -177 -882 734 296 -566 285 -109 -251 622 -492 -480
3288 -480 1084 -164 -1016 867 369 -930 384 311 -416 282 -156 -441 744 -150 -1002 947 486 -1122
3306 -1122 334 704 -639 66 245 -375 423 -71 -776 768 428 -1136 374 883 -887 -125 687 -350
3324 -350 -21 216 -532 460 426 -1076 349 897 -1064 -256 1020 -381 -421 509 -281 140 350 -732 170
3343 170 891 -905 -360 1156 -461 -665 718 -52 -351 305 -379 72 649 -810 -305 1130 -511 -761
3361 -761 923 118 -645 404 55 -241 441 -426 -273 928 -436 -764 952 115 -916 446 321 -512
3379 -512 281 -57 -266 652 -281 -676 951 99 -1056 525 573 -755 91 368 -333 287 -77 -580 681
3398 681 143 -1042 546 693 -844 54 723 -436 -29 268 -339 360 196 -706 468 592 -901 -12
3416 -12 817 -508 -247 487 -187 -64 231 -459 244 477 -889 33 848 -565 -416 658 -85 -288 336
3435 336 -196 -28 328 -565 -2 812 -551 -426 770 -155 -507 476 0 -273 292 -277 -107 547 -361
3454 -361 -405 740 -98 -641 541 156 -447 183 24 -261 406 -147 -323 563 -68 -616 494 276 -530
3473 -530 214 302 -317 141 42 -302 422 64 -535 358 316 -653 104 402 -367 -69 272 -180 215 117 -321
3494 -321 263 247 -514 131 434 -464 -22 316 -225 -36 121 -221 148 222 -382 27 468 -459 -121 456 -187
3515 -187 -222 297 -61 -71 210 -233 41 375 -246 -128 380 -156 -265 309 32 -225 239 -16 -50 204 -127
3536 -127 -140 340 -104 -269 300 42 -249 179 -7 -82 149 -38 -78 192 -100 -280 242 46 -325 156 157 -245
3558 -245 110 113 -113 116 17 -274 203 54 -290 140 156 -218 79 140 -102 48 31 -74 72 70 -193 98 153
3581 153 -195 -22 113 -101 -100 142 -93 56 93 -152 23 231 -186 8 178 -161 -132 165 -80 -45 90 -44
3603 -44 9 80 -90 5 151 -119 -99 76 -38 -90 70 13 -97 97 -94 -14 83 -44 -57 126 -8 -164 94
3626 94 30 -109 42 5 -97 74 22 -13 99 -24 -151 36 46 -149 22 17 -68 15 23 -94 49 34 -102 93
3650 93 119 -127 -32 77 -109 -11 77 -88 5 113 -91 12 49 -158 33 80 -66 -32 105 -47 0 49 -80 15
3674 15 23 -23 -59 39 -69 -36 24 -98 -65 59 -79 -61 23 -28 -59 87 16 5 57 7 -67 155 25 -128 107 -42
3700 -42 -105 180 11 -78 38 -25 -27 111 -66 -83 78 -92 -72 51 70 -48 61 -9 -59 53 29 -86 84 -54
3724 -54 -76 83 5 -54 2 38 -87 51 44 -62 61 -29 -109 90 61 -150 31 74 -156 1 36 -68 21 23 -141
3749 -141 69 69 -63 55 78 -155 -7 170 -68 24 112 -27 101 60 -162 88 97 -168 -24 165 -68 16 93
3772 93 -64 36 150 -136 26 158 -181 -66 210 -164 -92 175 -42 -111 100 -79 25 103 -150 5 211
3793 211 -154 -95 215 -62 -157 81 -35 -16 108 -99 -60 212 -117 -129 284 -109 -232 99 -30 -136 144 -65
3815 -65 -122 240 -133 -162 274 -11 -227 149 98 -256 125 94 -148 160 -67 -186 206 -36 -260 252 165 -318
3837 -318 115 104 -267 89 84 -176 123 78 -261 178 144 -329 116 258 -236 -63 222 -177 -2 64 -270 213
3859 213 172 -356 145 320 -267 -67 328 -155 -128 182 -150 18 160 -300 115 385 -257 -94 463 -163 -187
3880 -187 286 -75 -129 150 -156 -32 307 -329 -133 484 -203 -340 345 -28 -245 228 -27 -59 261 -268 -136
3901 -136 455 -169 -322 411 26 -441 246 168 -193 132 -148 -160 328 -129 -361 432 51 -482 288 252 -359
3922 -359 92 132 -191 184 17 -294 350 35 -522 235 331 -445 107 321 -189 21 51 -270 269 54 -424
3943 -424 245 299 -538 -1 464 -266 -48 192 -189 109 75 -397 262 254 -560 40 528 -342 -227 387 -118
3964 -118 -63 152 -218 99 277 -438 49 496 -349 -207 569 -73 -253 247 -47 16 206 -298 -100 422 -333
3985 -333 -303 558 -79 -398 371 110 -289 210 -59 -108 290 -234 -174 528 -100 -515 466 124 -498 196 129
4006 129 -123 184 -92 -194 455 -55 -535 452 222 -569 174 263 -333 110 72 -171 236 -68 -410 470 193
4027 193 -513 238 398 -354 -23 240 -229 105 163 -310 284 138 -506 189 373 -465 -41 404 -197 -129 197
4048 197 -172 121 100 -369 125 266 -450 -102 415 -275 -248 265 -19 -124 157 -185 107 263 -384 -68 472
4069 472 -213 -303 370 -57 -238 239 8 17 247 -198 -77 441 -222 -307 402 -40 -383 233 48 -206 113
4090 113 -105 -27 309 -167 -232 375 -76 -411 233 193 -260 77 77 -152 172 6 -195 275 -20 -343 219 217
4112 217 -411 77 223 -176 -9 70 -143 212 67 -280 231 185 -387 -9 286 -237 5 236 -135 69 99
4133 99 -256 106 163 -289 77 239 -289 -133 216 -49 -70 168 -186 -27 198 -198 65 299 -256 -114 274
4154 274 -67 -162 164 -18 -7 162 -153 -18 198 -150 -117 302 -73 -190 207 11 -136 104 -8 -111 165
4175 165 -54 -64 298 -77 -214 208 17 -221 53 61 -129 77 -3 -37 147 -24 -90 148 41 -157 67 114
4197 114 -177 72 41 -27 65 35 -91 58 108 -120 91 122 -181 -52 140 -158 -17 53 -182 22 22 -114 45
4220 45 140 -156 2 105 -139 -22 130 -80 -72 22 -36 33 140 -119 -58 183 -52 -66 110 -62 -119 21 -86
4243 -86 -49 66 -54 -1 180 -86 -108 145 -31 -48 85 -49 -82 58 -63 -15 106 13 -67 51 81 -99 43
4266 43 0 -76 70 -37 -43 6 -27 -88 110 19 -52 33 48 -106 53 -30 -45 65 15 -47 77 29 -89 58 36 -42
4292 -42 25 104 -65 36 27 -56 11 -12 -88 46 -2 -66 -36 78 -40 63 38 -36 -24 88 -5 54 20 -65 -38 40 -82
4319 -82 -7 23 -44 19 38 -58 15 35 -85 -34 56 -45 -1 50 -70 -57 89 -66 -31 56 -41 -64 21 -18 -43 91 -2
4346 -2 -82 43 18 -63 39 54 -74 -3 10 -120 49 78 -81 -37 44 -3 34 -36 -76 92 -14 -89 -49 76 -1 29
4372 29 118 -8 -43 -26 -45 71 49 -42 19 11 -54 -18 40 -84 25 51 -81 -46 54 -56 -2 74 -85 70 81 -84
4398 -84 -57 30 -86 -9 85 -94 79 21 -101 -11 130 -63 -92 34 -98 -74 58 -33 14 15 -101 0 104 -63
4422 -63 -53 97 -45 -65 68 -28 28 84 -41 46 125 -168 -73 182 -25 -99 66 -25 -95 79 -39 -100 97 -78
4446 -78 -81 175 -49 -155 171 25 -142 81 -13 -96 6 -7 -99 120 -29 -130 112 49 -96 114 39 -84 37
4469 37 30 -46 92 -42 -167 111 -12 -164 54 100 -143 9 102 -121 57 17 -159 171 5 -205 14 129
4491 129 -180 8 127 -78 -48 10 -85 115 23 -255 40 216 -166 12 174 -152 -73 116 -66 8 41 -184
4513 -184 67 160 -238 -9 241 -151 -145 178 -2 -45 52 -36 32 189 -194 -58 219 -133 -132 240 30 -206 45
4536 45 -63 -66 187 -167 -77 227 -121 -167 223 -76 -230 178 39 -118 79 -56 -72 147 -102 -177 232 64
4558 64 -306 204 144 -234 69 104 -98 112 -37 -146 205 -12 -269 216 95 -280 36 209 -106 -30 69 -154
4580 -154 121 -52 -186 162 138 -285 63 268 -167 -14 175 -72 101 63 -175 121 93 -327 56 322 -171
4601 -171 -105 289 -126 -75 102 -111 74 153 -198 69 255 -241 -63 329 -99 -164 191 -53 -34 81 -150 7
4623 7 176 -235 -103 316 -153 -248 265 87 -193 134 -3 -22 171 -211 -103 252 -125 -220 278 72 -247 228
4645 228 71 -103 116 -74 -143 215 -52 -285 251 48 -299 96 178 -199 53 68 -91 137 -39 -193 282
4666 282 88 -330 139 198 -298 -23 95 -168 38 66 -173 177 54 -323 110 187 -322 -10 283 -156 -11
4687 -11 105 -116 39 74 -240 59 247 -298 -12 244 -172 -73 138 -53 -48 130 -137 -2 167 -204 -46 308
4709 308 -220 -174 312 -6 -192 178 -10 -101 80 -165 14 275 -197 -163 264 -55 -222 128 124 -144 56 -38
4731 -38 -117 161 -102 -96 281 -2 -273 127 80 -216 85 36 -133 73 67 -130 212 -16 -237 128 102 -248 -2
4754 -2 152 -195 -5 67 -162 54 5 -173 178 95 -220 25 162 -210 -80 166 -68 10 99 -141 72 79 -200
4777 -200 47 187 -191 -135 226 -64 -52 91 -9 -60 26 -129 -19 182 -127 -76 223 -61 -139 186 -119 -67
4799 -67 100 -101 31 186 -96 -121 220 -70 -120 168 60 -146 82 -11 -52 110 -60 -59 189 -29 -101 212 24
4822 24 -188 38 49 -142 -34 2 -22 76 18 -106 160 58 -140 72 80 -151 6 25 -116 20 -17 -156 85
4845 85 8 -183 7 119 -113 -20 135 -90 -13 113 -98 43 50 -64 8 83 -148 15 128 -54 -59 72 -82
4868 -82 -34 79 -88 -15 85 -110 -2 97 -104 -142 96 -74 -93 24 -18 -139 49 -75 -30 63 -55 -93 65
4891 65 -20 -96 45 28 -107 29 -42 -35 128 -67 -74 33 51 -32 44 37 -46 51 81 -16 35 27 -30 123 -4 -122 35
4918 35 49 -69 19 78 -83 2 -36 -64 -27 44 -50 50 50 -82 15 39 -62 -43 58 -29 -35 32 -42 1 53 -91 -37 55
4946 55 -63 -11 66 10 15 50 34 3 31 -82 -1 23 31 -2 58 -7 -31 106 6 -81 43 -75 -37 53 -38 -98 62 17
4974 17 -69 46 -16 -3 55 38 8 51 9 -23 19 -2 -47 -34 -11 -57 33 75 -50 30 3 -79 -36 -10 -46 -26 30 -3 -15
5003 -15 -21 -15 -58 12 -76 -2 74 -40 -52 -16 -24 33 2 -67 -10 16 -30 49 69 -24 -27 98 -38 9 26 -74 32 31 -58 -26
5033 -26 90 -66 -19 94 -45 -39 15 -48 -14 63 -83 -24 54 -48 -50 72 -35 -25 65 -33 -37 34 -16 -39 67 -72 22
5060 22 109 8 -66 105 11 -72 47 -20 -39 34 2 -54 66 -67 -76 93 8 -74 83 -30 -69 65 -1 -1 48 -33 43
5087 43 21 -31 -80 103 58 -142 35 20 -110 38 -14 -102 57 32 -94 90 50 -172 61 43 -97 57 37 -71
5111 -71 33 33 -122 39 78 -115 115 120 -131 -36 55 -27 41 25 -73 25 52 -154 -17 66 -64 -19 69 -70 7 30
5137 30 -46 -22 72 -89 39 85 -130 -146 108 -81 -76 107 -21 -45 67 -8 -22 143 -143 -45 152 -33 -119 66
5161 66 66 -50 113 -36 -4 138 -58 -70 198 -98 -134 64 0 -102 54 71 -125 75 -22 -88 161 -3 -103
5184 -103 147 76 -236 40 9 -68 62 18 -126 96 -1 -109 127 -16 -208 58 154 -219 -16 79 -107 30
5206 30 58 -118 106 27 -192 41 114 -218 -59 98 -69 -72 56 -89 57 46 -216 38 192 -210 -33 229
5228 229 -124 -109 91 -46 -35 79 -129 67 179 -145 -40 212 -127 -115 184 -28 -85 128 -10 -67 163 -89
5250 -89 -27 221 -94 -222 296 55 -240 84 42 -147 95 -43 -62 172 -35 -182 163 -63 -318 139 107 -185
5272 -185 62 14 -166 120 -1 -112 219 46 -243 182 188 -223 -9 138 -92 -20 33 -132 150 36 -172 150
5294 150 210 -241 19 229 -145 -52 157 -75 27 38 -181 106 129 -298 41 200 -141 -84 164 -107 -47 87
5316 87 -134 109 134 -179 -16 210 -228 -51 199 19 -133 74 32 -26 78 -131 -81 271 -209 -164 287 -55
5338 -55 -214 171 55 -150 118 -17 -69 148 -53 -181 229 -140 -235 133 42 -226 54 106 -101 45 -94 -88
5360 -88 172 -39 -188 133 100 -210 3 148 -140 -11 51 -69 37 -30 -145 93 83 -273 111 91 -182 -3
5382 -3 140 -138 9 41 -65 170 57 -241 8 185 -173 -30 156 -144 -102 52 -56 22 74 -108 68 140
5404 140 -123 -62 260 -75 -167 70 -59 -13 35 -62 16 121 -94 -74 187 -73 -139 134 20 -171 79 26 -50
5427 -50 129 -89 -93 200 -73 -166 181 -13 -146 48 21 -122 73 -10 -132 196 -50 -168 125 40 -191 99
5449 99 115 -43 61 19 -13 82 16 -77 87 58 -141 48 174 -152 45 121 -112 -27 -3 -56 69 -19 -156 60
5473 60 70 -116 -74 130 -56 4 74 -57 -30 53 -57 19 127 -122 -22 151 -69 -151 119 41 -95 83 -23
5496 -23 34 54 -139 -100 42 -85 -139 69 -37 -106 15 -13 1 86 -28 -82 64 -56 -86 98 0 -181 91 80
5520 80 -95 53 -22 -45 83 16 -77 55 1 -131 15 60 -66 11 30 -113 10 49 -66 21 -57 -57 54 1 -117
5545 -117 48 65 -83 -103 17 0 -18 53 -18 -45 46 -115 8 48 -98 -20 23 -42 5 69 -43 -59 78 -44 -12
5570 -12 130 -59 -30 15 23 -55 85 4 72 -29 -67 -49 70 -14 -4 118 -56 -48 90 22 -51 3 3 27 59 -2 -1 53
5598 53 64 -63 35 -4 -89 -45 -32 16 1 -28 -110 65 28 -65 -11 -3 50 26 -1 -42 17 16 9 20 63 -33 -4 -19 -76 -5 36
5629 36 13 -34 -24 -11 81 -24 -28 33 135 -21 55 43 -29 -7 2 -18 -5 11 -6 -11 19 11 -21 22 -45 12 0 32 -133 18
5659 18 -64 12 45 -11 -74 13 -24 -42 33 22 -5 -12 26 -50 73 -26 -42 45 -5 -65 41 48 -54 -28 38 -17 59 70 -51
5688 -51 54 24 -62 8 -33 13 -43 17 -83 13 27 -32 -49 2 -68 26 -6 -96 -42 -20 -53 -5 4 -36 25 -7 1 -8 -7 -82 21
5719 21 17 -74 -31 68 -64 4 -39 -40 -51 89 -48 -40 60 -14 -21 54 -51 -17 23 -77 -13 38 -76 -38 78 26 -32 53
5747 53 23 60 121 8 -29 64 -46 -18 108 -51 -105 42 1 -117 41 -29 -33 59 -17 -85 54 17 -20 32 -8 -51 41
5774 41 -5 -104 -29 62 -45 19 -21 -64 47 -4 -122 79 6 -110 -14 56 -37 -1 97 12 25 -19 -119 40 49 -117 28
5801 28 27 7 -61 42 -68 108 60 -80 85 17 -64 -20 84 -35 -62 21 -12 -60 -36 -69 -3 72 -93 8 22 -94
5827 -94 -79 73 -40 -37 -1 -74 40 82 -130 -22 154 -133 14 144 30 -63 71 42 -43 21 -72 -22 75 -31 -29
5852 -29 118 -114 -74 94 -7 -72 113 39 -60 24 -43 -63 102 -40 -67 52 12 -118 60 32 -85 14 -42 -4 66
5877 66 -41 -142 101 20 -145 19 41 -106 -23 13 -49 -5 7 -75 56 37 -135 61 92 -77 23 37 -80 31
5901 31 -5 -41 5 77 -71 89 46 -191 14 65 -3 -18 8 -7 76 59 -123 54 86 -124 22 177 -59 -36 69
5926 69 -31 -27 38 -68 68 76 -47 20 170 -48 -41 123 -64 -21 73 -37 6 27 -96 24 77 13 -138 50 23
5951 23 -149 100 34 -84 -18 77 -15 164 25 -72 155 17 -101 131 75 -85 52 -16 -68 28 14 -4 59 8 -82
5976 -82 73 85 -69 5 74 -46 73 -10 -74 13 -11 -114 40 29 -129 -14 96 -103 -44 123 -97 -36 -7 -8 34
6001 34 27 -106 -20 78 -101 -74 99 -26 -21 25 -8 62 0 -94 34 39 -117 -62 76 -58 -44 171 31 -63 64 -97
6027 -97 -61 74 -51 -61 70 19 -103 72 17 -78 -12 -1 -27 56 -21 -24 70 -15 -57 61 18 -117 65 24 -35 -22 -21
6054 -21 -50 71 -14 -71 121 30 -95 -32 0 -95 37 24 -67 -12 8 -39 69 -4 -84 73 41 -85 -86 69 -16 41 21
6081 21 -30 -56 17 -34 -3 73 -93 -30 88 24 -23 25 -50 43 2 -78 -47 106 -11 -113 54 -97 40 -36 -9 -68
6107 -68 68 26 9 10 -15 3 57 -31 -54 41 111 26 48 25 -39 13 -16 34 75 57 -43 41 -12 14 78 83 -70 55 28
6136 28 26 30 27 -33 45 -17 -38 69 30 -21 -24 89 48 35 26 -35 21 34 -91 -16 2 -48 -46 43 -31 2 25 -42 -11 24 -21 -2
6168 -2 29 -87 -26 60 0 -13 28 -55 -27 29 19 57 13 -13 -4 46 -24 -19 17 -28 8 7 24 -30 23 9 -32 59 -40 -119 -8
6199 -8 -14 -71 35 -4 23 -21 -43 15 32 -10 11 65 48 10 -66 1 -26 1 1 34 -23 9 7 41 -18 -91 5 14 -55 -41 45 2
6231 2 16 47 -49 29 -46 18 -43 3 16 -58 32 -78 -54 -29 -80 -17 29 -14 47 17 -38 -8 38 -6 -49 20 -23 62 -4 -55
6261 -55 -36 46 -49 -45 -26 -40 -23 -33 -13 17 59 40 6 27 -5 -48 45 36 -9 37 29 -18 10 8 -14 64 -23 -76 59 51 25 61
6293 61 43 18 28 13 -86 35 12 -55 18 -25 -31 57 4 11 -19 69 4 16 -21 -36 69 37 -2 49 -26 -3 -1 -54 -42 -13 -27
6324 -27 -31 -21 -29 -6 41 47 23 10 -29 -92 39 61 26 -5 -4 -26 35 -4 -31 -29 29 -70 -22 82 35 35 69 -26 -8 -16 5 0 -12
6357 -12 9 22 18 24 -29 2 -21 12 19 -51 1 3 -7 -40 34 -10 -93 -19 48 57 -70 -42 -42 -30 -17 0 68 -63 -58 6 60 -15 -25
6390 -25 -16 -64 4 -1 31 30 75 2 -12 -6 -14 93 57 -63 12 1 4 -10 -17 -55 -2 -5 -15 -31 -25 -43 -4 50 -59 23 18 -29 -1 81
6424 81 20 35 61 -53 -16 57 38 5 16 4 48 22 -20 -13 18 -14 -76 28 -47 -9 4 -16 -52 41 40 -44 55 -35 -37 26 9
6455 9 29 69 -47 -10 47 16 -13 26 -64 -34 28 -77 -23 25 6 -63 -36 34 -12 31 56 -15 57 60 -2 48 -30 -33 -5 51 -18
6486 -18 19 -23 -46 73 -49 -11 -7 -88 -8 -10 9 -20 35 -29 -11 -19 -21 -16 80 -14 -21 -14 36 -26 30 22 -13 -25 46 -26 77 48 -16
6519 -16 56 -2 -45 15 59 -52 16 -25 38 34 18 -40 18 -12 0 -14 32 -52 12 105 35 -27 0 -15 72 48 -37 -15 17 -50
6549 -50 -49 51 -12 21 41 30 35 10 -85 -31 -22 -58 -71 67 9 33 24 23 -28 -17 -43 35 54 -68 -41 45 -20 -55 72 -5 -10
6580 -10 38 22 -15 10 9 -52 41 36 -61 -22 46 -57 16 15 -60 -54 -4 34 37 7 -57 24 90 -100 -1 12 -24 36 23 -44 -35 15
6612 15 -87 7 30 -42 4 26 -100 38 65 -46 82 10 18 15 27 -13 -46 -19 -79 41 20 -25 -44 77 23 33 -56 -35
6640 -35 1 9 -29 -10 10 5 29 -44 3 -23 24 -45 17 37 -24 -72 79 -48 -28 51 -52 -39 14 54 -15 2 -5 8 26 -18
6670 -18 -111 23 44 -51 -47 99 -50 14 53 -43 2 -26 -67 18 3 -143 -8 35 -40 0 -10 -27 8 24 -66 24 59 -31
6698 -31 -33 37 -67 36 98 -52 -110 34 -29 -51 70 -78 43 6 7 15 118 15 -43 -31 41 -81 -15 -13 -16 -41 -91 -83
6726 -83 39 -84 -20 90 -28 -42 57 6 -23 4 16 0 71 28 -34 77 -10 -3 28 53 -20 -17 -59 -44 56 -34 -54 -15
6754 -15 -15 -27 54 23 -63 -49 -66 -21 -16 -1 -48 20 77 -30 20 29 -32 3 28 35 9 11 -75 16 -12 -32 43 8 -32 -34 28 -53 -13
6787 -13 -40 -27 22 -6 -6 11 2 -30 14 63 -25 -45 54 -58 9 16 40 -34 13 -2 -27 92 -14 -26 46 52 -1 24 -26 -18 42
6818 42 -7 21 19 -49 58 57 -9 30 95 43 -19 -19 -18 10 -36 24 17 -20 60 -26 18 14 12 7 71 -9 50 15 -6 62 -33 -8 57 30
6852 30 -21 1 -8 -53 -50 29 -27 33 -42 -23 19 -19 -42 22 17 -9 26 21 -93 11 41 -73 -43 40 -5 -53 -8 18 5 -7 -10
6883 -10 -90 -59 52 35 78 -26 15 54 -47 9 -8 -1 -15 26 -59 -37 16 28 -35 -32 -8 1 -29 -7 57 15 90 -22 35 51
6913 51 -35 11 -16 -25 39 -3 9 -10 46 19 62 -17 58 52 28 -30 31 -16 25 40 -21 38 -16 52 -36 19 -29 14 -19 60 -58
6944 -58 24 15 8 -62 -4 -2 -23 23 17 73 73 8 3 22 -62 -38 -23 31 -8 -25 3 0 -4 -106 -40 21 -79 -77 4 -47 18 35 24 -70
6978 -70 -6 -29 -34 127 12 14 43 46 25 -1 -2 53 47 -70 30 106 20 28 29 -32 -7 30 -9 41 12 10 63 37 32 11 39 34 -6
7011 -6 -41 -21 -12 21 2 17 31 -32 -53 -33 -50 -36 -7 -7 -9 16 -4 -14 -22 45 28 -38 -11 32 -39 14 -24 39 48 -72 49 1
7043 1 -15 -9 7 -17 63 23 -104 36 37 -23 18 37 -19 -54 43 -16 -37 4 -50 -32 -42 21 -46 -14 25 52 55 -50 -9 40 -2
7074 -2 1 16 41 17 -2 16 -26 49 34 -34 -10 79 -21 -30 -12 -13 23 9 -65 50 -42 -17 -16 -50 -47 -6 22 -35 32 -7 -24 17
7106 17 80 -59 22 -38 14 -31 -32 -6 2 74 -16 26 -7 -8 14 -25 -27 -48 68 -14 -16 -28 -65 -14 -5 -78 6 34 -83 8 -32 2
7138 2 113 80 -45 39 -3 -25 -33 -14 -35 -72 9 -39 -71 7 -11 -43 22 -85 -24 -9 18 -13 45 26 -3 38 -35 -9 34 19
7168 19 -14 -43 -48 14 51 -57 1 28 -20 -65 33 -52 -18 27 41 -41 -5 -35 -92 91 46 -47 -11 24 -36 -16 -57 -103 76
7197 76 18 -17 52 9 -71 19 45 -47 28 49 -17 9 -44 6 54 62 -49 61 -19 -26 6 -28 -70 8 18 -87 -3 -29 -62 16
7227 16 53 19 -48 52 11 -56 46 -28 62 55 -31 -13 28 32 -49 28 -71 -55 99 -41 21 86 -13 -73 16 31 -15 101 -19
7256 -19 10 -4 -1 -52 -34 -99 -114 -17 8 17 -16 15 -19 18 5 -54 52 92 -49 82 18 -80 16 26 -61 0 -34 30 79 42
7286 42 -81 5 37 -16 58 -65 -22 -45 8 26 7 -15 -86 -24 23 -47 15 60 -38 89 58 22 52 -54 -25 49 26 11
7314 11 55 -26 -65 33 12 20 -30 24 -15 9 -10 -92 -7 17 1 -29 30 11 44 -9 11 -32 46 -28 -2 125 -18 -51 -39 2
7344 2 -37 42 7 -61 41 -13 -19 -10 33 -28 54 10 1 25 34 32 7 35 -8 27 31 -19 -18 38 -63 39 2 8 18 42 37 46 -20 -97
7378 -97 99 -1 -32 -20 32 -25 -46 28 8 25 34 27 36 67 -48 -16 -2 18 107 19 37 1 -13 -20 0 -9 -84 25 13 -61 16
7409 16 4 -6 52 -25 -5 -3 11 7 24 -9 2 53 -30 2 -8 2 6 -45 12 -23 -49 -10 -58 -55 -59 -71 26 -29 -22 16 27 -10 -18 26
7443 26 -6 -30 43 -35 48 18 -87 -21 -3 -37 -22 -21 15 -50 -29 47 -31 27 0 32 -12 50 -38 5 8 0 -8 -9 26 -22 -28 -30 18
7476 18 -28 14 -4 -60 26 -36 -15 -57 -24 1 -53 15 7 -66 27 43 -28 10 10 -10 -33 -14 -26 -12 42 -21 18 20 -13 -43 10 -30
7508 -30 67 38 -5 -4 18 30 -7 62 35 -20 43 -27 6 56 -11 -80 55 42 -24 -22 -31 -14 -56 -37 16 -2 72 8 -38 -14 -41
7539 -41 -38 -18 17 -22 17 -39 -14 30 4 -8 -12 -8 19 17 55 -13 -12 -24 -23 -4 -22 48 3 -37 49 30 10 34 32 -47 -14 8 -3 2
7573 2 45 58 42 3 23 28 -23 27 -71 3 -3 -81 24 -55 -66 30 -20 -21 -22 -17 -17 19 16 -27 10 12 -17 -32 -52 28 -16 -6 12 25
7607 25 -5 -16 -13 76 35 14 -45 19 -3 39 -34 19 -20 -15 75 -28 3 -29 -25 44 -50 -21 9 2 -17 26 19 9 -27 -10 26 -37
7639 -37 46 -18 72 -19 -27 3 -9 -8 -48 -25 -28 0 -18 58 -37 -60 -34 -28 9 8 10 -45 23 -55 -8 -30 -3 14 5 -29 -31 41 19 6
7673 6 17 12 -1 15 -7 59 6 -1 10 54 -10 6 -1 18 -11 -9 19 18 62 -71 -25 14 13 -33 83 -49 -67 15 10 -17 -2 8 -2
7706 -2 8 -19 -3 -31 -16 10 -127 19 -44 -22 -38 -50 24 -33 -103 45 9 -24 -32 3 -3 35 9 19 -78 35 -24 25 1 54
7736 54 -58 44 -18 -59 68 -46 15 18 -24 33 15 -10 8 -35 -34 -52 92 -30 -26 -3 52 -51 -23 -24 44 11 -38 -31 -54
7765 -54 -27 -27 73 -2 -6 36 21 -6 8 -22 38 3 -26 8 -33 -46 31 21 7 2 -92 34 27 22 -21 44 9 -8 1 -11 -7 33 24
7798 24 88 -5 22 -40 -70 17 8 -19 -24 -8 -61 -102 47 9 64 -50 -52 2 -4 1 -15 75 -67 51 20 1 -23 48 55 -58 -57
7829 -57 -27 24 -9 12 -12 6 -7 -20 20 -52 14 23 -23 21 -43 -14 39 49 0 1 -39 24 -36 -2 -11 7 15 -21 57 -32 -67 -91
7861 -91 49 -8 -13 43 -38 -3 48 -15 -35 53 3 28 -2 -18 -15 -12 -39 -86 39 -8 -19 29 19 -1 67 -48 -39 -1 12 -34 24
7892 24 17 -53 13 27 61 41 18 -26 -12 -94 18 9 -26 -22 26 -23 34 13 9 -13 -50 -57 13 76 10 -1 -45 28 13 -49 -11 1
7924 1 0 0 -59 -19 -29 -37 -80 -68 9 16 -7 40 -63 31 -8 28 62 14 27 -34 68 -46 -12 -42 4 13 -35 4 35 13 -1 53
7956 53 19 -21 -2 3 -1 -30 12 -22 12 -22 26 65 -70 -19 -40 10 4 -27 -63 8 10 -49 -17 -77 -40 -2 26 44 49 -50 -6 -16
7988 -16 -10 -48 -33 46 -83 -43 48 -26 28 44 29 -25 57 -24 -40 47 8 -26 15 39 -10 -4 0 -25 -30 -65 4 8 14 20 96 21 -38
8021 -38 112 9 12 -27 27 -19 35 10 23 4 -82 -36 -27 5 -29 -9 38 -7 4 13 -38 -80 -48 -14 26 36 -49 32 -4 17 -25
8052 -25 33 -50 83 79 10 1 11 -50 -17 9 -30 -6 17 14 22 1 62 58 21 -53 21 46 56 15 6 -5 10 55 -40 8 30 -25 -38
8085 -38 41 -22 28 -40 24 -17 62 -22 -54 -31 34 -89 3 -35 -12 -80 49 -17 29 51 -52 20 26 1 37 11 -78 81 -14
8114 -14 -50 3 -9 -41 -32 6 -18 51 77 10 33 -28 -33 -29 -23 28 59 18 -16 -2 32 -17 -11 73 4 41 45 25 -30 -32 11 7 5 13 4 -10
8150 -10 -58 -12 -1 -54 12 22 -56 -58 -13 -20 -18 -13 -8 15 -1 20 -16 -36 -69 24 -10 10 37 -9 41 5 78 -9 -17 22 9 -30 -18
8183 -18 -4 -31 -7 -19 0 56 -1 4
8191D
$$ Imaginary data points
##PAGE= N=2
##DATA TABLE= (X++(I..I)), XYDATA
0 0 0 0 0 8 -8 8 -8 8 -16 24 -24 32 -40 48 -56 72 -87 96 -112 135 -160 184 -212 243 -277 317 -361 411
28 411 -466 523 -585 657 -737 824 -917 1019 -1131 1257 -1392 1544 -1710 1890 -2093 2318
44 2318 -2570 2855 -3174 3540 -3966 4467 -5059 5778 -6673 7818 -9338 11466 -14649 19890
58 19890 -29969 55951 -245533 -397019 504395 55446 -336038 175364 134212 -81722 82983
69 82983 -171350 -41416 289361 -241679 -278095 421104 35004 -369795 210937 205193 -190679
80 -190679 18912 16141 -46978 131907 -148600 -171543 304160 -13080 -313594 226763 179667
91 179667 -238509 47441 114421 -101480 56956 -53970 -146208 211637 -286 -280170
101 -280170 211137 188976 -269543 37841 193604 -138767 -17388 42435 -113037 114885
111 114885 24571 -233063 167867 183954 -281773 26400 262272 -166004 -84510 147146
121 147146 -85878 -9980 66759 -162445 76372 181717 -228677 -19754 291008 -135625
131 -135625 -165954 195976 -8284 -125802 56328 -32505 12068 94501 -139337 -4565 219252
142 219252 -122596 -142667 204692 4470 -163837 66423 31374 -38159 33893 -75917 15488
153 15488 155630 -121930 -94668 215120 -29051 -186228 118612 54701 -118730 34810
163 34810 11374 -24427 89394 -67290 -71340 172136 -31424 -174453 137331 68275 -163684
174 -163684 40580 76118 -74861 31986 7572 -60598 101496 -1485 -135781 108408
184 108408 70247 -164414 28702 108925 -91660 -10844 60185 -42024 35357 18098 -89937
195 -89937 66108 59131 -132486 19690 110991 -87309 -35068 82113 -24558 -14475 22316
206 22316 -38989 39504 30537 -95687 29286 84691 -93505 -25466 94206 -36072 -35377 50123
218 50123 -18526 1249 27992 -59965 14490 63213 -78540 -18962 93259 -41450 -47784 68891
230 68891 -10194 -33675 38201 -24086 -12766 49744 -44804 -28585 73494 -27047 -54817 64449
242 64449 7582 -48975 33968 7513 -27644 26151 -15558 -27558 45516 -12245 -44952 49717
254 49717 14142 -49458 24880 22498 -31662 9841 6133 -19679 21648 -3500 -30200 31033
266 31033 9244 -38457 20784 21960 -28178 7675 13017 -18945 10934 1190 -24596 22207 10021
279 10021 -32892 17762 23092 -29362 3025 20004 -18617 1804 10667 -17237 10878 11553 -26300
292 -26300 9945 22054 -27450 -1531 27134 -16243 -9022 18991 -8714 -6000 11710 -10143
304 -10143 -567 15174 -12674 -3740 18403 -10424 -10851 15369 -3595 -10094 10637 -58 -5187
317 -5187 7639 -2723 -4642 7463 -3784 -5768 7810 -1476 -5407 6165 -738 -3863 5194 -1275
331 -1275 -2416 5966 -1909 -3746 4775 -2401 -4862 3877 -1128 -2701 5351 -162 -2284 5598 -1301
346 -1301 -4909 4444 -664 -5636 3643 1417 -4479 2410 2039 -3291 1803 2200 -2409 1646 1759 -3170
362 -3170 96 920 -3500 -353 2218 -1367 110 3004 33 -1220 1138 -11 -1965 -223 648 -957
378 -957 -481 707 -244 -817 421 381 -403 959 759 -822 206 341 -1826 -714 670 -760 -384 1390
396 1390 242 -616 687 -134 -959 660 -89 -973 1221 480 -1932 379 1160 -2190 -670 2453 -567
413 -567 -1106 2092 130 -1456 697 -479 -916 1126 -1005 -824 2286 -1025 -2207 2410 59 -2392
429 -2392 2326 1092 -1805 1687 -40 -2359 1711 -700 -2891 2913 579 -2933 2983 992 -3062
444 -3062 2570 276 -3477 3570 292 -5119 3992 1683 -6568 3026 3527 -5390 2489 3451 -4374 3232
460 3232 1761 -6905 4251 3355 -9622 3394 7424 -8873 334 8105 -6048 -346 5461 -5913
474 -5913 2515 5494 -9871 2429 9622 -11747 -2218 12725 -7205 -4793 10122 -3890 -2011
487 -2011 6827 -7964 526 10621 -12271 -3187 16782 -9146 -9835 15249 -2546 -9273 9583
500 9583 -2798 -3349 10350 -9540 -4506 17590 -10428 -13280 20063 -1719 -16597 13389 3053
513 3053 -10406 8962 -3130 -6728 15510 -7960 -14138 21914 -1126 -22592 16538 7967 -19079
526 -19079 8241 5926 -10888 10963 -1727 -14763 19321 1346 -25530 17053 13284 -25237
538 -25237 5865 15167 -14863 3706 5801 -13140 13607 4131 -24426 16361 16096 -30055 4011
551 4011 23256 -19296 -3611 14742 -11270 5397 7687 -21307 13290 18195 -32236 2705 31548
564 31548 -23964 -12238 26053 -8957 -8393 12135 -12389 5959 16512 -27954 2048 33985
576 33985 -27007 -17419 35594 -8353 -21502 18882 -2483 -5303 13491 -19004 719 31336
588 31336 -27697 -18259 43443 -10032 -33872 28565 6788 -22175 12210 -3034 -5790 22700
600 22700 -19771 -16291 41874 -10944 -39131 35410 13059 -36714 11938 13931 -14240 10244
612 10244 -7497 -11960 32550 -11201 -35691 39595 12717 -47118 17089 26795 -28058 1753
624 1753 10417 -12843 18192 -4125 -29647 34819 12745 -50192 19357 36008 -38875 -5185
636 -5185 28551 -14971 -6 5903 -19568 23054 10808 -44087 20121 37545 -44754 -7438
648 -7438 41521 -19470 -14425 18442 -11508 7937 10958 -34223 16842 35486 -46456 -8093 51881
661 51881 -23763 -28053 32736 -3238 -12465 12812 -17357 7021 27686 -37615 -7343 51435
673 51435 -25237 -34412 42370 2481 -29918 15292 349 -4138 17116 -25012 -5424 44290
685 44290 -25569 -34204 49108 3222 -43681 22465 15546 -20911 8806 -5480 -7553 30411 -19141
698 -19141 -29795 47344 3355 -50944 27299 27188 -35350 2314 15228 -11305 12210 -8291
710 -8291 -20611 37114 410 -47810 31526 30038 -46486 1756 32528 -19245 -3508 7154
722 7154 -13559 21016 1624 -38610 28843 28031 -50025 3042 43682 -27100 -15528 24355 -8370
735 -8370 780 6016 -23904 18818 22009 -43413 4061 44701 -30745 -20562 35656 -6356 -15411
748 -15411 12157 -10031 6668 15666 -32417 3885 39877 -31533 -21322 42950 -6808 -28031
760 -28031 20582 2019 -8920 11058 -16052 67 29435 -25780 -18737 42047 -6975 -34307
772 -34307 25917 10303 -21688 8269 235 -5264 17250 -15977 -14284 34625 -7711 -33656 28959
785 28959 13541 -30866 8298 13532 -12087 6696 -4031 -10921 23847 -5501 -28868 27206
797 27206 13376 -34817 9238 22516 -19099 -1528 9100 -8424 10217 -1294 -20402 20866
809 20866 10732 -32403 9809 25014 -23206 -5040 18799 -8921 -1168 5334 -12397 11444
821 11444 8876 -25774 8395 23615 -24311 -7045 24971 -9375 -10188 12032 -5387 837 8023
834 8023 -16187 4228 19049 -20595 -7069 25540 -9415 -15263 16428 -189 -7990 7294 -6388
847 -6388 205 13149 -14867 -6014 22458 -9336 -16406 18714 1910 -14270 8222 1535 -4768
860 -4768 7939 -7406 -5005 16705 -7752 -14485 18091 2139 -17215 9248 6474 -9643 4485
873 4485 127 -5202 10014 -4094 -11110 14344 1706 -16559 9127 8173 -12338 2800 5757
886 5757 -6408 4550 483 -8208 9191 2296 -13587 7333 8386 -12639 1159 8859 -6768
899 -6768 74 4276 -5387 3886 3048 -9357 4591 7075 -10741 245 9367 -6646 -2702 6533
913 6533 -3208 -418 3613 -5143 1860 5499 -7697 -340 8303 -5874 -3661 7120 -2278 -3157 4280
928 4280 -2115 -616 4273 -4486 -1018 6592 -4393 -3840 6633 -1417 -4473 4195 -139 -2492 3221
943 3221 -1530 -1625 4519 -2452 -3371 5264 -812 -4780 3741 970 -3684 2165 668 -2063 2554 -472
959 -472 -2516 3378 4 -3687 2689 1210 -3561 1450 1500 -2424 1130 862 -1876 1684 661 -2446
975 -2446 1536 1193 -2641 677 1412 -2004 294 1248 -1416 609 953 -1508 716 1162 -1706 288
991 288 1265 -1511 -182 1138 -976 -148 951 -734 169 1053 -906 11 1067 -968 -368 991 -729
1008 -729 -447 824 -352 -330 714 -322 -195 717 -246 -257 644 -304 -498 458 -229 -480 360 26 -319
1027 -319 394 73 -151 284 -62 -243 223 -120 -338 224 -54 -325 246 66 -210 311 99 -97 293 -92
1047 -92 -229 272 -171 -396 260 -43 -365 291 219 -276 241 182 -257 291 -17 -388 272 -10 -620 221 282
1068 282 -555 158 447 -191 197 255 -419 257 121 -744 277 384 -850 80 678 -619 39 601 -449
1087 -449 159 464 -738 247 579 -1152 -51 906 -1052 -240 983 -664 -38 916 -857 100 1107
1104 1107 -1367 -224 1561 -1219 -803 1589 -696 -775 1353 -582 -315 1542 -1212 -616 2220 -1306
1120 -1306 -1529 2366 -541 -1955 1813 -7 -1362 1510 -485 -942 2314 -956 -2017 2931 -188
1135 -188 -3082 2207 898 -2566 1289 620 -1548 1847 -358 -2086 3060 -4 -3754 2749 1624
1150 1624 -3935 1231 2018 -2550 926 792 -2216 2526 492 -3980 3110 2299 -5123 1312 3655 -3916
1166 -3916 -146 2742 -2521 979 1517 -3737 2557 2939 -5679 1303 5053 -4995 -1205 4743 -2800
1181 -2800 -1102 2865 -2895 1102 3159 -5147 906 5949 -5532 -2087 6687 -2974 -3416 4333 -1615
1196 -1615 -1332 3287 -3729 23 5821 -5276 -2685 8002 -2928 -5433 5971 -72 -4056 3223
1210 3223 -1379 -1190 4743 -4269 -2615 8279 -3086 -6759 7712 928 -6989 3848 1429 -3444
1224 -3444 3393 -2117 -2897 7511 -2701 -7278 8885 1807 -9780 4634 4739 -6246 1539 1603
1238 1603 -3334 4671 -1342 -6591 8279 2156 -10926 5368 6982 -8934 231 5599 -4198 1174
1252 1174 1016 -5226 6169 2067 -10624 5718 8147 -11224 -423 9595 -5612 -2611 4512
1265 4512 -3492 2145 2483 -8298 4688 7789 -11579 -431 12086 -7017 -5461 8316 -2051
1278 -2051 -2495 3271 -5065 2626 6479 -10520 -108 12986 -8427 -7117 12097 -1677 -7420 5592
1292 5592 -1147 -1509 5046 -7145 -836 11924 -8242 -7984 14189 -1020 -11396 7722 2914 -5921
1306 -5921 3361 -2141 -1750 8265 -6593 -6822 13791 -1733 -13033 9837 5237 -10138 2856
1319 2856 2902 -3696 4703 -3484 -5553 11625 -1812 -13128 11075 6271 -13690 3101 8037 -6602
1333 -6602 768 1341 -4187 7155 -1194 -10864 10342 5744 -14912 3794 10998 -9297 -1981 6383
1347 6383 -3618 1870 760 -7543 7725 4797 -14181 4146 12461 -11531 -3808 11245 -3861
1360 -3861 -3625 4090 -3772 2826 4056 -10597 3066 11385 -11394 -4566 13627 -3900 -7736 6899
1374 6899 -199 -1949 3095 -5793 1783 8631 -10086 -3738 13873 -4938 -9680 9883 1465 -6656
1388 -6656 3568 -1102 -718 6019 -7235 -3281 12667 -5277 -10452 11799 2256 -10761 4755
1401 4755 3530 -4300 3033 -2579 -2717 9098 -4453 -9202 11816 2033 -12830 5914 6537 -7818
1415 -7818 1245 2555 -3307 4838 -2048 -6929 9654 1514 -12757 6602 7974 -10440 -18 6981
1429 6981 -4122 412 1267 -4435 5712 1388 -10085 5765 7368 -11005 -206 9305 -5170
1442 -5170 -2708 4346 -2367 1857 1557 -6905 4524 6017 -10223 170 10015 -6470 -4314 7241
1456 7241 -1785 -2106 2918 -3657 2054 4744 -8126 192 9513 -6748 -5105 9018 -1484 -5274
1470 -5274 4347 -632 -1174 3587 -4572 -412 7490 -5704 -4742 9148 -1404 -7101 5388 1442
1484 1442 -3973 2515 -976 -1298 4870 -3633 -3811 7695 -1327 -7269 5749 2513 -5847 1971 1929
1499 1929 -2372 2403 -1222 -2786 5477 -966 -6171 5434 2471 -6735 2016 3647 -3639 634 1178
1514 1178 -2223 3116 -159 -4707 4505 2231 -6547 2029 4534 -4589 -404 3240 -2229 652 1243
1529 1243 -3094 2649 2185 -5359 1629 4610 -4753 -1149 4366 -2130 -1379 2316 -1690 552 1996
1544 1996 -3423 804 3774 -3893 -1290 4472 -2041 -2386 2934 -633 -1008 1660 -1630 131 2778
1559 2778 -2761 -1069 3941 -1829 -2494 3148 -331 -2116 1815 -430 -812 1859 -1479 -1032 3136 -1318
1575 -1318 -2345 3077 -56 -2663 1769 433 -1644 1245 -379 -1167 2045 -588 -2014 2419 327
1590 327 -2629 1630 1075 -2121 681 734 -1316 919 230 -1520 1521 498 -2048 1139 1212 -1965 259
1607 259 1192 -1244 48 581 -947 563 566 -1264 741 1040 -1445 146 1135 -1063 -241 803 -697
1624 -697 47 545 -905 366 698 -1062 164 1076 -937 -291 883 -612 -307 594 -569 -80 674
1641 674 -651 -82 913 -622 -389 895 -339 -501 632 -261 -463 544 -232 -321 655 -183 -471 684
1659 684 -26 -484 444 46 -489 311 70 -316 221 108 -286 307 64 -308 311 169 -333 149 106 -293
1679 -293 55 -39 -238 164 81 -179 202 95 -303 224 93 -281 56 90 -310 104 104 -294 137 178 -173 234
1701 234 243 -257 191 180 -356 75 235 -351 -22 284 -164 28 344 -229 4 304 -268 -21 286 -212 -208 257
1723 257 -199 -185 225 -51 -139 296 -213 -36 330 -262 -110 318 -296 -237 351 -156 -151 244 -88 -58 472 -262
1745 -262 -121 522 -282 -334 517 -205 -448 361 -104 -319 427 -216 -310 667 -252 -515 747 -4 -754 556
1765 556 51 -593 374 54 -391 633 -43 -602 925 188 -1016 662 405 -979 323 353 -652 411
1783 411 148 -645 837 228 -1065 725 669 -1204 196 749 -926 175 436 -775 554 411 -1262
1800 -1262 789 967 -1533 227 1362 -1256 -228 976 -793 -58 648 -1078 482 1148 -1649 188
1816 188 1793 -1414 -622 1791 -745 -772 1042 -773 -60 1144 -1515 -33 2080 -1560 -1080 2409
1832 2409 -675 -1557 1602 -205 -860 1136 -953 -401 2026 -1463 -1229 2821 -638 -2295 2122 394
1848 394 -1722 1105 -97 -969 1623 -1056 -1362 2889 -641 -2653 2702 803 -2817 1312 999 -1703
1864 -1703 1053 -190 -1535 2330 -427 -2889 2804 1256 -3644 1430 2294 -2500 310 1150 -1536
1879 -1536 1239 139 -2560 2451 1266 -3955 1509 3067 -3298 -349 2681 -1662 -94 1057 -1936
1894 -1936 1601 1242 -3796 1391 3501 -3873 -788 4011 -1869 -1554 2144 -1074 93 1329 -2895
1909 -2895 953 3215 -3893 -911 4795 -2162 -2637 3360 -419 -1538 1554 -1568 201 2816 -3379
1924 -3379 -1026 5071 -2444 -3536 4592 110 -3376 2210 255 -1234 2005 -1960 -1037 4337 -2264
1939 -2264 -3725 5051 399 -4751 2591 1863 -2680 1076 -62 -1233 3043 -1696 -3298 4904 332
1954 332 -5561 3275 3007 -4343 569 2106 -1879 1251 -350 -2692 3845 464 -5511 3386 3605 -5459
1970 -5459 245 4127 -2468 -575 1449 -1807 1921 578 -4462 2948 3375 -5901 308 5332 -3427
1985 -3427 -1922 3333 -1250 -146 1142 -3025 1955 2942 -5410 348 5824 -4120 -2782 5034 -873
2000 -873 -2361 2218 -1133 341 2276 -3989 161 5245 -4091 -3062 5882 -941 -4140 3127 459
2015 459 -1571 1736 -1933 -130 4065 -3584 -2701 6162 -1179 -5273 4074 1676 -3740 1482 480
2030 480 -1049 2527 -2095 -2300 5155 -1077 -5363 4365 2232 -5086 1362 2578 -2158 821 -220
2045 -220 -1619 3495 -780 -4614 4262 2182 -5807 1450 3860 -3310 -358 1873 -1466 1538 42
2060 42 -3352 3485 1858 -5634 1668 4513 -4299 -1155 3597 -1631 -581 1190 -2017 1874 1584 -4480
2076 -4480 1523 4258 -4575 -1293 4750 -1912 -2211 2366 -850 -10 1414 -2897 1028 3545 -4147
2091 -4147 -1222 5219 -2134 -3172 3455 -80 -1964 1434 -1036 34 2548 -2915 -1028 4589 -2143
2106 -2143 -3337 4077 404 -3396 1698 630 -1146 1560 -1375 -855 3527 -1703 -3002 4116 373
2121 373 -3982 2047 1575 -2290 823 205 -1049 2181 -970 -2439 3514 392 -4015 2240 2160 -3176
2137 -3176 322 1616 -1454 746 96 -1710 2396 419 -3425 2038 2169 -3515 203 2495 -1882
2152 -1882 -295 1041 -1194 992 527 -2484 1572 1968 -3206 191 2854 -2047 -1024 1937 -884
2167 -884 -297 895 -1388 793 1526 -2512 127 2771 -1974 -1312 2446 -612 -1353 1259 -462 -232
2183 -232 1203 -1453 -75 2281 -1643 -1240 2592 -510 -1796 1514 71 -1044 869 -531 -383 1616
2199 1616 -994 -1131 2266 -417 -1910 1583 534 -1577 747 197 -755 878 -395 -943 1648 -208
2215 -208 -1722 1497 685 -1775 584 808 -1089 348 179 -848 934 11 -1294 1195 552 -1622
2231 -1622 594 1020 -1156 69 704 -704 299 229 -952 699 533 -1274 387 1013 -1164 -142
2247 -142 976 -592 -150 467 -629 207 457 -851 161 851 -896 -287 972 -552 -367 711 -276
2264 -276 -257 514 -463 -101 619 -613 -219 883 -411 -478 714 -70 -505 425 -102 -256 431 -275 -290 668
2284 668 -191 -435 665 37 -473 397 77 -404 264 -77 -289 410 -20 -381 414 94 -451 393 186 -375
2304 -375 135 134 -351 132 81 -343 278 129 -362 200 244 -391 132 311 -275 32 102 -255 36 168 -295 98
2326 98 266 -307 31 280 -187 11 243 -210 -32 232 -190 -34 184 -126 -80 303 -122 -46 293 -149 -117
2347 -117 252 -96 -88 198 -132 -166 133 -138 -91 183 -60 -43 200 -36 -159 156 -23 -195 107 -51 -215 157
2369 157 -90 -100 223 -46 -140 226 22 -213 138 15 -192 143 60 -211 138 86 -115 223 -3 -265 185
2390 185 36 -260 131 102 -249 118 75 -204 230 43 -293 232 151 -338 149 214 -350 47 152 -268 134
2411 134 97 -260 245 208 -451 185 310 -396 -89 328 -278 -70 197 -277 153 238 -393 151 429 -473 -124
2432 -124 517 -280 -156 331 -296 -11 335 -412 33 511 -525 -154 705 -291 -368 500 -162 -258 338 -297
2452 -297 -108 490 -534 -216 849 -369 -489 744 49 -523 491 -157 -270 478 -323 -348 828 -296
2470 -296 -690 886 121 -868 534 224 -617 418 -20 -463 650 -228 -797 939 124 -1133 665 581
2488 581 -866 223 344 -515 393 -27 -874 876 211 -1299 753 822 -1175 103 873 -733 102 400
2506 400 -746 579 333 -1236 577 1008 -1445 47 1329 -878 -351 812 -523 134 547 -1129
2522 -1129 488 1066 -1564 -5 1684 -1099 -770 1461 -416 -462 697 -612 133 928 -1334 -179
2538 -179 1860 -1232 -1095 1862 -286 -1176 1035 -75 -418 825 -879 -232 1590 -1155 -1207 2107 -291
2555 -291 -1775 1368 400 -1036 696 -143 -465 1194 -889 -1127 2034 -218 -2065 1541 954 -1840
2571 -1840 587 700 -870 707 -216 -981 1675 -159 -2182 1685 1059 -2375 560 1538 -1228 93
2587 93 529 -833 1014 45 -1877 1569 1067 -2544 581 2068 -1746 -490 1425 -697 125 496 -1299
2604 -1299 1116 1011 -2595 476 2331 -2079 -815 2172 -716 -847 1008 -623 371 926 -1933 462
2620 462 2171 -2210 -959 2838 -931 -1638 1671 -49 -633 825 -970 91 1857 -1925 -943 2927
2636 2927 -1048 -2171 2163 387 -1748 804 90 -497 1243 -1210 -797 2533 -929 -2276 2434 585
2652 585 -2514 1060 1044 -1179 635 -235 -742 1925 -749 -2111 2487 654 -2931 1203 1693 -1902
2668 -1902 114 840 -797 978 -167 -1578 2043 590 -2914 1374 2011 -2563 -151 1798 -985
2683 -985 -47 510 -1038 1320 500 -2422 1377 1918 -2741 -219 2500 -1421 -906 1367 -568 204 633
2700 633 -1700 888 1731 -2495 -198 2765 -1575 -1484 2076 -241 -972 789 -764 315 1250 -1911
2716 -1911 -140 2622 -1628 -1690 2530 -101 -1822 1164 129 -529 915 -1013 -242 2127 -1301 -1514
2732 -1514 2633 -22 -2271 1361 797 -1385 526 -40 -516 1375 -871 -1235 2287 -48 -2426 1570
2748 1570 1143 -1927 416 832 -836 571 -195 -991 1682 -51 -2083 1594 1175 -2307 337 1468
2764 1468 -1196 -115 607 -718 772 200 -1512 1321 1052 -2190 332 1898 -1485 -566 1301 -579
2780 -579 -148 431 -953 637 853 -1758 297 1817 -1543 -667 1644 -502 -772 817 -393 30 708
2797 708 -1198 165 1563 -1356 -640 1824 -545 -1149 1100 17 -572 549 -581 -103 1069 -1092
2813 -1092 -694 1724 -499 -1313 1356 233 -1058 572 138 -412 700 -523 -570 1241 -386 -1227 1236
2830 1236 381 -1395 548 576 -804 283 86 -549 727 -204 -980 1065 389 -1289 563 784 -890
2847 -890 32 525 -510 305 114 -699 694 361 -1073 495 850 -1040 -22 801 -450 -89 303 -450
2865 -450 241 356 -819 268 736 -896 -95 1023 -505 -315 560 -287 -167 301 -489 50 507 -699
2883 -699 -149 827 -411 -490 734 -141 -409 397 -115 -136 373 -403 -176 628 -299 -468 634 -51 -497 445
2903 445 63 -327 186 -133 -218 385 -155 -425 487 18 -538 365 157 -451 170 128 -265 224 -31 -330 380
2924 380 6 -413 304 287 -415 141 173 -255 129 202 -262 119 123 -356 151 222 -394 43 404 -309 -22 247
2946 247 -215 19 131 -211 21 220 -247 -71 316 -218 -84 307 -89 -144 180 -106 -58 135 -157 -81 210
2967 210 -156 -192 271 -27 -180 158 -82 -156 193 -27 -68 161 -106 -88 200 -13 -155 146 -24 -139 172
2988 172 76 -136 155 -16 -149 130 0 -198 45 66 -151 90 81 -165 99 87 -78 25 45 -122 44 105
3010 105 -165 98 62 -125 73 72 -135 20 131 -204 44 204 -183 -8 61 -116 -38 69 -107 -5 99 -149
3032 -149 -45 88 -74 -56 78 -94 6 66 -97 11 132 -92 -40 169 -93 -68 177 -41 -122 87 -134 -36
3054 -36 137 -145 -43 169 -109 -181 171 -13 -31 170 -31 -69 79 -150 -107 203 -91 -115 260 -17 -135 124
3076 124 93 -73 126 3 -191 193 -72 -200 223 23 -287 98 126 -148 76 22 -141 152 -80 -285 197
3097 197 19 -361 144 128 -275 103 165 -227 97 -19 -292 244 49 -299 180 246 -403 23 297 -151 -11
3118 -11 80 -230 130 152 -285 182 270 -429 56 429 -282 -115 289 -224 55 144 -307 132 282 -492 -22 472
3140 472 -349 -214 417 -170 -123 241 -153 8 305 -406 -48 504 -460 -320 527 -70 -327 347 15 -147
3160 -147 285 -217 -125 484 -436 -403 643 -164 -492 513 119 -452 302 -62 -266 396 -248 -353 604 -97
3180 -97 -595 465 176 -621 194 230 -290 241 1 -292 522 -11 -695 591 281 -857 201 449 -483
3199 -483 68 212 -335 370 76 -651 522 339 -890 250 622 -714 -180 517 -296 86 161 -350 388
3218 388 283 -851 228 729 -783 -245 786 -360 -260 439 -249 9 295 -635 163 718 -841 -304
3236 -304 985 -412 -580 699 -83 -264 293 -253 47 686 -671 -344 1091 -440 -783 885 97 -694
3254 -694 396 7 -203 437 -469 -237 972 -443 -854 1050 95 -976 441 352 -510 314 -28 -272
3272 -272 734 -271 -820 1020 191 -1095 576 544 -812 164 290 -255 402 -129 -598 836 190 -1121
3290 -1121 550 747 -1015 -33 649 -458 17 209 -430 506 209 -949 528 777 -1127 -93 947
3307 947 -581 -346 616 -193 49 235 -663 473 680 -1034 -96 1100 -710 -585 857 -185 -381 372
3325 372 -331 103 547 -840 -67 1124 -703 -636 1053 -122 -755 496 -6 -256 414 -452 -118 903
3343 903 -615 -637 1149 -106 -1008 664 300 -656 285 -51 -186 640 -418 -568 1054 -77 -1066 762
3361 762 463 -859 236 391 -380 291 -128 -449 657 -46 -881 720 488 -1064 218 634 -612 -25
3379 -25 254 -428 340 53 -767 609 383 -1061 283 891 -721 -195 562 -267 -70 218 -416 328 391
3398 391 -881 235 865 -689 -360 815 -287 -329 412 -194 42 350 -592 164 765 -722 -337 976
3416 976 -305 -611 566 -51 -265 320 -297 -9 612 -569 -287 938 -318 -600 715 95 -558 342
3434 342 34 -246 349 -311 -298 683 -267 -679 688 77 -761 300 303 -408 105 -18 -336 434 -129 -544
3454 -544 654 57 -801 352 385 -526 159 187 -244 135 -54 -376 436 169 -677 347 434 -569 -25 437
3474 437 -320 -60 169 -303 216 154 -493 220 407 -506 -70 546 -295 -207 460 -239 -21 159 -263 183 310
3495 310 -450 -51 533 -299 -268 400 -84 -220 270 -79 -39 270 -250 -83 421 -289 -294 456 -65 -239 253
3516 253 30 -146 195 -69 -124 312 -157 -288 358 -25 -368 243 70 -271 111 76 -99 105 -59 -169 232
3537 232 19 -374 225 98 -274 21 193 -229 26 78 -167 120 69 -249 128 161 -417 0 281 -149 -15
3558 -15 128 -91 -31 123 -162 66 168 -261 66 222 -223 -80 131 -126 -45 143 -105 76 118 -135 23
3579 23 179 -140 -128 246 -96 -113 198 -94 13 147 -95 -57 124 -69 -107 144 4 -162 91 -24 -136 100
3601 100 -9 -155 131 2 -97 122 -5 -123 114 1 -129 100 48 -43 75 110 -82 147 90 -67 74 21
3623 21 -119 6 76 -143 -6 91 -98 57 50 -102 15 48 -82 15 82 -49 2 123 -49 32 104 -50 -2 86
3647 86 -61 -24 92 -107 -22 1 -90 -43 80 -12 7 107 -74 -59 50 -26 34 70 -58 -34 69 16 -2 62 -6 -85
3673 -85 104 -12 -54 74 56 -36 22 -114 -94 145 -52 -22 116 -33 -63 43 -51 -23 16 66 -27 29 84 -121 89
3698 89 -23 -108 -18 25 -67 -8 21 -52 74 -4 -69 25 46 -88 54 92 -129 51 112 -20 62 15 -165 35 5 -147
3724 -147 27 97 -121 4 113 -162 -11 50 -17 36 52 -71 2 -2 -139 -35 105 -151 14 167 -56 -14 88
3747 88 -128 -41 74 -89 11 160 -109 -87 183 -34 -95 95 -63 53 90 -74 -23 104 -154 -83 170 -140
3769 -140 -68 124 -20 -69 118 -144 -82 153 -109 -73 203 -32 -204 149 99 -139 132 -21 -76 64 -82 -77 136
3792 136 -100 -209 199 36 -187 116 92 -87 69 -14 -102 167 -11 -201 239 92 -228 95 75 -142 -24
3813 -24 86 -127 96 3 -220 206 51 -265 180 218 -226 66 154 -157 82 -6 -105 149 83 -246 165 270
3835 270 -339 -7 233 -238 -53 120 -129 2 27 -248 183 223 -371 -11 377 -218 -204 263 -75 -94 135
3856 135 -147 49 199 -217 -18 406 -300 -260 406 -102 -205 130 -39 -87 184 -194 -45 365 -192 -183 403
3877 403 -14 -355 284 40 -204 92 -40 -45 258 -170 -271 401 -43 -379 323 123 -342 89 98 -182 138
3898 138 -46 -227 403 -55 -425 383 220 -490 163 272 -289 56 115 -224 290 23 -306 331 227 -495
3918 -495 123 342 -393 -54 249 -184 69 42 -322 220 209 -457 123 462 -368 -67 418 -179 -115 200 -144
3939 -144 102 161 -363 116 420 -447 -111 552 -166 -244 380 -91 -122 181 -269 26 353 -404 -201 542 -191
3960 -191 -386 322 20 -220 202 -118 -115 261 -252 -194 510 -199 -425 439 67 -422 260 96 -207 158 -134
3981 -134 -177 294 -150 -352 484 35 -542 259 232 -365 120 69 -136 242 -59 -301 413 23 -571 260 402
4002 402 -394 48 298 -218 21 99 -215 275 65 -479 287 368 -442 46 463 -356 -59 179 -217 97 107
4023 107 -361 189 353 -459 43 527 -341 -138 336 -65 -132 152 -233 17 285 -437 51 449 -409 -215
4043 -215 470 -122 -226 242 -18 -27 179 -251 -54 437 -301 -225 528 -52 -334 311 90 -290 146 -28 -63
4064 -63 277 -224 -206 446 -134 -503 404 162 -333 160 61 -184 204 -90 -234 367 -116 -341 315 192 -435
4085 -435 138 206 -236 118 19 -158 300 -9 -254 285 72 -433 169 317 -312 -80 238 -72 68 50 -211
4106 -211 167 100 -297 75 303 -314 -3 316 -175 -79 140 -152 23 154 -281 90 278 -337 -44 334 -139
4127 -139 -158 182 -65 -115 71 -202 17 201 -252 -115 329 -111 -187 320 -36 -140 157 7 -55 119 -115
4148 -115 -93 272 -168 -209 226 -42 -239 225 75 -187 74 -3 -39 150 -128 -208 268 -41 -196 144 155 -231
4170 -231 123 -1 -105 117 34 -55 185 -17 -215 107 76 -202 -27 93 -157 80 58 -84 121 77 -225 163
4192 163 216 -171 32 157 -155 -4 152 -28 5 50 -93 46 113 -184 30 146 -136 -110 145 -45 -82 36
4214 36 -61 -8 120 -95 -38 158 -80 -14 127 -16 -84 70 -24 -5 66 -45 -52 100 -107 -45 199 -88 -112 94
4238 94 1 -133 -3 32 -43 111 -14 -45 135 -28 -102 95 -10 -121 27 66 -73 42 78 -63 31 25 -32 134
4262 134 42 -27 41 54 -97 -8 53 -64 49 -21 -25 37 54 5 63 114 -78 58 11 -36 -9 63 -16 -14 62 -23 -27 100
4290 100 -3 -23 34 -86 -30 57 -63 -22 60 -26 6 61 -70 -86 52 -105 -109 87 -3 -18 -10 -52 -24 14 -16 -34 111
4317 111 -11 -37 15 26 -115 71 4 -84 70 40 -79 64 -7 -28 -19 50 20 85 2 -38 21 41 -125 56 110 -74
4343 -74 114 18 -46 22 0 -76 52 -16 -50 29 51 -34 16 8 -73 36 24 -79 -13 -5 -64 19 60 -95 -28 56 -58 12
4371 12 30 -55 44 94 -16 13 32 -100 -7 53 -83 -8 94 -89 21 65 -86 21 51 -64 -45 103 -6 -39 8
4396 8 -22 -54 114 -22 27 88 -36 -7 49 -46 -19 53 -34 -113 44 3 -19 131 -17 -4 116 -58 -39 206 -57 -155
4422 -155 80 -24 -177 69 -36 -94 10 -19 -34 83 4 -81 102 44 -126 38 0 -81 6 -32 -77 230 24 -77
4446 -77 122 86 -119 19 103 -119 -16 21 -70 64 49 29 129 51 -184 125 102 -138 28 76 -72 -9 60 -112
4470 -112 29 40 -96 76 65 -84 -8 123 -104 -2 99 -94 63 66 -93 59 117 -169 2 256 -119 -43
4492 -43 199 -169 -102 73 -11 -39 101 -141 10 162 -103 -96 222 -17 -187 125 4 -8 94 -155 -50 203
4514 203 -113 -87 243 -46 -214 141 11 -174 149 -37 -50 153 -97 -109 198 -21 -214 176 57 -194 73
4535 73 -11 -77 118 2 -108 170 -60 -202 233 51 -225 122 111 -164 8 50 -130 37 -10 -202 171 148
4557 148 -308 156 202 -193 -20 135 -130 43 12 -93 130 81 -311 100 170 -223 -24 166 -82 -19 94 -139
4579 -139 42 133 -191 72 148 -267 -103 317 -116 -103 224 -47 -85 90 -107 -5 138 -233 -49 264 -131
4600 -131 -179 290 7 -170 62 -50 2 190 -135 -48 292 -110 -277 318 42 -238 184 18 -188 103 -66
4621 -66 -79 226 -127 -241 257 -66 -356 201 172 -255 31 113 -77 126 -49 -168 236 -39 -260 174 148 -308
4643 -308 39 168 -216 0 22 -212 152 -14 -224 261 132 -312 10 268 -189 -1 220 -117 47 43 -219
4664 -219 94 66 -369 52 277 -261 -114 243 -65 -140 50 -108 93 118 -203 -5 277 -192 -107 340 -52
4685 -52 -133 150 -68 15 165 -109 -38 244 -254 -138 376 -87 -275 228 44 -142 116 34 4 141 -136 -152
4707 -152 289 -104 -225 220 75 -256 121 5 -97 85 -41 -104 280 -72 -273 242 40 -299 139 123 -174
4728 -174 53 86 -65 123 40 -256 220 90 -261 157 146 -271 19 119 -86 -37 28 -131 113 124 -314 92
4750 92 115 -233 -54 245 -118 -97 122 -74 5 59 -185 -13 140 -247 -23 199 -228 -128 215 -45 -125 41
4772 41 -112 34 103 -146 -49 223 -162 -104 182 -1 -118 73 13 -41 130 -49 -19 182 -104 -184 211 -34 -181
4795 -181 156 18 -156 103 15 -73 75 -102 -116 216 -23 -127 161 69 -206 43 57 -106 40 19 -43 207
4817 207 61 -187 84 84 -263 22 95 -51 -36 25 -44 101 46 -112 81 198 -104 14 71 -116 -112 110 -43
4840 -43 -22 40 -102 -9 13 -65 60 130 -20 -44 191 -122 -96 77 -60 6 25 -70 0 179 -84 -40 170 -39 -117
4865 -117 44 22 -3 72 -16 28 115 -49 -37 73 -50 -125 1 -33 -79 69 -17 -50 95 3 -4 7 -17 -54 99 -29
4891 -29 -59 106 57 -128 40 23 -60 82 40 -64 104 70 -68 72 114 -84 22 6 -117 -1 16 -34 59 24
4915 24 -154 72 103 -79 11 47 -70 -23 51 -41 -33 66 -51 14 77 -57 17 52 30 -30 39 -48 -87 52 -30 -60 81
4942 81 -23 -2 69 -66 -35 75 -33 -55 45 4 -101 -1 -43 -63 67 20 -17 21 -22 10 64 -3 -49 15 -73 -147
4968 -147 0 13 6 8 8 -62 49 -8 -32 24 22 -40 41 7 -53 -57 -63 -61 43 22 -38 61 -24 -34 44 25 -64 -55 41 -78 -12 13
5000 13 -59 -44 61 -56 9 30 -9 -48 38 -61 -61 49 34 -15 95 -58 -24 124 -88 -4 61 -45 -61 2 -49 34 74
5027 74 -35 -25 49 -22 -41 4 -76 -45 118 11 -33 1 9 -62 50 47 -66 26 -1 -116 27 -23 -101 90 -7 -15 -1 -16
5055 -16 14 96 -52 -75 112 54 -93 97 -13 14 75 9 -86 56 -46 -59 42 -11 -15 25 47 -124 56 14 -98
5080 -98 79 54 -89 49 80 -91 14 79 -68 59 79 -86 -92 53 -52 -27 32 -58 97 -14 -75 -13 25 -99
5104 -99 -48 115 -59 -34 44 -70 49 18 -49 35 136 -123 -47 154 37 -54 51 -64 -22 107 -120 117 71 -52
5128 -52 -28 155 -74 -70 169 -38 -121 79 -58 -70 62 -114 -23 186 -3 -117 143 18 -131 51 10 -75 101
5151 101 21 -50 105 -105 -119 144 -28 -155 87 105 -132 32 4 -46 72 -36 -101 68 -15 -155 81 95 -142
5174 -142 38 82 -43 -2 31 -65 81 102 -96 94 128 -199 8 153 -95 40 139 -109 14 21 -193 73 173
5197 173 -185 31 152 -106 -10 137 -94 -37 90 -70 93 68 -263 -50 174 -169 -62 199 -47 -116 104
5218 104 23 -41 110 -173 -17 170 -112 -175 193 -16 -157 181 30 -28 129 -15 -70 153 -105 -114 248 -55
5240 -55 -238 174 98 -168 81 24 -90 120 -1 -179 165 -57 -241 206 101 -248 49 105 -155 15 24 -134
5262 -134 146 -7 -123 185 89 -257 107 166 -203 41 107 -85 38 27 -169 107 106 -214 73 227 -187 -38
5284 -38 259 -85 -59 114 -146 21 95 -195 75 205 -219 -109 302 -94 -121 153 -84 -95 100 -113 -65 252
5306 252 -145 -122 247 -74 -249 189 8 -112 135 -9 -83 192 -91 -79 205 -142 -153 250 60 -264 67
5327 67 13 -63 97 -28 -48 123 -3 -179 252 94 -235 102 193 -172 20 56 -61 125 18 -161 152 67
5349 67 -204 172 107 -176 7 188 -93 -54 16 -150 115 104 -199 96 191 -189 -38 171 -129 -42 94 -107
5371 -107 46 92 -141 27 84 -147 11 177 -113 -122 132 -72 -62 69 -40 -5 199 -140 -34 288 -114 -131
5393 -131 248 34 -171 88 21 -34 40 -91 -62 237 -24 -125 218 2 -176 100 51 -163 63 -16 -37 149
5415 149 -64 -67 170 56 -194 110 100 -182 60 31 -121 88 20 -103 128 41 -120 48 102 -218 71 127 -60
5438 -60 -36 20 -66 49 6 -93 138 122 -169 119 190 -141 -13 150 -83 3 47 -48 1 53 -131 50 136 -76 -28
5463 -28 116 -66 -47 87 -120 38 65 -153 16 81 -92 -42 153 -5 -67 51 -2 -79 25 -89 -51 70 -136
5486 -136 -88 161 -43 -32 139 37 -69 73 -1 -86 122 8 -15 65 -54 -139 23 24 -44 65 44 -81 19 66
5510 66 -3 5 -37 -91 56 38 -146 42 106 -102 -2 -21 14 43 28 -62 39 37 -88 -10 47 -101 3 116 -65 -42
5536 -42 -63 -71 -51 52 -113 51 72 -103 -24 81 -49 -21 32 -74 -8 -1 -16 -26 28 -86 -32 111 -38 4 40 14
5562 14 -40 81 -14 -20 9 -31 13 61 57 -121 48 18 -124 34 32 -95 56 53 23 12 25 -39 52 34 -59 55 57 -67
5590 -67 44 -18 -80 12 56 -42 -24 39 -29 52 16 -7 19 62 -52 48 47 -37 17 -41 -55 31 12 -36 -10 4 -102 46
5618 46 96 -29 -67 97 12 8 58 -26 25 13 -8 9 58 -58 24 -4 -17 -50 15 59 -33 28 -32 -94 75 61 -23 -1 20
5647 20 -62 8 -2 -40 18 -49 8 37 -59 -43 23 29 -14 40 33 -65 -15 20 -35 -56 -34 -61 -27 20 -32 28 117 -64 10 13 -17
5678 -17 60 80 -57 62 77 -61 -37 11 3 -9 64 -94 -11 42 -87 -56 -2 -31 7 -9 -26 -36 11 -16 -59 28 -22 40
5706 40 60 -57 27 -2 9 -16 -49 -15 -28 44 -34 -34 89 -42 15 5 -14 18 6 -64 6 12 -48 48 127 -51 -88 52 15
5735 15 -25 75 -77 14 95 -53 -39 -19 -13 -67 -32 22 -14 6 31 -79 11 -58 -51 121 -34 -111 60 11 -26 28 8 -34
5763 -34 15 -62 -161 38 32 -70 28 -9 -73 8 109 -118 -16 8 -49 32 28 22 42 71 -106 23 36 -126 16 77 16
5790 16 -22 60 14 40 -21 -136 -19 50 -58 -53 102 -89 14 36 -59 -21 73 -38 51 64 -87 -58 24 -67 -49 -8 -115
5817 -115 -104 73 -12 12 37 -33 -6 55 -44 -38 72 -4 -61 29 36 -13 34 29 -38 82 -106 -99 104 -5 -13 60 15 -74 25
5846 25 20 -68 78 -16 -79 118 5 -77 17 20 -122 -24 53 -52 39 -36 -91 85 3 -101 117 94 -178 69 50 -76
5872 -76 35 92 -20 29 38 -81 92 102 -111 -6 183 -107 -14 53 -10 -19 16 -75 54 2 -87 25 84 -124 -32 86
5898 86 -42 -48 107 -7 5 100 -132 18 80 -65 -106 92 1 -90 42 -11 9 -4 -52 0 119 -133 -108 92 -1
5923 -1 -125 66 20 -27 73 -54 -9 69 -38 57 148 -24 -156 117 29 -140 59 -6 -29 25 -57 -37 100 58 -105
5948 -105 84 41 -153 121 5 -72 51 17 8 24 24 -119 11 1 -70 49 64 -156 6 67 -149 -4 46 -19 -24
5973 -24 105 -105 54 81 -121 -54 110 -62 -57 47 -115 65 12 -67 -29 110 -101 11 98 -88 -46 68 -16 -5
5997 -5 -19 -88 -50 112 -105 7 73 -30 -46 83 26 -131 28 1 -45 61 16 -57 113 -62 -84 48 38 -50 52
6022 52 -20 -93 1 -1 1 109 -21 -79 91 -42 -161 59 95 -101 0 26 -17 43 -14 9 76 16 -107 59 69 -74
6048 -74 6 83 0 24 48 -31 33 50 -74 69 58 -113 20 26 -61 -21 101 -13 15 83 -97 49 85 -62 -2 114
6074 114 -51 -17 116 -19 -26 30 -65 -68 14 -14 33 36 -104 -87 77 -18 -112 15 34 11 -25 -16 -15 102 -79 -96 81 30
6102 30 -40 63 2 -54 18 54 -18 91 -6 -15 19 -23 -15 14 31 -82 5 50 -4 50 78 4 68 26 -34 -48 35 -86 -35
6131 -35 29 -43 25 -5 -31 -29 20 -22 22 17 -112 50 18 -77 3 42 7 -3 47 27 -34 46 -75 -39 104 -32 -48 4 52
6160 52 14 25 -25 19 31 -41 -28 70 -24 -31 41 57 0 -29 -70 -83 36 53 -20 55 10 -8 75 77 -55 -34 -46 1 27 12
6190 12 -35 30 -13 -45 12 -35 -26 -47 -12 -16 58 5 -9 -10 -46 -29 45 35 -36 15 0 -34 -17 -18 -22 47 6 3 19 117 -10 15 37
6223 37 -58 5 59 38 -14 65 -13 -18 50 -23 -16 45 43 22 41 -70 31 63 -51 -53 42 -24 -22 -47 -22 -64 -16 -40 -58 46 -5
6254 -5 -8 22 -9 -71 21 33 4 -16 43 -6 31 6 -8 0 10 -26 25 18 -11 -23 19 -3 27 -30 31 5 77 -23 -13 15 22 26 31
6287 31 11 -32 -10 -6 41 96 -21 56 39 20 -6 35 -13 47 1 -47 53 42 -14 34 37 28 -48 0 -89 -15 -23 -57 -8 51 -56
6318 -56 -42 54 -3 39 23 -27 -6 57 -50 9 -61 12 -21 20 77 23 23 -7 40 12 14 15 -25 -13 -24 12 -42 -49 30 30 -18 31
6350 31 16 -33 -2 60 55 6 5 -23 16 -59 -49 24 -33 -9 -16 -52 -51 -15 -7 -64 -66 26 -77 -36 58 -24 -59 -45 -24 28 3 -17 57
6383 57 10 -15 0 -58 20 -65 83 -51 1 15 -20 1 13 15 28 -7 -8 30 -29 4 -69 41 -36 -29 -15 14 34 10 -5 61
6413 61 17 -37 -51 8 -36 -31 22 -82 -2 -10 -48 -16 57 -12 -103 4 -18 -43 -8 -42 17 39 24 -22 5 7 -67 -42 -4 -38 107
6444 107 50 -46 -9 -38 -3 4 2 -55 -44 -10 -98 -10 23 -3 -3 -28 78 27 7 -7 -2 54 -36 -17 -77 -37 -12 32 -33 -69 37
6475 37 -50 -48 -28 -103 -2 -4 -32 -4 34 -13 17 24 -8 20 40 -71 3 40 3 -30 60 -34 -46 39 -9 -21 22 -54 123 44
6505 44 -86 -48 84 -18 -83 46 -28 -26 25 -60 34 80 -38 27 -7 -70 -31 120 -47 -5 23 26 20 59 37 16 -26 -45
6533 -45 7 14 -20 -21 44 -22 18 97 -44 -44 26 -42 -13 124 0 -51 34 68 -65 65 15 -67 61 5 -60 71 -22 -62
6561 -62 20 19 -67 1 24 16 -19 4 -29 60 -26 -61 34 67 -42 -7 -21 -62 -55 29 -31 2 74 -42 7 4 -70 -5 -9 7 -90 51
6593 51 -25 -31 -5 -64 -25 -3 -30 34 60 -80 -4 79 -51 -43 -12 -6 45 27 17 -9 55 26 -39 7 -56 -24 38 -51 27 14 -10
6624 -10 14 27 -77 -57 63 -64 -36 43 41 -59 13 20 -15 29 4 -77 31 36 -79 63 -64 -86 8 37 -29 13 18 -18
6652 -18 -29 -21 -6 -32 -10 -58 76 5 -51 -34 40 -24 7 -19 -34 -19 -12 28 -17 36 -34 -10 54 -23 -9 35 20 -16 96 -19
6682 -19 62 47 -3 -17 15 -88 -22 91 -6 -46 80 -6 8 52 -38 16 87 34 -9 92 -8 4 1 -62 -59 49 -13 70
6710 70 18 -28 -39 60 -10 -25 5 -8 -29 32 47 -32 -10 -28 9 75 -59 -67 26 6 17 71 -23 -3 37 -46 -30 38 17 -85
6740 -85 78 -73 -114 -8 5 -31 -23 -35 1 61 71 -65 59 -50 -59 -14 60 -41 -50 -7 -10 -13 7 -78 -29 18 -39 19 66
6769 66 -91 15 57 -60 -111 10 -18 -32 31 -20 12 42 -4 16 87 -93 -3 -4 -29 9 57 10 -10 71 -41 23 26 -23
6797 -23 -37 51 -77 -2 46 20 18 38 10 -51 69 36 -30 -3 32 -59 43 13 -58 -23 44 2 1 -37 -31 64 7 -50 15 -33
6827 -33 -51 -47 32 -35 -4 0 22 32 22 -6 80 20 4 24 27 4 -16 19 11 7 -23 -76 -19 36 -38 20 37 -27 19 21 -21 -44 50
6860 50 -9 -13 -47 -4 -2 23 -40 -28 30 -14 -42 5 -8 -2 -8 -23 -38 9 -101 -33 30 -6 -7 52 -47 -55 10 20 11 22 16 19 88 -65
6894 -65 -47 32 -38 -32 -8 12 -14 -10 32 -19 56 -53 -14 85 -6 4 -29 -63 -34 10 -19 -61 -10 -16 18 77 -2 -49 23 -15 -97
6925 -97 5 16 -76 -31 25 -17 -40 -14 -20 7 7 -13 42 27 58 -7 -22 15 39 -23 -53 37 -1 48 -32 52 31 -16 -48 -20 -49
6956 -49 -25 1 -65 72 17 -49 55 -21 23 15 12 -53 -23 13 -13 84 32 8 -47 21 22 6 4 -50 52 -15 -24 -52 -32 -11 -34
6987 -34 19 -14 16 -10 -70 -3 -5 17 -17 39 5 -8 2 -1 -62 10 18 -49 8 -45 -31 60 41 -4 17 36 -7 -28 -17 -22 40 -87
7019 -87 41 16 26 9 9 60 0 5 -4 -5 -2 24 -58 20 20 69 -33 -47 -79 23 -34 -72 13 6 -30 -92 -84 -7 8 -33 19 53 -7
7052 -7 -49 26 -9 -77 44 45 -29 -4 -22 42 -12 56 -32 25 -4 -48 80 -65 -44 1 -38 -5 11 -31 -20 -10 41 -24 25 45
7082 45 -35 -8 -2 -16 -4 23 -29 77 54 -83 46 10 -20 -47 -39 -24 -37 17 -30 51 58 -11 -7 39 -32 9 34 -22 1 18 -22
7113 -22 -50 -7 -10 30 11 -11 28 -1 24 37 -11 12 -31 12 38 13 -7 -21 -7 18 -31 22 3 -33 -89 -16 -98 -16 -56 -3 22
7144 22 53 -33 -30 57 -80 17 43 39 38 -41 49 46 50 -24 -37 -18 11 -5 20 52 -82 27 29 -31 49 35 -23 32 22 -17 30 -8
7176 -8 -32 -8 38 22 38 58 21 -54 -33 -1 20 0 -59 -59 15 -11 -35 15 -66 3 45 -70 32 27 -60 -28 -35 -49 25 11 -36
7207 -36 2 39 23 36 15 19 16 27 -18 -48 2 -25 -66 54 21 -59 32 -93 -2 -19 -103 -4 47 18 -23 -10 -22 23 7 -10
7237 -10 65 44 10 -22 20 -6 17 -9 -36 -51 10 25 -45 -18 40 4 16 -38 -74 -8 33 3 63 25 -48 3 42 -24 0 -1 -5
7268 -5 -57 -4 -45 39 8 16 30 -9 -12 73 46 -60 76 53 -17 55 45 -34 -39 -1 27 24 0 26 -65 -1 3 52 -49 -17 16 58
7300 58 -24 42 25 3 15 36 0 -19 27 -37 -35 36 17 -47 3 -27 -82 0 -34 -8 29 -48 9 -2 51 -44 -16 -26 -56 31 33
7331 33 -34 45 -49 4 53 -5 18 66 -55 -55 -12 -18 5 -53 -26 60 33 -50 13 -13 -77 -49 0 14 -18 -32 36 31 -53 -71 -62 -3
7363 -3 -16 -12 -15 -31 -3 18 -49 -19 -79 -77 -70 -8 4 22 -46 15 7 -6 -3 -52 -69 2 47 21 -18 -50 74 -10 -19 -2 39 -84 -6
7396 -6 65 -3 -26 22 25 -51 12 6 16 12 -50 -50 -34 -7 -64 50 37 18 61 -18 -23 -11 -13 -33 -22 1 -21 -6 -19 -86 62 -13 -75
7429 -75 -15 -52 -11 32 26 -25 68 17 20 25 -38 -53 36 7 -60 -63 -38 -43 71 29 62 -24 -5 -29 35 8 -28 14 -4 -47 -52 38 11
7462 11 -20 -13 -50 0 17 23 44 -33 -11 -6 -10 -69 38 20 -13 -62 -42 -15 -59 45 -25 -15 21 5 -15 -20 -70 -31 -4 -7 50 58 20
7495 20 13 80 -46 -44 -14 -61 27 25 0 -22 42 57 7 23 -8 5 69 -10 23 36 -29 48 48 -17 45 20 7 -58 -1 13 -36 18
7527 18 -50 -25 52 -32 -84 -55 26 2 -4 -20 37 -1 -15 5 -5 44 -2 9 -32 -34 40 -49 -37 -70 47 4 -51 34 -22 -4 12
7558 12 -1 11 35 -9 -64 62 5 55 52 -62 -31 8 -7 2 7 -19 -44 0 -34 -17 6 1 -25 8 42 57 25 -8 -26 40 3
7589 3 -13 19 -47 22 22 -22 38 -27 -56 -124 -71 23 -3 -14 9 25 5 -49 -13 -23 -30 8 -91 23 -35 -33 -9 29 98 -61 11
7620 11 39 -27 -33 16 4 -32 -32 9 -19 -14 14 7 28 27 -15 -30 13 -71 -42 -13 -12 -13 -14 -2 25 -7 14 -22 -18 -8 61 -32 -37 -11 83
7655 83 -23 11 33 -29 -28 -5 6 1 -10 -50 22 64 -50 -24 -44 -20 -104 8 -22 -24 35 -26 -33 71 1 -31 -3 -34 17 44
7685 44 41 14 13 -41 22 7 1 15 22 -114 -55 -20 -2 -5 5 -43 -13 81 -18 -93 17 31 26 20 -18 26 -34 -45 -17 -12 -6 -26 105
7718 105 19 -39 21 40 23 55 25 -31 27 59 -12 19 20 -47 -43 23 43 -46 25 -52 33 -38 5 -4 -40 -67 -67 -41 -55 -74 11 -58
7750 -58 -34 6 32 -11 28 -14 0 -16 -3 1 36 -9 0 -62 -6 -17 44 68 -18 53 55 -57 -32 40 -20 10 37 12 -26 7 45
7781 45 49 72 -50 9 2 -78 37 28 -65 -9 -12 -69 -11 -6 -11 -48 26 -37 0 -33 -42 -3 12 -52 22 -32 -43 -16 -28 -102 -20 -3 -69
7814 -69 -30 -2 -21 -20 59 -24 -23 -106 -72 -11 -5 -74 -43 63 -94 41 7 12 52 -6 0 -18 58 -6 -17 21 -37 3 17 2 7 13
7846 13 11 -9 -28 12 -58 -63 -43 -64 17 -6 -4 0 -70 8 -2 -13 40 -4 0 -61 29 -7 21 -19 2 -42 -8 27 -44 28 17 -7 -37
7879 -37 13 -79 19 52 -38 -14 -25 -44 -5 -53 -12 13 33 -17 -1 -5 -6 26 -17 -14 27 21 -71 18 17 -8 -27 -64 9 50 -44 -81 8
7912 8 27 -19 -33 -28 38 13 2 -45 -49 15 -37 62 -2 -35 10 -20 -43 19 20 12 69 26 -63 11 77 -29 -24 54 44 -32 25 -39 -112
7945 -112 34 -39 19 -37 -18 36 94 -10 -27 74 -83 -70 33 24 -15 -62 0 5 20 -41 -20 16 34 -31 33 -2 -50 -7
7973 -7 -6 -21 -27 6 -9 31 -35 -55 12 30 -55 19 64 -33 34 -30 -3 4 -42 18 5 -91 -6 -5 46 -9 47 -18 -21 -12 -8 5 60 44
8007 44 -22 67 30 -3 -74 42 -35 -21 -8 76 -51 8 -45 -22 53 -31 -48 52 -79 -46 -18 -41 19 43 -45 34 -16 -39
8035 -39 21 47 -30 -77 49 42 42 -55 25 48 -12 -39 21 0 -7 5 24 7 20 22 -39 -7 -13 -6 -13 39 -4 13 -20 -39 32 35 -17 -55
8069 -55 -15 -26 42 71 -16 -90 32 15 -14 23 29 -39 9 -47 -34 90 -26 -30 -26 -42 -28 -10 -16 -50 -44 27 13 -22 12 -24 25
8100 25 3 25 16 50 -49 -39 -4 -18 -18 17 -28 -16 -27 -30 -54 30 2 43 10 -7 12 67 -25 -26 33 45 -67 -22 -65 -4 28 25
8132 25 7 -7 -39 12 16 -23 -8 -19 -22 -35 -61 19 -4 -10 -42 -7 -25 90 -44 -51 -10 25 1 -36 -29 -63 -59 -8 73 25 -24 -49
8164 -49 60 -42 -14 -23 17 56 -49 -40 23 83 11 1 -20 21 54 -28 57 3 -58 -34 55 -29 -20 -78 2 -13 -10
8191a0
##END NTUPLES=NMR FID
##END=
