##TITLE=1H_Ser NCO-1
 CDCl3
 8 sc, 
 1.11.2024
##JCAMPDX= 6.0         $$ Bruker NMR JCAMP-DX V2.0
##DATA TYPE= NMR FID
##DATA CLASS= NTUPLES
##ORIGIN= UXNMR, Bruker Analytische Messtechnik GmbH
##OWNER= root
$$ XWIN-NMR		Version 3.5
$$ Fri Nov  1 14:30:58 2024 Russian Standard Time (UT+4h)  she@DPX200
##.OBSERVE FREQUENCY= 200.1318
##.OBSERVE NUCLEUS= ^1H
##.DELAY= (6, 6)
##.ACQUISITION MODE= SIMULTANEOUS
##.ACQUISITION SCHEME= undefined
##.AVERAGES= 8
##.DIGITISER RES= 18
##SPECTROMETER/DATA SYSTEM= spect
##.PULSE SEQUENCE= zg30
##.SOLVENT NAME= CDCl3
##.SHIFT REFERENCE= (INTERNAL, CDCl3, 0, 15.7039)
##AUDIT TRAIL= $$ (NUMBER, WHEN, WHO, WHERE, WHAT)
$$ ##TITLE= Audit trail, XWIN-NMR		Version 3.5
$$ ##JCAMPDX= 5.01
$$ ##ORIGIN= Bruker BioSpin GmbH
$$ ##OWNER= she
$$ F:/spectra/data/she/nmr/H-F/1/audita.txt
$$ ##AUDIT TRAIL=  $$ (NUMBER, WHEN, WHO, WHERE, WHAT)
(   1,<2024-11-01 14:29:45.87 +0400>,<she>,<DPX200>,
      <created by zg, POWCHK disabled, PULCHK disabled
       configuration hash MD5:
       00 E9 B6 7A A2 85 ED C7 34 08 36 98 17 FE 4E 26
       data hash MD5: 16K
       D5 28 ED E9 4F 07 33 2E 4A 69 AE 3E 0E 66 86 33>)
$$ ##END=
$$ 
$$ hash MD5
$$ 82 AC C1 DF 75 EF 9E 11 B5 8D 4E 36 33 E2 DB E1
##$RELAX= 
##$RELAX= 
##$RELAX= 
##$RELAX= 
##$RELAX= 
##$RELAX= 
$$ Bruker specific parameters
$$ --------------------------
##$DU= <F:/spectra>
##$EXPNO= 1
##$NAME= <H-F>
##$PROCNO= 1
##$TYPE= <nmr>
##$USER= <she>
##$AMP= (0..31)
100 100 100 100 100 100 100 100 100 100 100 100 100 100 100 100 100 100 
100 100 100 100 100 100 100 100 100 100 100 100 100 100 
##$AQSEQ= 0
##$AQ_mod= 1
##$AUNM= <au_zg>
##$AUTOPOS= <>
##$BF1= 200.13
##$BF2= 200.13
##$BF3= 200.13
##$BF4= 200.13
##$BF5= 200.13
##$BF6= 200.13
##$BF7= 200.13
##$BF8= 200.13
##$BYTORDA= 1
##$CFDGTYP= 0
##$CFRGTYP= 5
##$CHEMSTR= <none>
##$CNST= (0..31)
1 1 145 1 1 1 1 1 1 1 1 1 1 1 1 1 1 1 1 1 1 1 1 1 1 1 1 1 1 1 1 1 
##$CPDPRG= <>
##$CPDPRG1= <>
##$CPDPRG2= <>
##$CPDPRG3= <>
##$CPDPRG4= <mlev>
##$CPDPRG5= <mlev>
##$CPDPRG6= <mlev>
##$CPDPRG7= <mlev>
##$CPDPRG8= <mlev>
##$CPDPRGB= <>
##$CPDPRGT= <>
##$D= (0..31)
0 1.2 0 0 0 0 0 0 0 0.06 0 0.03 0 0 0 0 0.0002 0 0 0 0 0 0 0 0 0 0 0 0 
0 0 0 
##$DATE= 1730456985
##$DBL= (0..7)
120 120 120 120 120 120 120 120 
##$DBP= (0..7)
150 150 150 150 150 150 150 150 
##$DBP07= 0
##$DBPNAM0= <>
##$DBPNAM1= <>
##$DBPNAM2= <>
##$DBPNAM3= <>
##$DBPNAM4= <>
##$DBPNAM5= <>
##$DBPNAM6= <>
##$DBPNAM7= <>
##$DBPOAL= (0..7)
0.5 0.5 0.5 0.5 0.5 0.5 0.5 0.5 
##$DBPOFFS= (0..7)
0 0 0 0 0 0 0 0 
##$DE= 6
##$DECBNUC= <off>
##$DECIM= 24
##$DECNUC= <off>
##$DECSTAT= 4
##$DIGMOD= 1
##$DIGTYP= 9
##$DL= (0..7)
0 120 120 120 120 120 120 120 
##$DP= (0..7)
150 150 150 150 150 150 150 150 
##$DP07= 0
##$DPNAME0= <>
##$DPNAME1= <>
##$DPNAME2= <>
##$DPNAME3= <>
##$DPNAME4= <>
##$DPNAME5= <>
##$DPNAME6= <>
##$DPNAME7= <>
##$DPOAL= (0..7)
0.5 0.5 0.5 0.5 0.5 0.5 0.5 0.5 
##$DPOFFS= (0..7)
0 0 0 0 0 0 0 0 
##$DQDMODE= 0
##$DR= 18
##$DS= 0
##$DSLIST= <SSSSSSSSSSSSSSS>
$$ [...]
##$SUBNAM2= <"">
##$SUBNAM3= <"">
##$SUBNAM4= <"">
##$SUBNAM5= <"">
##$SUBNAM6= <"">
##$SUBNAM7= <"">
##$SUBNAM8= <"">
##$SUBNAM9= <"">
##$SW= 24.0689170037331
##$SWIBOX= (0..15)
0 0 2 0 0 0 0 0 0 0 0 0 0 0 0 0 
##$SW_h= 4816.95568400771
##$TD= 16384
##$TD0= 1
##$TE= 0
##$TE2= 300
##$TE3= 300
##$TEG= 300
##$TL= (0..7)
0 120 120 120 120 120 120 120 
##$TP= (0..7)
150 150 150 150 150 150 150 150 
##$TP07= 0
##$TPNAME0= <>
##$TPNAME1= <>
##$TPNAME2= <>
##$TPNAME3= <>
##$TPNAME4= <>
##$TPNAME5= <>
##$TPNAME6= <>
##$TPNAME7= <>
##$TPOAL= (0..7)
0.5 0.5 0.5 0.5 0.5 0.5 0.5 0.5 
##$TPOFFS= (0..7)
0 0 0 0 0 0 0 0 
##$TUNHIN= 0
##$TUNHOUT= 0
##$TUNXOUT= 0
##$USERA1= <user>
##$USERA2= <user>
##$USERA3= <user>
##$USERA4= <user>
##$USERA5= <user>
##$V9= 5
##$VALIST= <valist>
##$VCLIST= <CCCCCCCCCCCCCCC>
##$VD= 0
##$VDLIST= <DDDDDDDDDDDDDDD>
##$VPLIST= <PPPPPPPPPPPPPPP>
##$VTLIST= <TTTTTTTTTTTTTTT>
##$WBST= 1024
##$WBSW= 4
##$XGAIN= (0..3)
0 0 0 0 
##$XL= 0
##$YL= 0
##$YMAX_a= 47445
##$YMIN_a= -63991
##$ZGOPTNS= <>
##$ZL1= 120
##$ZL2= 120
##$ZL3= 120
##$ZL4= 120
##$ABSF1= 10
##$ABSF2= 0
##$ABSG= 5
##$ABSL= 3
##$ALPHA= 0
##$AQORDER= 0
##$ASSFAC= 0
##$ASSFACI= 0
##$ASSFACX= 0
##$ASSWID= 0
##$AUNMP= <proc_1d>
##$AZFE= 0.1
##$AZFW= 0.1
##$BCFW= 1
##$BC_mod= 2
##$BYTORDP= 1
##$COROFFS= 0
##$CY= 11.3945322036743
##$DATMOD= 1
##$DC= 2
##$DFILT= <>
##$DTYPP= 0
##$F1P= 15.6554695791079
##$F2P= 12.8336369535428
##$FCOR= 0.5
##$FTSIZE= 0
##$FT_mod= 4
##$GAMMA= 1
##$GB= 0.15
##$INTBC= 1
##$INTSCL= 1
##$ISEN= 128
##$LB= 0.24
##$LEV0= 0
##$LPBIN= 0
##$MAXI= 10000
##$MC2= 0
##$MEAN= 0
##$ME_mod= 0
##$MI= 1.114404
##$NCOEF= 0
##$NC_proc= 0
##$NLEV= 6
##$NOISF1= 3.799351
##$NOISF2= 2.8
##$NSP= 1
##$NTH_PI= 0
##$NZP= 0
##$OFFSET= 15.70392
##$PC= 1
##$PHC0= -26507.34
##$PHC1= 14.18743
##$PH_mod= 1
##$PKNL= yes
##$PPARMOD= 0
##$PSCAL= 0
##$PSIGN= 0
##$REVERSE= no
##$SF= 200.130013532006
##$SI= 16384
##$SIGF1= 3
##$SIGF2= 2
##$SINO= 400
##$SIOLD= 16384
##$SREGLST= <1H.CDCl3>
##$SSB= 0
##$STSI= 0
##$STSR= 0
##$SW_p= 3612.71676300578
##$SYMM= 0
##$S_DEV= 0
##$TDeff= 0
##$TDoff= 0
##$TI= <>
##$TILT= no
##$TM1= 0
##$TM2= 0
##$TOPLEV= 0
##$USERP1= <user>
##$USERP2= <user>
##$USERP3= <user>
##$USERP4= <user>
##$USERP5= <user>
##$WDW= 1
##$XDIM= 8192
##$YMAX_p= 0
##$YMIN_p= 0
$$ End of Bruker specific parameters
$$ ---------------------------------
##NTUPLES= NMR FID
##VAR_NAME=  TIME,          FID/REAL,        FID/IMAG
##SYMBOL=    X,             R,               I
##VAR_TYPE=  INDEPENDENT,   DEPENDENT,       DEPENDENT
##VAR_FORM=  AFFN,          ASDF,            ASDF
##VAR_DIM=   8192,          8192,            8192
##UNITS=     SECONDS,       ARBITRARY UNITS, ARBITRARY UNITS
##FACTOR=    0.0002076,     1,               1
##FIRST=     0,             0,               0
##LAST=      1.7004516,     0,               0
##MIN=       0,             -63991,          0
##MAX=       1.7004516,     47445,           0
$$ Real data points
##PAGE= N=1
##DATA TABLE= (X++(R..R)), XYDATA
$$ [...]
559B08j1P80n53j749L23J301n04j197P66J679M3j140n2J566J06k100l38J518n52
$$ 208 197 977 424 -1325 -1002 299 -205 -1402 -636 1043 1086 -54 -106 1460 1566 -534 -872 646 94
578I4j701N84J322l75n29P60Q63J10o30n92N76M87j376j052R74O73q17k17P55
$$ 94 -1607 -1023 299 -76 -605 155 1018 1128 498 -94 482 969 -407 -1459 -485 188 -629 -846 -91
597i1P48r9r9K25O4l63n00P0l46m47K78M9k07Q39N22r50N46J325o65j396M58N97
$$ -91 657 558 459 684 748 385 -115 -45 -391 -838 -560 -511 -718 121 643 -307 239 1564 899 -497 -39 558
619E58q81q27L98M70q8o3K86O76L12n36j4M14j99p24p71L28R06p23j323J399J969
$$ 558 -323 -1150 -752 -282 -370 -433 -147 529 841 305 291 705 506 -218 -989 -661 245 -478 -1801 -402 1567
640A567j312j538K181J366k441j026J939J40k109n09J668O37j453l72J847J005
$$ 1567 255 -1283 898 2264 -177 -1203 736 876 -1233 -1742 -74 563 -890 -1262 585 1590
656A590j292r20J244P01j185j145J72R47j07j383K45K053k65j511J058J566j137
$$ 1590 298 -622 622 1323 138 -1007 -835 112 5 -1378 -1133 920 655 -856 202 1768 631
673F31j466R52O81j247r21N85P55l5o02L22J009J48l56r2k05J67p7q28k58N96
$$ 631 -835 117 798 -449 -1370 -785 -30 -65 -667 -345 664 812 456 364 159 326 249 -579 -837 -241
693b41j62n80P40Q64p22K9J190m70o53M41l19r06N41K93j055l44J565O58j292
$$ -241 -403 -983 -243 621 -101 -72 1118 648 -5 436 117 -789 -248 45 -1010 -1354 211 869 -423
712d23n7J530L11j360n55J099M6j824J56J312m37r31O68J163J51p47k11P25M85
$$ -423 -480 1050 1361 1 -554 545 591 -1233 -1077 235 -202 -1133 -465 698 849 102 -109 616 1101
731A101r59j183O40O63q65m92P76N69j41l12O31Q58q42j010R82M72j440q45J189
$$ 1101 142 -1041 -401 262 -603 -1095 -319 250 109 -203 428 1286 444 -566 416 888 -552 -1397 -208
750b08N12q63j11P81L23K44j37m45M63M1r36j93O23l34q65M83J248k71q34O08
$$ -208 304 -559 -670 111 434 678 541 96 559 600 -336 -529 94 -240 -1105 -622 626 355 -479 129
770A29J108m30r21K58L26q11p9L16o42j2J048j58n06R01L51n93j01N28l49r04
$$ 129 1237 807 -114 144 470 -341 -420 -104 -746 -758 290 132 -374 527 878 285 184 712 363 -541
790e41R0K85N1m75l19R82P75p33k70R69J17p66k04J60k66k58k27K19L08R0l46
$$ -541 -451 -166 -115 -590 -909 73 848 115 -155 814 931 165 -39 121 -145 -403 -630 -411 -103 -13 -359
811c59N41P65l37o15K13L66k33r23j78P34O2q46M72P75j81k03N15J24m09K4m24
$$ -359 182 947 610 -5 208 574 341 -582 -760 -26 36 -810 -338 437 256 53 568 692 283 307 -117
832a17j28K59n24n13J011L74q80L08J120l07o15N32J6o61n8J11l21j78J41K90
$$ -117 -245 14 -510 -1023 -12 362 -518 -210 910 603 -12 520 536 -125 -183 -72 -393 -571 -430 -140
852a40K47j44J41M03k6k36Q9l7m54j43K8j47m5J05K20L51L1j63L55M13o33k34
$$ -140 107 -37 104 507 481 245 334 297 -157 -300 -272 -419 -464 -359 -139 212 243 80 435 848 215 -19
874a9K02m54k92L09j56j81O18Q1k54O35K45p61J31N38n55o77K69J81k68m2J19
$$ -19 183 -271 -563 -254 -410 -591 27 108 -146 489 734 -27 104 642 87 -590 -321 -140 -408 -450 -331
895c31K55M00r6o3L52o6n36rK83m33m82J69M38k6k43L20N78q0l01K59J53n66k40
$$ -331 -76 324 228 165 517 451 -85 -94 189 -244 -726 -557 -119 -145 -388 -68 510 430 129 388 541 -25 -265
918b65J88l59j55K91k4J12M62l7j14M35nm75q9J23l11j75k3q3J47M31j95J42N38
$$ -265 -77 -436 -591 -300 -324 -212 250 213 99 534 529 54 -35 88 -223 -398 -421 -504 -357 74 -121 21 559
941E59j87k18K38K8n48k68K20o4k60N5M01J45J0Q7K50m8j82j9j69k17k2j67q3
$$ 559 372 154 392 420 -128 -396 -176 -240 -500 -445 -44 101 111 198 448 400 218 199 30 -187 -209 -376 -459
964d59K56M9p0L45K72j54L0K11j72m21J25j66l12J48J0j5J93L33j07J18K89k8
$$ -459 -203 -154 -224 121 393 239 269 480 308 -113 12 -154 -466 -318 -308 -323 -130 203 96 214 503 475
986D75l99K4M8l13l20J88P3q1P2K36K56L1NO5k4k28j16j28M4k69j81K84K88r5
$$ 475 76 100 148 -165 -485 -297 -224 -305 -233 3 259 290 295 360 336 108 -8 -136 -92 -361 -542 -258 30 -65
1010f5P7L34J44k69k6Q4l19p4o8j55j2J43M8Q2J54K35m1K6O6j35k30q5q3j40n8
$$ -65 12 346 490 221 195 279 -40 -114 -182 -337 -349 -206 -158 -76 78 313 272 298 364 229 -1 -86 -169 -309 -367
1035c67Q0J08J29M1K36J19L8k7k09Q1j42l44n7J48j21l4K05K93o9M9K59j7j85
$$ -367 -287 -179 -50 -9 227 346 384 357 148 229 87 -257 -314 -166 -287 -321 -116 177 108 157 416 399 214
1058B14l6k23q4j36n5J8Q3K13O0L4J98N8r2j8n0j44j87r8n8Q9n6J29K8K26P0O7
$$ 214 178 -45 -129 -265 -320 -302 -219 -6 54 88 286 344 252 234 184 40 -147 -245 -303 -214 -270 -141 -113 113 183 250
1084B50J6J50k36j92m6qk16r2J54O1N3K09J63L3O6j07j68J5j19j30j04l8P2L8
$$ 250 266 416 180 -12 -58 -66 -282 -374 -220 -159 -106 103 266 299 365 258 90 105 -14 -144 -248 -286 -214 -176
1108a76Q7J56P4J32No9j6j28o6j53p1Jm6n3K58J14J0J69L0Rq0L5j48k01m3p3q7
$$ -176 -89 67 141 273 278 209 193 65 -1 -154 -225 -224 -270 -323 -65 49 59 228 258 267 187 222 74 -127 -170 -243 -330
1135c30J24J37o9K23J79m4K5PJ0j55j74j06J0n1q9P8J83J59k5N0J48jj30j46n4
$$ -330 -206 -69 -138 85 264 220 245 252 262 107 -67 -173 -163 -214 -303 -225 -42 117 92 142 290 289 159 13 -41
1160d1ok73j9J61kKK11J59Q5Lo2m2N5k50k37J1k1p3J8J77J50Q7j0R4J13o1j73
$$ -41 -47 -320 -339 -178 -180 -178 33 192 277 280 218 176 231 -19 -256 -245 -266 -339 -321 -144 6 93 83 177 290 229 56
1187E6j9n9j30j68MM8J65R9k5J53J85j28k3k0o6j94j23l5K7N2k6P0K59J39o0j
$$ 56 37 -22 -152 -320 -316 -268 -103 -4 -29 124 309 181 158 138 72 -122 -245 -280 -253 -201 -227 -157 102 241 181 180
1213A80J56j25j95l5k08J1J8j38R5L02Mq0K65J33j66j17L5q4j90j06n8K07o3j13
$$ 180 336 211 16 -19 -227 -216 -198 -336 -241 61 65 -15 250 383 217 100 135 51 -139 -245 -303 -96 -159 -272
1237b72J73L38L1j23P1o6k7j04j90k0J24j16j83L21P3r4K06J97n3j40l8j3K7k74
$$ -272 -99 239 270 147 218 152 125 21 -169 -189 -65 -181 -364 -43 30 -64 142 339 286 146 108 95 122 -152
1261a52j50R2J30p3N4K60p0P1J71r9j98Q4j83o5OL0k31O8K74K1nJ15J13KJ9l00
$$ -152 -302 -210 -80 -153 -99 161 91 162 333 234 36 120 -63 -128 -122 -92 -323 -255 19 40 35 150 263 265 284 -16
1287a6r2R2j56j00R6oJ00J76rR0J19j34r0J24j6l76RJ27j46n8O8J64J40R1j33
$$ -16 -108 -16 -172 -272 -176 -182 -82 94 85 175 294 160 70 194 178 -198 -189 -62 -208 -266 -198 -34 106 197 64
1312F4J12R2j13q5q3r7j29K0P6P9J70r1O5L21j26l62K46J05k86j87L7l8K4M3L7
$$ 64 176 268 155 70 -13 -110 -239 -219 -143 -64 106 15 80 401 275 -87 159 264 -22 -209 -172 -210 -186 -143 -106
1337a06J39J09J9k5J60j41k36J13j9k17rk1N4J87Q6j08J67J39r5k7L1k48j02J59
$$ -106 33 142 161 136 296 155 -81 32 13 -204 -213 -234 -180 7 93 -15 152 291 196 169 200 -48 -150 9
1361Ik02q2J70m1O3K67j28N6R8k9o0q2r5k18J54kj41J29K03j05J10K20k24P5P2
$$ 9 -193 -275 -105 -146 -83 184 56 112 210 181 121 39 -56 -274 -120 -122 -263 -134 69 -36 74 294 70 145 217
1386B17k38q7P6j63l7J84O1j92K54J33j38R5l4m5M1p5k76R3Mj22P6J55k9J08J12
$$ 217 -21 -108 -32 -195 -232 -48 13 -179 75 208 70 165 131 86 127 52 -224 -131 -127 -249 -173 -18 -47 61 173
1411A73J3n4K2j43j23J54j89j58J24J24k8P1N6N2P5Qk7n8K1j75r8R6j69J5J98
$$ 173 186 132 154 11 -112 42 -147 -305 -181 -57 -85 -14 42 94 169 177 150 92 113 -62 -160 -64 -233 -218 -20
1436b0K6j5J36L9q5K04j41k07k8M3j04K6jMNK01J9l0J40j56M3M7k10p5L5n5n9
$$ -20 6 -9 127 166 81 285 144 -63 -91 -48 -152 -126 -127 -123 -118 83 102 72 212 56 99 146 -64 -139 -104 -159 -218
1463b18J29qN3J74K7j19P3R8j56n3K6j84n9J03o1Q4J54nj2J56Rk21Q2l3j39k1
$$ -218 -89 -97 -44 130 157 38 111 209 53 0 26 -158 -217 -114 -175 -91 63 58 46 202 211 -10 72 39 -100 -121
1489a21p6mO5J39o1P8N8K5O6N1j45j40J7Rj39O4r1Q0R1J4K8J51pm4k0rj06l1J40
$$ -121 -197 -201 -136 3 -58 20 78 103 169 220 75 -65 -48 -39 -178 -114 -205 -125 -34 -20 8 159 152 108 88 79 -27 -58 82
1518H2l12O2R0L5P1J08pm7K06j14j83j7L5j45k5O1m9O0J38K4P1l3M7q0L8j18p2
$$ 82 -230 -168 -78 -43 28 136 129 82 288 174 -9 -26 9 -136 -161 -100 -149 -89 49 73 144 111 158 78 116 -2 -74
1545g4pm1o3P9L7OJ18J13j8M7n2q5M1p1j72RL0j5j5J00nM8J58m8o1K8p6J1Rp0
$$ -74 -81 -122 -185 -106 -69 -63 55 168 150 197 145 60 101 30 -142 -133 -103 -118 -133 -33 -38 10 168 120 59 87 11 22 31 -39
1575c9p4LK6N1M0L1K7J20j6o2m1o7j1l8j04n5R6L3R8jP3mQ7n2l3o0j4p2r6P2o
$$ -39 -113 -110 -84 -33 7 38 65 185 169 107 66 -1 -12 -50 -154 -209 -113 -80 18 17 90 86 173 121 88 28 14 -58 -154 -82 -88
1606h8l1N0J58j5L4k1P4q3Pq9j13k2k3rJ27LmJ05O8j0l4N9p0j05Kn0r1Q7k5OJ39
$$ -88 -119 -69 89 74 108 87 161 78 85 -4 -117 -139 -162 -171 -44 -41 -45 60 128 118 84 143 73 -32 -30 -80 -171 -84 -109 -103 36
1637C6J02o8Q5m1K0n6j59J2k6k3k9M7P2M1M0O7n1L8j3p1nk2p7m6oO5k5j1J49o7
$$ 36 138 70 155 114 134 78 -81 -69 -95 -118 -147 -100 -28 13 53 120 69 107 94 23 18 -4 -81 -127 -133 -68 -93 -104 45 -22
1667b2J43l6pl9J2r0l7k6lK5P2J1L4nkO3L8n9Pr1J0j17N9n3jJ01j8O0O8k6j4J1
$$ -22 121 85 78 39 51 -39 -76 -102 -105 -80 -8 3 37 32 30 93 131 72 79 -12 -2 -119 -60 -113 -114 -13 -31 29 97 71 57 68
1699F8K6j40M1q9n7L9J8M5j5J61j3L2Qjp4Mj19N1j11K7qL7R2QN4k3QL8m1m2qp8
$$ 68 94 -46 -5 -94 -151 -112 -94 -49 -64 97 84 116 124 123 49 53 -66 -15 -126 -99 -107 -70 22 30 84 61 69 107 66 24 16 -62
1731f2m1K5n3M9J21kQ1q2J07J1j13jo7rn0k3o0O9P5J2J17o2J0OR9r8Qo2l4o1m2
$$ -62 -103 -78 -131 -82 39 37 118 36 143 154 41 40 -27 -36 -86 -109 -169 -100 -25 -13 104 42 52 58 157 59 67 5 -29 -90 -132
1762a32L0O4Q0l7O4k6Q4m5l4r8Rm0oM3j2M4n4R9K0k0R4lq8On9o2n4K0M5l6N4K4
$$ -132 -102 -38 42 5 69 43 127 82 48 -50 -41 -81 -87 -44 -56 -12 -66 33 53 33 127 124 36 42 -17 -79 -133 -113 -68 -104 -50 -26
1794b6M2Q2rJ1l1j4l0l1m9L6nKjK1J05n9J5J13m5j6p1j08J1j0l1j8M8J14M5k3
$$ -26 16 98 89 100 69 55 25 -6 -55 -19 -24 -22 -23 -2 103 44 59 172 127 111 40 -68 -57 -67 -98 -116 -68 46 91 68
1824F8L7Lk8Kq6nj4Oj31M8M6KqJ39J4l2K2p7N7q3p8%K8L6j9R7j7MQ2pNq7nPm9
$$ 68 105 108 80 82 -4 -9 -23 -17 -148 -100 -54 -52 -60 79 93 61 83 6 63 -20 -98 -98 -70 -34 -53 44 27 31 113 106 111 24 19 26 -23
1859b3Jl6n3N1M4JlQ1O5r4K5k4l8ml9m0j2R5lj4Q0j1kQ1j4m7j8p7o6M4p2O3qL5
$$ -23 -22 -58 -111 -60 -16 -15 -18 63 128 34 59 35 -3 -7 -46 -86 -98 -3 -6 -20 60 49 47 128 114 67 49 -28 -94 -50 -122 -59 -67 -32
1893c2nL2Q7p8K0K9l4k5l3j0m0k6J01l7Q4j1N0o7N8O1q0k6op4k5n8R3jR3L7n4
$$ -32 -37 -5 82 4 24 53 19 -6 -39 -49 -89 -115 -14 -51 33 22 72 5 63 124 44 18 12 -62 -87 -145 -52 -53 40 77 23
1924B3O2j8k2K8m2n3k3Jrqj8j9J53L2p2Q4l3n2J6m9l2j6j1k6N1M0L0k7P0nJ2n5
$$ 23 85 67 45 73 31 -22 -45 -44 -53 -61 -79 -98 55 87 15 99 66 14 30 -19 -51 -67 -78 -104 -53 -13 17 -10 60 55 67 12
1956A2QJ1p7l2K7l9Q2LO4K8n5k7N3j05P8k8k6P5j22K5l5R3JN6k6L5q0Q3o5ol6
$$ 12 20 31 -46 -78 -51 -90 -8 -5 59 87 32 5 58 -47 31 3 -23 52 -70 -45 -80 13 14 70 44 79 -1 82 17 11 -25
1987b5j08N3ML4qQN6n0J15K2k1o7k7k7mj3k9j6kN2J06L1r4R8Qm3n7k0QLn4O0m2
$$ -25 -133 -80 -76 -42 -50 -42 14 -36 79 101 80 13 -14 -41 -45 -58 -87 -103 -105 -53 53 84 -10 88 96 53 -4 -24 -16 -13 -67 -7 -49
2020d9N8j5Q9l9J6mJ6o2Rm2JJ2p7OJ26l3PR7p0J5ON1j55O3o4m8K8J6o4J03K5r4
$$ -49 9 -6 83 44 60 56 72 10 19 -23 -22 -10 -87 -81 45 12 19 116 46 61 67 118 -37 26 -38 -86 -58 -42 -106 -3 22 -72
2052g2J32j1q4M6Oq4NK5m1O1o1o2N9J11K4K5p4P2r2K0j7n7k4L5l6R5N9j11R2J7
$$ -72 60 49 -35 11 17 -67 -62 -37 -78 -17 -78 -140 -81 30 54 79 5 77 -15 5 -12 -69 -93 -58 -94 1 60 -51 41 58
2082E8l9K4n8Q8q4mK5j11M3N6l6N3J3P7k7Lm4k2Op9J7J1l6Q7L2n0NL7J9k8l9L5
$$ 58 19 43 -15 73 -11 -15 10 -101 -58 -2 -38 15 28 105 78 81 37 15 21 -58 -41 -30 -66 21 53 3 8 45 64 36 -3 32
2114C2o0M1l1J4p6PJ9M2O6k3p8L1Q3o3N1o3n6oO7q8N3J2K2N6nj5R2j26jm4m6O3
$$ 32 -28 13 -18 -4 -80 -73 -54 -12 54 31 -47 -16 67 4 55 -8 -64 -70 -3 -91 -38 -26 -4 52 47 32 124 -2 -3 -47 -93 -30
2146c0J3M6r7M1N2oL6M6k8n0j2m0j4kK0j7j6L6M3M2m2r3J06L8m2o1N9q2PJ3j4
$$ -30 -17 29 -68 -27 25 19 55 101 73 23 11 -29 -43 -45 -25 -42 -58 -22 21 63 21 -72 34 72 30 -31 28 -54 -47 -34 -48
2177d8N0no7N0N1M8j09k4L3KK4j02P2o2P9j8O0K5l3l2J9pOK0j46M3P8Ko8N9j9
$$ -48 2 -3 -70 -20 31 79 -30 -54 -21 -19 5 -97 -25 -87 -8 -26 34 59 26 -6 13 6 12 32 -114 -71 7 9 -59 0 -19
2208a9L4M0l2PJ8j06L4j1N8k3n9J1O2J6l9j4M1RJ7j7l7k7K5%j4jm1M0M0N0l9J
$$ -19 15 55 23 30 48 -58 -24 -35 23 0 -59 -48 14 30 -9 -23 18 27 44 27 -10 -37 -12 -12 -26 -27 -68 -28 12 62 23 24
2240B4N6o6Nl9p%J3J1n9M7J0K1K2M7j9k8n6J9%n2l7K1J03p7M0K8q3Q9n2L7Rm8
$$ 24 80 14 19 -20 -27 -27 -14 -3 -62 -15 -5 16 38 85 66 38 -18 1 1 -51 -88 -67 36 -41 -1 27 -56 33 -19 18 27 -21
2272b1Jn0oM4k8M6l4M3Rm3J04m8o9M2j7P9p0l6L3K6n2P7j1N1q1N4l0Mm7j5M0M
$$ -21 -20 -70 -76 -32 -60 -14 -48 -5 4 -39 65 17 -52 -10 -27 52 -18 -54 -21 5 -47 30 19 70 -11 43 13 17 -30 -45 -5 -1
2304ak8L2j8pL6P5J4m9q2N6J8jl4l4K7NN6k7Ml0L6k2l2J0N0n8j1n0M7n6lJ23l7
$$ -1 -29 3 -15 -22 14 89 103 54 -28 28 46 45 11 -23 4 9 65 38 42 12 48 26 -6 4 54 -4 -15 -65 -18 -74 -77 46 9
2337Ij3P2kq4J2K6ql3Ok7rn8J18Rn1P6l7K6l0o4R7m2Pn8L2O8o0L5l0O3n6lP9n1
$$ 9 -4 68 66 -18 -6 20 12 -21 -15 -42 -51 -109 9 18 -33 43 6 32 2 -62 35 -7 0 -58 -26 42 -18 17 -13 50 -6 -9 70 19
2371A9L8m6k1nQLN2J3j7J1no2O9k5p3R4j31JO8l%N4l1J0Kn6M6m0j6J2k4J5K0l2
$$ 19 57 11 -10 -15 -7 -4 48 61 44 55 50 -12 57 32 -41 53 -78 -77 -9 -12 -12 42 11 21 23 -33 13 -27 -43 -31 -55 -40 -20 -52
2405e2Q5m0j9N2jL2p2Q2p3K3L2p4Km6P1l8L7N7Pkm1p6N2mk8kP3l0j10Q0jo4kQ0
$$ -52 33 -7 -26 26 25 57 -15 67 -6 17 49 -25 -23 -69 2 -36 1 58 65 63 22 -54 -2 -6 -34 -36 37 7 -103 -23 -24 -88 -90 -10
2439a0k4P3l3j5l3K0pK4J8r0P0j8O2k3l2Q6p0k4J7k0o8P5oK6l1M4j8j0L6Pkn0
$$ -10 -34 39 6 -9 -42 -22 -29 -5 13 -77 -7 -25 37 14 -18 68 -2 -26 -9 -29 -97 -22 -28 -2 -33 11 -7 -17 19 26 24 -26
2471b6P1l0p2K3j4rJ6L0Ok0JJ4J05n6K5q3R9j00J1m3P7N3o1kj9J9N6n8j1o4O6
$$ -26 45 15 -57 -34 -48 -57 -41 -11 -5 -25 -24 -10 95 39 64 -19 80 -20 -9 -52 25 78 17 15 -4 15 71 13 2 -62 4
2502Dj8m6kM2L8l2m6R6L5p6KK4j0l6J4m8mQ3j0j9K0p8J12K1m1K6l5l7JqLm2Q6
$$ 4 -14 -60 -62 -20 18 -14 -60 36 71 -5 -3 21 11 -25 -11 -59 -63 20 10 -9 11 -67 45 66 25 51 16 -21 -20 -28 -25 -67 19
2535A9j3L0n3L3Qrl1L8J2jl3L1j02K7L1N4n9Mj0Q4l9jk3o1l8N5O4m4jQJL4jj6
$$ 19 6 36 -17 16 24 15 -16 22 34 33 0 31 -71 -44 -13 41 -18 -14 -24 60 21 20 -3 -64 -102 -47 17 -27 -28 -20 -19 15 14 -2
2569bj7k0J8J7K2l8Ql4N0l8jJ7K8l1J2o0M5N1o7j9L2P9j18P2m3N2j5J3P8l0j9
$$ -2 -19 -39 -21 -4 18 -20 -12 -46 4 -34 -35 -18 10 -21 -9 -69 -24 27 -40 -59 -27 52 -66 6 -37 15 0 13 91 61 42
2600D2p6N9n2K1j8QM3ql2L2K2N1p5L3k3p2J7N0n9M7l2j2K3L3m1M8n2M3l7K0l0
$$ 42 -34 25 -27 -6 -24 -16 27 19 -13 19 41 92 17 50 27 -45 -28 22 -37 10 -22 -34 -11 22 -19 29 -23 20 -17 3 -27
2631b7k1J7j5O9p5%NP2j9j6J1n5Q5%j02N4QK2k8l8J52p2k0QL7q2K9N2r5M4L1j03
$$ -27 -48 -31 -46 23 -52 -52 -47 25 6 -10 1 -54 31 31 -71 -17 -9 13 -15 -53 99 27 7 15 52 -30 -1 51 -44 0 31 -72
2663g2N6j1J0J9L6o1K6l0Km1L9MJ6l1kO1j2m5N8m2J2N1p4N9m9J2j2kL6qj1mJ8
$$ -72 -16 -27 -17 2 38 -23 3 -27 -25 -66 -27 -23 -7 -38 -40 21 9 -36 22 -20 -8 43 -31 28 -21 -9 -21 -23 13 5 -6 -10 8
2696HM1O1n5J6j10L6lqM1p8%M8K7k9k6M9L6q2M1k6Qj9J1k5J8O6o1J1k5R7J0r9
$$ 8 49 110 55 71 -39 -3 -6 -14 27 -51 -51 -3 24 -5 -31 18 54 -28 13 -13 -5 -24 -13 -38 -20 46 -15 -4 -29 68 78 -21
2728b1N9o5N9j8n8M2LJ0k7PK5%k5K5m6j8J00j16J05j03N7K0lk3P9n8l3O1l6K4
$$ -21 38 -27 32 14 -44 -2 1 11 -16 -9 16 16 -9 16 -30 -48 52 -64 41 -62 -5 15 12 -11 68 10 -23 38 2 26
2758B6j7J5q4M0KM8m5n1L6K2MM1m1l0L4L5k9k5l3N3N3m1k0j1M6MKl8N8j15K4K2
$$ 26 9 24 -60 -20 -18 30 -15 -66 -30 -8 -4 37 -4 -34 0 35 6 -19 -52 1 54 13 -7 -18 28 32 34 -4 54 -61 -37 -15
2790a5K9m8lN8J5o7M6KQJl9j4j1L9Rj7J0J5Jl4O0oJnm9J5l0N0j0j5n1O3L1m7K7
$$ -15 14 -34 -37 21 36 -31 15 17 25 26 -13 -27 -38 1 10 -7 3 18 19 -15 45 39 40 35 -14 1 -29 21 11 -4 -55 8 39 -8 19
2825A9L9pp7N1m4j3Lj4P0Qn9j8M4K6k0M2m6J7J9k0o6K6L2j2O2o8j0nK6MJ5o0Q7
$$ 19 58 51 -26 25 -19 -32 -29 -43 27 35 -24 -42 2 28 8 50 4 21 40 20 -46 -20 12 0 62 -6 -16 -21 5 9 24 -36 51
2858E1n2m1ON5m0j0J1%L7K9J9n7QL3j09R3k1q6L8NM2K8l5l2R2p1K9l5N0qm3K9
$$ 51 -1 -42 -36 19 -21 -31 -20 -20 17 46 65 8 16 49 -60 33 12 -74 -36 -31 11 39 4 -28 64 -7 22 -13 37 29 -14 15
2890A5J5j3p2J03J3n1M2k9j0Rjm0%k3P7mm4j5MrJ09m2l8J8L3n9n5O2o8P3j4K7
$$ 15 30 17 -55 48 61 10 52 23 13 22 21 -19 -19 -42 35 31 -13 -28 -24 -33 76 34 -4 14 47 -12 -67 -5 -73 0 -14 13
2922A3J9n8MQK0K0l1orK2K6k3K5m2k3Q0r0L5O2l7N0m4n2j5P8j5Jr8L5N4O3o0m8
$$ 13 32 -26 -22 -14 6 26 -5 -11 -20 2 28 5 30 -12 -35 45 -45 -10 52 15 65 21 -31 -46 32 17 18 -80 -45 9 72 12 -36
2955c6j6P4j8m6L9Pj3J8m2N7K7p3NK2J4q3N8j1j7K8kqL1j3j8M7J7m5K7m7K5L8
$$ -36 -52 22 4 -42 -3 4 -9 9 -33 24 51 -22 -17 5 19 -64 -6 -17 -34 -6 -8 -16 15 2 -16 31 48 3 30 -17 8 46
2987D6j7q6k5N1K9j9N5l0rRm1L7n5M2ll5L8J2q0J30j5k4l6K2LJ2K4k5j9j6L3m2
$$ 46 29 -57 -82 -31 -2 -21 34 4 -5 4 -37 0 -55 -13 -16 -51 -13 -1 -81 49 34 10 -26 -4 -1 11 35 10 -9 -25 8 -34
3019c4M4l3oL6j3k6O4j12Q4J0k9qj3m4N9m7O1o6L7O4K8m9K6l5pk0ln9J10j4kK6
$$ -34 10 -23 -29 7 -6 -32 32 -80 4 14 -15 -23 -36 -80 -21 -68 -7 -73 -36 28 56 7 33 -2 -9 -29 -32 -91 19 5 3 29
3051B9k7N3j00O1L3o3m6M4plN0n6L5Nk8N8o4N2k1J6j1m7M6o7O5r3Q3Ok3M5l9L2
$$ 29 2 55 -45 16 49 -14 -60 -16 -23 -26 24 -32 3 8 -20 38 -26 26 5 21 10 -37 9 -58 7 -86 -3 3 -20 25 -14 18
3083A8l6N9r1L2O9o2K7r4P5l7M9m3Q2%l9K7j7q7l6Q4l0L1n9J8j2P9k0rJ1O9o4
$$ 18 -18 41 -50 -18 51 -11 16 -78 -3 -40 9 -34 48 48 9 36 19 -68 -104 -20 -50 -19 -78 -60 -72 7 -13 -22 -11 58 -6
3114fL2o0N5n3km0oQ6J3n9J5J07m5j3k6M3o7l8J0rL5R1j7q2M1M4K4p3RO4o0Oq6
$$ -6 26 -34 21 -32 -34 -74 -80 6 19 -40 -25 82 37 24 -2 41 -26 -64 -54 -63 -28 63 46 -36 5 49 73 0 9 73 13 19 -67
3147f7O4J3m1K5J8O8m3J6n0mL3p5M5J2l2m8M6N3p0M6Nj6k0j9Q6J9j42J51m6q5
$$ -67 -3 10 -31 -6 12 80 37 53 3 -1 32 -43 2 14 -18 -66 -20 33 -37 9 14 -2 -22 -41 45 64 -78 73 27 -58
3177e8R3n8J0L0k3O6K2n4k2J0O1j15rN2k9q2J17N%k0P1p5koK9n3P2q2L9j5Nk7
$$ -58 35 -23 -13 17 -6 60 82 28 6 16 77 -38 -47 5 -24 -106 11 16 16 -4 67 -8 -10 -16 13 -40 32 -50 -11 -26 -21 -48
3209d8O9NL1J6L8j42M0j4j1nj9M4j4Q3j07L1J2j7j0L3j0l8J02j03N2l5kQO2L0
$$ -48 21 26 57 73 111 -31 9 -5 -16 -21 -40 4 -10 73 -34 -3 9 -8 -18 15 5 -33 69 -34 18 -17 -19 -11 51 81
3239H1l8o1L4Pl0nrl0P4j4l5N1NK8m8M2l3M5j5%o5O4pk4mM4k7JL7%l4K6k3j3L4
$$ 81 43 -18 16 23 -7 -12 -21 -51 23 9 -26 25 30 58 10 52 19 64 49 49 -16 48 41 17 13 57 30 31 68 68 34 60 37 24 58
3274E8q3K4lk4J3O7j9l2N0l3K2J1o1on3N6lK6p5J8P4oJ3j9J0k6L6J1n8K8k6k0
$$ 58 -25 -1 -4 -28 -15 52 33 1 51 18 40 51 -10 -16 -69 -13 -16 10 -65 -47 27 21 34 15 25 -1 35 46 -12 16 -10 -30
3306c0N0L1n4N1J5Mn1K4k2l7o0N6l1Q2k6m3R8m2M2No9%N0k4M0r3J0m3K1P0j9P1
$$ -30 20 51 -3 48 63 67 16 40 18 -19 -79 -23 -54 28 2 -41 57 15 57 62 -7 -7 43 19 59 -34 -24 -67 -46 24 5 76
3338G6k7Km5j4N0o5j3K0l1Ml6Q5M7pq9N9L6lo6kpm9J11q8P3O6o8M4q8O4l6Q1k5
$$ 76 49 51 6 -8 42 -23 -36 -16 -47 -43 -79 6 53 46 -43 16 52 49 -17 -19 -26 -75 36 -52 21 87 19 63 -25 39 3 84 59
3371E9p9O8l6n9ML0l3O0J1J3k9j8J5J2NM4j56J12j01J08J2j5n3M9p1R6k0O6m6
$$ 59 -20 48 12 -47 -43 -13 -46 14 25 38 9 -9 6 18 23 67 -89 23 -78 30 42 27 -26 23 -48 48 28 94 48
3400D8j09P0mn5l1M2M2j2RO0l1n0M4M5k9o4n0L9M6rM6m2j5N9j9lk4L6j2j4m0o
$$ 48 -61 9 5 -50 -81 -39 3 -9 0 60 29 -21 23 68 39 -25 -75 -36 10 1 47 5 -10 49 30 27 3 39 27 13 -27 -33
3432c3L7k6k6P7Lm6L1J8j1k2K1n1M4j11O7k8Q2j10N5L7o5K5N6K7n3N3o2n8R1m4
$$ -33 4 -22 -48 29 32 -14 17 35 24 2 23 -28 16 -95 -28 -56 26 -84 -29 8 -57 -32 24 51 -2 51 -11 -69 22 -22
3462b2L9pn8J08j06J42m5lm8J9m1J0n5O4K3j0l4j01J59kL8JnJ3j14J6rn1M9j2
$$ -22 17 10 -48 60 -46 96 51 48 0 19 -22 -12 -67 -3 20 10 -24 -125 34 32 70 71 66 79 -35 -19 -28 -79 -30 -42
3492d2P7m6N1L2l5r0R5n0L5nn1K5k5K3K2R5j50J14r3K2m7L4Q7j10k6K8N6p9K9
$$ -42 35 -11 40 72 37 -53 42 -8 27 22 -29 -4 -29 -6 16 111 -39 75 -18 4 -43 -9 78 -32 -58 -30 26 -53 -24
3521b4N1k0jk8M7L1m7pm6L9kn5P2qk9O4k1k4P2m4Kj3k7pp1K2K7K7R3n3KkJ16j35
$$ -24 27 7 6 -22 25 56 9 2 -44 -5 -7 -62 10 2 -27 37 16 -8 64 20 22 9 -18 -25 -96 -74 -47 -20 73 20 22 20 136 1
3555AJJ6J4l6J1l2K7m1j2M6O5l4M5j05M0m9J04r6J5J7k8N0p7L8J12q0N7n1K0o5
$$ 1 2 18 32 -4 7 -25 2 -39 -51 -5 60 26 71 -34 6 -43 61 -35 -20 -3 -31 19 -58 -20 92 12 69 18 38 -27
3585b7k1N3o8j7K7J08o6K2J6K6q5N7O7m9j3Om8k1L0lj8j4P5l8kJ9K9l1r9R6jm2
$$ -27 -48 5 -63 -80 -53 55 -11 11 27 53 -32 25 92 43 30 36 -12 -33 -3 -6 -24 -38 37 -1 -3 16 45 14 -85 11 10 -32
3617c2j6Ol2J42p5l8O2k4O9o0J8j5p6M7J5Km0L3NM0k5J1N5o4N8K0m8J5r2L9J1
$$ -32 -48 -42 -74 68 -7 -45 17 -7 62 2 20 5 -71 -24 -9 -7 -47 -14 -9 31 6 17 72 8 66 86 38 53 -39 0 11
3648A1j07J46m2K0J0O8q6LN5n3n6o5J16l8n6O6N3k9J1J1oj9M0p1q9P7m5M2K5j9
$$ 11 -96 50 8 28 38 106 20 23 78 25 -31 -96 20 -18 -74 -8 45 16 27 38 32 13 53 -18 -107 -30 -75 -33 -8 -27
3678b7oL3L5Qm7%K1J6mo8J5l3R2n2L7m0Q1M4r7MPm7K3l0Pj8%M0M2Oll8P2M9j26
$$ -27 -33 0 35 43 -4 -4 17 33 29 -39 -24 -57 35 -17 20 -20 61 105 8 12 19 -28 -5 -35 -28 -46 -46 -6 36 42 39 1 73 122 -4
3713dj3m3K3PPKN8l7j3N0M2k1n4j2j2j1JN0j4m8LM7M7o4J7k9P7l7L3n8l6M6ml8
$$ -4 -17 -60 -37 -30 -23 -21 37 0 -13 37 79 58 4 -8 -20 -31 -30 20 6 -42 -39 8 55 -9 8 -21 56 19 52 -6 -42 4 0 -38
3747c8N5o3N4J1Mj7M3n0k7Qk7POQl9N1Q2m6n4J45n3o5L7p1j2L6j2l7L9m7O7j5
$$ -38 17 -46 8 19 23 6 49 -1 -28 -20 -47 -40 -34 -26 -65 -14 68 22 -32 113 60 -5 32 -39 -51 -15 -27 -64 -25 -72 -5 -20
3779b0L2J5Kll7L3NJ1j09N9M5p0J6J9M3j1k5K1N2j06J7nJ7l3l5nO3J2Q4o8P1l2
$$ -20 12 27 29 26 -11 22 27 38 -71 -12 33 -37 -21 -2 41 30 5 26 78 -28 -11 -16 1 -32 -67 -72 -9 3 87 19 90 58
3811E8r6K5R4l5p3jK6P9p3l2J5K8o7M3K6J0qpm9J6lN7J9n4j4O0Pm1pK9l7k9qm2
$$ 58 -38 -13 81 46 -27 -28 -2 77 4 -28 -13 15 -52 -9 17 27 19 12 -37 -21 -24 33 52 -2 -16 44 51 10 3 32 -5 -34 -42 -84
3845h4O1k8j1J27o9P0j06J10k4j6nj5J2n3J7l2N3r4N4j2Q7M2q3p6M4K9o7P9l7
$$ -84 -23 -51 -62 65 -4 66 -40 70 46 30 25 10 22 -31 -14 -46 7 -87 -33 -45 42 84 1 -75 -31 -2 -69 10 -27
3874b7L5ljl9M6k9K8J1k8Kj4m0O8k6lk5L8pJ7R0l8p9ON1n5m2L0J9m9K6k4J02l8
$$ -27 8 5 4 -35 11 -18 10 21 -7 -5 -19 -59 9 -17 -20 -45 -7 -14 3 93 55 -24 -18 33 -22 -64 -34 -15 -64 -38 -62 40 2
3907BP8l7j7N2o6K5j2k3m9J06j32P2P3j27N3J7J2%M5l0Ql4k0l6P2o8J7L4j0%R9
$$ 2 80 43 26 78 12 37 25 2 -47 59 -73 -1 72 -55 -2 15 27 27 72 42 50 16 -4 -40 32 -36 -19 15 5 5 104
3938A04q5LJ8j0l2m6JJ4n9O1L9J0Ql4K7jl0N9n1Nm9J6N7m6Om1R1Qq4P5L2m2op1
$$ 104 19 22 40 30 -2 -48 -47 -33 -92 -31 8 18 26 -8 19 18 -12 47 -4 1 -48 -32 25 -21 -15 -56 35 43 -41 34 66 24 18 -53
3972e3nk7PM3M2k2M0OP4q9L9o7Oj6K1l2OM2L4l5j5j3N4LOl4O3r9n2N0Om4P4o9
$$ -53 -58 -85 -78 -35 7 -15 25 31 105 16 55 -12 -6 -22 -1 -33 -27 15 49 14 -1 -14 40 43 49 15 78 -21 -73 -23 -17 -61 13 -56
4006e6N0K4NJ4N0q5o7R2n8j2kK7j8O4L4o1M1N2j35R6j15R3j0m5K6np5J4O6P2m6
$$ -56 -6 18 23 37 87 2 -65 27 -31 -43 -45 -18 -36 28 62 1 42 94 -41 55 -60 33 23 -22 4 -1 -76 -62 4 76 30
4037C0M1p2J9J9m9K8k7Pl7L5n7M1L6k6P4r2J19Kj30L4k5JJ2N3m3LNL9M4n1J1o3
$$ 30 71 -1 18 37 -12 16 -11 -4 -41 -6 -63 -22 14 -12 62 -30 89 91 -39 -5 -30 -29 -17 36 -7 -4 1 40 84 33 44 -19
4069a9K8k1n0O1k0j5M9m9M0J5K7l0P0m5l3m4L3kl8L5NN9p2K2mR5p2L5m2%j34J16
$$ -19 9 -12 -62 -1 -21 -36 13 -36 4 19 46 16 86 41 8 -36 -3 -5 -43 -8 -3 56 -16 6 2 97 25 60 18 18 -116 0
4101@n6K8L7n1j2RQ6J0k8m9m0J06j06k1L2J8J4j8oP0k2K9L0k7k0r0O1l0O0j20
$$ 0 -56 -28 9 -42 -54 -45 41 51 23 -26 -66 40 -66 -87 -55 -37 -23 -41 -47 23 1 30 60 33 13 -77 -16 -46 14 -106
4131a06P7J1J0K4O4k4K6m6O2j33P6l8%p7J5N1j4M2L7n9N2j8O8n9k3o2k6J3K9M1
$$ -106 -29 -18 -8 16 80 56 82 36 98 -35 41 3 3 -74 -59 -8 -22 20 57 -2 50 32 100 41 18 -44 -70 -57 -28 13
4161A3ln5N1J6K2J3r8O9o0J8kQ7j29M2K3o6J21n0j8O3l7m7K1K2l2m0MK5rP9p0
$$ 13 10 -45 6 22 44 57 -41 28 -32 -14 -16 71 -58 -16 7 -59 62 12 -6 57 20 -27 -6 16 -16 -56 -52 -27 -36 43 -27
4192b7Q4m0j2RN2q0Nk4J5qk9M6jj4N0L8l0qPn4MP1j04J2pQN5j1L5o0J20j20m0
$$ -27 57 17 5 14 66 -14 -9 -33 -18 -26 -55 -9 -10 -24 26 64 34 26 33 -21 -17 54 -50 -38 -45 -37 18 7 42 -18 102 -18 -58
4225e8J14l7p6J51j72O0l8K8J0j7P5m3pKLk5lK4j4J3L0q9J20k0l1L6MJ2pl1l6
$$ -58 56 19 -57 94 -78 -18 -56 -28 -18 -35 40 -3 -10 -8 -5 -30 -33 -9 -23 -10 20 -69 51 31 0 36 40 52 45 14 -22
4256b2K8k1k7J3P5m4m8P4n7J1L3K5qq1k5K3j7Q4q3O5k4j0J23n7rm2j9M1m5mm1
$$ -22 6 -15 -42 -29 46 2 -46 28 -29 -18 15 40 32 -49 -74 -51 -68 16 -67 -2 -26 -36 87 30 21 -21 -40 1 -44 -48 -89
4287h9KP9J8k0k6Q5o7K0%OK9Jk4l8m7J09l2M0pK1l5j0jk9Qn2J9M2M6r8RK9M7n
$$ -89 -87 -8 10 -10 -36 49 -18 2 2 8 37 38 14 -24 -71 38 6 46 39 60 25 15 14 -15 -7 -59 -40 2 48 -50 -41 -12 35 30
4321C0O7p0L2J6L0j50NL7n0K5J5nM9l5J1J6n4L6ql8n8M2N9RJ1l1j7k3N0P1m9o
$$ 30 97 27 59 75 105 -45 -40 -3 -53 -28 -13 -18 31 -4 7 23 -31 5 -3 -41 -99 -57 2 11 22 -9 -26 -49 1 72 23 17
4353A7Qr2M8M5l1k6nL9M3q3R9k6p5O3K8r4L3n4K0MLllK7%J5jL0l2M3q0N1l4MJ8
$$ 17 25 -67 -19 26 -5 -31 -36 3 46 -37 62 36 -39 24 52 -42 -9 -63 -43 -39 -36 -39 -42 -15 -15 0 -1 29 -3 40 -40 11 -23 -19 -1
4388al1L5L3n4J08k0k7qm8n7J7J8j0J42j63RP0L9m3J6N9q3j4M3q5L6K2j7k0j0
$$ -1 -32 3 36 -18 90 70 43 35 -13 -70 -53 -35 -45 97 -66 -57 13 52 9 25 84 1 -13 30 -55 -19 3 -14 -34 -44
4418d4P8qJ9o3NMk9L3J2K2j08K0J14q7oO9rM9l2pk1qO4m7o8L7k2k2rR1K7L2j13
$$ -44 34 26 45 -18 -13 -9 -38 -5 7 29 -79 -59 55 -32 -38 31 22 71 39 32 11 3 67 20 -48 -11 -33 -55 -64 27 54 86 -27
4451b7J1O4o9J5j9K7k1K4jj1N2n6J9N5k2k1L8l6l1Lq0Q9m6L0k6N7q0P2oJ2j1j5
$$ -27 -16 48 -21 -6 -25 2 -19 5 4 -7 45 -11 8 63 41 20 58 22 -9 -6 -86 3 -43 -13 -39 18 -62 10 4 16 5 -10
4483a0J2j2j9j1O4p3L6NO0K4jj29O7mj3n3R0n4k0rP3Oj0M3m4N6q5K7m5P5q5k5
$$ -10 2 -10 -29 -40 24 -49 -13 -8 52 76 75 -54 13 9 -4 -57 33 -21 -41 -50 23 29 19 62 18 74 -11 16 -29 46 -39 -64
4515f4M0L1L6o0J5j6J14k0j00M3K8n7Jjl3O2n9J6P7n5k5J07p0L9j7k2k9jN3p9
$$ -64 -24 7 43 -17 -2 -18 96 76 -24 19 47 -10 -9 -10 -43 19 -40 -24 53 -2 -27 80 10 49 32 10 -19 -20 33 -46
4545d6Q0j8o5R7Ml9Oj4lK5L1n7n0N5l7K2m3M1J6nk1NJ2m2l3O6M8o3P6j06O2L3
$$ -46 34 16 -49 48 52 13 19 5 2 27 58 1 -49 6 -31 -9 -52 -11 5 0 -21 -16 -4 -46 -79 -13 35 -28 48 -58 4 37
4577C7n9L1qJ5M5k1l2L5m6l0o2J06QJ5n4NO7l0K4n6m2L2K3n4J1K2K7jJ1Pj3N9
$$ 37 -22 9 1 16 61 40 8 43 -3 -33 -95 11 19 34 -20 -15 52 22 46 -10 -52 -20 3 -51 -40 -18 9 8 19 26 13 72
4609G2m3Ln4L3j12R3km8kO3nP8j28J01J4K2j22M6L0p6NK1R4j28qN9MR6j37R1l7
$$ 72 29 32 -22 11 -101 -8 -10 -58 -60 3 -2 76 -52 49 63 85 -37 9 39 -37 -32 -11 83 -45 -53 6 10 106 -31 60 23
4640B3k5l1j6O9l2l0N9RK6Rm1J7q7J8m4J4K0m5M5K9J2K4nrK9L7p5j7K4n2%M1K6
$$ 23 -2 -33 -49 20 -12 -42 17 26 52 61 20 37 -50 -32 -76 -62 -42 -87 -42 -13 -1 23 18 9 38 75 0 -17 7 -45 -45 -4 22
4673B2o4RN3J3k0J1km0L5k9r8M7k7R2k3m4J21m6K1k4K2j7J0j1m8N2l9oL4nj8M9
$$ 22 -42 -33 20 33 13 24 22 -18 17 -12 -110 -63 -90 2 -21 -65 56 10 31 7 29 12 22 11 -37 15 -24 -30 4 -1 -19 30
4705C0j9j8O0ll7J3J6r9M4m1MQkJ07J2k3n9J6m8Ppm2K5L8p2K8O3NJ3M5r1K5K1
$$ 30 11 -7 53 50 13 26 42 -57 -13 -54 -50 -42 -44 63 75 52 -7 9 -39 -32 -39 -81 -56 -18 -90 -62 1 6 19 64 -27 -2 19
4738A9l3ONK5l6L9p3j6N5J5NMm0O5q4k0M7jN0o0RqK7J01r1L3o9L5qm1O0p5N6l0
$$ 19 -14 -8 -3 22 -14 25 -48 -64 -9 6 11 15 -25 40 -44 -64 -17 -18 32 -28 -19 -27 0 101 10 43 -26 9 1 -40 20 -55 1 -29
4772b9l9Q3j1k8L1L1Lq8J7KL1K6r5K1Mn3O5N9J0K1l7J6jj1o6L3l2O5p6J2R3p6
$$ -29 -68 15 4 -24 7 38 41 -47 -30 -28 3 29 -66 -45 -41 -94 -29 30 40 61 24 40 39 28 -38 -5 -37 28 -48 -36 57 -19
4804a9N6M4p1J7ll3K7j6j8k1JK6l5Q9j9N9nk6p2O1j12K5R9m4r9Q3J5nRM6o0J9
$$ -19 37 81 10 27 24 -9 18 2 -16 -37 -36 -10 -45 44 25 84 79 53 -19 42 -70 -45 54 10 -89 -6 9 4 13 59 -1 18
4836A8j6j9J3n1L9m4K1lj9k8P4P1n4L5k3k2O8r5RJ7j8lm2L7K7MO8k3lRo5O3j12
$$ 18 2 -17 -4 -55 -16 -60 -39 -42 -61 -89 -15 56 2 37 14 -8 60 -35 -26 -9 -27 -30 -72 -35 -8 -4 64 41 38 47 -18 45 -67
4869f7PN6n6L9l7N9l6P7J8j39M7N7pr7N2k3O8m9J7pk4K8qJL6j5k7O1p0J9K9o3
$$ -67 -60 -4 -60 -21 -58 1 -35 42 60 -79 -32 25 18 -79 -27 -50 18 -31 -14 -21 -45 -17 -25 -24 12 -3 -30 31 -39 -20 9 -54
4901e4L6L7K4k4L7km4M9j16M8j2JM8On3j9L6PJ6L5l1J7Oo4J5k9n1M2O6o2j2Q9
$$ -54 -18 19 43 19 56 54 10 59 -57 -9 -21 -20 28 34 -19 -38 -2 5 21 56 25 42 48 -16 -1 -30 -81 -39 27 -35 -47 42
4933D2M1l7j0J5k6m5M8m7oj2J7J0k4J4N3j0l1P4K8m4l6o6M5n7N6l2N3L0l0Q0j25
$$ 42 83 46 36 51 25 -20 28 -19 -25 -37 -20 -10 -34 -20 33 23 -8 66 94 50 14 -52 -7 -64 -8 -40 13 43 13 93 -32
4964c2J14o5RK0n0QrJm1nP6mK3J6J0K1o5kn5L5o0O5n0L7olK5J8m4Pj7k6J03j12
$$ -32 82 17 26 46 -4 4 -5 -4 -45 -50 26 22 45 61 71 92 27 25 -30 5 -55 10 -40 -3 -9 -12 13 31 -13 -6 -23 -49 54 -58
4998e8R0l0j13R9k5R6q6R9l5m6K0J1k0k6j5qM1j3m8J42r9L4J4N5p7M8ol8K9n2
$$ -58 32 2 -111 -12 -37 59 -27 72 37 -9 11 22 2 -24 -39 -47 -6 -19 -67 75 -24 10 24 79 2 50 44 6 35 -17
5028a7l0OO0k1L6k1n3O9o8J2O7k3k2m2O5m0J3PjL6L6j5p2l0N2l4M9qr6K4O6k5
$$ -17 -47 -41 19 -2 34 13 -40 29 -39 -27 40 17 -5 -47 18 -22 -9 -2 -3 33 69 54 -18 -48 4 -30 19 11 -85 -61 5 -20
5060b0mK4Q0j14L8M6j04R4q5qj7M9J8J9k0J3Pn3L8P3k7j0n9l5J00l2L2m5RK8m6
$$ -20 -24 0 80 -34 4 50 -54 40 -45 -53 -70 -21 -3 16 -4 9 16 -37 1 74 47 37 -22 -57 43 11 43 -2 7 35 -11
5091a1K4M2p2J10o9l5J9n9L4k2O1m0qJ05j10M5J3K8pl0k7l8M5l8N2j0K1N8q0K8
$$ -11 13 55 -17 93 24 -11 8 -51 -17 -39 22 -18 -26 79 -31 14 27 55 48 18 -9 -47 -2 -40 12 2 23 81 1 29
5121B9l0L1n0J4J9n6l2N6L8J3m1R5o2k7N7MNo8KL4M5n7m2Ll8J23q3K7J4qn7j1
$$ 29 -1 30 -20 -6 13 -43 -75 -19 19 32 -9 86 24 -3 54 58 63 -5 -3 31 76 19 -23 -20 -58 65 -18 9 23 15 -42 -53
5153e3K3kl4O8Qm9R1p6M7n3O7n5O2p7J8L1j7k9nn6J23mo6J10l4k3O1p2RJ4n0O2
$$ -53 -30 -32 -66 2 10 -39 52 -24 23 -30 37 -18 44 -33 -15 16 -1 -30 -35 -91 32 28 -38 72 38 15 76 4 13 27 -23 39
5185C9j14J23m0NoM7ro9J19q5j0K8rl6J1lj5M5L2m7l2L3M2q2O3nk8o7P9o5Q0m2
$$ 39 -75 48 8 13 7 54 45 -24 95 10 0 28 19 -17 -6 -9 -24 21 53 6 -26 7 49 -33 30 25 -3 -70 9 -56 24 -18
5217a8M3KJ0ro7P0K1n6j8L6n3k4N0m5M2K6l6R2m2K4Ql7J2r4O3o6P7M3m4k9O1k4
$$ -18 25 27 37 28 -39 31 52 -4 -22 14 -39 -63 -13 -58 -16 10 -26 66 24 48 56 19 31 -63 0 -66 11 54 10 -19 42 18
5249A8J4n1K3n3K4M8n0J1JJ5K8O8o4K8k8M0L6r5m6M1o7J5J00k7J1l6k9J05l8j0
$$ 18 32 -19 4 -49 -25 23 -27 -16 -15 0 28 96 32 60 32 72 108 13 -33 8 -59 -44 56 29 40 4 -25 80 42 32
5279C2j2J9jn9L1j6J8l5K9o7J08oj6L5n7K8po1L9j6K2j5mPM4j6K5K3p4L7on4K7
$$ 32 20 39 38 -21 10 -6 12 -23 6 -61 47 41 25 60 3 31 24 -37 2 -14 8 -7 -11 -4 40 24 49 72 -2 35 29 -25 2
5312Bl2L2p0Q5m7J8J4PL3n2L5l6K3l7j7J9N3n4Q1o4N6k4%K5Nn8k7M2m7j4L0m6
$$ 2 -30 2 -68 17 -30 -12 2 9 42 -10 25 -11 12 -25 -42 -23 30 -24 57 -7 49 25 25 50 55 -3 -30 12 -35 -49 -19 -65
5344f5K6P5o9J8lQqJ4p9J35o9k7M4Rl4J8L0N9o3k5N1jq9P0Mp9L0N5K8l6k6J2n
$$ -65 -39 36 -33 -15 -18 -10 -18 -4 -83 52 -17 -44 0 9 -25 -7 23 82 19 -6 45 44 -45 25 29 -50 -20 35 63 27 1 13 8
5377Ho1P8j2k0LK2o6j9N8l3K7k0j6P1q0Q4lj8J6r0P4l3Nl9O9l6K5M6k9J5Mo0J1
$$ 8 -53 25 13 -7 -4 18 -48 -67 -9 -42 -15 -35 -51 20 -60 24 21 3 19 -71 3 -30 -25 -64 5 -31 -6 40 11 26 30 -30 -19
5410a9O4m8l1Q9p3L3%l9J6K3oj0L2k1j2Oj4k5L1J3j2O3l2K6qn4kn1O0o2N9m9l6
$$ -19 45 -3 -34 55 -18 15 15 -24 -8 15 9 -1 31 10 -2 4 -10 -35 -4 9 -3 60 28 54 46 -8 -10 -61 -1 -63 -4 -53 -89
5443h9P1oQK9L4j1q4O6J2l7K1n7o1Q8jK0j7N1m8M6oM0p1K4k7o6N5k2N1j0k5J4
$$ -89 -18 -24 -16 13 47 36 -48 18 30 -7 14 -43 -104 -16 -17 3 -14 37 -11 35 29 69 -2 22 -5 -71 -16 -38 13 3 -22 -8
5475hL7n0L3k4j8L7%n4K6nl1M9J6J2l0K1jRJ8Rj8l7n1N9J6n1K3m0R4j2m6L7l1
$$ -8 29 -21 12 -12 -30 7 7 -47 -21 -26 -57 -8 8 20 -10 11 10 19 37 46 28 -9 -60 -1 15 -36 -13 -53 41 29 -17 20 -11
5508a1m4N6m1N1j5J3J6lLm8N9o6N1qpj9M8j15M7K7N1m8L5M3k1n8K8J8l0jk7O3
$$ -11 -55 1 -40 11 -4 9 25 22 25 -23 36 -30 21 13 6 -13 35 -80 -33 -6 45 -3 32 75 54 -4 24 42 12 11 -16 47
5540D7n0K2j8o4N2k0J3L5Pk6k1K0k0R%Ql8%j7P9l6o9J34j05NN5K5l4n0J6PO5q2
$$ 47 -3 19 1 -63 -11 -31 -18 17 24 -2 -23 -3 -23 -14 -14 -6 -44 -44 -61 18 -18 -87 47 -58 -53 2 27 -7 -57 -41 -34 31 -51
5573e1P2J0l1KJ6m7L1J8j2N3l6o1M7mL8j2nkM3p5M4m6J4k4Mmn3R0K2q4R3m0j0
$$ -51 21 31 0 2 18 -29 2 20 8 61 25 -36 11 7 45 33 28 26 69 -6 38 -8 6 -18 -14 -18 -71 19 41 -43 50 10 0
5606@MJ0o0N3j4j5m3jO2OK8pn5P2l2k6K9Nm0K3rl3N5LML1rqk5L3qp2M7K4m4L5
$$ 0 4 14 -46 7 -7 -22 -65 -66 -4 2 30 23 -32 40 8 -18 11 16 -24 -1 -10 -43 12 15 19 50 41 33 8 41 33 -39 8 32 -12 23
5642B3p1K8O4k7l7Q7k6o9O7J0o8k0N5k8J4m4k4P3K9pJ3m4j3M8O9j25l1J08o7l2
$$ 23 -48 -20 44 17 -20 67 41 -28 39 49 -19 -39 16 -12 2 -42 -66 7 36 29 42 -2 -15 33 102 -23 -54 54 -13 -45
5672d5K1m5K6J6MR7p5N3kj02L2K1Njml8N3j0Rj0j3lj8jP0m9J4j3K1QJlL3%m6m
$$ -45 -24 -69 -43 -27 -23 74 -1 52 50 -52 -20 1 6 5 1 -37 16 6 15 5 -8 -11 -29 -30 40 -9 5 -8 13 21 22 19 52 52 6 2
5708BO7pl7j7p2P9j00M1J4J4Q9q6P8j8k2N7j14L6jJq1L9P9o7K2PK0KqPl8LJ2k8
$$ 2 69 62 25 8 -64 15 -85 -44 -30 -16 73 -13 65 47 25 82 -32 4 3 4 -77 -38 41 -26 -4 3 23 25 17 24 -14 -11 1 -27
5742b7L0L7n3L7qL8n1LM7l9p6N4jqNRK4Q4p9l2k4RM9n8n2L5j2N3l6K7M2k7L5N
$$ -27 3 40 -13 24 16 54 3 6 53 14 -62 -8 -9 -17 -12 -3 21 105 26 -6 -30 -21 28 -30 -82 -47 -59 -6 -42 -15 27 0 35 40
5776D0j8K9o3K0k8J6Jk6l1K7J4J9NK1l1J8k%j7r2O2nO9p0l9P0N6k4j1N6j20P5
$$ 40 22 51 -12 8 -20 -4 -3 -29 -60 -33 -19 0 5 26 -5 13 11 11 -6 -98 -36 -41 28 -42 -81 -11 45 21 10 66 -54 21
5808B1Ml5qj4j4L8jj3M8Pj1J1lm5N1n0RK7n2L6n2K8lJ7Q0n5J1nm0j4J1P4j08P
$$ 21 25 -10 -18 -32 -46 -8 -9 -22 26 33 22 33 30 -15 36 -14 -5 22 -30 6 -46 -18 -21 -4 76 21 32 27 -13 -27 -16 58 -50 -43
5842d3K3KO0%q4P4j6q0J13q6N1K7pk1l0Jl6K9K2K0j3JKj8N1m7m0N8K5j06J00J6
$$ -43 -20 -18 42 42 -42 32 16 -64 49 -37 14 41 34 13 -17 -16 -52 -23 -1 19 6 7 9 -9 42 -5 -45 13 38 -68 32 48
5874D8n1M6m7nJ3nl1P1o2J8j1P2l6l7rO2no5N7l4j0%O7K5j08J2L1l1P4o0K4r5
$$ 48 -3 43 -4 -9 4 -1 -32 39 -23 -5 -16 56 20 -17 -26 36 31 -34 23 -11 -21 -21 46 71 -37 -25 6 -25 49 -11 13 -82
5906h2M4L0K0J9q2L7M4o9oN4m6L1O7m1J1M2j07q2J23p2J3P4o7J21j14l7J15q1
$$ -82 -38 -8 12 31 -51 -14 30 -39 -45 9 -37 -6 61 20 31 73 -34 -116 7 -65 -52 22 -45 76 -38 -75 40 -41
5934d1P0Mk1l9km4KP8j7m8N7j9L2L9o2L2n9M3k0pnKL7q5N5J7O5k0m8PJ1O4k3l9
$$ -41 29 33 12 -27 -29 -73 -71 7 -10 -58 -1 -20 12 51 -11 21 -38 5 -15 -22 -27 -25 12 -73 -18 -1 64 44 -4 3 14 78 55 16
5968A6p5N8M3m8j2m7J02k7l6K5L0J6l7pL2Np1l7Q0j9K6oq7Q6j8Lp4O6p1J0J11
$$ 16 -59 -1 42 -6 -18 -65 37 10 -26 -1 29 45 8 1 33 38 -33 -70 10 -9 17 11 -76 10 -8 -5 -79 -13 -84 -74 37
5999C7m9M0r4K1Q0kN0j40jJ33j08j9Q2n8J6mm3P5JO1j06L0mnN2l2KJ0n3l3L7J12
$$ 37 -12 28 -66 -45 35 33 83 -57 -58 75 -33 -52 30 -28 -12 -16 -59 16 17 78 -28 2 -2 -7 45 13 15 25 -28 -61 -24 88
6031H8j10Q0q3K8k3n8N4k4OO0j6j4Q9k3l3l9Mm3K8L1M3m4Rl7j0l5M4O5n8M5QJ4
$$ 88 -22 58 -25 3 -20 -78 -24 -48 -42 18 2 -12 77 54 21 -18 -14 -57 -29 2 45 1 10 -27 -37 -72 -28 37 -21 24 32 46
6063D6p8J8j6L4n0N0jJ2K9K7n5qN4nn2n2O4o0L7K8l0k9M1m8M9L3l0P2r8L4m1J4
$$ 46 -32 -14 -30 4 -46 4 3 15 44 71 16 8 62 57 5 -47 17 -43 -6 22 -8 -37 4 -44 5 38 8 80 -18 16 -25 -11
6095a1m8R7n6m1J8J0M3L3k8N2p3N0lj02P6n4l1P0k5l7N8j8k5L0l0Q6Pp4Q6r4L8
$$ -11 -59 38 -18 -59 -41 -31 12 45 17 69 -4 46 43 -59 17 -37 -68 2 -23 -60 -2 -20 -45 -15 -45 41 48 -26 60 -34 4
6126Dl0J5n8K7P4l1k7M7M4n4p2J05r7PKl1P9N1l5j6N2%n1M1n7jm1M6K8mk5O8J5
$$ 4 -26 -11 -69 -42 32 1 -26 21 65 11 -61 44 -53 -46 -44 -75 4 55 20 4 56 56 5 46 -11 -12 -53 -7 21 17 -8 60 75
6159G5n6J9p5P5n7k2K6J8l0N7j0J0n2R7j69Q3J1J8n1K8m0P5n3m7J5L3K7oPkJ2
$$ 75 19 38 -37 38 -19 -41 -15 3 -27 30 20 30 -22 75 -94 -11 0 18 -33 -5 -45 30 -23 -70 -55 -22 5 -1 6 4 16
6190A6L8j15P3%m9N8m2J9m9O2N0K3j36O9J1kl6J5pQk9o8Q0OL4M8J1j23J4Oj0L3
$$ 16 54 -61 12 12 -37 21 -21 -2 -51 11 61 84 -52 17 28 26 -10 5 -2 6 -23 -91 -11 -5 29 77 88 -35 -21 -15 -25 8
6222HK7no7PM4k9j8M1J5k4pm0J7K6K3j6L5n4j5N6m7J0j1OqJ9L0M0m6j9k0N0l0
$$ 8 35 30 -37 -30 14 -15 -33 8 23 -1 -8 -48 -31 -5 18 2 37 -17 -32 24 -23 -13 -24 -18 -26 -7 23 63 17 -2 -22 28 -2
6255bJ2J5j6jk8J1O1k8l4jRqJ0n6N3j5M4m8j4K5j0NM4L3o3J4n4J5m4J07Jk5R%
$$ -2 10 25 9 8 -20 -9 52 24 -10 -11 -2 -10 0 -56 -3 -18 26 -22 -36 -11 -21 -16 28 61 -2 12 -42 -27 -71 36 37 12 21 21
6289B1m7M3n5O5J4Prm0rL4k8jJ0K1O5j38O7J6j7K5l0k5k6M5mn3K7OJ18r3M3j13
$$ 21 -26 17 -38 27 41 48 39 -1 -10 24 -4 -5 5 26 91 -47 20 36 19 44 14 -11 -37 8 4 -49 -22 -16 102 9 52 -61
6321f1M8N5k6K2ql2RM1r2L0J4m5P0l9k2L7l1L7K4m2o2QN8J0JKM9j8KJ3o5k8L4
$$ -61 -13 42 16 38 30 -2 7 48 -44 -14 0 -45 25 -14 -36 1 -30 7 31 -11 -73 -65 -7 3 4 6 55 37 39 52 -13 -41 -7
6354gK6K2l1l0JmQK0MmJ0O2p2k4M2o5L4J4ON6q7K9n3lL0K0j2KJj1k2lN7k0O0o6
$$ -7 19 41 10 -20 -19 -23 -15 5 9 5 15 77 5 -19 23 -42 -8 6 12 68 -19 10 -43 -46 -16 4 -8 -6 -5 -16 -38 -41 16 -4 56 -10
6390a0k5J2l8QO6j8J7n1J4m7P6K7n1P4p1Q9r0L7j3NM7m1j6o2L9j8N6MM3o6k2l
$$ -10 -35 -23 -61 -53 13 -5 12 -39 -25 -72 4 31 -20 54 -17 72 -18 19 6 11 58 17 1 -61 -22 -40 16 20 63 -3 -25 -28
6422b8L0m2N3K8p7K6O2j03O5o4O0k6Qm6M5O5r9M2o4M5m5J11J0l1j20J64q3j5J8
$$ -28 2 -40 13 41 -36 -10 52 -51 14 -50 10 -16 -8 -54 -9 56 -43 -1 -65 -20 -65 46 56 25 -95 69 -14 -29 -11
6451a1L0j0j6J7m3J01n0l3K5N0k2l5l7R1p9m1K7%J08j50P1P5q5J07q6L1%k2l4
$$ -11 19 9 -7 10 -33 68 18 -15 10 60 38 3 -34 57 -22 -63 -36 -36 72 -78 -7 68 -17 90 4 35 35 13 -21
6480b1J2M1j2l9kJ6k5j7K1K9k3OK5k3J0j3O7k7Kk4P5r7N6o4lK6J2l5L9k7l7P4
$$ -21 -9 32 20 -19 -21 -5 -30 -47 -26 3 -20 -14 11 -12 -2 -15 52 25 27 3 78 -19 37 -27 -30 -4 8 -27 12 -15 -52 22
6512B2K7o7J9L9l7nl4j7KM3J8m9L8j0L3n8Q2k6L5q2K3M4j11L1Q2n2J9QJj8K5n9
$$ 22 49 -18 1 40 3 -2 -36 -53 -51 -8 10 -39 -1 -11 22 -36 46 20 55 -27 -4 40 -71 -40 42 -10 9 17 18 0 25 -34
6544c4N3K6j1l8oJ8o0L5kOk6nL8k2M2J3m6K4K2j7J8k4P2j25M4m6lO8n8R6r7P1
$$ -34 19 45 34 -4 -10 8 -52 -17 -19 -13 -39 -44 -6 -28 14 27 -19 5 27 10 28 4 76 -49 -5 -51 -54 14 -44 52 -45 26
6576B6K5p3L7kl4Qj7j8mO4K4m1l9M0k4N4kl0J38j59O8n9O8l7K7j2Ll2M2L2j04
$$ 26 51 -22 15 13 -21 -13 -30 -48 -52 12 36 -5 -44 -4 -28 26 24 -6 132 -27 41 -18 50 13 40 28 31 -1 41 73 -31
6607c1k4M7loO9q2N1Ko9N2qk5kK0J3k2J4n8M0Kl9OM0%J13j21k5N0RK7l0J7l0l9
$$ -31 -55 -8 -11 -17 52 -30 21 23 -46 6 -2 -27 -29 -9 4 -18 -4 -62 -22 -20 -59 -53 -13 -13 100 -21 -46 4 13 40 10 27 -3 -42
6641d2P0LJ2J3l0j9k9N5k4j1rJ8j7l6O7J1kk5N7p4K5k6O1j19L3J7K7M7j12J35
$$ -42 28 31 43 56 26 7 -22 33 9 -2 -11 7 -10 -46 21 32 30 5 62 -12 13 -13 48 -71 -38 -21 6 53 -59 76
6671G6q6J3l3O4l0J3mo7J2O1l0J9m0L4km2L8l5R6m7l1mj7P5l4%l5N4lk5j0Q2p9
$$ 76 -10 3 -30 34 4 17 13 -54 -42 19 -11 8 -32 2 0 -42 -4 -39 57 10 -21 -25 -42 33 -1 -1 -36 18 15 -10 -20 62 -17
6704a7L5O0q8J8L6lj9r4J03q6M9kJl7M6kK5j5k5J11j44M5l9P7m3J5k8P6j8j7j8
$$ -17 18 78 -10 8 44 41 22 -72 31 -55 -6 -8 -7 -44 2 0 25 10 -15 96 -48 -3 -42 35 -8 7 -21 55 37 20 2
6735Bj4J9j0l3m6J18J2j00O2J15r4n0N8k7Rl2l0L0k2K6K1p4N4k0L4Qn6QL5J8p6
$$ 2 -12 7 -3 -36 -82 36 48 -52 10 125 31 -19 39 12 21 -11 -41 -11 -33 -7 14 -60 -6 -26 8 16 -40 -32 3 21 -55
6766e5N1n1O3k4K1n0N7j8M6q3Q9o9j4Q0n2M7r9N0l4L1J8M1q3Q9l8mJ4o5M4N8k6
$$ -55 -4 -55 8 -16 5 -45 12 -6 40 -43 46 -23 -37 43 -9 38 -61 -11 -45 -14 4 45 -38 51 13 9 23 -42 2 60 34
6797C4qj25J07O3m1J8Jl0m1M0M4n1n8m2Q1L7k2r3J08n7P3o5N1n5L3L2k9j5l1j8
$$ 34 26 -99 8 71 30 48 49 19 -22 18 62 11 -47 -89 -8 29 7 -86 22 -35 38 -27 24 -31 2 34 5 -10 -41 -59
6827e9M9J9K4n8J07r8N5J3l4m1k7M4p9P3J5n4Q5p0J0N8q3M7N2kp8lN7Nm2R0q1
$$ -59 -10 9 33 -25 82 -16 39 52 18 -23 -50 -6 -85 -12 3 -51 34 -36 -26 32 -51 -4 48 46 -32 -35 22 27 -15 75 -6
6858fm2J35q5P0l0rk6Jm8L2oO1o3oJ7j0P9m9J1Qm0O8j00pRj4OL2L9p0O2L6K2j35
$$ -6 -48 87 2 72 42 33 7 8 -40 -8 -14 47 -16 -22 -5 -15 64 15 26 34 -6 62 -38 -45 -36 -50 -44 -12 27 -43 19 55 77 -58
6892e8R0p1QN8M3p3lM8n3M7m0K7K7m5Nj9l6N7K8q4L8K0oJ9L4p9M2J2l7K0JJ3l6
$$ -58 32 -39 -31 27 70 -3 -6 42 -11 36 -4 23 50 5 10 -9 -45 12 40 -44 -6 14 8 27 61 -18 24 36 -1 19 20 33 -3
6925cl5K0L4n2L3M2l3l0j3mJ29j32L0L8qn2L4Lmm0K0L7l1N5o2M8k6j6P1q0N1m9
$$ -3 -38 -18 16 -36 -3 39 6 -24 -37 -41 88 -44 -14 24 16 -36 -2 1 -3 -43 -23 14 -17 38 -24 24 -2 -18 53 -27 24 -25
6957b5q0J07kRQ1o3l1j4M5j7l9R9n2j9l9P4K3l8J3qO3p1J4J6M6r3K4j9j9OL6O
$$ -25 -105 2 0 9 90 27 -4 -18 27 10 -29 70 18 -1 -40 34 57 19 32 24 87 16 30 46 92 -1 23 4 -15 -9 27 33
6989C3J4o9M9m3L6L4q7O0j00M1Pj8O8n1j2O0l0K4J4p9J9L0rL1n1N9lj5j0q0K8
$$ 33 47 -22 27 -16 20 54 -33 27 -73 -32 -25 -43 25 -26 -38 22 -8 16 30 -49 -30 0 -9 22 -29 30 27 12 2 -78 -50
7020e0R8l8j3j4J3o5J25p2K1O4o8O3o4l8J13q5M8kq7J5Oj2K4nqj7R0j10O1L4l8
$$ -50 48 10 -3 -17 -4 -69 56 -16 5 69 1 64 0 -38 75 -10 38 36 -51 -36 -30 -42 -18 -23 -31 -48 42 -68 -7 27 -11
7051a1l8L5L9k9J5k8j7l1L5J15j36j2O9Ll8L0j02M4J8L4M6K4m4m1J03j28O7Oq
$$ -11 -49 -14 25 -4 11 -17 -34 -65 -30 85 -51 -63 6 9 -29 1 -101 -57 -39 -5 41 65 21 -20 83 -45 22 28 20
7080B0n6m8N7M0n9R3l5pMK7J1J0n0jj4K4j3N7j15N3O3j38J05k4L1n1L6o5jj0M0
$$ 20 -36 -84 -27 13 -46 47 12 5 9 36 47 57 7 6 -8 16 3 60 -55 -2 61 -77 28 4 35 -16 20 -45 -46 -56 -16
7111a6J5k6l2K3R0m3j6M8j14J02o3L8jN6q3L6J3j8M5l6J8J4p9RO3l4k0ql9Q7o6
$$ -16 -1 -27 -59 -36 54 11 -5 43 -71 31 -32 6 5 61 -22 14 27 9 54 18 36 50 -29 -20 43 9 -11 -19 -58 29 -37
7142c7M5o9K7J09n3m3L1K6m7NK9Pn4j4m6R0m2LJ9kMmRl0N6l2jK3%oo5P3k0k3m
$$ -37 8 -61 -34 75 22 -21 10 36 -11 -6 23 30 -24 -38 -84 6 -36 -33 -14 -16 -12 -16 -7 -37 19 -13 -14 9 9 3 -62 11 -9 -32 -36
7177c6L4N6nr1k0J4Q0l0l2R1m0Pl1l5jO3L1n5l3m6Q1M2j0k8rk0L6o0J18n6j5M0
$$ -36 -2 54 49 -42 -62 -48 32 2 -30 61 21 28 -3 -38 -39 24 55 0 -33 -79 2 44 34 6 -3 -23 13 -47 71 15 0 40
7209D0m9nl6P1o8N0k0J5M8j01M8nlJ2l1K2K8n0J4M0J9l3J1L3n6Q4m3m3M7r3J05
$$ 40 -9 -14 -50 21 -47 3 -17 -2 46 -55 -7 -12 -15 -3 -34 -12 16 -34 -20 20 39 6 17 50 -6 78 35 -8 39 -54 51
7240E1q5JL7J1o4O0j5Q9p9L6m8J1Nl1J7j1O6n6J0j0J1j8R5j14L8k8m1L5j5K0j4
$$ 51 -34 -33 4 15 -49 11 -4 85 6 42 -6 5 10 -21 -4 -15 51 -5 5 -5 6 -12 83 -31 7 -21 -62 -27 -42 -22 -36
7271c6%N4M5m2n1Q7o1n0O9j1n1L5k9K0j3K5j3Q8n5MJ6j1k7j2mL7k0ol9J50j76
$$ -36 -36 18 63 21 -30 57 -4 -54 15 4 -47 -12 -41 -21 -34 -9 -22 66 11 15 31 20 -7 -19 -23 14 -6 -12 -51 99 -77
7302g7J01j9L4oj7Ln8L6PK3n1lK5M9k3J6kJ8m9J0K9k8m4k4K9L5o4M7K3QJ5o1j5
$$ -77 24 5 39 33 16 19 -39 -3 4 27 -24 -27 -2 47 24 40 38 56 7 17 46 18 -26 -50 -21 14 -50 -3 20 28 43 -18 -33
7335c3N7o0N7nn1j4K8j7pM6J6l0j1n3Q2p6OQ3m5R1q4j5Q0J7m2L0m5j6k4L1L2j0
$$ -33 24 -36 21 16 -35 -49 -21 -38 -45 1 17 -13 -24 -77 5 -71 -65 18 -27 64 -20 -35 45 62 20 50 5 -11 -35 -4 28 18
7367A8m7P5l1L1m5K4J2j5n3J8j6J3L5jn7P3o8L1N8n2lk0okjK6M5j7n6L5Mp1Q2
$$ 18 -29 46 15 46 1 25 37 22 -31 -13 -29 -16 19 18 -39 34 -34 -3 55 3 0 -20 -26 -28 -29 -3 42 25 -31 4 8 -63 19
7400A9n7LKJ1N9m2J5m4P4n8M7j1%MK3l8L5l9K7K7r1N9p9O6k0Jl7Pj6j4J01M9n1
$$ 19 -38 -35 -33 -22 37 -5 10 -34 40 -18 29 18 18 22 45 7 42 3 30 57 -34 25 -54 12 -8 -7 -44 -37 -53 -67 34 83 32
7433C2nq2L6M8q0O9m6M4n8K6QN0j7p1j9L7J8K1Lk3%J3QjM7jj02M3RJ7J3j6j7j1
$$ 32 27 -55 -19 29 -51 18 -28 16 -42 -16 -8 42 25 -46 -65 -28 -10 11 14 -9 -9 4 12 11 58 57 -45 -2 7 24 37 21 4 -7
7467gJ2k3M3Mm0J1j1PJ5LJ9o0K3qPlL7m8K7L2J6q5O2j5J7m0J8K2q9M2O1m3j5K5
$$ -7 5 -18 25 29 -11 0 -11 -4 11 14 33 -27 -4 -12 -5 -8 29 -19 8 40 56 -29 33 18 35 -5 13 35 -54 -12 49 6 -9 16
7501A6J46j46K3m2j8PL0K9j3p2O7k9j0Pj9nJ03p4MP6p1k4M4j1O8r4J4m8O8K7n8
$$ 16 162 16 39 -3 -21 -14 16 45 32 -40 27 -2 -12 -5 -24 -29 74 0 4 80 9 -15 29 18 86 -8 6 -42 26 53 -5
7532eP6p8l4RJ03n9L4j02P0Nl6N6p9PK5k2J0O0p4L5n9M5NOL9m6n4j7O4k9J40q5
$$ -5 71 -7 -41 -32 71 12 46 -56 14 19 -17 39 -40 -33 -8 -30 -20 40 -34 1 -58 -13 -8 -2 37 -9 -63 -80 -16 -45 95 10
7564A0k9M5j4po6L3j7Q2l5j1rL7MK1m0l2M9rp6L9Jj9P8L8m2m1L4j04J15k0p8N2
$$ 10 -19 26 12 5 -61 -28 -45 37 2 -9 -18 19 23 44 4 -28 21 12 -64 -25 -24 -43 35 73 31 -10 24 -80 35 15 -63 -11
7596a1Nnk4K2M8l8j3qJ8J7l8O6o4L4o7P6q0M1N5m1P8r8j1J08j11L8L2l7Ql0j8
$$ -11 -6 -11 -35 -13 35 -3 -16 -24 -6 11 -27 39 -25 9 -58 18 -62 -21 34 -7 71 -27 -38 70 -41 -3 29 -8 0 -30 -48
7627d8N4o4Q4k1L9k6nj4L0Lk6Jk7N3r6O4K7pm2L4l4QK7L1q6P2m8N4o3QL8J4o5
$$ -48 6 -58 26 5 44 18 13 -1 29 32 6 7 -20 33 -63 1 28 21 -21 13 -21 -13 14 45 -41 31 -17 37 -26 -18 20 34 -31
7660c1M1k9N4l3k8j3M4j8j0L5Kp8Q5l5L8p2Q1Pj1l1K1J2q3P6j8l7J6K1L8Np2O
$$ -31 10 -19 35 2 -26 -39 5 -13 -23 12 14 -64 21 -14 24 -48 33 40 29 -2 19 31 -52 24 6 -31 -15 6 44 49 -23 -17
7692a7OJ6kM9k2n8N9Rp6P8n1N3Mo1J1kJ6k9n4P6KJ4l4O0K7m8k1k2L4r4R7o9O2
$$ -17 -11 5 3 52 30 -28 31 40 -36 42 -9 44 48 -13 -2 -4 12 -17 -71 5 7 21 -13 47 74 26 5 -17 17 -77 20 -49 13
7725A3k3j1QoPP1k1OJm7M2q4JN7k9J8J2k9O5n5L9q2J1L6k6M6k0p7P0L3k3k8N4
$$ 13 -10 -21 -13 -19 -12 59 38 44 45 -2 40 -44 -43 14 -15 3 15 -14 51 -4 35 -47 -36 0 -26 20 0 -77 -7 26 3 -25 29
7758B9p6J11j19J17m0k5k4k4N7l4L7j6NJ2n9K6M0OK9m1nRmmj32J43J9j01J18p6
$$ 29 -47 64 -55 62 22 -3 -27 -51 6 -28 9 -7 -2 10 -49 -23 17 23 52 11 6 15 11 7 -125 18 37 -64 54 -22
7788b2k0O2K6k9k0J2l3N8q2L4L9L2p5P7k5PPn0J2l1lQ5l7k6J5j3J5l6K2QL4q1
$$ -22 -42 20 46 17 -3 9 -24 34 -48 -14 25 57 -18 59 34 41 48 -2 10 -21 -24 61 24 -2 13 0 15 -21 1 9 43 -38
7820c8j8P3k2K1n4O8j7j4jnj2M5lPmj8K4r5O6k7O2j2p3L0JKk6N5K7J0m2n6m0Q3
$$ -38 -56 17 -5 16 -38 30 13 -1 -2 -7 -19 26 23 30 26 8 32 -63 3 -24 38 26 -47 -17 -16 -14 -40 15 42 52 10 -46 -86 -3
7854co9R8J5m6K2l4j5Q3qrL1m2ol9kO1j4n5Q2l9OP9q8J7o0J8ok6N4k2O5m7l6M3
$$ -3 -72 26 41 -5 17 -17 -32 51 43 34 65 23 17 -22 -24 37 23 -32 50 11 17 96 8 25 -35 -17 -23 -49 5 -17 48 1 -35 8
7888HL1m7J8j16J57p9pPP7j3rl9ML5j9mN7n9q5J13n8l0O7M6n2J1k9O6k0rl2KL1
$$ 8 39 -8 10 -106 51 -28 -35 -28 49 36 27 -12 -8 27 8 4 61 2 -83 30 -28 -58 9 55 3 14 -15 51 31 22 -10 -8 23
7921B3o7N1Nn4K0NL5L3k8k0J2J2l9K7J9j1o3K7Jk0M1j5J3L5n1Rj2k0Kp2J41o6
$$ 23 -44 7 12 -42 -22 -17 18 51 23 3 15 27 -12 15 34 23 -40 -13 -12 -32 9 -6 7 42 -9 0 -12 -32 -30 -102 39 -27
7953b7P7l4n4L8l5R6L8r6J3m2J9j5L8M6n1q8R1mqnj5Q9l5k6Ko6Q9k6J7Lp6J05
$$ -27 50 16 -38 0 -35 61 99 3 16 -26 -7 -22 16 62 11 -77 14 10 2 -3 -18 71 36 10 12 -54 35 9 26 29 -47 58
7985E8n1M0k9o3J8O3k3n1JN4r0j1N4J6J3ll0K1N7m5l0J9Rl6J5Q7n1m0Q2r1j2R4
$$ 58 7 47 18 -45 -27 36 13 -38 -37 17 -73 -84 -30 -14 -1 -4 -34 -13 44 -1 -31 -12 -3 -39 -24 63 12 -28 54 -37 -49 45
8017D5k8j00N6ML9n1NQO3k2k9M7K2k9L0n7n9M3K5L2j21O4K3J5k2j00J17k1K8L3
$$ 45 17 -83 -27 -23 16 -35 -30 -22 41 19 -10 37 59 30 60 3 -56 -13 12 44 -77 -13 10 25 3 -97 20 -1 27 60
8047F0o5J3k7OJ3Qj2j1J1k5P6n5K0Ml9m3Q0%r4JJ08j7j06R9p7O1O5L1p4l5K8m3
$$ 60 -5 8 -19 -13 0 8 -4 -15 -4 -29 47 -8 12 16 -23 -66 14 14 -80 -79 29 12 -94 5 -72 -11 54 85 11 -24 4 -39
8079c9P6%k6n2K6N4j8o4kO0J7Mk5M5q2k1L3JOPJ0j24R0K7l4L7K3m3pqk4N7m6j0
$$ -39 37 37 11 -41 -15 39 21 -43 -45 15 32 36 11 56 -26 -47 -14 -13 -7 0 10 -114 -24 3 -31 6 29 -14 -21 -29 -53 4 -42 -52
8113e2O0j9O5l0%l3j5mj5M2l1k8N6O7n0l5L4J3r4N0M5l6%NL3Jo4M9mj5QN2o0K0
$$ -52 8 -11 54 24 24 -9 -24 -28 -43 -1 -32 -60 -4 63 13 -22 12 25 -69 -19 26 -10 -10 -5 28 29 -35 14 10 -5 3 55 -5 15
8147A5j5J0K3k4J6n9J3O8qn7K1j5rJ1k6K0mL3r1Q3j6p1K6K1J23j08k6J12n4k4
$$ 15 0 10 33 9 25 -34 -21 47 39 -18 3 -12 -21 -10 -36 -16 -20 13 -78 5 -11 -82 -56 -35 88 -20 -46 66 12 -12
8177a2K1l5NL9m7J1L6m6J9M5j9Rk6n1
$$ -12 9 -26 -21 18 -29 -18 18 -28 -9 36 17 26 0 -51
8191e1
$$ Imaginary data points
##PAGE= N=2
##DATA TABLE= (X++(I..I)), XYDATA
0@%%%%%%%%%%%%qJ6j6J6j6J6k4L2l2M0m8N1n9O8p6Q8j04J16j27J43j61J81k01
$$ 0 0 0 0 0 0 0 0 0 0 0 0 0 -8 8 -8 8 -8 8 -16 16 -16 24 -24 27 -32 36 -40 48 -56 60 -67 76 -85 96 -105
35a05K23k49K76l06L40l76M16m62N12n68O30o99P77q67R74j101J251j435J669
$$ -105 118 -131 145 -161 179 -197 219 -243 269 -299 331 -368 409 -458 516 -585 666 -769 900
54I00j973K387k992L953n709R913l5767l4703J02171j0805p2208L1278O1000l7081
$$ 900 -1073 1314 -1678 2275 -3434 6479 -29288 -63991 38180 27375 -44833 -13555 47445 10364
68A0364l7452J8635J4618n547K370o806L297J7511j3952l2461J6003K9524j5463
$$ 10364 -27088 -8453 6165 618 2988 -3818 -521 16990 3038 -29423 -13420 16104 641
81F41j6231K7592J1003k9273q265J8863l370j0511Q914O986k956k044r875n185
$$ 641 -15590 12002 23005 -6268 -14533 4330 960 -9551 -637 6349 3393 1349 -8526 -13711
95a3711J8391O169k1677P029K8582j6991k7853J7369R404j8975P399J6783j4256
$$ -13711 4680 10849 -10828 -3799 24783 7792 -20061 -2692 6712 -12263 -4864 11919 -2337
108b337m540J6365q644j3514J4877M953r814R946J011k0121N567J5041j7398o970
$$ -2337 -6877 9488 844 -12670 2207 7160 -2654 7292 8303 -11818 -6251 8790 -8608 -15578
122a5578K6790J244k4125J1579J7693k5117j0965L2034J543l1905R043K6979j9225
$$ -15578 11212 12456 -11669 -90 17603 -7514 -18479 13555 15098 -16807 -7764 19215 -10
135a0k2324K1511J2580j6746K455J3240q741n033P365o728n970J1637J116j0743
$$ -10 -22334 -823 11757 -4989 -2534 10706 1965 -3068 4297 -2431 -8401 3236 4352 -6391
149f391N191O779r963j735J0119j345k980M667j760k837K499o200n398J1350M628
$$ -6391 -1200 5579 -4384 -6119 4000 2655 -325 4342 2582 -255 2244 -3956 -9354 1996 6624
164F624j3396P95J5978m454j4980O420J1816n525o719L714K151l122j770j823
$$ 6624 -6772 -5977 10001 5547 -9433 -3013 8803 3278 -3441 273 2424 -698 -2468 -4291
178d291J46O499J763o370K273O835n946n887P017K094p465J270M903m242j476
$$ -4291 -4145 2354 4117 -2253 20 6855 909 -4978 2039 4133 -3332 -2062 2841 -1401 -2877
193b877L188l839J747J0742n250j1741J0822J0057j6744r125J7031M896j5607
$$ -2877 311 -3528 -1781 8961 3711 -8030 2792 12849 -3895 -13020 4011 8907 -6700
206f700l79J2869j920q753L068O454j257l727K41K897j76n334k674N401L199n306
$$ -6700 -7079 5790 3870 -4883 -1815 4639 3382 -345 -104 2793 2617 -2717 -5391 10 3209 -2097
222b097j631O732J808n659j035M154N21k052j104r97J347J284m290j866O826K267
$$ -2097 -3728 3004 4812 -847 -1882 2272 2793 741 -363 -1360 -13 1271 -3019 -4885 1941 4208
238D208o629J158P502l402o949M405M091o059k420N124R22m275p53L379K229r92
$$ 4208 -2421 -1263 6239 2837 -4112 293 4384 -1675 -4095 1029 1951 -2324 -3077 302 2531 1539
254A539k460J366M164k516n931K333M418m485l039N777J496n719J398O021k671
$$ 1539 -921 445 4609 2093 -3838 -1505 2913 -1572 -4611 1166 2662 -3057 -1659 4362 1691
269A691m467M098K891m272k253K039m2j388M47J93L70K191Q2j959J237J390k148
$$ 1691 -2776 1322 4213 -59 -2312 -273 -315 -1703 -1256 -1063 -693 1498 1580 -379 858 2248 100
286A00p87J570q23k093Q03J121j112k57J663P06O86J25k044M61K482k546l718
$$ 100 -687 883 60 -2033 -1230 -109 -1221 -1478 185 891 1577 1702 -342 119 2601 55 -3663
303c663L023K912m124j990M956R37m016J623L565j853j922J281M43j923j061N93
$$ -3663 -640 2272 -1852 -3842 1114 2051 -1965 -342 3223 1370 -552 729 1172 -751 -1812 -1219
319a219O75L17p49k15K386P95k353K07K334q17k289K77Q03j445p08J574k06n28
$$ -1219 -544 -227 -976 -1191 1195 1990 -363 -156 2178 1361 -928 -651 152 -1293 -2001 -427 -633 -1161
337a161J980P12j407N78R78j436r94J386p68k215J341J643k156l67K815M26j202
$$ -1161 819 1531 124 702 1680 244 -750 636 -132 -2347 -1006 637 -1519 -1886 929 1355 153
354A53M67O02l55n43q34o19N30J52j350O12J697r43l77K222K70j821J89J489j082
$$ 153 620 1222 867 324 -510 -1129 -599 -447 -1797 -1185 512 -431 -808 1414 1684 -137 52 1541 459
373D59k247N16J169j067k82R94M02L12N21Pl70L67J73j328m93P52r29p65J248
$$ 459 -1788 -1272 -103 -1170 -1452 -458 -56 256 777 784 414 781 954 -374 -867 -115 -1044 -1809 -561
392e61J42n69J095R70l08j92J72k62m59O3j020o88J358j75j267J137J329l28k39
$$ -561 -419 -988 107 1077 769 577 749 487 28 91 -929 -1617 -259 -434 -1701 -564 765 437 198
411A98O95M48j008m88M00p70p88M15L06l8q6P02P45M7j3n3o7J97q65q86M59r5
$$ 198 893 1341 333 -155 245 -525 -1313 -898 -592 -630 -716 -14 731 778 765 712 645 842 -23 -909 -450 -545
433e45p45M97P83l5J81Q81J48p05K90J50r92j59m3p07J90N36l08K57Q05N70m8
$$ -545 -1290 -793 -10 -45 136 1017 1165 460 750 900 -92 -251 -294 -1001 -811 -275 -583 -326 479 1049 1001
454A001l76K17J04n74p74l06L30k3n14L49P24K96J12Q4N73M7j068J2L26p71r88
$$ 1001 625 842 946 372 -402 -708 -378 -401 -915 -566 158 454 566 650 1223 1270 202 214 540 -231 -1219
475a219M90O27l49q6P90N91L06k32o00M45L07j178p79N53P7o89J31P52M48k6R9
$$ -1219 -729 -102 -451 -537 253 844 1150 918 318 763 1070 -108 -887 -334 -257 -946 -815 -63 385 359 458
496D58M87K44n02q02K72J70j091m71P22L77k89j06Q45Q38l16o32N93J11q47p14
$$ 458 945 1189 687 -115 157 327 -764 -1235 -513 -136 -425 -531 314 1152 836 204 797 908 61 -653
516f53K75k8m47J17J96M53N03j14Q0O09q6o75r5l4o57p4l4l40M28P51k58NJ068
$$ -653 -378 -406 -853 -736 -540 -87 416 302 382 991 905 230 135 101 -556 -630 -664 -1004 -576 175 -83 -78 990
539I90J21q56j25M67k62j024o29O99O65q50l99J380R49p40l77O94L17n46r49k51
$$ 990 1111 255 130 597 335 -689 -1318 -619 46 -804 -1203 177 1126 386 9 703 1020 474 -475 -726
559g26O85k68j194L62J685k80j075R57J510n03j496L7J130k14k050k88J979j8
$$ -726 -41 -309 -1503 -1141 544 264 -811 146 1656 1153 -343 -306 824 610 -1440 -1728 251 233
577B33j707O97J874l48q88N72O17l43q55n20L26M59r54p77J366Q26p06r3R50L29
$$ 233 -1474 -777 1097 749 -139 433 1050 707 -148 -668 -342 117 -837 -1614 -248 578 -128 -221 729 1058
597A058m91m57P1j03n14l76J42J35j67L55N30n0N35M26r91q3J092p25j703M74
$$ 1058 567 110 181 78 -436 -812 -670 -535 -702 -347 183 133 668 1094 103 20 1112 387 -1316 -842
617h42J057o68p32P33P92k4j5J46L08L0p88k38L70m13o18j97N26R42m38r38J270
$$ -842 215 -453 -1185 -452 340 316 301 447 755 785 -3 -241 129 -284 -902 -1099 -573 369 -69 -1007 263
638B63J835j423j906J716J436k596j429K185M53j825j84J821Q47j385l78J697
$$ 263 2098 675 -1231 485 1921 -675 -2104 81 534 -1291 -1475 346 1193 -192 -570 1127
654A127N63j639r64J027O66j467r56Q39J123l1j068L60J947k97j897O88J499j377
$$ 1127 1690 51 -913 114 780 -687 -1643 -804 319 288 -780 -420 1527 1230 -667 21 1520 143
672A43j605R02R99j041q23J151R65k11n51K74P78m5q82k39o3n0km97m0Q77O1l04
$$ 143 -1462 -560 439 -602 -1425 -274 691 480 -71 203 981 936 54 -185 -248 -298 -300 -797 -837 40 101 -203
694b03O08P54q04l99R25l62j215L74K6n92M50O72o48j96J459O53j441l81J341
$$ -203 405 1159 355 -44 881 519 -696 -322 -296 -888 -438 234 -414 -610 849 1502 61 -320 1021
713A021P9j656n64J174K44j482J78J738k82r53Q12R58l26r74l56P33J60j056p50
$$ 1021 1100 -556 -1120 54 298 -1184 -1006 732 450 -503 309 1267 941 -33 -389 344 504 -552 -1302
732a302P88J016o81m89J002O15l11m57K40M55q60j038P61P48j193p26J446Q48
$$ -1302 -514 502 -179 -668 334 949 638 181 421 876 16 -1022 -261 487 -706 -1432 14 862
750H62q62k44Q64J98j76m44m06J87J23p70j69P65K7o01M68J276l29r89M28Q38
$$ 862 0 -244 620 818 642 198 -208 -21 102 -668 -837 -72 -45 -646 -178 1098 769 -220 208 1046
770A046n88j161K75N02n81j73O54k24p5J053Q3q06M17M47q07m34M47k22p83K18
$$ 1046 458 -703 -428 74 -507 -680 -26 -250 -325 728 811 5 422 869 62 -372 75 -147 -930 -712
790g12O54R5k36p1Q32O35r02n62P69j7r37k11L67l6q3O5K72L57J47k66J72N11
$$ -712 -58 37 -199 -270 562 1197 295 -267 502 485 -452 -663 -296 -332 -415 -350 -78 279 426 160 332 843
812H43n21q35K16M23k98p43J09R39K02o65L27Q50j71o37L08J8n71j53m1j76L56
$$ 843 322 -513 -297 126 -172 -915 -806 133 335 -330 -3 847 676 39 347 365 -206 -359 -400 -576 -220
833b20j09l37R22N83q55m4J083m45r86L13K07p19k5M32j23p5L68M15J14k06j13
$$ -220 -329 -666 256 839 -16 -60 1023 578 -408 -95 112 -607 -632 -200 -323 -398 -30 385 499 293 180
854A80L89l09m69l3O7l28j20L52R3k0K29L11J88m7m24R8J61n26l86K97rk82M82
$$ 180 569 260 -209 -242 -175 -503 -623 -271 -178 -198 31 342 530 483 59 157 318 -208 -594 -297 -306 -588 -106
877a06J14j69N21K84m80K13J72p52j67N21m43n52M28M51j99P3K69K14J42j59l40
$$ -106 8 -161 360 644 164 377 549 -203 -370 151 -292 -844 -416 35 -164 -91 178 392 534 375 35
898C5K66j45o05m6L58j77l45M39M98O1l24L11L98l34n70J34J46n54j15L27j7j78
$$ 35 301 156 -449 -495 -137 -314 -659 -220 278 339 15 326 724 390 -180 -46 100 -454 -569 -242 -259 -437
920d37N23Q3K4K83k2l25J99j42m66j19J91j65q9L07M5J73L79p4j16K72j91m89
$$ -437 86 169 193 476 454 129 328 186 -280 -399 -208 -373 -462 -155 -110 63 442 368 252 524 333 -156
942a56J08P6l95k26L76K17k04J13M29P1j09K9O7k46k85N0j58j71J03J25rL50O8
$$ -156 -48 28 -367 -593 -217 0 -204 -91 338 409 300 329 396 150 -135 -85 -243 -414 -311 -186 -195 155 223
965B23m9J93J54k61k12O4r6m66J28Q0k00K06M12j12J64L01j81j76Q9j36m08n5
$$ 223 174 367 521 260 48 112 16 -450 -322 -242 -442 -236 176 64 228 529 348 172 261 125 -283 -338
987c38K26k05j71L35K03Q3K5J65J88j78k23J41k63l33j2j1J93k6n9L77K39p3m4
$$ -338 -112 -317 -488 -153 50 133 158 323 511 333 110 251 -12 -345 -357 -368 -175 -201 -260 117 356 283 239
1010B39K04q4k99j53J2k19j39K40pQK34J79J32oP1k25r8m2k45j51N5Q4j34J77
$$ 239 443 359 60 -93 -81 -300 -439 -199 -206 -198 36 215 347 341 412 187 89 47 -198 -349 -294 -210 -344 -167
1034a67K05J29J09j4R7j40l8j47j95k1k6j81M2L55o0M2K05K50j26j34Q6j95k37
$$ -167 38 167 276 262 359 219 181 34 -161 -182 -208 -389 -347 8 -52 -10 195 445 319 185 271 76 -161
1057a61On8j11J7J07J32J34J28J39Jr0M1k54j25l1k35K9k0J42J01J22J48O5M3
$$ -161 -155 -213 -324 -307 -200 -68 66 194 333 334 244 285 31 -94 -125 -360 -331 -351 -209 -108 14 162 227 270
1081B70J19j90j31n2k06j20j3J12njJ34L28n2P3J04j53q9m1k78on5p2M1J25J05
$$ 270 389 199 68 16 -190 -310 -323 -211 -216 -217 -83 245 193 266 370 217 128 87 -191 -197 -252 -324 -283 -158 -53
1106e3J44N0J05M0p0l9k28k4l9k26K2O4Q3J17N8K64J6o6M4Qj82k16r0j6j00L7
$$ -53 91 141 246 286 216 177 -51 -75 -114 -340 -318 -254 -171 -54 4 268 284 218 262 270 88 -128 -218 -234 -334 -297
1132b97L3O8J86J53JR3J5j23q3q2p9p9j15NJ02J01O2J15J75P9j00q7N0j33j70
$$ -297 -264 -196 -10 143 144 237 252 129 46 -36 -115 -194 -309 -304 -202 -101 -39 76 251 330 230 143 193 60 -110
1157a10j93L1N7l2kK78J28r7J94O3m4j18k10Oj4j87j05Q0J96K6L7K45P9o0m7q5
$$ -110 -303 -272 -215 -247 -249 29 157 60 254 317 273 155 -55 -49 -63 -250 -355 -275 -79 -53 -16 229 308 248 201 116
1183A16l0q8k29o7Q3j0L0O9K00J47L7k8P0l4j23k74P6q1j55mK15k4J47J8R3J16
$$ 116 86 -2 -231 -298 -215 -225 -195 -126 74 221 258 230 300 266 143 -131 -55 -136 -291 -295 -80 -104 43 61 154 270
1209B70K5j17r2K2j82k02Q0q6J06Q1N4O5K13N1k19J37J18l48j34J21j15r4M4J8
$$ 270 295 178 86 108 -74 -276 -196 -282 -176 -95 -41 24 237 288 69 206 324 -24 -158 -37 -152 -246 -202 -184
1233a84K68pMO4K28p5k56K2j91L0k9j65O3J31pJ5K80J46k60Q1Q1o8k87Kk9j4l8
$$ -184 84 77 81 145 373 298 42 64 -127 -97 -126 -291 -228 -97 -104 -89 191 337 77 158 239 171 -116 -114 -143 -157 -195
1260a95k9Q5K95o5qK40m1j36L3j25j89k0o8o4J78P3r9K34K31j67p4R1k5j16j8
$$ -195 -224 -139 156 91 83 323 282 146 179 54 -135 -155 -223 -287 -109 -36 -135 99 330 163 89 180 155 39 21
1285B1k29n0R8o4Q2J13P4R2J16r1n2M5j68p3M5m0k97M9M07r7q0J57J17J20q4j12
$$ 21 -208 -258 -160 -224 -142 -29 45 137 253 162 110 155 -13 -86 -41 -81 -378 -329 78 -19 -99 58 175 295 211 99
1311I9r9M3j47j33N8P7j22N8K09O6J36r9k8J64j38l38P3J88l59n3K36K6N8R2R7
$$ 99 0 43 -104 -237 -179 -102 -224 -166 43 109 245 146 118 282 144 -194 -121 67 -292 -345 -109 -83 -25 67 164
1336A64j9Q7p0j71N7j50j48M4R8l2m3O2J80K13q5q1J11M7k93q0K9j46n8K49n5
$$ 164 145 232 162 -9 48 -102 -250 -206 -108 -140 -183 -121 59 272 187 106 217 264 -29 -109 -80 -226 -284 -35 -90
1361i0p6K07J08q7J10K3j82N6j24j01k1L3j08J72Q4p6P0L27r6r1J28j66j21L7
$$ -90 -166 41 149 62 172 195 13 69 -55 -156 -177 -144 -252 -80 4 -72 -2 325 229 138 266 100 -21 16
1385A6j78q3P2Q8j17K10J44j25Q3J32p5j35L3j32NK5k60N2K75n7%K27ro4M8m2
$$ 16 -162 -245 -173 -85 -202 8 152 27 110 242 167 32 65 -67 -62 -37 -297 -245 30 -27 -27 200 191 127 175 133
1411A33j41o5k7q9J43p6j45J64K96j40M4J06n0m1j3j49o3j1m0MJ24K8j08K07K07
$$ 133 -8 -73 -100 -189 -46 -122 -267 -103 193 53 97 203 153 112 99 -50 -113 -124 -164 -160 -36 -8 -116 91 298
1436B98k16M3J16k17KJ7k70M2J25p9J22O6J5J7J63m6r7M0j70r3M7n2j22J06J22
$$ 298 82 125 241 24 26 43 -227 -185 -60 -139 -17 49 64 81 244 198 101 141 -29 -122 -75 -127 -249 -143 -21
1461b1p7J66N2k6J06J0j34j54J62k05j16J40q4j2J85Q0q3J10J05o9N1n8j79r1
$$ -21 -98 68 120 94 200 210 76 -78 84 -121 -237 -97 -181 -193 -8 72 -11 99 204 135 186 128 -51 -142
1485a42J47j54j16J66K9P3R9J9KN9o6m5j8o9j27K6N3n7M9N5R3L1J01j78J9O6j97
$$ -142 5 -149 -265 -99 -70 3 102 121 123 182 116 71 53 -16 -143 -117 -64 -121 -72 -17 76 107 208 30 49 115 -82
1512h2R1p3r1O1K5p0P7J58o2P0J57j37l8m2K1k22J7M7n3L7J38nkQ5K8L6o5m8j04
$$ -82 9 -64 -155 -94 -69 -139 -62 96 34 104 261 124 86 44 65 -157 -140 -93 -146 -109 29 24 22 107 135 171 106 58 -46
1541d6k4O3j55K2K8O7J30l4M1O5L2j37J3J1j79N3k7o0k8J63o8J12J23l4M0O0j35
$$ -46 -70 -7 -162 -140 -112 -45 85 51 92 157 189 52 65 76 -103 -50 -77 -137 -165 -2 -70 42 165 131 171 231 96
1568I6q1o2k6j45R6O5l6j3J83k9J27pm9J3j12p6p1lL5O4J5m8P5R2J9pNo9l8kp3
$$ 96 15 -47 -73 -218 -122 -57 -93 -106 77 48 175 168 119 132 20 -56 -127 -130 -95 -31 -16 -64 11 103 122 115 120 51 13 11 -62
1599f2n5j48J52K3J2R8JM9J34m2j13O0j48r8R8r6m8R0K0NK8J35N8p0Q8k11N9J
$$ -62 -117 -265 -113 -90 -78 20 21 70 204 162 49 109 -39 -137 -39 -135 -183 -93 -73 -68 -40 95 153 83 171 -40 19 20
1627B0j34J6l9k0M2R3J4N5O6L1Mn5j54Q2k0j21l0L1N0K0L1Q3m3K0LJ3mL8j18p2
$$ 20 -114 -98 -137 -157 -115 -22 -8 47 113 144 148 93 -61 21 1 -120 -150 -119 -69 -49 -18 65 22 42 45 58 54 92 -26 -98
1657i8K3r7P9N2M4N8N4Km2Olo0q4J2p4mP7mP7N2J9Qj0J0k7q8n4Jp7L8m0J02rQ0
$$ -98 -75 -172 -93 -41 3 61 115 117 75 81 78 18 -66 -54 -128 -132 -55 -59 18 70 89 97 87 97 70 -18 -72 -71 -148 -110 -150 -48 -57 23
1691B3J15L3r9L9q4k9P6j28rl5K9J3j4Q4N6o9Q1L6n8rn5j8k1o2lP5P5p3qJ09L3
$$ 23 138 171 72 111 27 -2 74 -54 -63 -98 -69 -56 -70 14 70 1 82 118 60 51 -4 -22 -43 -105 -108 -33 42 -31 -39 70 103
1722A03l6K9o2j1k5p2k1J0o2J03J9L4N6K8m9oRM3j68lJ7q2M9L4K3R1pL0N0l8J4
$$ 103 67 96 34 23 -2 -74 -95 -85 -147 -44 -25 9 65 93 44 38 47 90 -78 -81 -64 -146 -97 -63 -40 51 44 74 124 86 100
1753A00r0J1l0n6%M1p1L1M0P9K6L2OKj02O3n9j35K0J7K1N1nJ8N3K2Oj8o6K5j03
$$ 100 10 21 -9 -65 -65 -24 -95 -64 -24 55 81 113 119 121 19 82 23 -112 -92 -75 -54 -3 -8 10 63 85 91 73 7 32 -71
1784g1Lj3n4MR9j1Q1l1O5N0p7L3r3N0j48M1m0K1N5K1Q2o2Q8j8L3q0J4m7m1j4n8
$$ -71 -68 -81 -135 -131 -32 -43 38 7 72 122 45 78 -15 35 -113 -72 -112 -91 -36 -15 67 5 93 75 108 28 42 -5 -46 -60 -118
1815a18Q1J7K1J6K6k9L9j9M0m5k0n0o9K7L0J0j0L5J10j5rN9p8mo4j01J4M7o9p
$$ -118 -37 -20 1 17 43 14 53 34 74 29 9 -41 -110 -83 -53 -43 -53 -18 92 77 68 127 49 45 -19 -120 -106 -59 -128 -135
1845a35O7O6N7nm0Q1p7K1J6r6Mj02K5J18q4J26Njj0N1J4l0r7M3m5j0r9O2Q8p4
$$ -135 -68 -2 55 50 10 91 14 35 51 -45 -41 -143 -118 0 -84 42 47 46 36 87 101 71 -26 17 -28 -38 -137 -75 13 -61
1875f1K2R6mNL2j5j4n5j23L8L5p6N7PQ2n4R6M4q2Mj7n0K5m2p0MQ0L5OQQJ9k7N5
$$ -61 -39 57 53 58 90 75 61 6 -117 -79 -44 -120 -63 -56 26 -28 68 112 30 34 17 -33 -8 -50 -120 -116 -36 -1 5 13 21 40 13 68
1909F8r6L4k9L4j05KL8l7R4RJ6Q2o8O5p3k6l3J8j09J0P4k3J9J0oQ6L1k0pj0l8
$$ 68 -28 6 -23 11 -94 -92 -54 -91 3 12 28 110 42 107 34 8 -25 -7 -116 -106 -32 -55 -36 -26 -32 54 85 65 58 48 10
1940A0k8r7k6J03pO5p%O8m0N0l2j7m0k2n3j6M5J8k6J6K4N5mMJ0j32J42q3qm6k0
$$ 10 -18 -115 -141 -38 -45 20 13 13 81 41 91 59 42 2 -20 -73 -89 -44 -26 -52 -36 -12 43 39 43 53 -79 63 -20 -28 -74 -94
1972i4JJ20pJ1M4o2J1m1J15nj04l8k1J1o3nJ21L5LMM5o1k3%K2n8M9j06K1N2J0
$$ -94 -93 27 20 31 75 13 24 -17 98 93 -11 -49 -70 -59 -122 -127 -6 29 32 36 81 20 -3 -3 19 -39 10 -96 -75 -23 -13
2003a3%L5K0L7j5j7j5m9k8kQQN7jo7Q4m2P8l7K3jk9p4n5R8j39J49j8qOJ3N0j2
$$ -13 -13 22 42 79 64 47 32 -17 -45 -47 -39 -31 26 25 -42 42 0 78 41 64 63 34 -40 -95 3 -136 13 -5 -13 -7 6 56 44
2036D4J8l5l1M6m6l6j3Rk4P5k3JJ00o8M5r7P0Ll8m3j2O5Pn1J1M4k3P3Qo8k6j05
$$ 44 62 27 -4 42 -4 -40 -53 -44 -68 7 -16 -15 85 17 62 -35 35 38 0 -43 -55 10 17 -34 -23 21 -2 71 79 11 -15 -120
2068a20O2K0k0l9Q3j9l5P4m2R4K5j71J52l9m2K0j05N7N1k0n2L6N1j4L0M3m5Ml7
$$ -120 -58 -38 -58 -97 -14 -33 -68 6 -36 58 83 -88 64 25 -17 3 -102 -45 6 -14 -66 -30 21 7 37 80 35 39 2
2097Bj48J63k1q1L3L7rN8L3pk4j4l2p%J5l9l5M1k3N2K9n3O4L7m9o2J18q5l2MM3
$$ 2 -146 17 -4 -85 -52 -15 -24 34 67 60 36 22 -10 -17 -17 -2 -41 -76 -35 -58 -6 23 -30 34 71 22 -40 78 -7 -39 -35 8
2129Hm3P1n4K4L2kM9j1j00N5Pr3o5L1RO6j4P3Rm6N5k3L7L5j26L9k5k2k3K6K0m
$$ 8 -35 36 -18 6 38 36 85 74 -26 29 36 -57 -122 -91 -82 -16 -30 43 52 6 61 38 75 110 -16 23 -2 -24 -47 -21 -1 -5
2161eM6O1m0nm7M5L1j01p6L0no8P9Q3m4pJ06q9PK1lo7N0m2n7M2K0k7M3O4L5p8
$$ -5 41 102 62 57 10 55 86 -15 -91 -61 -66 -134 -55 28 -16 -23 83 -6 1 22 19 -48 2 -40 -97 -55 -35 -62 -19 45 80 2
2193BNj8K5k1l8M6Ml6%P7o2k2R7j6J5l8L7q6K5j7K4kl8k2P0nK7oj7L8p3J09n3
$$ 2 7 -11 14 -7 -45 1 5 -31 -31 46 -16 -38 59 43 58 20 57 -29 -4 -21 3 1 -37 -59 11 6 33 27 10 48 -25 84 31
2226C1q1K2qk6qO4J6j5O4j9m7L1k1Jj4n9P5m3MmQK4K2ol1RnLk0JkM4Jn5N9j6K2
$$ 31 -50 -28 -36 -62 -70 -6 10 -5 59 40 -7 24 3 4 -10 -69 6 -37 -33 -37 -29 -5 17 11 -20 -11 -16 -13 -33 -32 -34 10 11 -44 15 -1 21
2263B1k8O0K3o3k2JqJ5n2m6J15l8K8K5L5lj3j22J03j4n2M0m0K8n0K1M7J9j7J1
$$ 21 -7 53 76 13 -9 -8 -16 -1 -53 -99 16 -22 6 31 66 63 50 -72 31 17 -35 5 -35 -7 -57 -36 11 30 13 24
2293B4k3L2n0J1m8m4O7J4r4P5L6k4M4n1O7o8N4K5j1r7L7K3J3q1P2rM1L3r3j4M7
$$ 24 1 33 -17 -6 -54 -98 -31 -17 -111 -36 0 -24 20 -31 36 -32 22 47 36 -61 -24 -1 12 -69 3 -6 35 68 -25 -39 8
2324HQo1m7P1oJ8J1Ml0M3K1j9J7j17P4lpqm8L8O7l5%K3K6n6L1pk7k8RK2j9jLj7
$$ 8 16 -45 -92 -21 -27 -9 2 6 -24 19 40 21 38 -79 -5 -8 -15 -23 -71 -33 34 -1 -1 22 48 -8 23 16 -11 -39 -30 -8 -27 -28 -25 -42
2360d2N3mK3L8j0m8P4q3m4M4m9N2k2K1j8K8j1K0L6l7L3p6k1J5L0r4O1l0N4Q3m6
$$ -42 11 7 30 68 58 10 84 1 -43 1 -48 4 -18 3 -15 13 2 22 58 21 54 -22 -43 -28 2 -92 -31 -61 -7 76 30
2391C0J5n3l0mM2Lm8O7m5M1j0J7m4N4j8K0o2L3n2K2Kl2L3k5NL2L9m8L3m2N2k9
$$ 30 45 -8 -38 -42 0 3 -45 22 -23 18 8 25 -19 35 17 37 -25 8 -44 -22 -20 -52 -19 -44 -39 -7 32 -16 17 -25 27 -2
2423bjL3or4%P8j4p1N8N9oJ9l6K4J9r1ql4J00lo5N7m3L2Kjm0M4j0m2M6j0j2L0
$$ -2 -3 30 24 -70 -70 8 -6 -77 -19 40 34 53 17 41 60 -31 -39 -73 27 24 -41 16 -27 5 7 6 -34 10 0 -42 4 -6 -18 12
2457A2Rm8o4j1J39l3l1J4n7R7J9r4K8m1M2J0l8LP5M5r6QK1oJ8j6J1L2l8J7K2p3
$$ 12 21 -27 -91 -102 37 4 -27 -13 -70 27 46 -48 -20 -61 -19 -9 -47 -44 31 76 -20 -12 9 3 21 5 16 48 10 27 49 -24
2489b4P4k7j1K5m8K6j7L3j7j8m7j3O8k9J5J3L6L4l3ol9M3n1k9l2O6L8mj3J3o3
$$ -24 50 23 12 37 -11 15 -2 31 14 -4 -51 -64 4 -25 -10 3 39 73 40 34 -5 38 -13 -42 -74 -8 30 26 13 26 -37
2520c7Q5n6L5k3O5p5k9N%l0N6M5m9P6j14N6O7l7Jn3Qj3M8L2o4RL3o5P2j7k6k2
$$ -37 48 -8 27 4 69 -6 -35 -30 -30 -60 -4 41 -8 68 -46 10 77 40 41 -12 -4 -17 31 63 -1 8 41 -24 48 31 5 -17
2552a7kL2K8j13J15p3j1L4j2K8KN4q7O7k4rkJ6n9rK8k5K1k2J1M7lJ8K6m8m5j1
$$ -17 -19 13 41 -72 43 -30 -41 -7 -19 9 11 65 -22 45 21 12 10 26 -33 -42 -14 -39 -18 -40 -29 18 15 33 59 11 -34 -45
2584d5J7Q4l2K7o2ok8N4l8J2O4JK5o6j7J7J7m2oK8J7m1O2n1L3pK4m2M2q4M1m5
$$ -45 -28 56 24 51 -11 -17 -45 9 -29 -17 47 48 73 7 -10 7 24 -18 -24 4 21 -20 42 -9 24 17 41 -1 41 -43 -2 -47
2616d7O0p4M5o0P6MNM3l9l0L9K2q6jl8P0n2K4K2L7Pp2M2j8K7j5m2j2M2M5p6M9
$$ -47 13 -61 -16 -76 0 4 9 52 13 -17 22 44 -42 -43 -81 -11 -63 -39 -17 20 27 -45 -3 -21 6 -9 -51 -63 -21 24 -52 -3
2648cN2m3K0J3mm5l6J1JM2J2l5J7j6K6N7l8m9M1J2l3j6J6Qo0KO1l1k1R5j5K2p7
$$ -3 49 6 26 39 35 -10 -46 -35 -34 8 20 -15 2 -14 12 69 31 -18 23 35 2 -14 2 10 -50 -48 13 -18 -39 56 41 63 -14
2681a4K8m8L8n6K4L3o7L2K3l9Q8k6j1J2l4Ro1rP1J9p1k4L2N6pK6K6j9j3k3J1j02
$$ -14 14 -34 4 -52 -28 5 -62 -30 -7 -46 42 16 5 17 -17 -8 -69 -78 -7 12 -59 -83 -51 5 -2 24 50 31 18 -5 6 -96
2713i6J09J4o0L9k8m6J07J9p1M7M0r8k8J9J9k0J6k7N2j1k4P2J3j04J5Q9l6m0o7
$$ -96 13 27 -33 6 -22 -68 39 58 -13 34 74 -24 -52 -33 -14 -34 -18 -45 7 -4 -28 44 57 -47 -32 57 21 -19 -86
2742h6K9k0M8%L3j6lJ9N6l6qk1pL9n2jNj7m9J32k2J9L2n5m0N9mn0J3r2K4J06o2
$$ -86 -57 -77 -29 -29 4 -12 -15 4 60 24 16 -5 -12 27 -25 -26 -21 -38 -87 45 23 42 74 19 -21 38 34 -16 -3 -95 -71 35 -27
2775b7L0%K2j7m2KQ3p0N3k9m6m3M1K4m2JR3J7p6K6QQm2N1l1O6o5MJ9q6R7j7J3
$$ -27 3 3 25 8 -34 -32 51 -19 34 5 -41 -84 -43 -19 -61 -60 33 50 -26 0 8 16 -26 25 -6 60 -5 -1 18 -68 29 12 25
2808B5kk0l5R9k5q1ML8p0PMO4M2N0p1j3M6m4no9O2N3r5N9K8n4k9M1mnJ6l4K6l3
$$ 25 23 3 -32 67 42 -39 -35 3 -67 -60 -56 8 50 100 29 16 62 18 13 -56 6 59 -36 23 51 -3 -32 9 5 0 16 -18 8 -25
2842b5oJ1n3O2J7n1J25j10M9l1Q9o4P4j18P0p8L9l3J7K4k3L5QL2m4m5N9j0q0M6
$$ -25 -31 -20 -73 -11 6 -45 80 -30 19 -12 77 13 87 -31 39 -39 0 -33 -16 8 -15 20 28 60 16 -29 30 20 -60 -14
2872a4l2J9njP3m0l8M9L5n4%L0L8p8K7K9p7R2m0k6J9oRj9K7j4Pj7J4Ql2O0m5M3
$$ -14 -46 -27 -32 -33 40 0 -38 11 46 -8 -8 22 60 -18 9 38 -39 53 13 -13 6 0 9 -10 17 3 10 -7 7 15 -17 43 -2 41
2906D1m5K6ml2L3k6ko4P3j5p0k3R9pL9rj3%Nl7RL7j9qljN7K7j5m2Rk1Rj8K1l1
$$ 41 -4 22 18 -14 19 -7 -9 -73 0 -15 -85 -108 -9 -16 23 14 1 1 6 -31 -22 15 -4 -12 -15 -16 41 68 53 11 20 -1 8 -10 11 -20
2942b0k3JN7m0K8RK7mm6O2k5ll5J17j00p0mM5J6j6P3kn8L7n5j0N9pm5K2J6n6K8
$$ -20 -43 -42 15 -25 3 12 39 35 -11 51 26 23 -12 105 5 -65 -69 -24 -8 -24 49 47 -11 26 -29 -39 20 13 -32 -10 6 -50 -22
2975b2J5L0n%K4J5n2J0l4l0J0J7KP0n0K4j3qJ8l6L4L7mr3P8n6j5Q2m2j9l1O1n
$$ -22 -7 23 18 18 42 57 5 15 -19 -49 -39 -22 -20 50 0 24 11 3 21 -15 19 56 52 -41 37 -19 -34 48 6 -13 -44 17 12
3008A2k1J8M2j2j4l6n6P4m3J3m8L7J5M7p3O7n3J08p5m5P7o7K2n4Q8km1L2j9J3
$$ 12 -9 9 51 39 25 -11 -67 7 -36 -23 -71 -34 -19 28 -45 22 -31 77 2 -43 34 -33 -11 -65 23 21 -20 12 -7 6
3038Fj9J4lJ13j23m6Q6m1m6M1mL6L1o3P7o1q1O1k5O8k7l6O5j8j4Nk5J06q6J2n
$$ 6 -13 1 -2 111 -12 -58 28 -13 -59 -18 -22 14 45 -18 59 -2 -83 -22 -47 21 -6 -42 23 5 -9 -4 -29 77 -9 3 -2
3069bN2k7m1J3n7K0l1Q4m4N5m0O1l9l1M3k9j5j0Q2lj18N8N9J7m1Q7o5Qk0k8oJ3
$$ -2 50 23 -18 -5 -62 -42 -73 11 -33 22 -18 43 4 -27 16 -13 -28 -38 44 41 -77 -19 40 57 16 103 38 46 26 -2 -8 5
3101En9K2N0J5m4M1k8K9N3m9l7pm4Q5j9n8nM9J1K0M9m5l6O4q2O7o8L2k7K3J8m0
$$ 5 -54 -32 18 33 -11 30 2 31 84 35 -2 -9 -53 32 13 -45 -50 -1 10 30 79 34 -2 62 -20 47 -21 11 -16 7 25 -15
3133a5N2kJ8r8J12m7k5mN4k4j31P5N4j0J9l0M4o0L0k3L6j1L3m6J1k2l4O3q%K3
$$ -15 37 35 53 -45 67 20 -5 -9 45 21 -110 -35 19 9 28 -2 42 -18 12 -11 25 14 47 1 12 -10 -44 19 11 11 34
3164C4l0Q1o4l2L8m0K3l5j8j9P1j8%L5M0o9K0m2O0l4N4r3%J7pN1o3K7k9L6PJ7
$$ 34 4 85 21 -11 27 -13 10 -25 -43 -62 9 -9 -9 26 66 -3 17 -25 35 1 55 -38 -38 -21 -28 23 -40 -13 -42 -6 1 18
3196A8r0R7l5K6n8L6%n3N9J3Q0k6o5ol1O3m2KOl1M6o4R1m5P0m2J9j4m2O9o5k5
$$ 18 -72 25 -10 16 -42 -6 -6 -59 0 13 93 67 2 -4 -35 28 -14 -12 -6 -37 9 -55 36 -9 61 19 38 24 -18 51 -14 -39
3228c9j0K6N1Nl3M7o3N0M4j37M2P0o2k3J7k4J4J2n4J14o7Q9k2j1Op2l2L4L1l2
$$ -39 -49 -23 28 33 0 47 -16 34 78 -59 -17 53 -9 -32 -15 -39 -25 -13 -67 47 -20 69 47 36 42 -30 -62 -28 3 -29
3258b9L1p0K9L8j0J1qJ6R3m6pm1r9J05m7nJ0N4n9LP5J8pk2o4L3n8Q2Kj03O7j4
$$ -29 2 -68 -39 -1 -11 0 -8 8 101 55 48 7 -92 13 -34 -39 -29 25 -34 -31 44 62 55 33 -31 2 -56 26 28 -75 -8 -22
3290b2K3l0K1j%O4p3kl1j4l9Q7KRlK5j0K7N6j07L5j6jl7R9p1N5r8M8JKQj7L5n9
$$ -22 1 -29 -8 -9 -9 55 -18 -20 -51 -65 -104 -17 -15 -6 -9 16 6 33 89 -18 17 1 0 -37 62 -9 46 -52 -4 -3 -1 7 -10 25 -34
3325c4nN1l7l9J14q0J1L9KJ7pKpl7L0n6J02r2qMN8j0kJ9k1l5P1l8N0p8m2%O8q4
$$ -34 -39 12 -25 -64 50 -30 -19 20 22 39 32 34 27 -10 20 -36 66 -26 -34 -30 28 18 16 35 14 -21 50 12 62 -16 -58 -58 10 -74
3359g4K8P7m3O8o0MO1j2r7M0n6K7j8M0K7j0n9J31o2Q3n5jl7K6k2o4K5J0L6J1l9
$$ -74 -46 31 -12 56 -4 0 61 49 -48 -8 -64 -37 -55 -15 12 2 -57 74 12 95 40 39 2 28 6 -58 -33 -23 13 24 -15
3390a5K7N1o0m2M7K1kpl3K5k3Om5L2M7N6q9J4N3np1Pj8J7Ol4k4N0M4Mo3Q1M7q8
$$ -15 12 63 3 -39 8 29 27 20 -13 12 -11 -5 -50 -18 29 85 -4 10 63 58 -13 -6 -24 -7 -1 -35 -59 -9 35 39 -24 57 104 16
3424A6Kk9J1j6J6Rl2M3KK8k7j5j3RQ1n2p5oj4J1O0l1PK3n0L7O0j1o6JonM9k7K
$$ 16 18 -11 0 -16 0 9 -23 20 22 50 23 8 -5 4 85 33 -42 -48 -62 -51 9 -22 -15 8 -42 -5 55 44 -22 -21 -27 -32 17 -10 -8
3459hk7P7nj4J6On0j8K4M2o9N1j28M7J7M9M4rK2r7Q5q1ML5j3m6P8k5M1rk2L0J9
$$ -8 -35 42 37 23 39 45 -5 -23 1 43 -26 25 -103 -56 -39 10 54 45 67 -30 55 -26 -22 13 0 -46 32 7 48 39 17 47 66
3492F6l0k6Qj5O4j09j3l1P6K0M6p5L8mL5n5L2k7K8q2L1j9lQ0k1m9M8n1P4K4k7
$$ 66 36 10 18 3 67 -42 -55 -86 -10 10 56 -19 19 15 50 -5 27 0 28 -54 -23 -42 -45 35 14 -35 13 -38 36 60 33
3523C3K6p5J9ko6M8kj8LM8j5j0P7p6M9Ml5k1m7qN1O6o1L6j2L3nm5K0p5N1L1n1
$$ 33 59 -16 3 1 -65 -17 -19 -37 -34 14 -1 -11 66 -10 39 43 8 -13 -60 -68 -17 49 -12 24 12 45 40 -5 15 -60 -9 22 -29
3556b9pJ7n7P4P8o7K8n5Ol8N1MN3q6k6L2p5Q0Q4o9k6N9m8L2j4K3L5n7m6M7l1J
$$ -29 -36 -19 -76 -2 76 9 37 -18 -12 -50 1 5 58 -28 -54 -22 -97 -17 67 -2 -28 31 -17 15 1 24 59 2 -44 3 -28 -27
3588b7K9J1j5J9K5Ln0mm5nJK5J6j9J3K4O4o5N7K6p1J1j2lm0l6%Q8J9n7K1L8p3
$$ -27 2 13 -2 17 42 45 -5 -9 -54 -59 -58 -33 -17 -36 -23 1 65 0 57 83 12 23 11 8 -32 -68 -68 20 39 -18 3 41 -32
3621c2N3K5kPp8K0k1J6p8M5k6J04J5j8j4J1k8NK9r9O2j5Rk8J10j02Q6n8RL7m2
$$ -32 21 46 44 51 -27 -7 -28 -12 -90 -45 -71 33 48 30 16 27 -1 4 33 -66 -4 -19 -10 -38 72 -30 56 -2 7 44 2
3652Bm1N9l9N2j36N5O1p2R2l5M4L2k8J1J4j00Pk9K6l9R9q8N7K5%kN9q9ml9N5p2
$$ 2 -39 20 -19 33 -103 -48 13 -59 33 -2 42 74 46 57 71 -29 -22 -51 -25 -64 35 -53 4 29 29 27 86 -3 -7 -46 9 -63
3684f3qL8j5M9O4n3M5jl3jj5l6N9p9J3R1r0m2N9P8j7ok5Q3k9l%j10J0l3N2p8N9
$$ -63 -71 -33 -48 1 65 12 57 56 23 22 7 -29 30 -49 -36 55 -35 -77 -18 60 43 37 12 95 66 63 63 -47 -37 -70 -18 -96 -37
3717c7M4L4m6P6J4j22P1qN1j78Q1%j9N8m6K5M2j6Mm4Q6l4o0%j6Oj9J3L7J4Oj7
$$ -37 7 41 -5 71 85 -37 34 26 77 -101 -20 -20 -39 19 -27 -2 40 24 28 -16 70 36 -24 -24 -40 -34 -53 -40 -3 11 17 0
3749@O8k4n8l5O0p4K2KOK6K1J8j5J7j3L4o5L6J2l9l0J2l6N1lN2%K5nPll7l1q6
$$ 0 68 44 -14 -49 11 -63 -41 -39 -33 -7 14 32 17 34 21 55 -10 26 38 -1 -31 -19 -55 -4 -7 45 45 70 65 72 69 32 1 -85
3783h5R5l5J4j6L3k7N6qj7kmj2L2J3r3P5m6j3N6L4k5M2j3j01J29n4l2Kl2O9n3
$$ -85 10 -25 -11 -27 6 -21 35 27 10 8 4 -8 24 37 -56 19 -27 -40 16 50 25 67 54 -47 82 28 -4 -2 -34 35 -18
3814a8J9OJ1lJ8rj0L9o8J3k8N7m1k3j0P4n9P0Lqk3L1pn3K2o2M2j7k0K8l7J6L0
$$ -18 1 7 18 15 33 24 14 53 -15 -2 -30 27 -14 -37 -47 27 -32 38 41 33 10 41 34 -19 3 -59 -17 -34 -54 -26 -63 -47 -17
3847a7lK8J08j03m9k0P0Qp4n6O9M1j7O3l3N3k4m6O9m7Qm9M1q3K3K4K5J1M0m1J6
$$ -17 -20 8 116 13 -36 -56 14 22 -52 -108 -39 2 -15 48 15 68 44 -2 67 20 28 -21 20 -63 -40 -16 9 20 60 19 35
3878C5k5J1j4mk9l0j9L5J8l6L5N4l5N0KM9j23Ln8O6m7P3n0K2l3J05k3j5o3jJ01
$$ 35 10 21 7 3 -26 -56 -75 -40 -22 -58 -23 31 -4 46 48 97 -26 -23 -81 -15 -62 11 -39 -17 -50 55 32 17 -46 -47 54
3909E4q7O0Nj04rj3K2R6m5NM2pJ3l7L3J7l4q2P7J9m1j5P1oO0l8j7J0mo4j1o3P8
$$ 54 -33 27 32 -72 -81 -94 -72 24 -21 -16 26 19 32 -5 28 45 11 -71 6 25 -16 -31 40 34 94 56 39 49 45 -19 -30 -93 -15
3942a5j1PL3J4L8K1n5j8K8n0K5o0J4l1N2k2L3m2R5m1M0j12J14j06jP2o3O0j00
$$ -15 -26 -19 14 28 66 87 32 14 42 -8 17 -43 -29 -60 -8 -30 3 -39 56 15 55 -57 57 -49 -50 22 -41 19 -81
3971h1N6K5NM7l3L9q5l3R0qk5Jkn5L8KK7k8Q6o8M3pm9M7n7PK2j6J9J0j8K7p8J16
$$ -81 -25 0 5 52 19 58 -27 -60 30 22 -3 -2 -4 -59 -21 -19 8 -20 66 -2 41 34 -15 32 -25 -18 4 -12 7 17 -1 26 -52 64
4005F4n4l9O1n7nOJ6j3N5j02L2K4L1L0n1Q2r4K2n9L6oj5K3M7q9R1n4O1j0Oo5N2
$$ 64 10 -29 32 -25 -30 -24 -8 -21 34 -68 -36 -12 19 49 -2 80 -14 8 -51 -15 -21 -36 -13 34 -55 36 -18 43 33 39 -26 26
4037B6l9K2l7kJ2o0P6J1qJ3NJ3j0K1j8j2m3Jj8j8PL1mL1K0K0k5m4P6o8N5r2qJ5
$$ 26 -13 9 -28 -30 -18 -78 -2 9 1 14 19 32 22 43 25 13 -30 -29 -47 -65 -58 -27 -31 0 20 40 15 -29 47 -21 34 -58 -66 -51
4071e1M2l8KR2j9LJ9l4Qn2L1k3p0P6L6l5P9n8P3n6J2K0j0l4k4Q1j23L4l2O9nJ8
$$ -51 -9 -47 -45 47 28 31 50 16 24 -28 3 -20 -90 -14 22 -13 66 8 81 25 37 57 47 13 -11 70 -53 -19 -51 18 13 31
4103C1L9rJ8k6q8K8j4l2L0mMJ4ok7LJ24q7J7k1L6k6k7m1M6rj1K8OP7k7m4J2kN1
$$ 31 70 61 79 53 -35 -7 -21 -53 -23 -27 -23 -9 -15 -42 -39 85 -2 15 -6 30 4 -23 -64 -18 -27 -38 -10 -4 73 46 2 14 12 63
4137F3j19N4m5K7J2m4lP1J7L5p5N1p6J6Qj2Pkm2k0J11o6KN0qP3p8K2oo7K3m0P0
$$ 63 -56 -2 -47 -20 -8 -52 -55 16 33 68 -7 44 -32 -16 -8 -20 -13 -15 -57 -77 34 -32 -30 20 12 85 7 29 23 -44 -21 -61 9
4170Il8LL0l9P3M9q7P7n8k7L4m0m6J43j28K1J7kL8l5M3K2q0P0j6o3l3K5K1J7P8
$$ 9 -29 -26 4 -35 38 87 0 77 19 -8 26 -14 -60 83 -45 -24 -7 -9 29 -6 37 59 -21 49 33 -30 -63 -38 -17 0 78
4201G8j25P0j8J6qM5j0n3N3p1rN3j15R8l2O0l0L6PM9r4Rl0O2q1n8K1N4J4lL4J2
$$ 78 -47 23 5 21 13 58 48 -5 48 -23 -32 21 -94 4 -28 32 2 38 45 94 0 9 -21 41 -40 -98 -77 -23 -9 -12 22 34
4233C4jj5m5L2L7r9L0J5j0j1K1LN4l9mM8n5L8m1P9r0k7lL9L1rJ04o6l0j5J00j59
$$ 34 33 18 -27 5 42 -57 -27 -12 -22 -33 -12 -9 45 6 2 50 -5 33 -8 71 -19 -46 -49 -10 21 12 116 50 20 5 105 -54
4265e4L5L3km2n0L4M7j1j0RP8K7n3l1M9pL3r3k1J3J4K7r5R8j2K9k2J0j6j6k6k2
$$ -54 -19 14 12 -30 -80 -46 1 -10 -20 -11 67 94 41 10 59 52 85 -8 -29 -16 -2 25 -70 28 16 45 23 33 17 1 -25 -47
4297d7J6N6rk8K1L8J5K9j28J22n0r7P5n8j8J02k8l4O0J3lm3JN2o6k0M0mk1m0N2
$$ -47 -31 25 16 -12 9 47 62 91 -37 85 35 -62 13 -45 -63 39 11 -23 37 50 47 4 5 57 -9 -29 11 7 -14 -54 -2
4328bJj4oL5O6k7l7rM1k4l7L9r5k8J04j3l8P3l5P1q3K4L2m6K0j04P9K9n6J6L2
$$ -2 -1 -15 -21 14 80 53 16 7 48 24 -13 26 -69 -97 7 -6 -44 29 -6 65 -18 6 38 -8 12 -92 -13 16 -40 -24 8
4359Hj8P2o8Q5r0L9m7o9R5J5m2q1J41n8k4M0P2l3J1l5m6rj4oM3Rk4L1L5m1L4l6
$$ 8 -10 62 -6 79 -11 28 -19 -88 7 22 -20 -101 40 -18 -42 -2 70 37 48 13 -33 -42 -56 -62 -19 -10 -34 -3 32 -9 25 -11
4391a1N1k9n8JjL0q3J03o7R8l8njN3O4p7k7m9j2P6q0m6R5J2K4q2K1M1M2m9j7R1
$$ -11 40 11 -47 -46 -47 -17 -100 3 -64 34 -4 -9 -10 43 107 30 3 -46 -58 18 -62 -108 -13 -1 23 -59 -38 3 45 -4 -21 70
4423G0n5Jk2q7Q3l0P3Qk7L4J1j3n8j0O9j15oN5J5m7J15n3J21l3r1Pl2JO4q2K1
$$ 70 15 16 -6 -93 -10 -40 33 41 14 48 59 46 -12 -22 47 -68 -74 -19 -4 -51 64 11 132 99 8 15 -17 -16 48 -34 -13
4454a3j01R0K0pl1J7J24l3k7j9l3l0O0l9K3K1k2J5j5K2L4k1J2k2%l5k7J3M9l2
$$ -13 -114 -24 -4 -11 -42 -25 99 66 39 20 -13 -43 17 -22 1 22 0 15 0 22 56 35 47 25 25 -10 -37 -24 25 -7
4484gMk3M0QJ7Nm7LL7l0n2M8p0L0M3P5j33J08o1j6L6n0O4m3J9o4KJ8O9k1m0nL2
$$ -7 -3 -26 14 22 39 44 -3 0 37 7 -45 3 -67 -37 6 81 -52 56 -5 -21 15 -35 29 -14 5 -59 -57 -39 30 9 -31 -36 -4
4517dj4N3k1M7k2q5N1m2K5m9RM6j6R3m3M3Jl3j5m8N7p5Lm3M9J2L7J7QN3q5R3j38
$$ -4 -18 35 14 61 39 -46 5 -37 -12 -61 -52 -6 -22 71 28 71 72 39 24 -24 33 -42 -39 -82 -33 -21 16 33 41 94 9 102 -36
4550c6N9j5o4l3P1K7n3M1J6k7O2L4j8q2ql8Q4m8K7kl2L7j2K4j6P9j2o0j0M0r6
$$ -36 23 8 -56 -89 -18 9 -44 -3 13 -14 48 82 64 -18 -26 -64 20 -28 -1 -3 -35 2 -10 14 -2 77 65 5 -5 35 -61
4581f1O6Nm8O8j6ll0P0M1q8L4k4j0Ql7mol4Q1l0N4kL0p4O3p2K1j4m9N9m4l1P4
$$ -61 5 10 -38 30 14 11 -19 51 92 4 38 14 4 12 -25 -29 -35 -69 12 -18 36 34 64 -10 53 -19 2 -12 -61 -2 -46 -77 -3
4614clk9Q5K2l5K4lq5k7K1m3K3J0N0J2n2l3P3J3J3mm3K3m7j7M7j6jj1M4M7M1q1
$$ -3 -6 -35 50 72 37 61 58 -27 -54 -33 -76 -53 -43 7 19 -33 -66 7 20 33 29 -14 9 -38 -55 -8 -24 -25 -36 8 55 96 15
4647A5J7n2K2j3J0m7J8N5k1l2Q4j6p0N4J4j6ll1O0m3j8K9j24N5M2j2J05j16K7
$$ 15 32 -20 2 -11 -1 -48 -30 25 4 -28 56 40 -30 24 38 22 19 -12 48 5 -13 16 -108 -53 -11 -23 82 -34 -7
4676gR3j39J6k4RLNj0Q4o9J27r1J06p2j0pL5nk8o0J7K7Qj9Rk6J8KM6K3l0n1k1
$$ -7 86 -53 -37 -61 -52 -49 -44 -54 30 -39 88 -3 103 31 21 14 49 44 16 -44 -27 0 8 -11 -2 -28 -10 -8 38 61 31 -20 -41
4709d1N1n5l6J16j1k8j1kK2%N1o7l7J3P6m6no9R3n6J8J0ON7n3J6Jp6k0R3m4m5
$$ -41 10 -45 -81 35 24 -4 -15 -17 5 5 56 -11 -48 -35 41 -5 -10 -79 14 -42 -24 -14 -8 49 -4 12 13 -63 -83 10 -34 -79
4741g9MO4mMj0jK4k0L0jp8Q2k8k7K5PN7m4L1J0p3N4K7o3M3o8NJ8K5o1K8jK4M7
$$ -79 -75 -11 -15 -11 -21 -22 2 -18 12 11 -67 15 -13 -40 -15 -8 49 5 36 46 -27 27 54 -9 34 -34 -29 -11 14 -47 -19 -20 4 51
4775E1J9m0l0Q0j19N4m3j3qlP7kl8P7n9N6o5o2R2n2j5k3N7j0J5M0L2k0p4N9m4
$$ 51 70 30 0 80 -39 15 -28 -41 -49 -52 25 23 -15 62 3 59 -6 -68 24 -28 -43 -66 -9 -19 -4 36 68 48 -26 33 -11
4806a1L1m5j1P4r9j7O0M5k8J7J9L4pmk0J0p4M3L6k0j5m3Q9k9j7jOrm8M0j2k4M
$$ -11 20 -25 -36 38 -61 -78 -18 27 -1 16 35 69 62 58 38 48 -26 17 53 33 18 -25 64 35 18 17 23 14 -34 6 -6 -30 -26
4839b6J2mM4no4L3RMm4N7jp6J10r6L1M9j45N4J19q%l9l4K9l1N2l8pJ08j28K6J9
$$ -26 -14 -18 26 21 -43 -10 -1 3 -41 16 15 -61 49 -47 -16 33 -112 -58 61 53 53 14 -20 9 -22 30 -8 -15 93 -35 -9 10
4871A0M8m0K8o4K6K2p4M8k3N6p9%k7M7K0Pk9J01op1k2O5J7p4n4Q0n7m6O9K3P5
$$ 10 58 18 46 -18 8 30 -44 4 -19 37 -42 -42 -69 -22 -2 5 -24 77 71 0 -22 43 60 -14 -68 12 -45 -91 -22 1 76
4902G6j09J10p4J3kj9qk6K5k8L7L9Ol8J4O1o2NJ5j4J7q3JN8l4l3R9pl5M1m7P7
$$ 76 -33 77 3 16 14 -5 -13 -39 -14 -42 -5 34 40 2 16 77 15 20 35 21 38 -45 -44 14 -20 -53 46 39 4 45 -2 75
4934G5Qq7k2J7Rqn7J17j06N7O5l3J3j2J2m7J5K1j12J12K1Oo8j5k2M2ooR0j28O0
$$ 75 83 -4 -26 -9 0 -8 -65 52 -54 3 68 35 48 36 48 1 16 37 -75 37 58 64 -4 -19 -41 1 -5 -11 79 -49 11
4965A1l3J8l0qM5Ok1M5l2J7l3L4m5N0nn1J2L4l9N4m7QL6K8J3r9K2KJ8m7k5O0o2
$$ 11 -22 -4 -34 -42 3 9 -12 33 1 18 -15 19 -26 24 19 -32 -20 14 -25 29 -18 -10 26 54 67 -32 -10 -8 10 -37 -62 -2 -64
4998f4L9M2L6n8N9K6j00K7o2Q9m2J6p7N0M6nPj8MM3k7J6j14R1m4Mp4oP1o3J00
$$ -64 -25 17 53 -5 54 80 -20 7 -55 34 -8 8 -69 -19 27 22 29 11 15 58 31 47 -67 24 -20 -16 -90 -96 -25 -88 12
5029A2K5m8k2L4L2K1o0lL5j05N5N0%J3k7L0r1N9n5P2pj3j1m2qO2k5l7R3o9J01
$$ 12 37 -11 -33 1 33 54 -6 -9 26 -79 -24 26 26 39 12 42 -49 10 -45 27 20 7 -4 -46 -54 8 -17 -54 39 -30 71
5060G1n3M8p3Nk5L1qm4R1n0l7Q0jm7k0K3J0nn3nN0%m4lN5j7JNR1o1%J0r0P2KM1
$$ 71 18 66 -7 -2 -27 4 -4 -48 43 -7 -44 36 35 -12 -32 -9 1 -4 -57 -62 -12 -12 -56 -59 -4 -21 -20 -15 76 15 15 25 -65 7 9 50
5096E0o5j8L7l3J03o9j3J3P7l8o5J4M7j04N9k7N7l7L8M1l8jK0q7L7Nk4lj7lj0
$$ 50 -15 -33 4 -29 74 5 -8 5 82 44 -21 -7 40 -64 -5 -32 25 -12 26 67 29 28 48 -39 -2 3 -21 -24 -41 -44 -54
5127e4j1L2P8K7n1m1P4n8krk7J8l7N5lJ2Q2k4l4k4NJ6K7m0Pq7Q6j3J5nL7o6K7
$$ -54 -65 -33 45 72 21 -20 54 -4 -6 -15 -42 -24 -61 -6 -9 3 85 61 27 3 8 24 51 11 18 -69 17 4 19 14 51 -15 12
5160A2M5j4k2l7J8m3J3p5O1rO4m8N9k3K9k1m1N6p8M7n4LJ4M9Pl8PL2J2k9j2%N3
$$ 12 57 43 21 -16 2 -41 -28 -103 -42 -51 13 -35 24 1 30 9 -32 24 -54 -7 -61 -58 -44 5 12 -26 -19 13 25 -4 -16 -16 37
5193C7o3O6k1m1M9q5P6k2J8K0L4p0qJ6n5N1lm6L0RqQ0m7j9M1m9j2J0n6Q2jo6P0
$$ 37 -26 40 19 -22 27 -58 18 -4 14 34 68 -2 -10 6 -49 2 -1 -47 -17 -8 -16 64 17 -2 39 -10 -22 -12 -68 14 13 -53 17
5226A7j8Q1qn6J0n5M7o9R6l6m5J5Ml1O4o2j2K5oJ01l6oM2r2L1k5K7kJ8m2L3k8
$$ 17 -1 80 72 16 26 -29 18 -51 45 9 -36 -21 -17 -48 16 -46 -58 -33 -39 62 26 20 62 -30 1 -24 3 1 19 -23 10 -18
5258a8M9kN3p5m5L7K5p3k7P9K0k6qOM3Rn8K7k0Jj4l2NO3o8k5J18Rr2J02m3J2j9
$$ -18 31 29 82 7 -38 -1 24 -49 -76 3 23 -3 -11 -5 38 47 -11 16 -4 -3 -17 -49 -44 19 -49 -74 44 53 -39 63 20 32 13
5291A3p8K3n1P8j11P6K0N3lm5MM7On5j9P1P8j42j6J1j1M1mM4qn3R4m4L7K9j26
$$ 13 -65 -42 -93 -15 -126 -50 -30 23 20 -25 -21 26 32 -23 -42 29 107 -35 -51 -40 -51 -10 -14 30 22 -31 63 19 56 85 -41
5322d1L7P0p8j8N3KK7k7k7J0O8n5PK6o1J2q4R6k8L8jq%k9O2o8k1L3j2K7qo7m1
$$ -41 -4 66 -12 -30 23 25 52 25 -2 8 76 21 28 54 -7 5 -79 17 -11 27 26 18 18 -11 51 -17 -38 -5 -17 10 2 -65 -106
5355a06P2M8o9P0r0Q8o1Q3q9K3M2ROp6M0m7R6mn0L4M6j08L6n1L9j1O8o5J7K7P
$$ -106 -34 14 -55 15 -75 13 -48 35 -54 -31 11 20 26 -50 -10 -57 39 35 -15 19 65 -43 -7 -58 -19 -30 38 -27 -10 17 24
5386B4n0P6j2L5lo3L4q7N4k4m1R2k3j9OJ5k6J4Kj4O8j9m4j5M4pm2P4m3KM6L4j10
$$ 24 -26 50 38 73 70 7 41 -46 8 -16 -57 35 12 -7 -1 14 -12 2 4 -10 58 39 -5 -20 24 17 -25 49 6 8 54 88 -22
5419b2O2nrp0k7NL1P1m9L4n0Q4ro4%J5k5O3m1o0Q0k5M0K0n6L2olK8r0j9J9pqk8
$$ -22 40 35 26 -44 -71 -66 -35 36 -13 21 -29 55 46 -18 -18 -3 -28 35 -6 -66 14 -11 29 49 -7 25 19 16 44 -46 -65 -46 -53 -61 -89
5454h9O8P1j0QM1r8M6j4j8q2%M3j1j0J2jL2L8K3l8n9Q7l3O1J3n2k2k3KR3k6M5
$$ -89 -21 50 40 48 89 -9 37 23 5 -77 -77 -34 -45 -55 -43 -44 -12 26 49 11 -48 39 6 67 80 28 6 -17 -15 78 52 97
5486I7o3j4l4OK8k9p6P4j6K5L1m3K4k2J01n3n2N7K7p4j1qj5N4k7M1nk1l2M6l9
$$ 97 34 20 -14 -8 20 -9 -85 -11 -27 -2 29 -14 10 -12 89 36 -16 41 68 -6 -17 -25 -40 14 -13 28 23 2 -30 16 -23
5517b3M1J7o2l6J1rJ0L9k0M2J8L1o6O1n4L4l6R0j05%n9M9N4nk7lpJ0O4o5k2N6
$$ -23 18 35 -27 -63 -52 -61 -51 -12 -32 10 28 59 -7 54 0 34 -2 88 -17 -17 -76 -27 27 22 -5 -8 -15 -5 59 -6 -28 28
5549B8n9J1nL4n0l2J09mj3n6K1L2j0N3o5lj6j4J2N7o9O5kK7j3j1l0j0l5O6j21
$$ 28 -31 -20 -25 9 -41 -73 36 32 19 -37 -16 16 6 59 -6 -9 -25 -39 -27 30 -39 26 24 51 38 27 -3 -13 -48 18 -103
5580a03Q2L9q5R4k5qK7m1J8O5n8Kl2OL9k9K6m2PL1M1JJ0r4P4j5j4m9oQN0O3j19
$$ -103 -21 18 -67 27 2 -6 21 -20 -2 63 5 7 -25 -19 20 -9 17 -25 -18 13 54 55 65 -29 45 30 16 -33 -39 -31 19 82 -37
5613c7L5o0O8M3j02N8J0NPn5MO4m6K1J7n5K1rJ9Rk0k2nN3m8KRl7K7k6O2K4k4O5
$$ -37 -2 -62 6 49 -53 5 15 20 27 -28 -24 40 -6 15 32 -23 -2 -11 8 17 -3 -25 -30 23 -25 -23 -14 -51 -24 -50 12 36 12 77
5647G7n7N0l3l2J8n7L8l3R6L1j06O9l5j5K7m6J3m6OJ7K4m2M0nO8j01RN4k9n4J3
$$ 77 20 70 37 5 23 -34 4 -29 67 98 -8 61 26 11 38 -8 5 -41 -35 -18 6 -36 4 -1 67 -34 -25 29 0 -54 -41
5678d1K0j5J7l7N4m5N6K9m5J8L7o7J0n4Q5o7m2Q3pK7k4K3ll5N7m1J4j3j9krK5
$$ -41 -21 -36 -19 -56 -2 -47 9 38 -7 11 48 -19 -9 -63 22 -45 -87 -4 -11 16 -8 15 12 -23 34 -7 7 -6 -25 -27 -36 -11
5710a1k7J02l6J9o0P5P2n9Kl4l7k8k3j6LO6mJ2o3P5L9m6O9n1m2J5J6l9j2LK1o
$$ -11 -38 64 28 47 -13 62 134 75 77 43 6 -22 -45 -61 -58 8 4 16 -47 28 67 21 90 39 -3 12 28 -11 -23 -20 1 -5
5742eM8o6P3N1j21j7RK9m9K3m9O8j5M7m3J4k4O2n0l0P2k9Nk1N8m5o2R3m9M9k2
$$ -5 43 -23 50 101 -20 -37 -28 1 -48 -25 -74 -6 -21 26 -17 -3 -27 35 -15 -45 27 -2 3 -18 40 -5 -67 26 -23 26 4
5773Dmj0qL3L5m6k7N7j30P0n2P8J3L5k9q5N8J3OJ8n3k1M0k0l4J22o9K6k7P0o5
$$ 4 0 -10 -18 15 50 4 -23 34 -96 -26 -78 0 13 48 19 -66 -8 5 11 29 -24 -45 -5 -25 -59 63 -6 20 -7 63 -2
5804bNm8O9j2q9J14p6N1L4L2m4J4l6O6p0j2m6O8m5Q7m6n9NN4k8P8m2q7O7jPk6
$$ -2 3 -45 24 12 -77 37 -39 12 46 78 34 48 12 78 8 -4 -50 18 -27 60 14 -45 -40 14 -14 64 22 -65 2 1 8 -18
5836a8O7q5OJM3m7L2J0k1nJ8k6No5J9K6l3j4O4R3o2nL6j0l4m1j2K1j6P3n7m7P7
$$ -18 49 -36 -30 -29 14 -33 -1 9 -12 -17 1 -25 -20 -85 -66 -40 -73 -87 -23 70 8 3 39 29 -5 -46 -58 -37 -53 20 -37 -84 -7
5869gJ1N1L7q6PmpK2n0l7O7k6K8k4J1J8k3M4l5n7Q2m6K6M9j46M7N2m2L1L8j8m4
$$ -7 4 55 92 6 13 9 2 24 -26 -63 4 -22 6 -18 -7 11 -12 32 -3 -60 22 -24 2 51 -95 -48 4 -38 -7 31 13 -31
5901c1j4M7J8r5L8j8j8N5l3M9m6R3nj09Q1j6l3j9%K0J9K9M%l7Q2m2J2O2r2K3N6
$$ -31 -45 2 20 -75 -37 -55 -73 -18 -51 -2 -48 45 40 -69 12 -4 -37 -56 -56 -36 -17 12 16 16 -21 61 19 31 93 1 24 80
5933H0l7k9k2k8L9k8O9o0L3O9q1Kl8JM4l6M2j0Pj3n3J30q9k1%M7j9l5K0j0O5j14
$$ 80 43 14 -8 -36 3 -25 44 -16 17 86 5 7 -31 -30 14 -22 20 10 17 4 -49 81 -8 -29 -29 18 -1 -36 -16 -26 39 -75
5965g5M8m7J04j5k1k1pM0k6nL8Kn4J3j3N6k0M4j3J7p8NK0P4q9J03r5J7k6M4l2
$$ -75 -27 -74 30 15 -6 -27 -34 6 -20 -25 13 15 -39 -26 -39 17 -3 41 28 45 -33 -28 -8 66 -23 80 -15 2 -24 20 -12
5996a2l5L0K9L0k8k3J6Mj1L1j8n6J18q0L8m3N2kj10M3m8O5J4N3q4L2n6L5J4n2
$$ -12 -47 -17 12 42 14 -9 7 11 0 31 13 -43 75 -5 33 -10 42 40 -70 -27 -75 -10 4 57 -27 5 -51 -16 -2 -54
6026e4O2q2Q8O0p4k7LK5p3Q2j7o8M7J9m5P1K6r8N0Q0r7P2r0K0K4l8K3k1K1O7k2
$$ -54 8 -74 14 74 0 -27 -24 1 -72 10 -7 -75 -28 -9 -54 17 43 -55 -5 75 -22 50 -40 -20 4 -34 -11 -32 -11 56 34
6057C4l8N2m5JL9m3l3oPkN8k6M2Lm4k9K2m4P0j1p0M5Q5p8l2L2%N7n9M5r0J40o0
$$ 34 -4 48 3 4 43 0 -33 -39 -32 -34 24 -2 40 43 -1 -30 -8 -52 18 7 -63 -18 67 -11 -43 -11 -11 46 -13 32 -58 82 22
6090B2O6q9M0n2K6l3kL9J4o4j0O3l9L3m0Q9j8j0m9K0R%K9k7J8r7L6J3K1l3pk6
$$ 22 88 -1 39 -13 13 -20 -22 17 31 -33 -43 20 -19 14 -26 63 45 35 -14 6 15 15 44 17 35 -62 -26 -13 8 -25 -32 -58
6122e8K1L4rJ7J7J0n0Nkm4R1lj7j2n5M4L5o4J1M1j1N1m6L3m0Q3k4n3RN8p5j1M9
$$ -58 -37 -3 -12 5 22 32 -18 -13 -15 -59 32 29 12 0 -55 -11 24 -40 -29 12 1 52 6 39 -1 82 58 5 14 72 -3 -14 35
6155C5l3O8j11O9j3j9J1pm1M1jL5%p1O0jj5n6J9O7k8k1m6L9J6k6J6o2N3oQ7q9
$$ 35 2 70 -41 28 15 -4 7 0 -41 0 -1 34 34 -37 23 22 7 -49 -30 37 9 -12 -58 -19 -3 -29 -13 -75 -22 -28 59 -30
6187c0J14j44O3l2j7P6p1L5m4P6p6M1M2n4L0j3K3Kj0l2l0%P6p4M2O6j3ok8K2l7
$$ -30 84 -60 3 -29 -46 30 -41 -6 -50 26 -50 -9 33 -21 9 -4 19 21 11 -21 -51 -51 25 -49 -7 59 46 40 12 34 -3
6218cN0km6K7n5L4J0l2RJ3n7M5k3m2R1Kr5J0J10q8M2k6L8rrL0l7NqK8m2M5qNm9
$$ -3 47 45 -1 26 -29 5 15 -17 -8 5 -52 -7 -30 -72 19 21 -74 -64 46 -42 0 -26 12 3 -6 24 -13 -8 -16 12 -30 15 7 12 -37
6253c7K4m5J03l7K3j0j6L2k4k9L1K1K2m1J8q0M0L8k8M1m3Ok0l1L8n1L1P7k7m0
$$ -37 -13 -58 45 8 31 21 5 37 13 -16 15 36 58 17 35 -45 -5 33 5 46 3 9 -11 -42 -4 -55 -24 53 26 -14
6283a4k6L7K2m6M0L8p6qkL5k6L3k3j8l9L2N6p6J45l4j3n7k6k8L2P5k3k2K3l4J4
$$ -14 -40 -3 19 -27 13 51 -25 -33 -35 0 -26 7 -16 -34 -73 -41 15 -61 84 50 37 -20 -46 -74 -42 33 10 -12 11 -23 -9
6314iK5qK7j04O8QN9o8n9P7m7k7m3O7R1j14J25r7K8j3MM3m9n2QJ11o3J0oJ6k1
$$ -9 16 8 35 -69 -1 7 66 -2 -61 16 -31 -58 -101 -34 57 -57 68 -29 -1 -14 -10 33 -16 -68 -60 51 -12 -2 -8 8 -13
6345a3pL6j8j2Kk1N7pp9O2oJ9K4lqj0k0%o4J8P0k1QK9m4n7K9M5M1k6nnrKrj8j5
$$ -13 -20 16 -2 -14 -12 -33 24 17 -62 0 -6 13 37 34 26 16 -4 -4 -68 -50 20 -1 7 36 -8 -65 -36 9 50 24 19 14 5 7 -2 -20 -35
6382c5RJ6l7P6k9O1L0o7q0j0O0O9m8j0j0j6oN5K8o1KK3k9K3K6Mj0r7Q2mJ9m2N3
$$ -35 -26 -10 -47 29 0 61 91 24 -56 -66 -6 63 15 5 -5 -21 -27 28 56 -5 -3 20 -9 14 40 44 34 -63 19 15 34 -8 45
6415D5rk2lK6m0k8R3k4Po3m4NM7nK4pP4r3N3n1J0k2L2m1J7L5j5j1J9l7N9j4J0
$$ 45 36 14 11 37 -3 -31 62 38 45 -18 -62 -57 -10 -15 9 2 76 -17 36 -15 -5 -27 5 -36 -19 16 1 -10 9 -28 31 17 27
6448B7K1j23N3PL6k7KN6j9m7L3K7o5K7m2N9J0J8p8pK5j4n1P8m6O9n2L4m2P1k7
$$ 27 48 -75 -22 -15 21 -6 -4 52 33 -14 19 46 -19 8 -34 25 35 53 -25 -32 -7 -21 -72 6 -40 29 -23 11 -31 40 13
6479A3r5Q6m8O0mOK3O0j07L7q8N1K7rQ2j00l7P7n9j3qJ3j7O4l8j3O4n2qP5j5k
$$ 13 -82 4 -44 16 12 18 41 101 -6 31 -57 -6 21 12 94 -6 -43 34 -25 -38 -46 -33 -50 14 -24 -37 27 -25 -33 42 27 25
6511B5J3j9j4j6m3O1n4L7K4k1J3k5j9J2J7K5Rj4k9RN7j06M7k5R0q2M5K3k2k8M4
$$ 25 38 19 5 -11 -54 7 -47 -10 14 -7 6 -19 -38 -26 -9 16 25 11 -18 -9 48 -58 -11 -36 54 -28 17 40 18 -10 34
6542C4l8K2JPj7l6QR8o5l7QK9n0N3m8K3K3l2M0K0l8p3P9l5MK6l4J4Rl6P6m9N2
$$ 34 -4 18 19 26 9 -27 -19 79 14 -23 -15 14 -36 17 -31 -8 15 -17 23 43 5 -68 11 -24 -20 6 -28 -14 -5 -41 35 -14 38
6575C8kk2nrk5j1L1l7P7q5R5k1mK9m1j6J6ol3L8j2j6kM6k7l8MN4l4lj0J2j5L8
$$ 38 36 14 9 0 -25 -36 -5 -42 35 -50 45 24 20 49 8 -8 8 2 -31 7 -5 -21 -23 23 -4 -42 -38 16 -18 -21 -31 -19 -34 4
6609Do7N0m2NP2j2QL2L5m7r9O5l4M2q2O8l8P0J2p9K5K1J4n0N5k3l6Oj3N3j2L4
$$ 4 -63 -13 -55 -50 22 10 18 50 85 38 -61 4 -30 12 -70 -2 -40 30 42 -37 -12 9 23 -27 28 5 -31 -25 -38 15 3 37
6641C7n3j0J12j39KL7K7l3JOn2P1Qj9jlq6J02O4o2n4L7k1l7O4L7rj7K2k9L7j06
$$ 37 -16 -26 86 -53 -51 -14 13 -20 -19 -13 -65 6 14 -5 -6 -9 -95 7 71 9 -45 -8 -29 -66 -2 35 26 9 31 2 39 -67
6673f7P2k4K7l8j4O6q8L9O3lo0L6j3O3l7L3j7k1M8n0n5K2L0m5N2l7KP2p2OjL7
$$ -67 5 -19 8 -30 -44 22 -66 -27 36 33 -27 9 -4 59 22 55 38 17 65 15 -40 -18 12 -33 19 -18 -16 56 -16 -10 -11 26
6705B6j9J1p9L1K8M2k4o8Q1l8M4m3K5n0O3l1M7k6Nk0J9n6J5M0MK4q2N0r6O1M4
$$ 26 7 18 -61 -30 -2 40 16 -52 29 -9 35 -8 17 -33 30 -1 46 20 25 5 24 -32 -17 23 27 51 -31 19 -77 -16 28
6736B8l5kn8L1M5ML1Mp7Q2m4l7L5m2O8J1q5N9rk2O1l0k7kK2k9K8%Qj3l7j1R9l0
$$ 28 -7 -9 -67 -36 9 13 44 48 -29 53 9 -28 7 -35 33 44 -41 18 9 -13 48 18 -9 -11 11 -18 10 10 18 5 -32 -43 56 26
6770B6p0R2n3j4Qp0J14n5J0M3J3l0l1M5m9l4O4l4J00k1n3J6nl5K4K4k9l6M9pN1
$$ 26 -44 48 -5 -19 -11 -81 33 -22 -12 31 44 14 -17 28 -21 -55 9 -25 75 54 1 17 12 -23 1 25 -4 -40 9 2 53
6801E3j33J00m5P8j6p6L4k4m2J10%o5Q6l1O6o9m9M3N8n2n4K9l2Q5q9pO8k1l4J2
$$ 53 -80 20 -25 53 37 -39 -5 -29 -71 39 39 -26 60 29 95 26 -23 20 78 26 -28 1 -31 54 -35 -42 26 5 -29 -17
6831a7J1Lo1P4j4n9K3K3Qn7J33j07qK1N6p3O9k8k5m4O0Jm6N4l0mK5KK1l5M3l9
$$ -17 -6 -3 -64 10 -4 -63 -40 -17 -9 -66 67 -40 -48 -27 29 -44 25 -3 -28 -72 -12 -11 -57 -3 -33 -37 -12 -10 11 -24 19 -20
6863b0l7P5o9O7k4M1l8Q4j04L5NK3lL3q2M7n9P9o9j2J06p8K7l1K6k3K8%K5j12
$$ -20 -57 18 -51 16 -8 33 -5 79 -25 10 15 38 35 68 -14 33 -26 53 -16 -28 78 0 27 -4 22 -1 27 27 52 -60
6893f0%n7J25j7L7lj3K5n1N2k4L0j14N8l4M3kN7m7K6j4q4R1p6K8p8J11L9m6Rk0
$$ -60 -60 -117 8 -9 28 25 12 37 -14 38 14 44 -70 -12 -46 -3 -5 52 5 31 17 -67 24 -52 -24 -102 9 48 2 11 -9
6924ij0J2L6n0O3J7M3m4L3j35L4J29j53J4RJ0L0o4K9k6M5nm1nqM4j7L1N2j74J00
$$ -9 -19 -7 29 -21 42 59 102 58 91 -44 -10 119 -34 -20 -11 -1 29 -35 -6 -32 13 8 -33 -38 -46 -2 -19 12 64 -110 -10
6955a0K4K3o7J3M2J3p4P0o6n0P5o4O0ONJ2P2r1L1l1r4R0L2k0MlJ1OJk6K8k6N0
$$ -10 14 37 -30 -17 25 38 -36 34 -32 -82 -7 -71 -11 -5 0 12 84 -7 24 -7 -101 -11 21 1 5 2 13 19 20 -6 22 -4 46
6988D6m2m6J6j1j7L3j3L2M1p0L1N7o6J9k3K9l9k9K9J2L8lj03R5p6L8m1P1O9p4
$$ 46 4 -42 -26 -37 -54 -21 -34 -2 39 -31 0 57 -9 10 -13 16 -23 -52 -23 -11 27 24 -79 16 -60 -22 -63 8 77 3
7018CL9m6O0l4op0J6K6o8O7L6J0l1LJ7Ok1l2JO3l9OJ8J7j3n7M3K7j0p4P9p4m3
$$ 3 42 -4 56 22 16 -54 -38 -12 -80 -13 23 33 2 5 22 28 7 -25 -24 39 0 6 24 41 28 -29 14 41 31 -43 36 -38 -81
7051h1O3P5o4NJ7nJ0k6K3jl0j3J0J1Kn1J04m4Q3j18k5O4P4j31Q9l2m7M6l0K0J8
$$ -81 -18 57 -7 -2 15 10 20 -6 17 16 -14 -27 -17 -6 -4 -55 49 5 88 -30 -55 9 83 -48 41 9 -38 8 -22 -2 16
7082A6J2KK3q9J9MN5o9L0%Oo7M8K3j6R4qr8ML7k8P1j33J00j3k1K2nJ4j1m5J1J
$$ 16 28 30 53 -36 -17 -13 42 -27 3 3 9 -58 -10 13 -3 91 83 -15 -11 26 -2 69 -64 36 23 2 24 19 33 22 -23 -12 -11
7115a1j2L2Rj6l5J0JQ3k6m2k0M8p3K6K8J3j0J1L0l5j3q3J06l1K1n4R3j07K9P3
$$ -11 -23 9 18 2 -33 -23 -22 61 35 -7 -27 21 -52 -26 2 15 5 16 46 11 -2 -85 21 -10 11 -43 50 -57 -28 45
7145D5j03J51p9j3krO3o1K9n4L7J1k5K9k0O2j08P4k2l7rj2L8M4L2q0OnO5pr3%
$$ 45 -58 93 14 1 -1 -10 53 -8 21 -33 4 15 -10 19 -1 61 -47 27 5 -32 -41 -53 -15 29 61 -19 -13 -18 47 40 -53 -53
7177e3K4K1k1N7o3N5LMq8J51p9n5Q3n2K4L9n5K8n5M6NK0n7KN1m3K0j0l2J4NK4
$$ -53 -29 -8 -29 28 -35 20 23 27 -61 90 11 -44 39 -13 11 50 -5 23 -32 14 19 39 -18 -16 35 -8 12 2 -30 -16 -11 13
7209A3m1l7J05k4ll8J4J0j7lLM0l2m1K4J4O5j3n3J9km3L1K4Ko2N7k2n5J00mm1
$$ 13 -28 -65 40 16 13 -25 -11 -1 -18 -21 -18 22 -10 -51 -27 -13 52 39 -14 5 3 -40 -9 15 17 -45 12 -10 -65 35 31 -10
7241a0M3o6N4K3j28N7L6k0J1o8P0k1jM1n1O1o4P2m6ONMnJ2Jm1J7K9qj5M2Qk5m2
$$ -10 33 -33 21 44 -84 -27 9 -11 0 -68 2 -19 -20 21 -30 31 -33 39 -7 -1 4 8 3 15 16 -25 -8 21 13 -2 40 48 23 -19
7275a9J3L8q6Q4j05J07k0m3J4l4J15l8k7Mm8j5M6m4M7l1K5k6j6J17j04j3P8j6
$$ -19 -6 32 -54 30 -75 32 12 -31 -17 -51 64 26 -1 3 -45 -60 -14 -58 -11 -42 -17 -43 -59 58 -46 -59 19 3
7303CK5m1krNqK8QRj8M6o8J33j05JJL3p1J3N1J1Mm0oR4j08QN9ro0M6k2m8QP0j00
$$ 3 28 -13 -15 -24 -19 -27 1 9 18 0 46 -22 111 6 7 8 41 -30 -17 34 45 49 9 3 97 -11 -3 56 47 -13 33 11 -37 -29 41 -59
7339e9J6OP8p1M3n8L8M2j3kl5l9L1K6jLj5M4j4l3l8O3q6J23q3j4L3J1m0M5k1L8
$$ -59 -43 -37 41 -30 13 -45 -7 35 22 20 -15 -54 -23 3 2 5 -10 34 20 -13 -51 12 -74 49 -34 -48 -15 -4 -44 1 -20 18
7371A8J0k5N7l4j6Ro9J1K2J8k6J5mN9k7O9jj44N3m4N1j04Q7m2J30p8K4j4L8j02
$$ 18 28 3 60 26 10 19 -50 -39 -17 1 -25 -10 -14 45 18 87 86 -58 -5 -49 2 -102 -15 -57 73 -5 19 5 43 -59
7401e9J01l0l5m3mK7PM2l4k2L1L4PPm2Jl3K2J7o2N9QJ0K5Ol4r2Q2M8o0kL6m7N
$$ -59 42 12 -23 -66 -70 -43 -36 6 -28 -50 -19 15 22 29 -13 -12 -45 -23 -6 -68 -9 -1 9 34 40 6 -86 -4 44 -16 -18 18 -29 -24
7435b4K9K2qJqK8l4j0M7rl1q7P5KM5l0q3M3M6njN4p9L4j1RK4n7J4l2M7MK9l5m7
$$ -24 5 27 19 20 12 40 6 -4 43 34 3 -84 -9 -7 38 8 -75 -32 14 9 8 62 -17 17 6 15 39 -18 -4 -36 11 15 44 9 -38
7470c8L2L6J7n0Pj0J6m1K5QM7o3N0qn2N2m8O8l3o4J1k0L6p8J25j8k0Q0l5Jl3J0
$$ -38 -6 30 47 -3 4 -6 10 -31 -6 2 49 -14 36 28 -24 28 -20 48 15 -49 -38 -58 -22 -100 25 7 -13 67 32 33 0 10
7502A0j4Mk8J05r0K4r5Q6Lo3J04p9j3K2M6K5p8L0K6J7o2Jm4N4P0oj9kq5J00n1
$$ 10 -4 0 -28 77 -13 11 -84 2 5 -58 46 -33 -46 -24 22 47 -31 -1 25 42 -20 -19 -63 -9 61 55 36 34 -51 49 -2
7533bJ6N2q6P5p8nJ09q5OPrK1k1pK3J6k8k3M6l3k8J1K2l9J47j26L6K2l0Krqm7
$$ -2 14 66 -20 55 -23 -28 81 -4 2 9 0 21 0 -7 16 32 4 -19 27 -6 -34 -23 -1 -40 107 -19 17 39 9 11 2 -6 -53
7566e3P5k7mmj4N7j8l1N6m0J8K8l6K3n2M6n4N5L7qo4N5%q5L4k3L2LJ4Kj6K0m4
$$ -53 22 -5 -9 -13 -27 30 12 -19 37 -3 15 43 7 30 -22 24 -30 25 62 54 -10 45 45 -40 -6 -29 3 6 20 22 6 26 -18
7599a8M0l0P7l4r7P4K2q0K4O0qj2m1J7Q5j31J14l5n2M3rj8%L4J2Jl1M4Mm5K6j4
$$ -18 22 -8 69 35 -62 12 34 -46 -22 38 30 18 -23 -6 79 -52 62 27 -25 18 9 -9 -9 25 37 38 7 51 55 10 36 22
7631B2o0K9j5j0L7N4q5M9l0K5l1K8l1OM0n3O4j9j0k0N1l2rN0k5k4Lj7j6m1J11
$$ 22 -38 -9 -24 -34 3 57 -28 21 -9 16 -15 13 -18 -12 28 -25 39 20 10 -10 41 9 0 50 25 1 4 -13 -29 -70 41
7662D1m2rk7Q6j8ko7J7Q1j6l8l5K3k2km1k0Q1J0k8L8j3M7o4M6o6NN0J06r8q1Q6
$$ 41 -1 -10 -37 49 31 29 -38 -21 60 44 6 -29 -6 -28 -30 -71 -91 -10 0 -28 10 -3 44 -20 26 -40 -35 15 121 23 -58 28
7694B8r4L6O6k8m5O0l9L5M4n3q7R5L5r8l9J36n0oQ7o3k3O0p2J2j7P8j27P8o8R2
$$ 28 -66 -30 36 8 -37 23 -16 19 63 10 -77 18 53 -45 -84 52 2 -4 83 20 -3 57 -15 -3 -20 58 -69 9 -59 33
7724C3J1J9o8j9K7mL8l4p3Q1k6qK6K1k0N7l6JM9m7K6k0j7m4O1m2N2k3k1J7Op2
$$ 33 44 63 -5 -24 3 -1 37 3 -70 11 -15 -23 3 24 4 61 25 26 75 28 54 34 17 -27 34 -8 44 21 0 17 23 -49
7756d9P8K1k1m7k7J2Q1n9K8K3%m7Jj1O5n5j7K5nK5K2m1J7m4k3M3lL0o9J28q1M3
$$ -49 29 50 29 -18 -45 -33 48 -11 17 40 40 -7 -6 -17 48 -7 -24 1 -4 21 43 2 19 -25 -48 -5 -8 22 -47 81 0 43
7788D3p6m9R7l2mN7k9m6M1n5R2o6JJ0N0o8J6k9L9Lj1j0j3P5m2J7pm9Q9o4l3N0
$$ 43 -33 -82 15 -17 -21 36 7 -39 2 -53 39 -27 -26 -16 34 -34 -18 -47 -8 -5 -16 -26 -39 36 -6 11 4 -45 44 -20 -53 -3
$$ [...]
8191B9
##END NTUPLES=NMR FID
##END=
