##TITLE=1H_Ser N-2025
 200.13MHz, CDCl3,
 8 sc
 
 11.3.2025
##JCAMPDX= 6.0         $$ Bruker NMR JCAMP-DX V2.0
##DATA TYPE= NMR FID
##DATA CLASS= NTUPLES
##ORIGIN= UXNMR, Bruker Analytische Messtechnik GmbH
##OWNER= pz
$$ XWIN-NMR		Version 3.5
$$ Tue Mar 11 14:40:22 2025 Russian Standard Time (UT+4h)  she@DPX200
##.OBSERVE FREQUENCY= 200.1313
##.OBSERVE NUCLEUS= ^1H
##.DELAY= (6, 6)
##.ACQUISITION MODE= SIMULTANEOUS
##.ACQUISITION SCHEME= undefined
##.AVERAGES= 8
##.DIGITISER RES= 18
##SPECTROMETER/DATA SYSTEM= spect
##.PULSE SEQUENCE= zg30
##.SOLVENT NAME= CDCl3
##.SHIFT REFERENCE= (INTERNAL, CDCl3, 0, 14.3821)
##AUDIT TRAIL= $$ (NUMBER, WHEN, WHO, WHERE, WHAT)
$$ ##TITLE= Audit trail, XWIN-NMR		Version 3.5
$$ ##JCAMPDX= 5.01
$$ ##ORIGIN= Bruker BioSpin GmbH
$$ ##OWNER= she
$$ F:/spectra/data/she/nmr/H-C/1/audita.txt
$$ ##AUDIT TRAIL=  $$ (NUMBER, WHEN, WHO, WHERE, WHAT)
(   1,<2025-03-11 14:39:15.20 +0400>,<she>,<DPX200>,
      <created by zg, POWCHK disabled, PULCHK disabled
       configuration hash MD5:
       00 E9 B6 7A A2 85 ED C7 34 08 36 98 17 FE 4E 26
       data hash MD5: 16K
       AE A1 97 E7 BD 4E D5 4D 62 FB 87 08 59 69 90 DA>)
$$ ##END=
$$ 
$$ hash MD5
$$ D1 E5 C1 B5 50 AA 3C F7 59 7D DA E0 63 44 5D A5
##$RELAX= 
##$RELAX= 
##$RELAX= 
##$RELAX= 
##$RELAX= 
##$RELAX= 
$$ Bruker specific parameters
$$ --------------------------
##$DU= <F:/spectra>
##$EXPNO= 1
##$NAME= <H-C>
##$PROCNO= 1
##$TYPE= <nmr>
##$USER= <she>
##$AMP= (0..31)
100 100 100 100 100 100 100 100 100 100 100 100 100 100 100 100 100 100 
100 100 100 100 100 100 100 100 100 100 100 100 100 100 
##$AQSEQ= 0
##$AQ_mod= 1
##$AUNM= <au_zg>
##$AUTOPOS= <>
##$BF1= 200.13
##$BF2= 200.13
##$BF3= 200.13
##$BF4= 200.13
##$BF5= 200.13
##$BF6= 200.13
##$BF7= 200.13
##$BF8= 200.13
##$BYTORDA= 1
##$CFDGTYP= 0
##$CFRGTYP= 5
##$CHEMSTR= <none>
##$CNST= (0..31)
1 1 145 1 1 1 1 1 1 1 1 1 1 1 1 1 1 1 1 1 1 1 1 1 1 1 1 1 1 1 1 1 
##$CPDPRG= <>
##$CPDPRG1= <>
##$CPDPRG2= <>
##$CPDPRG3= <>
##$CPDPRG4= <mlev>
##$CPDPRG5= <mlev>
##$CPDPRG6= <mlev>
##$CPDPRG7= <mlev>
##$CPDPRG8= <mlev>
##$CPDPRGB= <>
##$CPDPRGT= <>
##$D= (0..31)
0 0.7 0 0 0 0 0 0 0 0 0 0.03 0 0 0 0 0 0 0 0 0 0 0 0 0 0 0 0 0 0 0 0 
##$DATE= 1741689554
##$DBL= (0..7)
120 120 120 120 120 120 120 120 
##$DBP= (0..7)
150 150 150 150 150 150 150 150 
##$DBP07= 0
##$DBPNAM0= <>
##$DBPNAM1= <>
##$DBPNAM2= <>
##$DBPNAM3= <>
##$DBPNAM4= <>
##$DBPNAM5= <>
##$DBPNAM6= <>
##$DBPNAM7= <>
##$DBPOAL= (0..7)
0.5 0.5 0.5 0.5 0.5 0.5 0.5 0.5 
##$DBPOFFS= (0..7)
0 0 0 0 0 0 0 0 
##$DE= 6
##$DECBNUC= <off>
##$DECIM= 32
##$DECNUC= <off>
##$DECSTAT= 4
##$DIGMOD= 1
##$DIGTYP= 9
##$DL= (0..7)
0 120 120 120 120 120 120 120 
##$DP= (0..7)
150 150 150 150 150 150 150 150 
##$DP07= 0
##$DPNAME0= <>
##$DPNAME1= <>
##$DPNAME2= <>
##$DPNAME3= <>
##$DPNAME4= <>
##$DPNAME5= <>
##$DPNAME6= <>
##$DPNAME7= <>
##$DPOAL= (0..7)
0.5 0.5 0.5 0.5 0.5 0.5 0.5 0.5 
##$DPOFFS= (0..7)
0 0 0 0 0 0 0 0 
##$DQDMODE= 0
##$DR= 18
##$DS= 0
##$DSLIST= <SSSSSSSSSSSSSSS>
$$ [...]
##$SUBNAM0= <"">
##$SUBNAM1= <"">
##$SUBNAM2= <"">
##$SUBNAM3= <"">
##$SUBNAM4= <"">
##$SUBNAM5= <"">
##$SUBNAM6= <"">
##$SUBNAM7= <"">
##$SUBNAM8= <"">
##$SUBNAM9= <"">
##$SW= 18.0517328524113
##$SWIBOX= (0..15)
0 0 2 0 0 0 0 0 0 0 0 0 0 0 0 0 
##$SW_h= 3612.71676300578
##$TD= 16384
##$TD0= 1
##$TE= 0
##$TE2= 300
##$TE3= 300
##$TEG= 300
##$TL= (0..7)
0 120 120 120 120 120 120 120 
##$TP= (0..7)
150 150 150 150 150 150 150 150 
##$TP07= 0
##$TPNAME0= <>
##$TPNAME1= <>
##$TPNAME2= <>
##$TPNAME3= <>
##$TPNAME4= <>
##$TPNAME5= <>
##$TPNAME6= <>
##$TPNAME7= <>
##$TPOAL= (0..7)
0.5 0.5 0.5 0.5 0.5 0.5 0.5 0.5 
##$TPOFFS= (0..7)
0 0 0 0 0 0 0 0 
##$TUNHIN= 0
##$TUNHOUT= 0
##$TUNXOUT= 0
##$USERA1= <user>
##$USERA2= <user>
##$USERA3= <user>
##$USERA4= <user>
##$USERA5= <user>
##$V9= 5
##$VALIST= <valist>
##$VCLIST= <CCCCCCCCCCCCCCC>
##$VD= 0
##$VDLIST= <DDDDDDDDDDDDDDD>
##$VPLIST= <PPPPPPPPPPPPPPP>
##$VTLIST= <TTTTTTTTTTTTTTT>
##$WBST= 1024
##$WBSW= 4
##$XGAIN= (0..3)
0 0 0 0 
##$XL= 0
##$YL= 0
##$YMAX_a= 225868
##$YMIN_a= -274454
##$ZGOPTNS= <>
##$ZL1= 120
##$ZL2= 120
##$ZL3= 120
##$ZL4= 120
##$ABSF1= 10
##$ABSF2= 0
##$ABSG= 5
##$ABSL= 3
##$ALPHA= 0
##$AQORDER= 0
##$ASSFAC= 0
##$ASSFACI= 0
##$ASSFACX= 0
##$ASSWID= 0
##$AUNMP= <proc_1d>
##$AZFE= 0.1
##$AZFW= 0.1
##$BCFW= 1
##$BC_mod= 2
##$BYTORDP= 1
##$COROFFS= 0
##$CY= -3
##$DATMOD= 1
##$DC= 2
##$DFILT= <>
##$DTYPP= 0
##$F1P= 0
##$F2P= 0
##$FCOR= 0.5
##$FTSIZE= 0
##$FT_mod= 4
##$GAMMA= 1
##$GB= 0.15
##$INTBC= 1
##$INTSCL= 1
##$ISEN= 128
##$LB= 0.25
##$LEV0= 0
##$LPBIN= 0
##$MAXI= 10000
##$MC2= 0
##$MEAN= 0
##$ME_mod= 0
##$MI= 1.114404
##$NCOEF= 0
##$NC_proc= 0
##$NLEV= 6
##$NOISF1= 3.799351
##$NOISF2= 2.8
##$NSP= 1
##$NTH_PI= 0
##$NZP= 0
##$OFFSET= 14.38212
##$PC= 1
##$PHC0= -474.6291
##$PHC1= 25.59221
##$PH_mod= 1
##$PKNL= yes
##$PPARMOD= 0
##$PSCAL= 0
##$PSIGN= 0
##$REVERSE= no
##$SF= 200.129724274929
##$SI= 16384
##$SIGF1= 3
##$SIGF2= 2
##$SINO= 400
##$SIOLD= 16384
##$SREGLST= <1H.CDCl3>
##$SSB= 0
##$STSI= 0
##$STSR= 0
##$SW_p= 3205.1282051282
##$SYMM= 0
##$S_DEV= 0
##$TDeff= 0
##$TDoff= 0
##$TI= <>
##$TILT= no
##$TM1= 0
##$TM2= 0
##$TOPLEV= 0
##$USERP1= <user>
##$USERP2= <user>
##$USERP3= <user>
##$USERP4= <user>
##$USERP5= <user>
##$WDW= 1
##$XDIM= 8192
##$YMAX_p= 0
##$YMIN_p= 0
$$ End of Bruker specific parameters
$$ ---------------------------------
##NTUPLES= NMR FID
##VAR_NAME=  TIME,          FID/REAL,        FID/IMAG
##SYMBOL=    X,             R,               I
##VAR_TYPE=  INDEPENDENT,   DEPENDENT,       DEPENDENT
##VAR_FORM=  AFFN,          ASDF,            ASDF
##VAR_DIM=   8192,          8192,            8192
##UNITS=     SECONDS,       ARBITRARY UNITS, ARBITRARY UNITS
##FACTOR=    0.0002768,     1,               1
##FIRST=     0,             0,               0
##LAST=      2.2672688,     0,               0
##MIN=       0,             -274454,         0
##MAX=       2.2672688,     225868,          0
$$ Real data points
##PAGE= N=1
##DATA TABLE= (X++(R..R)), XYDATA
0@%%%%%%%%%%%%%%%%%%Mj0J4j6J6j6J6k0K8l2L4m0M6n2N8o6P4q4R8j09J21j35
40g1J51j69J87k05K25k48K74l02L32l67M04m45M92n41N97o63P38q22R19j035J175
61F26j347J565j850K241k816L740n486R902m2112q9527P4942J52619J16858O513
75B25868o1086n7124j3254j2534m5078o2993l4442j1841k0872l6260k4595M686
87a49525M1044N0486L1452J8900L1791M6918L9658N230k1822k0254j330R958o135
100G6371m2547n7798m1396j5957k545k4M198J4046K0129J9695R251k48J2797L5224
114C1196L7455J9817p307l0587l0034q882N044L27j1232j2885j0719j4456j5930
127d8193j2820M95K4326L4962J6855p936j5391k809J6593K2671J3613j393j0339
$$ plain form
0 0 0 0 0 0 0 0 0 0 0 0 0 0 0 0 0 0 0 0 4 -6 8 -8 8 -8 8 -12 16 -16 18 -22 24 -28 30 -36 38 -46 52 -57 64 -71
40 -71 80 -89 98 -107 118 -130 144 -158 174 -193 211 -234 258 -283 314 -349 389 -433 486 -549 626
61 626 -721 844 -1006 1235 -1581 2159 -3327 6575 -35537 -125064 -50122 102497 219355 225868
75 225868 164782 107658 94404 81870 36792 -26201 -60643 -72484 -93356 -129616 -154211 -149525
87 -149525 -108481 -57995 -26543 -7643 24148 71066 110724 115954 94132 73878 72548 82506 76371
100 76371 33824 -23974 -65370 -81327 -83872 -83896 -79698 -65652 -45523 -25828 -16577 -16825 -4028 31196
114 31196 68651 88468 81161 50574 20540 11658 16702 17029 5797 -7088 -17807 -32263 -48193
127 -48193 -61013 -60518 -36192 -1230 15625 7689 -7702 -10511 6082 28753 42366 40973 30634
140C0634p919o970j1871r562j583J884m99p615j2603o355M480R265J918m208O298
155a4706K3902K6586J0892j4665k7787j1707J5340K3047O477j7826k8061k1403
167b9911p244N524Q378O193P171K473n346k863R288K0060J9925O638q685j2382
181A9219n852J490j558j2219j4227r246j905L109O38n144n180L353J5298K0084
195G860J5005P104j347n205j890O03k121k515m562r755j4741j5714r823L3Q831
210b8237J1222M635m73M164R433J0343R860N265K176K235m15p184j3467j3698
224d141o824j526m52k375o290o503j74M550P567J1273J1854J0312M663j243k580
239A8111o85J073J459m412j0110q951n859l674k810m595k997J808P504R275N083
$$ plain form
140 30634 22715 15745 3874 -5688 -7271 -5387 -5886 -13501 -26104 -32459 -27979 -18714 -16796 -21004 -14706
155 -14706 9196 35782 46674 32009 4222 -7485 7855 30902 37379 19553 -8508 -29911
167 -29911 -37155 -31631 -23253 -17060 -9889 -7416 -12762 -15625 -6337 13723 33648 40286 31601 19219
181 19219 13367 14857 13299 1080 -13147 -22393 -24298 -21189 -20551 -25695 -30875 -27522 -12224 7860
195 7860 22865 29969 28622 23417 21527 22130 20009 17494 12932 3177 -11564 -27278 -37101 -37068 -28237
210 -28237 -17015 -12380 -12853 -8689 744 11087 20947 26212 28388 30623 30208 23024 9557 -4141
224 -4141 -10965 -12491 -12943 -15318 -21608 -28111 -28285 -23735 -16168 -4895 6959 17271 21934 20691 18111
239 18111 17426 18499 19958 15546 5436 -3515 -9374 -13048 -15858 -20453 -23450 -21642 -14138 -4863 220
254B20J69Q49K953N327P843M435j018m903p707p403l667N16K071k000p194q059
270a7568l931K946R662Q040K287k56n35K437N261L461R3k596k280P59L5k396l919
287A500o150n002o36J381J714J479m86k68m05J765M944N237L243J834k808l005
303D337K53J308J425r94l282l883l767k764m92p65R21K978J384K32M52J207J702
320B52K785J646J295P86Q14n5k812l561j593j110K81P88k000l108k711k89K064
337f528L482K856J447q24L12K554J812Q26M51j734j348m33p44j734j733k323j420
354e081n64J033K361j21j249m80J47K577M155L287N61j366k266p98K42J370L90
371D198k512l235k026j488M54J006n62n23N76J145K445J784J073R60n7O59J745
$$ plain form
254 220 389 1238 4191 9518 17361 21796 20778 15875 8168 765 -2902 -2386 -315 -2315 -9509 -17568
270 -17568 -21499 -18553 -8891 -851 1436 1180 645 3082 8343 11804 11897 9301 7021 7780 7815 5419 1500
287 1500 -4650 -9652 -10288 -8907 -7193 -5714 -6200 -6468 -6873 -5108 -164 5073 8316 10150 7342 4337
303 4337 4590 5898 7323 6329 3047 -836 -4603 -7367 -7859 -8624 -7703 -4725 -3341 -3109 -2657 -1450 252
320 252 3037 4683 5978 6764 7578 7523 4711 1150 -443 -1553 -1272 -484 -2484 -5592 -8303 -8592 -6528
337 -6528 -3046 -190 1257 433 745 3299 5111 5937 6388 4654 3306 2873 2129 395 -1338 -3661 -5081
354 -5081 -5645 -4612 -2251 -2372 -3621 -4101 -3954 -1377 2778 6065 6626 5260 2994 2196 2438 3808 4198
371 4198 1686 -1549 -3575 -5063 -4609 -3603 -4165 -4688 -4112 -2967 -522 1262 2335 3295 3238 3897 5642
388E642l71j324j498k399j048k45j65n84j500j815o95K50K314K693J377N37R63
405B132O67J038J237K72p18j316j004j355j515j051j220k148r88N13J433J962
421b061J244K11L65N22J269K061R87J251k97k099k356j441j33N13Kj949k215j628
439e754M62J550J671J231O14J79J317J525P13M67l79p94n15n63P5o64j918j366
457b149j547l69J140J349M1j24j17J50J646R02J140J91r9K64K8l86l9m40j305
476B76p98p19m05n8k89m83m00K87J254J669L08J0m26l66J591J459Q19m08j512
495A809k060j119j82J449K67n67r49j419o25J123J405N35M08L36P57J052J80N85
513B985j036j089o8n06o8Q8j447j779p18m8J142J844J500N44r47q5Q80Q84Q10
$$ plain form
388 5642 5271 3947 2449 50 -998 -1243 -1408 -1992 -3492 -5307 -6002 -5752 -3438 -745 632 1169 2132
405 2132 2799 3837 5074 5346 4628 3312 2308 953 -562 -1613 -2833 -4981 -5969 -5456 -4023 -2061
421 -2061 -817 -606 -241 281 1550 3611 4598 5849 5552 3453 1097 -344 -477 36 38 -1911 -4126 -5754
439 -5754 -5292 -3742 -2071 -840 -226 -47 1270 2795 3508 3975 3596 2802 2287 1724 1799 1135 -783 -2149
457 -2149 -3696 -4065 -2925 -1576 -1535 -1659 -1776 -1626 20 922 2062 2253 2154 2418 2446 2060 2021 1581 276
476 276 -522 -1241 -1646 -1704 -1993 -2476 -2876 -2589 -1335 334 642 652 226 -140 1451 2910 3729 3321 1809
495 1809 -251 -1370 -1552 -103 164 -403 -1352 -2771 -3396 -2273 -868 -333 75 411 1168 2220 2400 2985
513 2985 1949 860 792 286 218 306 -1141 -2920 -3638 -3686 -2544 -700 800 1344 397 312 1192 2076 2886
532B886O11k27j231j102j208j153o58p79k34J20K66J172M70l48Q39N63J475K258
550C720J198l0j632j286q49p25l99n36j389j693p53l22N59J561J382O37K80M46
568A69J533K317J220j27j637j177j46o22n87j299k219j411N0M05N58K61m63M25
586b750L22J884K720J966P81n12j577o51J39N55l66j580k048j416j187j97K8k96
604d185O45J057J000J334J195L56L68M15Q85J171K28r3j219k288j703n67k31j18
622a750n90r78r12k03O32J377J380J068J020N91O56J167O98L19q90j287q42j82
640A274p33q25j781j424j67m38Q29O84J60L12P77P79J768J785J332j96j051j165
658A920q5Q84M86j249k449j945j390J43L33M5k24O80R24J441J303M16Q52J07L11
$$ plain form
532 2886 3497 3270 2039 937 -271 -1424 -2082 -2861 -3095 -2975 -2709 -1537 -1067 -1415 -576 -13 1462 3720
550 3720 4918 4888 3256 1970 1121 396 -3 -539 -1928 -3621 -4374 -4696 -4137 -2576 -1194 -557 -277 169
568 169 1702 4019 5239 5112 3475 2298 2152 1530 943 -356 -2575 -3986 -3936 -3531 -2973 -2712 -3175 -2750
586 -2750 -2428 -544 2176 4142 4923 4411 2834 2183 2322 2877 2511 931 -1117 -2533 -3720 -3917 -3889 -4185
604 -4185 -3540 -2483 -1483 -149 1046 1402 1770 2185 3070 4241 4469 4376 3157 869 -834 -1401 -1632 -1750
622 -1750 -2340 -3318 -4230 -4433 -3801 -2424 -1044 24 1044 1635 2291 3458 4156 4475 3585 2298 1456 1274
640 1274 541 -284 -2065 -3489 -3656 -4094 -3265 -2581 -2421 -2109 -1332 -553 1215 3000 4332 4136 3085 1920
658 1920 1835 2719 3205 1956 -493 -2438 -3828 -3685 -3352 -3307 -3531 -2851 -1927 -486 817 1233 2085 2192 2503
677B503O08Q39K39p06k051k342j399L7Q38q3j123j440PJ027J635J362N88M77Q42
696A858K71R55M13jq67j280r21o41k66j20j113j548p06P44J140J168N14n4M43
715a1J71J378J189M71j06q56j423j97K05j85m15j637j050m43N96O02L35K50K56
734h70O94Q28O38L00L10P7k66n65J61j79k64j259j201o13M30J009L79l95p87k2
754a595Q39J347K48M3K06J1j1q0J13l88j60p07r11K52L53L09k78p73m27K51P80
775e78J374K34m35n14j89N07O80K62m3j244p98q8M70M76L14m46r17l06O6O51P12
796A88J0j68j64k5M91N25L43J9p36n03M2J13L22l79q05p67K1O04P90O2j93k32
818d42L02K11Q99K39j15k20l71J50o4k66j17p89m97j30L30K08K70n55k54L03P28
$$ plain form
677 2503 3111 3950 4189 3483 1432 -910 -2309 -2272 -1434 -1517 -2640 -4080 -4073 -3046 -1411 -49 539 1016 1858
696 1858 2129 3084 3497 3496 2629 1349 428 -213 -479 -599 -1712 -3260 -3966 -3222 -2082 -914 -400 -454 -11
715 -11 160 1538 2727 3198 3092 2236 813 616 821 636 221 -1416 -2466 -2909 -2313 -1711 -1376 -1126 -870
734 -870 -176 652 1290 1590 1900 1977 1711 1146 1307 1128 864 -395 -1596 -2209 -1779 -770 -391 -786 -1573 -1595
754 -1595 -756 591 839 882 1088 1099 1088 1008 1121 733 573 -134 -1045 -793 -440 -131 -409 -1182 -1609 -1358 -578
775 -578 796 1030 595 81 -108 399 1079 1341 1298 54 -744 -832 -362 114 428 -18 -935 -1241 -1175 -524 188
796 188 198 30 -134 -159 332 857 1200 1219 483 -20 22 135 457 78 -727 -1494 -1473 -869 -79 -17 -210 -442
818 -442 -140 71 970 1209 1094 874 503 653 589 323 206 -583 -1080 -1210 -880 -672 -402 -957 -1211 -908 -180
839a80R83P42n74rm21Q4N44n8l58p52r58j28K12J42J0k9n51J37K94J033J070k3
861A210k17j42k63K02L26j22m38k81q11k04O6r4ml63l33M38M26P34O69m46m5J15
883D23J75N41J43k03k62p08j18l57Q8J44l29o99Q2J50K52N38J7l93n0O42O84L45
905A105j88j30q0%j29L04k73l06n50k48m75Q6J74p7l09j85N92R3Q89L14O4j43
927E28R6K94O63ml64n92o42j66n06n1j81m46kl20K24N54N22N23J53L32K68O29
949A512K53p0k27q7q07m39n03j33m70m90k47qK33N75J68J45K70R29K57O01L12
970A774o1l70k96l29J05l01k90p49q14j38n07N24K48J45K39mP20P83M12L58k27
991A222k7j94L76k14k64n49p71m83j47K18l7Q3n00m4J46M66R02L96n0J16J37M38
$$ plain form
839 -180 803 1545 971 962 541 625 1169 1111 753 1 -957 -1085 -873 -731 -721 -750 -1301 -1164 -870 163 1233 1210
861 1210 993 851 588 790 1116 994 556 275 -536 -740 -674 -768 -772 -1135 -1468 -1030 -604 130 799 353 308 423
883 423 598 1139 1282 1079 817 109 -9 -366 -278 -134 -463 -1162 -1080 -930 -678 -140 -123 -516 -566 76 760 1105
905 1105 917 787 707 707 578 882 609 303 -247 -495 -970 -884 -710 -787 -1096 -1281 -689 -596 293 607 671 528
927 528 624 918 1581 1577 1213 621 -21 -187 -693 -744 -925 -1371 -1373 -1693 -1469 -915 -393 130 283 615 883 1512
949 1512 1765 1695 1468 1381 574 135 -368 -501 -971 -1461 -1708 -1716 -1483 -908 -740 -595 -325 604 861 1462 1774
970 1774 1713 1343 1047 718 823 522 232 -517 -1331 -1469 -1976 -1452 -1204 -1059 -820 -824 -104 679 1091 1449 1222
991 1222 1195 1001 1377 1163 899 350 -421 -904 -1051 -833 -870 -787 -1287 -1331 -1185 -719 183 579 529 645 782 1220
1013A220L38j18m11n14n12jl04k47l95m56j42k76O32L78M94K35J78K29N03O75
1033A506k76N7k95l8j59m05l43k94n34o30K01k31R5N19O3K07L66K67M05N15K78
1054A274r7N8o8k75n98j65m11k71n45j68J02K09J53L26j20J63L05N79L90J74Q8
1075A103k46o3k23l28K49n07l64n9m23j9K09M21k52R5L5K17Q05NM3o3j96P0J32
1098F41k28k91j48q2l40K09j22j6j19p5L14K0M77K41j38j35pp4N96j55m37m3j79
1121i1P9K05k99k10j50n0K58N8J03L09j83r9nJ17K90L66j53p09Rq3K02j53J0k18
1145c97O6J90l7j7L46k49O0M05j23j95M39O7o1j68l08k03O2k48R4R0l16L4j66
1168f35J87L79K00M3O9J16J34L03J25l28l59o0l70J16l23j06K4q3O0pJ59J68J00
$$ plain form
1013 1220 1558 1440 1029 515 3 2 -302 -549 -944 -1400 -1542 -1818 -1186 -808 -314 -79 99 328 831 1506
1033 1506 1230 1287 992 954 795 390 47 -247 -781 -1411 -1210 -1441 -1346 -827 -764 -557 -191 76 481 996 1274
1054 1274 1177 1235 1167 892 294 129 -282 -553 -1098 -1266 -1164 -955 -802 -476 -596 -433 -128 451 841 1015 1103
1075 1103 857 794 571 243 492 -15 -379 -438 -861 -880 -671 -250 -502 -407 -372 -155 650 655 698 635 439 509 641
1098 641 413 122 -26 -108 -448 -239 -361 -377 -496 -571 -257 -237 240 481 343 208 201 127 723 568 131 88 -91
1121 -91 -12 193 -106 -316 -466 -516 -258 -200 -97 212 29 -70 -75 42 332 698 545 -164 -155 -238 -36 -189 -179 -397
1145 -397 -331 -141 -178 -195 151 -98 -38 367 244 49 488 555 494 326 18 -185 -123 -371 -277 -187 -503 -469 -635
1168 -635 -448 -69 131 174 243 359 493 796 921 593 234 174 -196 -80 -403 -509 -485 -568 -508 -515 -356 -188 -88
1191h8L28J56mL32J29k89K76m55j09m1k41k43k78m56K12j03L62M8K56J9K03K86
1213C00K93K57r1l30k23L63Ml13j81m53k58j35K24o0m3P8K12N0L02J68Q5K46J28
1236F23LJ90l04J17K4o97j92k14j26J61j79j23J79J15l3K20R6K72J96O6R5j51
1258C38J34P4k17k00j13n5K5l30q9L5k53J12J84l4L47L32o5K7P9l02O38l00j79
1281A88P8k78J36L0q7k0l05J21j38L0J42L1k26J30J34N9k24L62N5K15j75L5j02
1304A91Q9l6p3p8k38J22J5k86k14K95J5K5j04K04L4K37J48j81J74j62j88Q6j27
1327e2R0J03R7q5k86r4J58k49m8J25J71j54K00j51J47K93j05j52m7J17m8K10j30
1350A10k32K2k66K73L74m17K40K9k30l1j29K13J07J27j30j69N7n3L0J22k47K08
$$ plain form
1191 -88 240 396 392 724 853 564 840 385 276 235 -6 -249 -527 -983 -771 -874 -512 -464 -208 -189 14 300
1213 300 593 850 759 429 206 569 573 260 79 -374 -632 -767 -543 -603 -646 -568 -356 -306 -4 164 249 495 623
1236 623 626 816 512 629 653 -44 -236 -450 -576 -415 -594 -717 -538 -423 -456 -236 -140 132 328 394 489 338
1258 338 472 546 329 129 16 -39 -14 -344 -433 -398 -651 -539 -355 -389 -42 290 225 252 331 29 667 367 188
1281 188 266 -12 124 154 67 47 -258 -137 -275 -245 -103 -72 -298 -168 -34 25 -199 163 218 433 258 293 191
1304 191 280 244 171 93 -145 -23 -8 -294 -508 -213 -198 -173 -277 -73 -39 198 346 165 339 177 -11 75 -52
1327 -52 38 141 238 153 -133 -227 -69 -318 -366 -241 -70 -224 -24 -175 -28 265 160 8 -39 78 30 240 110
1350 110 -122 -100 -366 -93 281 -136 104 133 -97 -128 -257 -44 63 190 60 -109 -52 -105 -75 47 -200 8
1372HR2J87j61Mj2j00O5J42j93R7n0O1l52K6j23K14Qrj60L8J64O7K3J61J09k62
1398D4K22j60J38M2j57j19l5j31o7J10j14rL3q8J21R9J59L9P9Q5J88j99L43k82
1422C41k08k99L19l74K96l22N9k56l2P2J51j09Q3L19k48L23J11k1R2j35L7k3n1
1445A25J55l4K4m57j69J34p3J00k71Q9J60j5J94qJ03Q8q5L89l8j15L3O6j63j01
1469A31l00R4Rk82p5k05J48n5L00j8O9J38J51O8j25L87j18J90N0j7j59Ol54p5
1493d2k03l16O0J36j66J16j39K38J19Q0J93K33K79l9j09J92k83jk15k56j7j85
1515c25jL7k57j63P8J20K59K56n2J71R2N4K45k4j5K4k67j59J08j50j53k03l71
1538f96J67O0Q0K42K2Q2J13Q3J24N2J0J54j75Kk59j45K72k69k08p4pl2j2J36k76
$$ plain form
1372 8 100 287 126 130 118 18 83 225 32 129 79 140 -212 -186 -309 -95 -87 -96 -256 -218 -54 13 36 197 306 44
1398 44 266 106 244 286 129 10 -25 -156 -223 -113 -227 -236 -203 -291 -170 -71 88 127 206 291 479 280 623 341
1422 341 133 -166 153 -221 75 -247 -188 -444 -476 -404 -253 -362 -279 40 -208 115 226 205 297 162 199 176 125
1445 125 280 246 270 -187 -356 -222 -295 -195 -466 -377 -217 -232 -38 -46 57 145 60 449 411 296 329 395 232 131
1469 131 -169 -75 -66 -348 -423 -628 -480 -535 -235 -253 -184 -46 105 173 48 435 317 507 557 540 381 387 33 -42
1493 -42 -245 -561 -501 -365 -531 -415 -554 -316 -197 -117 76 309 588 549 440 632 349 348 133 -123 -140 -325
1515 -325 -326 -289 -546 -709 -631 -511 -252 4 -48 123 215 269 514 490 475 499 232 73 181 31 -122 -325 -696
1538 -696 -529 -469 -389 -147 -125 -43 70 153 277 329 339 493 318 320 61 -84 188 -81 -289 -363 -370 -402 -414 -278 -554
1563e54J95K42pL36l4K61n8k60Q1P1O8l11J68l68J60k55NM2K9j8m4M0l9J53k63
1588c60K99L36k37J91m2o6K94k74P5j42j74J10o4k05q8P7K45j28j01J61R6k61
1610b58L54J12m2N1l2Lj00J37Mk45J6j67J00O1o2J20o1l29J95Q7J04j8nJ83J19
1635C27p9j66J80N0J16l18j86K40n7j55j17M3j1R9j56K42k20m5J49J6J38j64K1
1658e3K10o1j24K74k38o2j19K91o3J13k37J5m9O7q8Q8k4J35L0l37K03q4j2N7K7
1683d1P0q9J02J28J22l90J98k4j33K2j97K30p6J24j02j63K52j58q5o9N81k87Q2
1706I7p6K56j81K74k48j27lj3j80J27J49j32j39k14K11j16L45Q3j08N3j1N8L29
1729D34k05q9O8k64K46j83k9n4j52J26m1M1j44K02l5J9j64L64l4j86K5R8K6p9
$$ plain form
1563 -554 -359 -117 -124 212 178 439 381 121 202 273 341 30 198 -170 -10 -265 -260 -218 -189 -207 -251 -211 -250 -97 -360
1588 -360 -61 275 38 229 187 121 415 141 216 74 -100 10 -54 -259 -347 -270 -25 -153 -254 -93 3 -258
1610 -258 96 208 166 217 185 188 88 225 229 -16 0 -167 -67 -6 -68 52 -9 -338 -143 -56 48 30 25 208 327
1635 327 248 82 262 312 428 110 -76 164 107 -48 -165 -122 -133 -34 -190 52 -168 -213 -64 -48 90 -74 -53
1658 -53 157 96 -28 246 8 -54 -173 118 55 168 -69 -54 -103 -36 -124 -36 -60 75 105 -232 -29 -113 -125 -68 -41
1683 -41 29 -60 42 170 292 -98 100 76 -57 -35 -232 -2 -78 46 -56 -219 33 -125 -210 -279 302 15 97
1706 97 21 277 96 370 122 -5 -8 -21 -201 -74 75 -57 -196 -410 -199 -315 30 113 5 58 47 105 434
1729 434 229 140 208 -56 190 7 -22 -76 -228 -102 -143 -102 -246 -44 -79 -60 -224 140 106 -80 -55 43 69 -10
1753a0L28k30Q6k43r9P8O3L4Q4k65j0j32L30k49K75N1N2k13O4K34r7j18l9J75
1777A49Q3o9P5j39J05l06pN1J30J5k0q9k10J86o9K51q0j9K7P8Q4j76K8O8j0m8
1803H8R2l76L20k70P3j37R2J2k31L13kj08K03J24p8p7J46j87N8J40J4j61L5j96
1827a13N7R2j49J4j60J98j59N8L12j96K8K09K7j50O8K1j43L5J29o7o0j53J3J13
1851B4q5j15o5R7J31j04n2K0O9O5L5J49Rl6J0j29J67m9r7J30L7n38K03J70O0q9
1877A7k72M7O4K9O2J01O9r6P8p2J85n6m0Q4k40J17m5m4l9j24J37r9k59Q4J29J81
1903bj45P4m6P7J97O4m5M4MK9j79j25J1J92j81j42L7p6N3j5J08K06o1nR9k2J02
1930B53K5j9o2l09J65o1J00j14m05K31L7m2mJ16J66J7k21K47j98R3J04k7Lj1o2
$$ plain form
1753 -10 318 88 174 -69 -168 -90 -27 7 91 -174 -184 -316 14 -235 40 91 143 -70 -6 228 131 13 -26 149
1777 149 232 163 238 99 204 -102 -109 -58 72 87 67 -22 -232 -46 -115 136 56 37 64 142 226 50 78 146 136 88
1803 88 180 -196 124 -146 -73 -210 -118 -106 -337 -24 -26 -134 69 193 115 38 184 -3 55 195 209 48 83 -113
1827 -113 -56 36 -113 -99 -259 -61 -220 -162 150 -46 -18 191 218 68 136 157 14 49 178 111 51 -102 -89 24
1851 24 -61 -176 -241 -144 -13 -117 -169 -149 -80 -15 20 169 178 142 152 23 190 141 44 174 211 -327 -124 46 106 17
1877 17 -255 -208 -144 -115 -53 48 117 21 99 27 212 156 116 200 -40 77 32 -12 -51 -175 -38 -137 -396 -312 -183 -2
1903 -2 -147 -73 -119 -42 155 219 174 218 222 251 72 -53 -42 150 -31 -173 -136 -212 -159 -174 -66 140 79 74 173 151 253
1930 253 278 259 197 -112 53 -8 92 -22 -427 -196 -159 -201 -205 -89 77 94 -127 120 -78 15 119 92 95 84 22
1955B2R6j59J79pn2K6j09j65K7J31l5J04k89J85Q7k14M34k65K36l52K10J21j24
1978H7J46l78M6m8J26j28K35j81p4o4J0L26j36j42R5J58J14j62p7N2L04k91p0
2001e2L80j02j12l08L70l65J32j50J38r7J23lN8k08Q2K17j53R0J36M4j94K6k6
2024B6N8r4n0J61l4j62r4J07o1L09m01K6J76K6L8K91m7j42K2q9J85p0q2j71O2
2049a0K5q6P2j22J7K3m1K83j47O0K10j25Jj7j96L06q3O1N3j49j99J89k40R6Q9
2074G0j74R5j11q5p3L33N3j59J13j55K70P8l19J08J28o8l07K48j94J71m2o1j38
2097b19K62nj24j07K6L09k07J6K2O6M0J33j34L6k11L30m04L69m9l62R8Oq3K29
2121C7k2j25j05R4Q8K8J06o5j5J50j65j94R7L88k44j03R9l80M70l34J11J3oj43
$$ plain form
1955 22 118 -41 138 131 79 105 -4 -169 -142 -11 -46 58 -231 -46 41 -173 261 -4 232 -120 90 211 87
1978 87 233 -145 -99 -147 -21 -149 86 -95 -169 -233 -223 103 -33 -175 -80 78 192 30 -47 5 309 18 -52
2001 -52 328 226 114 -194 176 -189 -57 -207 -69 -166 -43 -46 12 -196 -114 103 -50 40 176 220 26 52 26
2024 26 84 -10 -60 101 67 -95 -189 -82 -143 166 -235 -209 -33 -7 31 322 275 133 155 66 251 181 99 -72 -10
2049 -10 15 -71 1 -121 -104 -81 -122 161 14 74 284 159 160 143 -53 253 170 231 284 135 -64 125 -115 -19 70
2074 70 -104 -9 -120 -205 -278 55 108 -51 62 -93 177 255 -64 44 172 104 -203 45 -149 22 -20 -81 -219
2097 -219 43 38 -86 -193 -167 142 -65 -49 -27 39 79 212 78 114 -97 233 -171 198 149 -213 -115 -109 -192 37
2121 37 15 -110 -215 -121 -33 -5 101 36 21 171 6 -188 -91 297 53 -50 49 -331 139 -195 -84 -71 -77 -220
2145b20P7P0J39j78R9L5R5j72m9P7Q1o3Q2j59L5K00j40Q9k14L4J10k91J04R2q
2170g5n3K54K8k56mJ71j29K05kq1j8K0k7j91M32k81j76K08k70J57J70L5k80j20
2194b83K91n8K0o8J82k3k01J86j12K27n6K3j40O8j48j4K8o2J09J39j96j98P6J27
2218h3J19L0o2j05L02P6l41M6K3j43K99J4k21j96K71n8j5J30j06J33j02J67k27
2241d9J68rj03lK09k31q9J21L9J69l56oL26j12p2K06Qm55K58p8J50q7J56r0k14
2266a44J08R4m4J78j30k86L69j83J87j50j51J12j72J82KJ73J33l86J39J02l6j2
2288H5o1l76O81k63mnK14j71j56j29J33K9j7J26k12R9m4l2J35M5J08k30J05j1
2312D9o1k70J27L39j65j27J23j17N4j05k01J91j93L10j34J68M6L1j36K29o4O4
$$ plain form
2145 -220 -143 -73 66 -112 -13 22 117 -55 -104 -27 54 -9 73 -86 -51 149 9 98 -116 -82 28 -263 -159 -67 -75
2170 -75 -128 126 154 -102 -106 65 -64 141 139 58 40 60 33 -158 274 -7 -183 25 -245 -88 82 117 -163 -283
2194 -283 8 -50 -30 -98 84 61 -140 46 -66 161 105 128 -12 56 -92 -106 -78 -140 -31 108 -88 -286 -210 -83
2218 -83 36 66 4 -101 201 277 -64 -18 5 -138 161 175 -46 -242 29 -29 -44 86 -20 113 11 178 -49
2241 -49 119 110 7 4 213 -18 -107 14 53 222 -134 -140 186 74 2 208 216 -239 19 -59 91 4 160 70 -144
2266 -144 -36 58 14 192 62 -224 145 -38 149 -1 -152 -40 -212 -30 -28 145 278 -108 31 133 97 85
2288 85 24 -352 329 66 62 57 271 100 -56 -185 -52 -23 -40 86 -126 -27 -71 -103 32 77 185 -45 60 49
2312 49 -12 -282 -155 184 19 -108 15 -102 -48 -153 -354 -163 -356 -46 -180 -12 34 65 -71 158 94 158
2334A58j50p1L67k92k1j32J22R5k0k51M9M0j4Q9l24J73J65J60q8j29J07J07k5
2357A15k43L69j99J55j10j38K94n05L34j6j94QJ32M4J19p3L6k6q6L5L7M6j81P8
2381C1o8q7J96J03n6m37K65K4l99J51L05Q5k77J55L3j18J56l0r3J72N7n6k27K99
2405A84j21j39K69k52R7j68L1J16j59K20k37j3J65M2K25j09j84K2L05m19K98j15
2427E8M7k88M6o5J84q1O8l7N7j6rQ9j26P7j01J92o0m8j86K14R6j62J60k91J76
2452fK67j54j13mK8lN3P6k4p8P9L9j42K03o2m11M37j80J5m8k3L6j27L76l51Q7
2478c0K1Q0j68j50M29j11M2q8rJ17j09m3QlJ65j63k12L38O1j8n4r7j12K27j6j73
2504f8N1J85n98K99q8J53m6J64j24J09J7o4J12k78J89p5P9j24L47l84J30Mj29
$$ plain form
2334 158 8 -63 304 12 -9 -141 -19 76 56 -195 -146 -106 -120 -31 -355 -182 -17 143 55 -74 33 140 115
2357 115 -128 241 42 197 87 -51 243 -262 72 56 -138 -130 2 46 165 92 128 102 16 51 88 134 -47 31
2381 31 -37 -124 72 175 119 -318 -53 -29 -428 -277 28 113 -164 -9 24 -94 62 32 -61 111 168 112 -115 184
2405 184 63 -76 193 -59 38 -130 -99 17 -142 78 -159 -172 -7 35 260 151 -33 -11 294 -125 173 58
2427 58 105 -183 -137 -202 -18 -99 -31 -68 -11 -27 -36 53 -73 4 -97 95 35 -13 -199 15 111 -51 109 -182 -6
2452 -6 261 107 -6 -10 18 15 68 144 120 42 121 160 18 221 159 -252 185 5 20 -28 -51 -15 -142 234 -117 -30
2478 -30 -9 71 -97 -247 182 71 113 25 16 133 24 -19 -11 -14 151 -12 -224 114 175 157 103 6 -106 121 105 -68
2504 -68 -17 168 -430 -131 -219 -66 -112 52 -72 37 54 -10 102 -176 13 -62 17 -107 240 -144 -14 -10 -139
2527a39P6O1Q6j67L25j03j50L5nN9q2K5O8j05r9J84p6r3J09Q7j84Q4n5j3K43k22
2553e1k5K28j39l03K43n4L16j74j31J51j03J26n9j55R5k9O0o6J46j41K4M0J19
2576A18L7j83K02k40J20j15K16j13N1J4p5K1j08p8J44J09o5q0Oq6J03Qj00k5K56
2601A37l0K0O7k48m7qNK12j38R0j63kR3j43J53Jn1r0R7l9l3K14l6%n3L7J1n2M8
2630E2j68K7J64j07K57k27j03J1l6N8N9p4p5J99k13m1K35M8kN8On9l81L22J18
2655A28l23J65N3r0KO6J33j52O8O1j53J40j98J5N1K01q3j81R1L3o9J19m4Qj94
2680a53N6L00j70j37MK96k15p8Q0J19rk33J66K3p1j00K0J21L0n3J21j24j6M1j65
2705a47K75p2j0J94Oj62j30R6o4J66k24J08j2k31K53Mj77J14j67K35m5j33M7O8
$$ plain form
2527 -139 -63 -2 84 -83 242 139 -11 24 19 78 -4 21 89 -16 -115 69 -7 -100 9 96 -88 -4 -59 -72 171 -51
2553 -51 -76 152 13 -290 -47 -101 215 41 -90 61 -42 84 25 -130 -35 -64 -4 -70 76 -65 -41 -1 118
2576 118 155 -28 174 -66 54 -61 155 42 93 107 32 53 -55 -133 11 120 55 -25 -19 -105 -2 6 -94 -119 137
2601 137 107 127 194 -54 -101 -109 -104 108 -30 60 -103 -105 -12 -155 -2 -1 -52 -142 -45 -84 -117 97 61 61 8 45 56 4 52
2630 52 -116 -89 75 -32 225 -2 -105 -94 -130 -72 -13 -87 -162 37 -176 -217 18 66 64 122 128 69 -312 10 128
2655 128 -195 -30 23 -67 -65 1 134 -18 50 111 -42 98 -100 -85 -34 167 84 -97 -6 27 -42 77 33 41 -153
2680 -153 -97 203 33 -104 -100 196 -19 -97 -17 102 93 -140 26 49 -22 -122 -102 19 49 -4 117 -7 -23 18 -147
2705 -147 128 56 46 240 246 84 -46 50 -14 152 -72 36 24 -207 46 50 -127 -13 -180 55 10 -123 -76 -8
2729hK7J7k10K29n2J17L1j01k18K09m2R7j28lN6k94K60j24k6P8j21K97j11K6J60
2754A66k78J26k5R3l54K92O7J28k32q6K00j45jJ5o8m2R3j69J85J74j64K9J17j71
2778e0k3L57k78J25j80P7rK6J47L8j91m9j26J20m5K70j09n3j19nO0K6K58q4l94
2803b11K21R5j13r6J13j14J11j1j06N1k2K13j01j4L4Lq3j53R2J85j21j7J04m5
2827A5p3o1J4J94j78R1p4P0R6j21l2J44r9k39K31p3J64J74k54K6j5J04k75j62
2851c33J06K80p4Q8j36r9K91k69K58k65K19j61M1L8j09K99r1q4M6j03J43k33J73
2874B5j10K93l04J44M4r4L6p7K22j03n9Q4l84J69J04J66Q0k72R3l7j02K42k29
2897f9L9K4m1n8P9j27K69j28O1K3p3J51K8j27j95J03K38j16k79K15Q7k79K07n
$$ plain form
2729 -8 19 36 -174 55 3 120 151 50 -168 41 -1 96 -32 -35 21 -273 -13 -137 -163 -85 -206 91 -20 6 166
2754 166 -112 14 -11 82 -272 20 87 215 -17 -103 97 -48 -49 -34 -102 -144 -51 -220 -35 139 -25 4 121 -50
2778 -50 -73 284 6 131 -49 28 19 45 192 230 39 -10 -136 -16 -61 209 100 47 -72 -77 -17 9 267 183 -211
2803 -211 10 105 -8 -104 9 -105 6 -5 -111 -60 -82 131 30 16 50 53 -30 -183 -91 94 -27 -44 60 15
2827 15 -58 -119 -105 89 -89 2 -72 -2 94 -27 -59 85 -14 -253 -22 -95 69 243 -11 15 0 104 -171 -333
2851 -333 -227 53 -21 67 -69 -168 123 -146 112 -153 66 -95 -54 -16 -125 174 83 -1 45 -58 85 -148 25
2874 25 -85 208 -96 48 92 -2 34 -43 179 76 17 101 -283 -114 -10 156 236 -36 57 20 -82 160 -69
2897 -69 -30 -6 -47 -105 -26 -153 116 -12 49 72 -1 150 178 51 -144 -41 197 81 -198 17 104 -175 32 27
2921B7J22j44p6k4J0M8j11K16j1q7L51j25l54L23j31O4l2J5N7j35q8K02n3p1J11
2946A04j77J18j82J08J14o5j1k80K54rM9J66k26M5N9k8J31o0j54j95j4P4nN4K24
2971I4J17j66J93l06J64k3j69K55j77m8J67r8j1k91L56J1P9j82l7J47j08K6R8
2994I1m7j73J66j4J25j81nJ80k03J40k67K22J78l37K94k47r2J68rm8J15nj28P8
3018Ao5J31j1j91J25L18l88M7j58O4K25l28K62K1R0j84k2K8J15%J05J49n34J98
3042bK6M0K7l0Oj20J20j42J12Nk49J47j77K09o0J35J61j83J66k24j72P0K45k21
3066a11K22k15O6N8L0K9J06k68J20JM2j08L0j4J21j39p8J01J04K6mp4j54n8L41
3091A74j06r7N3R9lo8j77K54l38L8J47m8K11k53K68k06M0k8k7K28p3j29N3k34
$$ plain form
2921 27 149 5 -71 -95 -85 -37 -148 68 57 -30 321 196 -158 165 34 98 66 81 138 3 -85 117 64 -7 104
2946 104 -73 45 -137 -29 85 20 9 -271 -17 -26 23 189 -37 8 67 39 170 110 -44 -239 -253 -179 -184 -130 94
2971 94 211 45 238 -68 96 73 -96 159 -18 -66 101 3 -8 -299 57 68 147 -35 -72 75 -33 -7 91
2994 91 44 -129 37 23 148 -33 -38 142 -61 79 -188 34 212 -125 169 -78 -170 -2 -11 -59 56 51 -77 1
3018 1 -64 67 56 -135 -10 308 -80 -33 -191 -127 98 -230 32 53 143 -41 -63 -35 80 80 185 334 -200 -2
3042 -2 24 64 91 61 67 -53 67 -75 37 42 -207 -60 -237 -28 -88 47 208 25 191 -33 -205 -135 110 -111
3066 -111 111 -104 -38 20 50 79 185 -83 37 38 80 -28 2 -12 109 -30 -108 -7 97 123 119 45 -109 -167 174
3091 174 68 -29 24 123 120 52 -125 129 -209 -171 -24 -72 139 -114 154 -52 -12 -40 -67 161 88 -41 12 -222
3115b22L98j21j4K8k33J59j0K6O4k9m9j56R4J71j01n8n4J26r1j50K92j39J67j64
3139f6L01r7l78J57M5P6J30L9k92L55j73j61J15l6j21J48O6l69K71p2M8O4J65
3162B15l48J17P1R2j78K8j52K70k15l6M1P0J25o5K7J6J73j67n8kJ20k84J54l18
3186c04K60k3m9Q0PQ7r7j2j23L69Nl79Q5J14q5J90k65K84m8K0l11L4K20L9K1l06
3212a87L8J53lq0J13j44K40j27p3R5n2j61K68PM5o2L1L2ll27O4m0J95p5M1j6j3
3239d1m7M1j5m5K17k3n4K9P4j06J41k52J00J30m18K27N6r4L1O5O0j10J07q7l6
3264e0J02j85K36j93J36M6R9j76j98K70q0N1k22J97j0K5l08R8N4K24k66J50mq2
3288h6K21J5k20O0N0o5Q1r1O9L5J9kn7m9j88K01P1K3n4Nj17O0j91K87k3k45L29
$$ plain form
3115 -222 176 55 41 69 -164 -5 -15 11 75 46 -3 -159 -65 106 5 -53 -107 19 -72 -222 70 -69 98 -66
3139 -66 235 138 -240 -83 -38 38 168 207 -85 270 97 -64 51 15 -106 42 108 -261 10 -62 -14 50 215
3162 215 -133 -16 55 147 -31 -3 -155 115 -100 -136 -95 -25 100 35 62 78 251 84 26 24 144 -140 14 -304
3186 -304 -44 -67 -116 -36 -29 58 -39 -51 -174 195 200 -179 -94 20 -65 125 -140 144 96 116 -195 -161 59 98 119 -187
3212 -187 -149 4 1 -79 34 -110 130 3 -70 25 -27 -188 80 87 132 70 101 133 130 -197 -133 -173 22 -53 -12 -28 -41
3239 -41 -88 -47 -62 -107 110 87 33 62 136 30 171 -81 19 149 -269 -42 14 -80 -49 16 76 -34 73 -14 -50
3264 -50 52 -133 103 -90 46 92 191 15 -183 87 7 58 -164 33 23 48 -260 -162 -108 116 -150 0 -4 -86
3288 -86 135 150 -70 -10 40 -25 56 -35 34 69 88 86 29 -20 -208 -7 64 87 33 38 -79 -19 -210 77 54 -191 138
3315A38K4k97pJ19J7N5q8j69J05K91l15L5j40K95O1k49J88J78k13L2J89l09K28
3338A68qn2r2J9j19J43M0j98l7o7J7K65J9j9j03j29Q4Q3j8J28l12J11K25k21J02
3363B9J01j22k9K80m00J93L8p8r8K3n9J30J2J11j06j65mJ23K0RL04j53j26Q7l2
3388H8j42J75j26k9o9K92l57K33j51J52j82J52j02K24j39J06j35J44M2j06m2L4
3410F2Q2j12k17J86j6j64K36j56M9NM5P8k26J30o9J74k1J28n5o8k3R9j42O8l3
3435D0j27j43L79j0k00r1oK58j41N8k44K84N5j2Rk3q8O5J77k24j87L2J04J56j07
3460A4k93K17J3j78K84L1m6N7o5j1J86j34O3k1o6J3j61J85k51k7J43J47j95Q4
3484a1J3M1j50lJ04P6j63J12l8J6j01L18j73k88K09M2LK6j25J08J60k30j2M3n9
$$ plain form
3315 138 162 -135 -142 -23 -6 49 -39 -208 -103 188 -127 -92 -232 63 124 -125 63 241 28 60 249 -60 168
3338 168 160 108 16 35 -84 59 99 -99 -136 -203 -186 79 98 79 -24 -153 -69 14 -4 124 -188 -77 148 -73 29
3363 29 130 8 -21 259 -141 52 90 12 -86 -63 -122 8 20 131 25 -140 -144 -21 -1 8 312 159 33 120 88
3388 88 -54 121 -5 -34 -103 189 -168 65 -86 66 -116 36 -66 158 19 125 -10 134 176 70 28 62
3410 62 144 32 -185 1 -15 -179 57 -99 -50 -45 0 78 -148 -18 -87 87 66 194 139 71 48 147 5 73 40
3435 40 -87 -230 149 139 -61 -152 -158 100 -41 17 -227 57 112 100 109 86 -2 63 240 16 -171 -139 -35 121 14
3460 14 -279 -62 -49 -227 57 88 42 99 34 23 209 75 138 117 51 64 -97 88 -163 -190 -47 100 -95 -11
3484 -11 2 43 -107 -110 -6 70 -93 19 -19 -3 -104 214 41 -247 -38 4 7 33 -92 16 176 -54 -66 -23 -82
3509h2Q6q0J07J12P3k29J13j41J7O4mm5K43k10q5j5P4j07K25l62R4J48j21J92
3533F7p8K2j04j13J13K53j48j33L08R4k17j37L03k56J52q3k27L00k14J35k48J17
3555i4M4J24k07K06j55J95j83K6q1L05j31j91K48j83L0J3q9lM2j38J78L00l64
3578a08r1M21l51J3J48j5j24K7J39j87K31q0j78M7j12J46n2L2p4K03j27M0J06
3601E4L9M4k6k9j26J59k52J9L27l2k47o8K47r7rn2j18P2M3M9K8m8J41j13j46K79
3627A38O4l15M1J49j87J61J01j41m5j95J17rp2J28r6P9j3J46M4j10P0o4L49l51
3651a1N0Q8o1q5m9J60q6%j43J93n09M18o2j11J97qJ87j39q1J12O2j41n7rj4P0
3677b9M8k63L57j18p3Q0j86L33J16q3j16l7m6P5l2l8K46j65J2J35k39J48l48K32
$$ plain form
3509 -82 4 -76 31 143 216 -13 100 -41 -24 40 36 -9 234 24 -61 -76 -2 -109 116 -246 -152 -4 -125 67
3533 67 -11 11 -93 -206 -93 160 12 -121 187 281 64 -73 230 -26 126 43 -184 116 -98 37 -211 -94
3555 -94 -50 74 -133 73 -82 113 -70 -44 -125 180 49 -142 106 -77 -47 -34 -123 -126 -84 -222 -44 256 -108
3578 -108 -199 222 -129 -116 32 17 -107 -80 59 -128 103 23 -155 -108 -220 -74 -126 -94 -168 35 -92 -52 54
3601 54 93 137 111 82 -44 115 -137 -118 209 177 -70 -138 109 12 3 -49 -167 -95 -52 -3 25 -23 118 5 -141 138
3627 138 202 -113 -72 77 -110 51 152 11 -34 -229 -112 -121 -193 -65 -161 -82 -95 51 95 -15 55 -9 340 -11
3651 -11 39 127 66 -19 -68 92 6 6 -137 56 -453 -35 -97 -208 -11 -19 168 29 -52 60 122 -19 -76 -85 -99 -29
3677 -29 19 -244 113 -5 -78 2 -184 149 265 182 66 29 -17 58 26 -12 234 69 81 216 -23 125 -223 9
3701IQ2j32J29k20L00n7j34O5n0k00K14l0J03j95K07l4o8K18o0j05O4P1n5j27
3725eK0P2j27j22P8J1j26K29q3R6o2M9j98J22J7P7j07l5N9k1j07J17k5o5J34P4
3751G2k61K00j0l9Q9N8j15j90N6J91J59k82k8K20J98k23j34J54j82j20K7K14r7
3774d3j3J76k43J88j23l2J68k40L52l27K21j19J27j54R2j03K71l08O5K3n4j30
3796b06O0P3J5N9J12K9j17Rm6j16Q5JJ7l1J70o3j9j60K07k3k07J50j2P8j81J06
3822a0j5k8J2j68K94J32l09J99O0j94%J44O2l94N3N5R8j51K38oK4k12O2M4K72
3847B62k12o1J96k6M8l12P7lK87m12K57nk05K41n6j07N8o5r2J06j37K65j77J66
3871I3qj12J02J2k23J25n3k3M2m5j00K79m1K9q3nj62K38N4k33K80k41J76R5k14
$$ plain form
3701 9 91 -41 88 -132 168 111 -23 42 -8 -208 6 -24 79 -116 91 57 -11 207 147 42 106 177 122 -5
3725 -5 15 87 -40 -162 -84 -73 -199 30 -53 43 -19 30 -168 -46 -29 48 -59 -94 -35 -56 -163 -46 -71 -136 -2 72
3751 72 -189 11 1 -38 51 109 -6 -196 -140 51 210 -72 -100 120 318 95 -39 115 -67 -187 -160 54 -43
3774 -43 -56 120 -123 65 -58 -90 78 -162 190 -137 84 -35 92 -62 30 -73 198 -110 -45 -22 -76 -206
3796 -206 -146 -73 -58 1 113 142 25 34 -12 -128 -43 -42 -25 -56 114 51 32 -128 79 56 -151 -1 -13 65 -116 -10
3822 -10 -25 -53 -41 -209 85 217 -92 107 167 -27 -27 117 179 -215 -162 -107 -9 -160 78 72 96 -116 -54 -10 262
3847 262 50 -11 185 159 207 -105 -28 -31 256 -156 101 96 -109 132 76 -31 27 -38 -130 -24 -161 104 -73 93
3871 93 85 -27 75 87 -136 -11 -64 -87 -45 -90 -190 89 48 77 -6 -11 -173 65 119 -114 166 -75 101 196 -18
3896a8j4mK34j31j09m7J26n2k10J72N2q2K02j28l2l3R8m4j69K90J37j06q5j15
3920f8N4Q5l8k20L71k07j72J17J59n0k57NJ64J37j07j12K11j6K6k32K15L1j46
3943e0j7J83k32J89k51M9J06k0Kk46L79j24o6J11P4p4m6o7J41J5L2Q6l07J5J12
3968fl28J89K26N5k23R5J33k21J45j49J69K1r0K14k91j18M14j01L4mr1l2j45J89
3992H5k29K57K7k45P5R8j1P0j51L2k4K9mJ45j7k14L50k18L8L8j37j46J37P4k85
4017b26M14m02K54j27J81q3K96l90K17l0q8K3j77J90J28k9l4l53K72q9n8J91j75
4040i5K60l48J72j36r1L62j84K32k13R4L6j53L28k99J00j33P5o2oQ4M2j44Q8n8
4064d9j20K31J29j88Q5m3R4o8j98J18k93K06J67p0p4K71l67J72j29K80l38N5K20
$$ plain form
3896 -18 -32 -36 198 67 -42 -89 37 -15 -225 -53 -1 -83 119 -9 -41 -74 24 -20 -189 101 238 132 47 -68
3920 -68 -14 71 33 -187 184 -23 -195 -78 81 31 -226 -221 -57 80 -27 -139 72 56 82 -150 65 96 -50
3943 -50 -67 116 -116 73 -178 -129 -23 -43 -41 -287 92 -32 -98 13 87 13 -33 -100 41 56 88 174 -133 -118 -6
3968 -6 -334 -145 81 136 -87 8 141 -80 65 -84 85 106 16 230 -61 -179 235 134 168 164 73 41 -104 85
3992 85 -144 113 140 -105 -30 68 57 127 -24 8 -16 13 9 154 137 -77 273 55 93 131 -6 -152 -15 59 -226
4017 -226 188 -214 40 -87 94 11 307 -83 134 104 16 39 -138 52 180 151 117 -236 36 -53 -111 80 -95
4040 -95 165 -183 -11 -147 -238 124 -60 172 -41 53 89 -64 264 -35 65 -68 7 -55 -61 23 65 -79 9 -49
4064 -49 -169 62 191 3 88 45 139 71 -127 -9 -302 -96 71 1 -73 198 -169 3 -126 154 -184 -129 91
4087I1o6o7O1j45L6K49J7k10K3K03k21j03K01l51L09N5l19K66J27J35k90k2j7
4110c8l3K3Q2M6j20l0K82j91q3j59K01o0J10K63l96j4J51o9k28K72j04J98n7j77
4134a31K40Lj97J47k39K26o5j24J92j88j2o1L37j58P4k55K4J80j85R5J27P9r5
4157A4o9n0K26o4m5N6J4k63R2J84j85P3j90K09j25J8J34K13l39j72K76j85L19
4180A41k00P5K5M6J12m1n0l02L65o6j06q4j0J49K8ORk17J11j88K89j91l6K24m5
4205D4j47j0J58N0P2j01M4q6j5Q3L4j55O0j11K63j04j47q4J33J75j71P3j96j45
4229b83L49m6j05K71k72J71j20R4Pr3n4P6n3J28O6n3L3j02L5l23J80k1J94j20
4253d1P0Q9J96l09j12K16k43M4j57J90J41q5L8m3J09O7k61L20k99J32j68J26M6
$$ plain form
4087 91 25 -42 19 -126 -90 159 176 -34 -11 192 -29 -132 69 -282 27 82 -237 29 156 291 1 -21 -38
4110 -38 -71 -48 34 80 -40 -70 212 21 -62 -221 -20 -80 30 293 -103 -117 34 -35 -263 9 -95 103 46 -131
4134 -131 109 112 -85 62 -177 49 -16 -140 52 -136 -148 -209 128 -30 44 -211 -187 -7 -192 -97 30 109 14
4157 14 -55 -105 121 57 12 68 82 -181 -89 95 -90 -17 -207 2 -123 -105 29 242 -97 -269 7 -178 141
4180 141 -59 16 41 87 199 158 108 -194 171 105 -1 -85 -95 54 82 88 97 -120 -9 -197 92 -99 -135 89 44
4205 44 -103 -113 45 95 167 66 110 24 9 92 126 -29 31 -80 183 79 -68 -152 -19 156 -15 58 -138 -283
4229 -283 66 20 -85 186 -86 85 -35 59 66 -27 -81 -5 -58 70 136 83 116 14 49 -274 -94 -115 79 -41
4253 -41 29 118 314 5 -107 109 -134 -90 -247 -57 84 -1 37 -6 103 170 -91 229 -70 62 -106 20 66
4276F6L2O7q4j40lO4l26J46K88j42q3K54o4J9j40j35L66k33J50p6n0K2j5p6K11
4301A18q9l3j34m8R1K14j67N3L5R4q6j48j86L76l6k81K94o6J54j47j31J90j65
4324i8Q9q1J4J20J64j63p6M5j41k1J02N6J05n9P9j68J13k02K16j51J21j05n4J59
4348F4rml75K98J67m30K25J29nm9J07M3q3m9P6m6l8j43J52J3p7J2r2Q4J92l14
4374a52J77J62l76K71p9K4RJ11l00R9J05r3J08j75L2J77j35R3K3N5L1j68J18m6
4398G1j47N5J63L6k76J67r3L6K00j19p0j34N7l0K97k57J94j3j42j38r3J04J17
4421a5j36K29j89J46j31J69r4o9j13K52J58j83j66K91m9j22P1r7k6r5K17l3K8
4444D3P9k16J11j75J4L6J41j0r9K68k40P6p1J01j42k17L18l8m1q8J7J30J13m4
$$ plain form
4276 66 98 165 81 -59 -62 2 -324 -178 110 -32 -115 139 75 94 -46 -181 185 -48 102 26 -24 -2 -17 -93 118
4301 118 29 -4 -138 -186 -95 119 -48 5 40 134 48 -100 -286 90 54 -227 67 1 155 8 -123 67 -98
4324 -98 -9 -90 -76 44 208 45 -31 14 -127 -148 -46 10 115 56 135 -33 80 -122 94 -57 64 -41 -95 64
4348 64 55 51 -324 -26 141 -289 -64 65 60 11 118 161 78 29 105 59 21 -122 30 43 -34 -22 -114 -30 162 -152
4374 -152 25 187 -189 82 3 27 36 147 -153 -54 51 -42 66 -109 -77 100 -35 58 81 136 167 -1 117 71
4398 71 -76 -21 142 178 -98 69 -24 12 212 93 23 -111 -54 -84 213 -44 150 137 -5 -143 -236 -132 -15
4421 -15 -151 78 -111 35 -96 73 -21 -90 -203 49 207 24 -142 149 100 -22 49 -48 -74 -169 48 15 43
4444 43 122 -94 17 -158 -144 -108 33 23 -76 192 -48 28 -43 58 -84 -301 17 -21 -62 -150 -133 -3 110 66
4468F6l14J43K6k4J20k35O2K02j7K26j58n4q3j3j71L41j35J41j18O7j46J34J3
4491G3j90Q2J9q2j29M41r2K5k19k09K44J38k12J83l63K08j4j08K05j80K46J21
4513A87l57M7K33L0k64K47j32q8J74M3j09J1J96k41q0K14o6m3q6Q4r1J80J28L3
4537B50j16k29Q9j32K63k92M6J22k13J27K46j03J3m9j9%Q9j17k6J6N5j1j61J50
4561bq8P9j07L6K18Q2k60N0J29j51j0Q9PQ4o1j92JL1o5L41m7k07J37j86J55N2
4587A15k89K84j86K04k83J55q6k8K08m0l3j65J91l6j34J23j07J85n5j39J31j45
4609a30K25k31J14J04m2j73P0l8J1J86J43j59l53J85J26qj35J52k5j6j8J91k25
4632d6lL0j3j64J35J44j0j17r7K90j42R7k2K9j18P7m4pq2J23r7K51j34n3K41n46
$$ plain form
4468 66 -248 -105 -79 -103 17 -218 -156 46 29 255 97 43 -40 -53 -224 117 -18 123 5 72 -74 60 73
4491 73 -117 -35 -16 -98 -227 214 122 147 -72 -281 -37 101 -111 72 -291 -83 -97 -205 0 -180 66 187
4513 187 -170 -123 110 140 -124 123 -9 -97 77 120 11 22 218 -23 -103 111 45 2 -84 0 -91 89 217 250
4537 250 134 -95 -6 -138 125 -167 -121 1 -212 -85 161 58 71 22 3 3 92 -25 -51 -35 20 9 -152 -2
4561 -2 -90 -11 -118 -82 136 218 -42 8 137 -14 -24 65 72 156 95 -97 -96 -65 -130 211 164 -43 94 -92 63 115
4587 115 -174 110 -76 128 -155 0 -86 -114 94 54 21 -144 47 11 -123 0 -107 78 23 -116 15 -130
4609 -130 95 -136 -22 82 40 -133 -63 -101 -90 96 239 80 -273 -88 38 30 -105 47 22 6 -12 179 -46
4632 -46 -49 -19 -32 -196 -61 83 73 -44 -141 149 7 104 82 111 -7 70 26 19 -63 60 -37 214 80 27 268 -278
4658b78M71l91K13J3l02L44j49N9j67J79K72k84k30K65Mj18K01l47J36L51n7j37
4680D8J34k06O3Mj33K62l02J7J02r3J46J6J5j23n0J50l3J40K4n4J40n4j04k77
4704a68R7P7K82l77j16J25O7q2Q0k05K20r0J71j79mQ3j18O6P3K10k76K3J88k07
4728f0J53k29K40l0nj87J05j88k2K96j93N8K91k10n8j91J06J64Q6k06p4N7J30
4751C3j13n6M0O2K24k91J60j06L38l71M74m10K4q7l9P6J59j14j20K12j39j37L86
4774B05l1l58M13k38J80k15J25j42J50m4m9l1o4K95r8m6J04N7l26J11J8K24j76
4797F4k85M9J33L01m21K21J22k2j13k54J73M3l4J48Nl5q8l5P3j55L09k34L20j35
4821A50j7j54k4j32L10j27r7J49m0R3q4j56J36K02j61j25r6j31K21P8j36O9R9
$$ plain form
4658 -278 193 -198 15 28 -274 70 -79 -20 -187 -8 264 -20 -250 15 19 -99 102 -245 -109 242 185 48
4680 48 182 -24 39 43 -90 172 -130 -113 -11 -104 42 58 73 -50 -100 50 17 157 181 127 267 213 109 -168
4704 -168 -71 6 288 -89 -205 -80 -13 -95 -15 -220 0 -90 81 -98 -102 -19 -137 -71 2 212 -64 -41 147 -60
4728 -60 93 -136 104 74 69 -118 -13 -201 -223 73 -120 -62 229 19 -39 -230 -124 40 126 -80 -154 -97 33
4751 33 -80 -136 -96 -34 190 -101 59 -47 291 -80 394 -16 8 -79 -118 -42 117 3 -117 95 -44 -181 205
4774 205 174 -184 229 -9 171 -44 81 -61 89 45 -4 -35 -99 196 98 52 156 213 -113 -2 16 240 64
4797 64 -221 -172 -39 262 -159 62 184 162 49 -205 -32 11 -23 125 130 95 7 -28 45 -110 199 -35 285 150
4821 150 133 -21 -45 -177 133 6 -91 58 18 111 27 -129 7 209 48 -77 -173 -304 -83 -5 -141 -72 27
4844B7q1J52j06j1L8j86J46j10J15MJ29k99J41q8l4K69K4k31k1R5J9jn9q7L25
4869A70j75O0k6L9M1J42k58j38Q3KL15j61K3p9N6l8j20j70J65J98j09R9o5k29
4893a75K99j4J32k38M3k48K14q6J06k10K05J11j60K11j30%j21j4J95l31k0K01
4915c0N1k90K32K12k28j13jK40k57J64j68J84J11k09p6L23k3l03J12j53K40l19
4937c01K14l2r3K82K49p1j45j36J07j37J93k92J56O0L6l3K79m25JJ11O2O2l36
4960a89L02m3k71J51oJ73M0k24k3n0K04j42J36j66L97k83jj40J49KK0K4N6j21
4984eO4o5J0j9n0J82J9j16J6J56k82L42k92j26J65mK20k29j17O0l7J12K7rP5M
5010A01j94K04k31N2m2J32j57j56L63n5J5j58J78k6j4Qm5K7r9K8K03j1k65R5J61
$$ plain form
4844 27 -54 98 -8 -19 19 -167 -21 -131 -16 -12 117 -182 -41 -129 -163 106 130 -101 -122 -27 -8 -9 -68 -155 170
4869 170 -5 55 29 68 109 251 -7 -145 -62 -60 255 94 117 38 94 56 -64 -234 -69 129 20 119 54 -175
4893 -175 124 110 242 4 47 -201 13 -73 33 -177 28 139 -21 190 60 60 -61 -75 120 -211 -231 -30
4915 -30 21 -269 -37 175 -53 -166 -167 73 -184 -20 -188 -4 107 -102 -178 145 122 -181 -69 -222 18 -301
4937 -301 -87 -119 -212 70 319 248 103 -33 74 -63 130 -162 -6 54 90 57 336 -89 -88 23 85 147 -189
4960 -189 113 70 -201 -50 -56 117 157 -67 -90 -140 64 -78 58 -108 289 6 5 -135 14 16 36 60 116 -5
4984 -5 59 -6 4 -15 -65 117 136 20 36 192 -90 252 -40 -166 -1 -5 215 -14 -131 -71 -108 4 31 22 97 101
5010 101 -93 111 -120 -68 -110 22 -135 -291 72 17 32 -126 52 26 12 20 -25 2 -97 -69 134 123 -142 -47 114
5035A14k9p2QR0k03j82L53n9k01K34j40k0K89j87j58L58j61j53J82j2Q1k20K78
5058A90%k45O8K1k38J85J84m7K9j46l0o7N5K4k7m0K96k15QJ19l1k23o5M2j48L92
5084I1PO7j11RJ58m16P9KM7J75j13q8J75j64L3J51l3j6O1j27j96J73P7k07J64
5109bJ9j35K76j63m2M9l22K20M2L9q6K92k71K1L14q6k5j37K57j60j56J19J1m1
5133C3k9l7o0o3J28p2j00K53J78n2r4pj08Q7K6j43P6k4j32K67l6o4M3j32J09n8
5159a1K7K3K4j89L03j24J56k15J48J3k42K73k44j42L5L8J33j34O1J49P5j30n3
5182b6J65k22j10J62J74l42J90J71j41k0J90m12J94J48j65r3j47L49L6k8j12J13
5204G4j60j08K20m9j40L93m18K58m6O4M3k28k01J94M0L39k98J07j39k3J01J0n0
$$ plain form
5035 114 85 13 21 111 -92 -274 79 20 -181 53 -87 -107 182 -5 -163 195 34 -119 63 51 132 -88 190
5058 190 190 -55 13 34 -204 -19 165 118 147 1 -29 -96 -41 -17 -44 -84 212 -3 5 124 93 -130 -195 -153 -301 91
5084 91 98 165 54 63 221 -195 -116 -114 -67 108 -5 -93 82 -82 -49 102 69 53 114 -13 -209 -36 41 -166 -2
5109 -2 17 -118 158 -5 -47 2 -320 -100 -58 -19 -105 187 -84 -63 251 165 140 3 260 100 -56 63 74 33
5133 33 4 -33 -93 -156 -28 -100 -200 53 231 179 85 78 -30 57 83 -60 16 -8 -140 127 91 27 70 -62 47 -11
5159 -11 16 39 63 -126 177 53 209 -6 142 155 -87 186 -58 -200 -165 -127 6 -128 -67 82 157 27 -26
5182 -26 139 -83 -193 -31 143 -199 -9 162 21 1 191 -221 -27 121 -44 -137 -284 65 101 73 -39 74
5204 74 -86 -194 26 -23 -163 230 -188 70 24 88 131 -97 -298 -104 -64 275 -23 84 -55 -78 23 33 -17
5227a7pN0k07J45J3j22J92k0j11Q5p8R9l6Pq2J0P6j02K60l67K7K77q0M7j24J61
5253I6k51R8L1J00l9O7l9k48k3J58O4r8J11j69J14o3l4j0K86l71Q5J98j21K04
5277A46j07j05j3K37l28Q8J08lP2r0j32k6m9K75m3J52k94P3j45J33j54L05j98
5300i8j0R7Q2j85K29j16K4j85J52J41k15P0l0L7j63L39j70J55j26M2Lp1o6QL25
5325B69j90j60O1RqJ32j93L27j55l33L02j09j58M1L34r4K4r9n8j39K03j03O9n3
5349h1J39j32J88q5j40J38o0j06O4j00K3L60j89r1N7M2k5O6j24J03j9L6j51K09
5373A22k48K4K57j82O5mNMj91J6P1LJ09K7k45J05L8M9j9r8J4K7r2k9L20q8K1k87
5401b06M29l98J52o6K28j59r9N1J8j09MQ0J7jm4K52l43J77K63k95K1L5Q8Q2r3
$$ plain form
5227 -17 -24 26 -181 -36 -23 -145 47 27 -84 1 -77 22 -14 -7 -89 -79 -3 -105 155 -212 -185 92 12 59 -65 96
5253 96 -155 -57 -26 74 35 102 63 -185 -208 -50 14 -84 27 -142 -28 -91 -125 -135 151 -220 -135 63 -58 146
5277 146 39 -66 -79 158 -170 -82 26 23 95 5 -127 -153 -202 73 30 182 -112 -39 -184 -51 -205 100 -98
5300 -98 -108 -11 71 -114 115 -1 23 -162 -10 131 -84 -14 -44 -7 -170 169 -1 154 28 70 73 2 -64 -56 269
5325 269 79 -81 -20 -11 -19 113 -80 247 92 -241 61 -48 -206 -165 169 75 99 0 -58 -197 6 -97 -28 -81
5349 -81 58 -74 114 29 -111 27 -33 -139 -75 -175 -152 208 19 -72 -15 27 2 68 -56 47 28 64 -87 122
5373 122 -126 -102 155 -27 38 34 39 43 -148 -132 -61 -58 51 78 -167 -62 -24 25 6 -92 -78 -51 -143 -172 148 60 81 -206
5401 -206 223 -175 -23 -89 139 -20 -119 -68 -50 -159 -155 -75 -58 -59 -103 149 -194 -17 246 -49 -28 7 95 177 84
5426H4p0PJ02j00K6J32k43J40j0O9m6K4j14j21J21J16j52K8J8q9N9n6k11J31K32
5451G7M1j02j43L73l35J70N0Q8l81K09j17J29K9n4j22J29R0j52j01L43k44j29
5473a52J0J71K33l41O0L8jrl8L30l84J79N9q7j59K32k54K48k05q6J91o8K13k70
5497i0k07K22R1P8q8q9J49n1J70k49J49j84J5l6J46j06O9r7R4m7L9j51j1K92l38
5522b30L36j44j58L20j44o3L05j38j10P4J31k52N9j24r2J43J60j1p4L4k5P6J06
5545A79j92n8J35m4m3n7J70j52J00r4k19J70J79M2j6k84J46N4q8LJ23j42K12m0
5569H4M2j25k87L39P1m29N30j69P3J2n7j20j11J53J35j63r5j8L66k05l05K56o
5592b9O6J05j52L0p1n6J38M1j5k8j31j06K84j15Nk3J20k8k03J35J30J04k12P5
$$ plain form
5426 84 14 21 123 23 49 181 -62 78 68 137 91 115 1 -120 1 117 -35 -7 11 -78 -19 -75 -286 -155 77
5451 77 118 16 -127 246 -89 81 131 219 -162 47 -70 59 88 34 -88 41 131 -21 -122 221 -23 -152
5473 -152 -142 29 262 -79 -19 19 18 9 -29 301 -83 96 155 68 -91 141 -113 135 -70 -156 35 -33 180 -90
5497 -90 -297 -75 16 94 6 -83 66 15 185 -64 85 -99 -84 -120 26 -80 -11 -108 -14 -61 -22 -173 -184 108 -230
5522 -230 106 -38 -196 124 -20 -83 222 84 -26 48 179 -73 -14 -138 -230 -87 73 62 -12 22 -3 73 179
5545 179 -13 -71 64 20 -23 -80 90 -62 38 -56 -275 -105 74 116 100 -184 -38 16 -72 -69 54 -88 124 84
5569 84 126 1 -286 53 124 -305 225 56 129 141 84 -36 -147 6 141 -22 -117 -135 231 26 -279 -23 -29
5592 -29 37 142 -10 20 -51 -107 31 72 57 29 -102 -208 76 -39 -34 -57 63 35 -168 -33 97 201 -11 64
5616F4o3N5J0l4j42KR7q1K7K12k34L1J57k60j7R9J44m7L5J2j48O5J14k08QN3J20
5643G1Jj31j5O4L4j31O5J10j8R7j17K4J6Pj95J50m6r4R4q6M6K48k75r9K44k56
5669a92K40Q6j77Q6j05J48k10J92k03J09Pm5J29L7j90q6J56K50k82l4R0m6j65
5692b05K00j57M70j87l17K17k29K34k2J2j2l9j94L78k13J95k93M2O8J80l07jK97
5715A17j88K15m40K26K10j06Q7j38K26l64J81o6O7K4j43J56j9P0k23K17j3j41
5737d5%L1Q3q6J1K0K36j47k1j18L12l37M9Q7j19oJ59j0j88j62K70K1n6o9J67k43
5763a61m0K28O8Q6j86j9j5j0M8o8p5Q5J17J43j33k6Rj76j1L9K7l9J37l0K5q6r
5790g2O8P1j99J07O8n4J39j0k26J02KK31m8k96J7J35l5j42O6K6j08L15j76j87
$$ plain form
5616 64 1 56 66 32 -110 -108 -11 -92 -65 147 -87 -56 101 -159 -176 -77 67 20 55 67 -81 -16 98 -110 -102 -49 71
5643 71 72 -59 -74 -10 24 -107 -42 68 50 147 30 54 70 77 -118 32 -14 -108 -14 -100 -54 194 -81 -180 64 -192
5669 -192 48 134 -43 43 -62 86 -124 68 -135 -26 -19 -64 65 102 -88 -174 -18 232 -50 -84 6 -40 -205
5692 -205 -5 -162 308 121 -196 21 -208 26 4 16 4 -35 -229 149 -64 131 -162 -120 -52 128 -179 -180 117
5715 117 -71 144 -296 -70 140 34 121 -17 209 -155 26 -40 27 51 -92 64 45 115 -108 109 96 -45
5737 -45 -45 -14 69 -17 -6 14 250 103 82 -36 276 -61 -12 75 -44 -50 109 99 -89 -251 19 40 -16 -85 82 -161
5763 -161 -201 27 95 181 -5 -24 -39 -49 -1 -69 -144 -59 58 201 68 42 51 -125 -136 -97 -70 -109 28 -2 23 -63 -72
5790 -72 -4 67 -132 -25 43 -11 128 118 -108 -6 -4 227 179 -117 -100 35 0 -142 -76 -50 -158 157 -19 -206
5814b06K54J8j64M32k18n1k5j56R4J8L72m42N1K00qk05J8j47N3Q3pr4K17j81M7
5839d7R6l59N80p7l51M1j4L97j90j15K1j44J76j41m9J01r4M12m05J74J57k10P1
5862C0J09k16N2J62j09N5p4p1lq0J81j22q2M4L03l23O3K44k73L16o3l41L00j43
5886d1j17K53k02mQ7o2k3q7P8J08J71j24l6K70l21O1Or5J95j83R0r1J59P0m2k13
5912i3K9n4J73j35R4N1k4j60Q9o2J0J59n1n4J65j90J43p1N2k15R8P3j25J22n3
5937b9j44K39j31J38J7k03N3K05k20J67J29j34k7j97J4J68J12j51J6K55k64j5
5959bM4o5J67l6l4j53K2j55L35j49J78q2k83J63M7M2K8j73K5Q3n4J25l20K46q
5984ij16K04q1o6Km7N1J9J21j93J49n2l1K20j57O2m8n0J8j06R1pl1K26n7rk56
$$ plain form
5814 -206 48 66 -98 334 116 65 40 -116 -22 -4 368 -74 -23 177 169 -36 -18 -165 -112 -29 -36 -130 87 -94 -47
5839 -47 49 -310 270 193 -158 -117 -131 266 76 -39 -18 -162 14 -127 -176 -75 -169 243 -162 12 169 -41 30
5862 30 139 -77 -25 137 28 83 9 -62 -65 -145 36 -86 -168 -124 179 -144 -81 163 -110 206 143 -198 102 -41
5886 -41 -158 95 -107 -111 -24 -86 -109 -196 -118 -10 161 37 1 271 -50 11 17 -78 117 -66 24 -67 92 162 120 -93
5912 -93 -64 -118 55 -80 14 65 41 -119 -30 -92 -82 77 26 -28 137 -53 90 19 71 -144 -46 27 -98 24 -29
5937 -29 -173 66 -65 73 90 -113 -60 145 -75 92 221 87 60 -137 -123 45 157 6 22 277 13 -2
5959 -2 42 -23 144 108 74 -79 -57 -212 123 -26 152 70 -213 -50 -3 39 67 -106 -81 2 -52 73 -247 -1 -9
5984 -9 -125 79 -2 -68 -66 -113 -62 -43 78 -115 34 -18 -49 171 14 76 28 -22 -4 -110 -19 -26 -57 169 112 103 -153
6011a53J26oj0j19R4j54J62J67k4j38j9J17j45K48k59K13j78J13moj80N0j38J76
6035f7J31k7n6J39rk10l7J37L6k2p9K23J98l12J05M5j44j04qJ81Nk58k3L9K99
6060A82j94q1LJ17K16k25j14L8Qn3O7R8J59r6k56J67O2lj37J10l8j05K82k80J09
6085C6J18j68J18j91L59m78R3NK19P4j68k05M0J47j9J32p9j35r3L3M4M40k63j51
6109i2K5L07k36L2K7j7j48J54nj78J92k12K98k25Q7O8k39O0J49po9K15l10O8K98
6134B42k61K23l8j21k41L61J9k67r8M21l39P0Q0k24J71m27M74n9o7J69j55J49
6156H2Q7J9K6r3r2j49K05J8j17r2J54J76p6n7K6n2K5qr2rR1J13j60k7O1j76J44
6183B7j97L83o2P4k47L3p3P8L1L1j3N3Ol08K23K2o8L5q0L8pO1Mj56J94k76L09
$$ plain form
6011 -153 -27 -33 -43 -162 -68 -222 -60 107 83 -55 -74 43 -102 146 -113 100 -78 35 31 25 -155 -105 -243 -67
6035 -67 64 37 -19 120 111 -99 -136 1 37 15 -64 159 357 45 150 195 51 -53 -61 120 125 -133 -156 -117 182
6060 182 -12 -93 -90 27 243 18 -96 -58 -50 -103 -36 62 221 125 -131 36 98 95 -42 68 30 -75 207 -73 36
6085 36 154 -14 104 -87 272 -206 -113 -108 111 185 17 -188 -148 -1 -20 112 33 -102 -195 -162 -118 322 59 -92
6109 -92 -67 240 4 36 63 46 -102 52 47 -131 61 -151 147 -78 9 77 -162 -102 47 40 -29 186 -124 -56 242
6134 242 -19 204 166 45 -196 165 184 -83 -181 240 -99 -29 51 -173 -2 -429 45 -14 -81 88 -67 82
6156 82 169 188 214 121 29 -120 85 103 -14 -106 48 224 148 91 117 65 90 82 -10 -19 72 185 25 -2 59 -117 27
6183 27 -170 213 151 225 -22 11 -62 16 47 78 65 118 124 -184 39 61 -7 28 -52 -14 -21 40 44 -112 82 -194 115
6210A15k6j32K6k40K08r3J49J05j35Qk13L48J5j73J94j21Jj68K05j75J05m4Q0
6233C9q1O5k50L00k25K49l1j01R9k99k5K08J83k78K81k64K46j67o3k45M37k62
6255a84J39J0J7K7Q1n4Qj24M6k20J46J66O0j47k7K73Q1m49q6J92J44P1j12M1m1
6280E8J35j79J1M5J37j62j94J69J8L5j18m9J44k6q2m4O2p6J39l9%pP7j07J8k6
6306f1K41k64R0j78L17j32j5J12p2M4L1Jj53j4q9J1K44ll74L60L3j62n4o0J21
6331b6O0k18K06o6l3J28n3qJ08j42K50j13k42K02q9j39N7R9j96K03J93j84q0N7
6355b6J43k48n5K01L1l5pKO1J07l29R8j62J86O9q3M6o8N5o8J79q8O0p0N8j23P2
6382Fj89L44m17L76j02j51m6R8J25l4j60M49k13k18J71k19L46j01J03L1j07n0
$$ plain form
6210 115 89 -43 -17 -257 -49 -142 7 112 -23 -15 -228 120 135 -38 156 35 36 -132 73 -102 3 -41 39
6233 39 -42 23 -227 73 -152 97 66 -35 64 -235 -260 -52 131 -147 134 -130 116 -51 -114 -359 78 -184
6255 -184 -45 -35 -18 9 90 36 44 -80 -34 -254 -108 58 118 -29 -56 217 298 -151 -237 -45 99 170 58 99 58
6280 58 193 14 25 70 207 45 -149 20 38 73 -45 -94 50 24 -58 -102 -40 -116 23 -16 -16 -23 54 -53 -35 -61
6306 -61 180 -84 6 -172 145 13 -2 110 38 82 113 114 -39 -53 -142 -131 113 110 -264 96 129 -33 -87 -147 -26
6331 -26 34 -184 22 -44 -77 51 -2 -10 98 -44 206 93 -149 53 -36 -175 -118 -19 -215 -12 181 -3 -83 -26
6355 -26 117 -131 -186 15 46 11 4 6 67 174 -155 -57 -219 -33 36 -47 -1 -69 -14 -82 97 9 69 -1 57 -66 6
6382 6 -183 161 -256 120 18 -133 -179 -81 44 10 -150 299 86 -132 39 -180 166 65 168 199 92 42
6404D2j68L1N6j52O1J21qQ4k99J62K85K1j28p4o6M1M7j54P4Q3j8j53K38J6j75
6429c3p1J02k3N8j60K25R8J7m66M18j05P7k70o6K57j13j65N20k51P2k95Q3J04
6452A3j6R9j72J48q9j8J40r4j08L42l3k39j65K08j83K53n7LP5rj26Q9k83Q6L44
6477B08j24j47l3K27mm3j09M2p8M8l6N0K1r4M5N4J9q7N0J45l0N0k07J04j61O1
6503b9j17N9J83k48L93l57oJ68r7M4J69m2k49J43J74r7q5q9P7r5M8K92j80k39
6527a80J07J34L2Q5q0J24k43q6K47O6k71J53m3J5o0O3m2ML7k48K25N4Mj26R4J0
6553G5p3MP6j30n2J31l6j9P4j17Q8l16M17j10Q5j43o9J80p0Q2l01K15P2k33J05
6578f5J12J76j90P7l00R7L2K3O8l6K05j78j88J38J99k76J08%Q6J1k50l5J03k15
$$ plain form
6404 42 -126 -95 -39 -191 -130 -9 -17 67 -232 -70 215 236 108 34 -32 9 56 -98 -24 59 41 -112 126 142 -33
6429 -33 -104 -2 -25 33 -127 98 196 213 -253 165 60 137 -133 -199 58 -55 -220 300 49 121 -174 -91 13
6452 13 -3 96 -76 72 -17 -35 105 11 -97 245 212 -27 -192 16 -167 86 29 32 107 98 -28 61 -222 -136 208
6477 208 84 -63 -96 131 127 84 -25 17 -61 -13 -49 1 22 -72 -27 27 46 -41 9 154 124 174 -33 71 -90 -29
6503 -29 -146 -87 96 -152 241 -116 -122 46 -51 -7 162 120 -129 14 188 91 6 -83 -6 -101 -53 239 59 -180
6527 -180 -73 61 93 178 98 222 -21 -107 140 206 -65 88 45 60 0 63 21 25 62 -186 39 93 97 -29 65 75
6553 75 2 6 82 -48 -100 31 -5 -24 50 -67 21 -295 122 12 97 -46 -115 65 -5 77 -224 -9 63 -170 -65
6578 -65 47 223 33 110 -190 -93 -61 -38 30 -6 199 21 -167 -29 170 -106 2 2 88 99 -151 -186 -83 -298
6602b98K91N2J40m20J82O7j31K53J3j56j64K77j03J27k31J28O4p0Q9k31J42J6
6624C7l0j56J93j69N8J17N9oj48J2J30p8Q7n3P3j34j82K90J08j10j79j03J27J35
6648G8O1k39J1K10r5J21k61J54j14J24l0k97M06k72K42K3kl9n0Q4k7j03J05k44
6672a54KK39j05j42L7J56j00l9o0J16k1j08Q8P7rJ76l13P9m5O0rr2j6j50K75k83
6698c41L16r1J63n1L0j39n1K85k88K43j23Q6n2R7o0q4n8J42j90K00J61m64J68
6721a01K34j46j11L6M8j7j04K01j42Q9j48L7P7p8K99k45j21N8J22J44k03R9J7
6744D5l5K33l06J11j34Q3L5L9m5J6l7r0R4M9k88J92J34j15J04Q5O7k61P7j7j24
6769h8l5L05j86j19J17k47K69j22K27j87O4q2o3K37P2k1n3J16j73J3j55o1J10
$$ plain form
6602 -298 -7 45 185 -235 -53 14 -117 136 149 -7 -171 106 3 130 -101 27 91 21 110 -121 21 37
6624 37 7 -149 44 -125 -67 50 109 103 -45 -33 97 19 106 53 126 -8 -190 100 208 98 -81 -184 -57 78
6648 78 139 -100 -89 121 26 147 -114 40 -74 50 20 -277 129 -143 99 122 120 81 31 115 88 -15 90 -154
6672 -154 -152 87 -18 -160 -123 33 -67 -106 -166 -50 -71 -179 -91 -14 -23 153 -160 -81 -126 -66 -75 -167 -183 -333 -58 -341
6698 -341 -25 -116 47 -4 26 -113 -164 121 -167 76 -47 39 -13 84 24 -60 -118 24 -166 34 195 -269 -101
6721 -101 133 -13 -124 -88 -40 -57 -161 40 -102 -13 -161 -124 -47 -125 174 -71 -192 -134 -12 132 -71 28 45
6744 45 10 243 -63 48 -86 -3 32 71 26 42 5 -85 9 58 -230 -38 96 -19 85 170 237 -24 53 36 -88
6769 -88 -123 182 -4 -123 -6 -253 16 -106 121 -66 -2 -84 -147 90 162 141 88 204 31 44 -111 -172 -62
6792f2kJ75l8j82J0K38l40NJ8M58j70j04jK55m29L71j22OK56n04N1K12k73l9K66
6817E5j42k15K54M7j5J2q5j58M56l02r7J07oJ55j53K57k21J13Ll9J07j0j68P5
6841C0O5j78J1J94k06J07m2N3q6J04J17k88L06k84o1M16n03J88j05J14J00k3j93
6864a64M0R6k00K50j9JJ6K2P7j11P3l1mO7p0j14R9j29q8J29M4R3O3r5k7j09K87
6891A96k55pJ02n7J27j13N6pq4O2j12N7J40o5p9J91j9L7k50l2K1J71J3J2l7q4
6917a6J70j23J67l13P7k26O4O3J03j51L27j43K77l40J28j28j90L02j20k60L00
6938c2J03j29P7QM0j48J91q8N5n9k61K40M9j15K75k62R3r8JJ78p1K0k94L8M69
6963B80j45j54L8O0j11OJ47l63L67J0n3p0M4N9j50q2L9R5N2q4k9L8l0o1M2J33
$$ plain form
6792 -62 -64 111 73 -109 -99 139 -201 -196 -178 280 110 6 5 260 -169 202 80 86 342 -162 -111 101 -172 -211 55
6817 55 -87 -302 -48 -1 -16 -4 -89 -247 209 -93 -190 -83 -89 66 -87 170 -51 62 65 26 133 123 -45 30
6841 30 95 -83 -72 122 -84 23 -19 34 -52 52 169 -119 187 -97 -158 258 -245 -57 -162 -48 52 29 -164
6864 -164 -124 -28 -228 22 3 4 20 42 119 8 81 50 46 113 43 -71 28 -101 -189 -60 -16 77 140 45 18 -91 196
6891 196 -59 -66 36 -21 106 -7 49 42 -42 20 -92 -35 105 40 -39 152 133 170 -80 -112 -91 80 93 105 68 -16
6917 -16 154 31 198 -115 -38 -264 -200 -137 -34 -185 142 -1 276 -64 64 -64 -254 48 -72 -332 -32
6938 -32 71 -58 19 27 67 -81 110 22 77 18 -243 -3 46 -69 206 -56 37 -61 -60 118 47 67 -227 -189 280
6963 280 135 -19 19 79 -32 -26 121 -242 125 135 82 12 56 115 -35 -117 -78 17 69 -15 -44 -6 -36 -97 -55 78
6989G8j91J73k9j7L8m6k5l9J36k19m8p9K49kPK47n12L27p2m4J38j05Rl3J2j0p1
7016a28K47k17lJ17r5j35K43R7l90M60k22j27l9M7L1L30m62J17J38J86k81J67
7038H1k71M13k25N5j14J44j39L9R4j36j73K36L2j12P8q4n7K57j80Q8o3P0p8j02
7062a47L23k02K33j68k6j58KO2Q7j1J97k95N0P6j31J01p2K51r5j20Q9j53L3K10
7086A36l3m0K4J4k12J08q0R7J80j54N3M9p2N5j39j06J09r0L55k07pQ5j52j12J12
7111b7Rp9J38k9Q4k35J75rj02N0J81k94R6R6o2N9J50m6o4M6o2Kj52P7P9m1n9j69
7139a88L55l8mj28J28p7j25M5n5K07j34k90J07J84J06N9k19n5N6J13m2q9N0j66
7163b00K98j55P9l6j12L5K95j13j33O1p1lm3M0k0J91r1M5J06mo3k16J13j35J18
$$ plain form
6989 78 -113 60 31 14 52 6 -19 -58 78 -141 -189 -268 -19 -21 -14 233 -279 48 -24 -68 70 -35 -26 -59 -47 -57 -128
7016 -128 119 -98 -101 16 -79 -214 29 126 -264 196 -26 -153 -192 -145 -114 216 -246 -129 9 195 -86 81
7038 81 -190 223 -2 53 -61 83 -56 -17 77 -59 -232 4 36 -76 2 -82 -139 118 -62 26 -37 33 -45 -147
7062 -147 176 -26 207 39 13 -145 -143 -81 6 -5 192 -103 -53 23 -108 -7 -79 172 77 -43 46 -107 -74 136
7086 136 103 63 87 101 -111 -3 -83 14 194 40 93 142 70 125 -14 -120 -11 -101 254 47 40 125 -27 -139 -27
7111 -27 -18 -97 41 12 96 -139 36 27 -75 -25 156 -138 -42 54 -8 51 201 155 91 137 75 77 -75 2 81 40 -19 -188
7139 -188 167 129 125 -3 125 48 -77 -32 -87 120 -14 -304 -197 -13 93 152 -67 -122 -66 47 5 -84 -34 -200
7163 -200 98 -57 22 -14 -126 -91 204 91 -42 19 -52 -55 -98 -58 -78 113 22 67 173 169 106 -110 3 -132 -14
7188a4J48k68J66l91K55L2O5Q0K2k95J52j8L1K14n9k13R0j00J13m4j85K33J13
7211A27Lj6k45k6J54n8J38p2J40k40Q9m7q1J30R3k20n6K58m7j04K89k51O6l8j19
7236a33K9oN5n6N4L7QQ3r6lj00K04j35R5J14k74J2N9RJ17n0O2j11O8r3J25j22
7263d8K38j04j73p3J35J33k08m7J8P7q9J76j09K50Jq2l6%N0k51K01J40P5j15l54
7288a95R1J02J58kk18K39j24k65J41K28L1r4O3J4l22J09P3j16K68k18K12k28Q8
7311C5q7j3J65k19J48p3j9J11k76J33J40p5j30k39M45r7j10J66l4J05l10M47j29
7334H4k53P2O5Q9J53l09nK30r1m9n4K48k11J27o4r1m3J01P8J48j33q7j88J94J01
7359A12mp1j80J13n4K30r2j42N8j04K20k54K08p7K57k31J0J13j84N1R8J60l76
$$ plain form
7188 -14 134 -134 32 -359 -104 -72 -7 73 95 -200 -48 -66 -35 179 120 -93 -3 -103 10 -34 -219 14 127
7211 127 130 114 -131 -157 -3 -61 77 5 145 -95 -6 -53 -134 -4 89 -131 -187 71 24 -80 209 -42 24 -14 -133
7236 -133 -104 -110 -55 -111 -57 -20 -12 71 -25 -28 -128 76 -59 36 150 -124 -112 -53 -44 73 23 85 -26 42 -51 74 -48
7263 -48 190 86 -87 -160 -25 108 -100 -147 -129 -52 -141 35 -74 176 177 95 59 59 109 -142 59 199 274 159 -195
7288 -195 -104 -2 156 154 -64 175 51 -214 -73 155 186 92 155 169 -153 -44 29 -87 181 -37 175 -53 35
7311 35 -52 -65 100 -119 29 -44 -63 48 -228 -95 45 -30 -160 -399 46 -51 -161 5 -29 76 -234 213 84
7334 84 -169 -97 -32 57 210 -99 -104 126 35 -14 -68 180 -31 96 32 -59 -102 -1 77 225 92 5 -183 11 112
7359 112 108 37 -143 -30 -84 146 54 -88 -30 -134 86 -168 40 -37 220 -11 -1 112 -72 -21 77 237 -139
7382a39j36K58M3o2K17l44J99N3N6j19J40k70J77P0l70K79j68R2L73m07P5n7j21
7405a61L6J24J00J29m14J10l9J26n6J42j44k0P5j18L33j77j13J15P2j84j48M20
7427B08k56l7P4n4J57j60j14R4N4J36j16J43k23K50L5m0j39j44N3M5J02r1R2J00
7451A69k16J19j07R0j09J95M9k67j14K90l10L3J09j30L33j75J41j06k10K70j62
7472a08k1L52k86MJ10%k54J67LL08l67j10P2L2O1n5M8J74l40K59L4k7j90K0o4
7497a78L40j32%Jo7J68o5Q5k78J42Rn3j46Q3L2rj12n2M5J69L9j19J06l0p5J20
7523B3p2p9J54O6j80j29J38Q6j06m9K70k67N0j6P0m8J51K50n00M5l9K3J44m4J70
7548A11Lk95K39K6J02o8j32J4J65P4l7k27O7j09j38K44L0j55J29P1j59K3p2J83
$$ plain form
7382 -139 -275 -17 26 -36 181 -163 36 89 145 26 166 -104 73 143 -227 52 -116 -24 349 -58 17 -40 -161
7405 -161 -125 -1 99 228 -186 -76 -115 11 -45 97 -47 -67 8 -110 223 46 -67 48 120 -64 -212 208
7427 208 -48 -85 -11 -65 92 -68 -182 -88 -34 102 -14 129 -94 156 191 151 12 -132 -79 -34 68 -23 69 169
7451 169 -47 72 -35 55 -54 141 190 -77 -191 99 -211 -178 -69 -199 134 -41 100 -6 -216 54 -108
7472 -108 -129 223 -63 -59 51 51 -203 -36 -33 275 -92 -202 -130 -98 -37 -92 -44 130 -210 49 83 56 -134 -114 -178
7497 -178 162 30 30 31 -36 132 67 152 -126 16 25 -28 -174 -91 -59 -68 -180 -232 -187 -18 21 -98 8 -22 -97 23
7523 23 -49 -128 26 92 -88 -217 -79 7 -99 -148 122 -145 -95 -111 -41 -89 62 312 -188 -143 -182 -159 -15 -59 111
7548 111 114 -181 58 84 186 118 -14 0 165 239 202 -25 42 -67 -205 39 69 -86 43 114 -45 -22 -94 89
7572H9l7M3l13J36J13j68J57j00J21n7J66j48N6p5OJ1J17j11pj10K42J06j12j24
7596Aq8K73k94LK27j4P3j41%j20J68k56L04j44n6J05q5M1M0J48l97L96j17P7j6
7621A28l14L38j03k69L41k06Q0j21J6L4JJ73j43J30J83j41q2J8j2k1r8OJ77o1
7645E4k29M15k41J14k7J16Q4M4m16p3L4K99k33j20K83l15L12j82J17J09j14J21
7667A52p0j12N4l9l4J54k23J64n2o5J50r7oJ33o9p2J23KN0L4j21j11J46j02j4
7692b5j41L14j05N1k2q6j08m5M9K10j8l2R9mrk38k07L58m7j64K38J80j51j40j16
7717a59O0J24L2jj81J62j7q2J24o9k16P9kl0K4J53p2P4q7ln0L6R4j68J59j15J23
7744hK0P9j59m9K90l30K79Kl31J84J97j83K06n6j72J8K1M8J4j76J63k06L39j94
$$ plain form
7572 89 52 95 -218 -82 31 -137 20 -80 41 -16 150 2 58 -17 -11 0 117 6 -1 -111 131 237 125 1
7596 1 -87 186 -108 -105 122 108 181 40 40 -80 88 -168 136 -8 -64 41 -44 -3 37 185 -212 184 67 144 128
7621 128 -186 152 49 -220 121 -85 -5 -126 -110 -76 -75 98 -45 85 268 127 45 63 51 30 -68 -62 115 54
7645 54 -175 240 -1 113 86 202 286 330 -86 -159 -125 174 -59 -179 104 -211 101 -81 36 145 31 152
7667 152 82 -30 24 -15 -49 105 -118 46 -6 -71 79 -18 -24 109 40 -32 91 93 143 177 56 -55 91 -11 -25
7692 -25 -166 148 43 94 72 -14 -122 -167 -118 92 74 42 141 137 128 -110 -317 41 -6 -170 68 248 97 -43 -159
7717 -159 -99 25 57 56 -125 37 20 -62 62 -7 -223 -144 -146 -176 -152 1 -71 3 -84 -87 -137 -101 -7 -175 -16 -131 -8
7744 -8 12 91 -68 -117 173 -157 122 124 -207 -23 174 -9 197 141 -31 -13 8 56 70 -106 57 -149 190 -4
7768dl2K62j09J27j36r8Nk00J69om4j20K45l5q3O0j62K13p6J7Q2k13OK25j56j44
7794b07K58J00j81K9k32K75k7n3J37k64M15k25N7N2j57J72r0j96M4J43j33K15
7816A32n3l9pn9j20P2k8J25k9n3Ql6ML1K02k13K88j36K20k70k49J36K0P9O6N5
7842A46L5k62j57L40K62l21J5J61o1K3j82qj58J98k28J63R0j42R2J7j52L21k04
7865a2o9m4J1J46j19J31J55j50j20m3K56j4p1k07J00lO8oM0P3l69J61K35l64J2
7890b03L43j42O4Pm8j58L26k45N7K5J61o1k8R3k34P5mK6k5l0l59K34K6M9L8o6
7916g9K7K45l23j55K94q6J04p4Q5j38J73J0j8p3R0k26K05j56j8M6L06j42qm05
7940c16K62J83Q7j57k47J53LL1R4R2j53P9r7L31k95kQ6k54J15j32J02l1L5j2J07
$$ plain form
7768 -4 -36 226 117 244 108 10 15 -185 -16 -22 -66 -186 59 24 -59 1 -161 52 -24 -7 75 -138 -132 93 -63 -207
7794 -207 51 151 -30 -1 -233 42 15 -38 99 -165 250 25 82 134 -23 149 59 -137 -93 50 -83 132
7816 132 79 40 33 -26 -146 -74 -102 23 -6 -59 -51 -87 -83 -52 150 -63 225 89 309 39 -210 -74 -54 25 91 146
7842 146 181 -81 -238 102 364 43 58 219 158 181 -1 -9 -167 31 -197 -34 56 -86 6 23 -129 192 -12
7865 -12 -81 -125 -114 32 -87 44 199 49 -71 -114 142 128 57 -150 -50 -53 15 9 49 122 -247 -86 149 -215 -203
7890 -203 140 -2 62 69 21 -137 189 -56 1 26 187 126 98 191 -43 32 28 54 29 -1 -360 -126 -100 -51 -13 -79
7916 -79 -52 193 -130 -285 9 -77 27 -47 38 -100 73 83 65 -8 82 -144 61 -95 -113 -67 239 97 89 -316
7940 -316 -54 129 216 59 -188 -35 -32 -1 93 185 32 111 14 345 50 48 134 -120 -5 -137 -35 -66 -31 -43 64
7965F4J08j74K34j38j09k07J87J95k34K1R4p2pL8k80M44n6k65R1j8m0K52j30p5
7989g7J10P7j12j68N1N7R0p3J81k42L28j15o6R7l9Q6q3n8j03J82m2j89J77j60
8013i1O9K21r9j63J06m4J20l01J15K9J66k10K33NM9l40K42l16L6K00j53N4Q6j57
8037a43N8M0R3m9J11O7k06Q2l1j27J05L0j09J37L7j06j85K45p5P7P1M7j32j1J2
8062C8o5J40n1j55p6J53J01q4rJ9N6j59M9n5J80P0k47J87k9k9R1K9pk66MK35l52
8089b32J01K31j83J29J79j16j11J50j99%j07K29j44J43j41J60o5K4j23J69J48
8110B42j56j16J13j40J05j73J02M5P8j71M7Kj8M4nJ09p8J11j84J1J04J07k62j1
8134i4P0pj37K32j07K34j50K27k99J1N7n8R9j54J88J18l18j15L27j2n5M5j32J0
$$ plain form
7965 64 172 -2 232 94 -15 -222 -35 160 -74 -53 41 -31 -38 0 -280 164 108 -157 -66 -84 -124 128 -2 -77
7989 -77 33 110 -2 -170 -119 -62 28 -45 136 -106 222 107 41 138 99 185 102 44 -59 123 81 -108 69 -91
8013 -91 -22 199 100 -63 43 -1 119 -182 -67 -38 128 -82 151 156 205 -135 107 -209 -173 27 -126 -72 14 -143
8037 -143 -85 -45 48 -1 110 177 -29 53 22 -105 0 30 -79 58 95 -11 -196 49 -26 51 122 169 37 26 38
8062 38 -27 113 62 -93 -169 -16 85 1 -8 11 67 -92 -43 -98 82 152 -95 92 63 34 125 154 147 -119 -115 120 -232
8089 -232 -131 100 -83 46 225 109 -2 148 -51 -51 -158 71 -73 70 -71 89 24 48 -75 94 242
8110 242 86 -30 83 -57 48 -125 -23 22 100 -71 -24 -22 -40 4 -1 108 30 141 -43 -32 72 179 -83 -94
8134 -94 -24 -31 -168 64 -43 191 41 268 -31 -20 37 -21 78 -76 112 230 -88 -203 124 112 57 102 -30 -20
8158b0K4j17q2J67P7o1J81m2m2n8j33K07k51J12N7J35k33J51J53l69L35n74N18
8181A35j34m9K18k01N9k7O0J22k08o4
$$ plain form
8158 -20 4 -113 -195 -28 49 -12 169 127 85 27 -106 101 -150 -38 19 154 -79 72 225 -144 191 -383 135
8181 135 1 -48 170 -31 28 1 61 183 -25 -89
8191h9
$$ Imaginary data points
##PAGE= N=2
##DATA TABLE= (X++(I..I)), XYDATA
0@%%%%%%%%%%%qJ6j6J6k4L2l2M0m8N6p2Q8j04J20j36J59j83K08k40K78l18L60
33A92m09M63n24N89o61P40q26R20j023J135j256J392j540J700j874K065k276K508
51A315k762L045l361L711m104M549n061N654o347P174q180R434j1052J3228j6332
66i089K1153k9746M9807j89147j17432K14544M8107l74n7287L2270O9143Q5733
78A17682J8169M955K657J5317l2304n5280n9651k9657j9575j6068m1109l4391
90a29255p400K6364K5210J3519P898L4349N6709N7726K5409j1848k5653o663N381
103G1746q16j9460k8230k6826k3176k4807k3995j7958O264L1575L1494J0948m027
116a7268p232Q508L1792L5938J6646m100j1901j1516j5901j8063j2454k361R223
$$ plain form
0 0 0 0 0 0 0 0 0 0 0 0 0 -8 8 -8 8 -16 16 -16 24 -24 32 -40 48 -56 64 -72 87 -96 112 -128 150 -168 192
33 192 -217 246 -278 311 -350 390 -436 484 -539 596 -660 732 -808 892 -982 1083 -1193 1315
51 1315 -1447 1598 -1763 1948 -2156 2393 -2668 2986 -3361 3813 -4367 5067 -5985 7243 -9089
66 -9089 12064 -17682 32125 -157022 -274454 -59910 -11803 -12177 -69464 -37194 31949 117682
78 117682 135851 140806 143463 158780 126476 71196 11545 -18112 -37687 -53755 -94864 -129255
90 -129255 -136655 -110291 -85081 -71562 -63664 -29315 27394 85120 110529 98681 73028 66365 71746
103 71746 70930 51470 23240 -3586 -26762 -51569 -75564 -93522 -87258 -55683 -24189 -13241 -17268
116 -17268 -24500 -15992 15800 51738 68384 64284 52383 40867 24966 6903 -5551 -7912 1311
129A311P891j5412l1508k2136L792K3675K3699R640j943l834M174J0004O257N557
143B1167J0156O459l183j2210j5709r559j742j435r340j2656j48J4148J0577o015
157i490j8101j2782J3462L7282L1561M710j7467j9602n110P482R930J510r709
170A3676j3839j5350j7307q319O974J5082J2204O29o176O14J2310J8503J1846
183C0847r95n121o30O50k615j0790j7718j5671n367M178N633j252n374l109J838
198b5496J1871J7583J3378J0222O090p67o784p845m648p87p81o523j4497j7681
212b6665q362J860M431N110O113N969R689R652N135J793K826P879P248m30p944
227B4304j3369j3853p931l877l044r39P1o27j782j100L985J0079J2157J0718M998
$$ plain form
129 1311 9202 -6210 -37718 -59854 -56062 -32387 -8688 952 -991 -4825 -651 9353 15610 21167
143 21167 31323 37782 34599 22389 6680 -2879 -4621 -6056 -15396 -28052 -28200 -14052 -3475 -9490
157 -9490 -27591 -40373 -26911 10371 41932 46642 29175 9573 4463 11945 21875 23385 13676
170 13676 -163 -15513 -32820 -41139 -34165 -19083 -6879 -6250 -12426 -11812 498 19001 30847
183 30847 29852 24731 24101 24751 22136 11346 -6372 -22043 -27410 -23232 -17599 -18851 -24225 -27334 -25496
198 -25496 -13625 3958 17336 27558 33648 32881 26097 18252 13604 12817 12036 5513 -8984 -26665
212 -26665 -35027 -33167 -28736 -23626 -17513 -11544 -1855 7797 12932 14725 17551 25430 32678 32248 24304
227 24304 10935 -2918 -10849 -14726 -17770 -18709 -18638 -19265 -21047 -22147 -18162 -8083 4074 14792 19790
242A9790j496L8J946jl200p392p380l981k056k619o864q334l152L374O825Q878
258e624N991R76N87J471K928O357O306K880m268r937q194l174J155L374q85p266
274g323o894k894K111N277M013J901J379K540N476M801L55j215k467j385J420
289G095J462j748l848n237m828k366r8K234K022j52o37r68L93M977N630L651J193
306H775j193j790n86k57M01q12j873m48k352m786k328r80J17J680J422R23K006
323b081J847J875L96j75K438K604J236N02l097m156k437o71O23N20j307k655k504
340g042q54K860K134Q25J297M80J202K593J433M11j81j034j77m48k45o08k797
357a51m176j756n26J621K707Q48j361r10k57K061L731K693J525j106j620K2N9
$$ plain form
242 19790 18294 18332 20278 20277 17077 9685 2305 -1676 -3732 -6351 -13215 -21549 -24701 -21327 -14502 -5624
258 -5624 367 1343 1930 3401 6329 12686 18992 21872 17604 7667 -527 -3701 -2546 828 -57 -7323
274 -7323 -14217 -17111 -15000 -9723 -5710 -3809 -2430 110 5586 10387 10742 9527 7060 5675 7095
289 7095 8557 6809 2961 -2276 -7104 -9470 -9568 -7334 -5312 -5464 -6101 -7069 -6676 -1699 3931 7582 8775
306 8775 7582 5792 5206 4949 5350 4538 2665 2217 -135 -4921 -7249 -8229 -8112 -6432 -5010 -4087 -2081
323 -2081 -234 1641 2037 1862 4300 6904 8140 8642 5545 1389 -1048 -1719 -1096 -576 -1883 -4538 -7042
340 -7042 -7896 -5036 -2902 -2077 -780 -300 902 3495 4928 5339 5158 4124 3947 3499 3254 2646 -151
357 -151 -4327 -6083 -6609 -4988 -2281 -1433 -2794 -3704 -3961 -1900 1831 4524 6049 4943 3323 3345 3404
374C404K1Q8k408k544j376q51j8k15r06j98K05J895K334J444M85P37P90J324J696
393E907J6o64k554k579j071j038K25q1j586j849k49L83J462K178J243J377O80
410A800J285J191M74j31l55j631j225k28m18j224j663k460j296j20R50J885J665
427a501J327Q48n53O90K198J773J302Q9k963k072j348r6K44p81j172j184j499
444d698M21J180O56P79P25P94J089J304J308M28p77j186l17M7K61p3j931j805
462a795j080k14L54M24J32K79J23Q53J165M51P60J021o02j89O88j00l62n04j122
481B82j029l01M05K53j373j356k55L77J689J807M64k44p67l43Q44J698J712P1
499C934j450j831j274q39P41L13r65q50k25n2J004O86L23K07O02J057J219N4L02
$$ plain form
374 3404 3425 3513 1105 -1439 -2815 -3666 -3684 -3899 -4805 -5003 -4798 -2903 -569 875 1360 2097 2887 4211 5907
393 5907 5923 5259 2705 126 -945 -1983 -1758 -1839 -3425 -5274 -5523 -5140 -3678 -1500 -257 1120 1800
410 1800 3085 4276 4750 4619 4264 2633 1408 1180 762 -462 -2125 -4585 -5881 -6001 -5051 -3166 -1501
427 -1501 -174 674 121 811 3009 4782 6084 6173 3210 1138 -210 -306 -62 -843 -2015 -3199 -4698
444 -4698 -4277 -3097 -2441 -1662 -937 -143 946 2250 3558 3986 3209 2023 1706 1753 2014 1941 10 -1795
462 -1795 -2875 -3089 -2735 -2311 -2179 -1900 -1777 -924 241 692 1452 2473 1871 1682 2370 2270 1908 1404 282
481 282 -747 -1048 -643 -390 -1763 -3119 -3374 -2997 -1308 499 963 719 -48 -391 453 2151 3863 3934
499 3934 2484 653 -621 -1460 -719 -406 -1371 -2221 -2446 -2498 -1494 -808 -485 -278 324 1381 2600 2654 2956
518B956p77j578q69j4L28L60j011j653j476p07J555J431J439R21K53K94O28J93
536B273L49R4k30l38p52j189p08j676j864m58K54R82J959J008J59m31N52J669
554A653K005O36N34j175j440p22p15j090j29j133k090j215k71J273J714J220m8
571i93J38P27K452J561N08j23q49n08J95p29j184j876k128j381l49L36J445N54
589b204k40k01r5J579K840K168O46j12j105j74j47n17n26j233j527o25r91r20
607c384o55m52K7P56J557J847J383M99M49k21L88J789O48p4j146j890j548q14
625h41n12m55o81q24l39n37O64J332Q71Q33O47M43J132J895O10K6p53r94n93k69
645A655o79j199j650j414p06j41M39J185J36P2m1P79K542K160J419k04j492j014
$$ plain form
518 2956 2179 601 -268 -282 46 406 -605 -2258 -3734 -4441 -2886 -1455 -16 905 1158 1452 2080 2273
536 2273 2622 2716 2486 2148 1396 207 -501 -2177 -4041 -4499 -4245 -3263 -1304 -296 -137 -568 -16 1653
554 1653 3658 4294 4828 3653 2213 1491 776 -314 -443 -1576 -3666 -4881 -5152 -3879 -2165 -945 -993
571 -993 -855 -128 2324 3885 4393 4270 3421 2913 3108 2379 1195 -681 -2809 -4190 -4539 -4203 -2758 -2204
589 -2204 -2444 -2645 -2740 -1161 1679 3847 4493 4381 3276 3102 2955 2438 1912 679 -848 -1473 -2464 -3384
607 -3384 -4039 -4491 -4464 -3708 -2151 -304 1079 1578 2027 1806 2194 3983 4631 4557 3411 1521 -27 -841
625 -841 -1353 -1808 -2489 -3313 -3652 -4189 -3525 -2193 -1322 -489 158 601 1733 3628 4238 4264 3511 2517 1924 1655
645 1655 976 -223 -1873 -3287 -3993 -4134 -3695 -2510 -2374 -2302 -2343 -1564 978 3138 4557 4353 2861 1847
663A847O70J73j51j334j832p57q66o04l22q59J9N94Q69J636J888R22M71m45l79
682A540J157J264O47r01k361j893r57l15K43k12j271o79Q5O91J436R96R32N83
700I85J39Q56J220M18k76q84j426m15l92K60r35j268j360m46J32J093J056P35
718e08M3J44M43J196J348N02q7j327r81p9n7J3r08r18q70M0n0L06J95P5P76L22
740c82P60Q01Q24j81l50p95j94R91M82p90j504j224n57P60O48J34m77r0L16M17
760d11N18M26M56k27p1N2M01N4Q9p16j214k82J38M98M61k89j163j84J90R12Q42
781D80j80o0m2l16J21J046M08l09o06j014m48N41L32L33p19n75m9Q5O01N38k37
802g0K33k54l8O31O77N8o9q67l92K40L18M48q21j083q1k42M35P02l34n2K57J10
$$ plain form
663 1847 2517 2690 2539 1205 -627 -1384 -2250 -2854 -3176 -4035 -4016 -3422 -2553 -917 971 1893 2364 1919 1540
682 1540 2697 3961 4608 3707 1346 -547 -1504 -1819 -1576 -1788 -3059 -3738 -3653 -2962 -1526 -530 402 985
700 985 1124 1980 3200 3618 3342 2458 1032 617 225 485 -450 -1718 -3078 -3524 -3392 -2299 -1243 -508
718 -508 -465 -321 122 1318 2666 3168 3081 1754 773 694 637 650 -258 -1176 -2046 -2006 -2056 -1750 -1555 -1480 -704 -382
740 -382 378 1179 2003 1822 1472 677 483 1474 1956 1166 -338 -1562 -2119 -1359 -711 -577 -1054 -1144 -828 -411
760 -411 107 533 989 762 691 743 1144 1198 1287 571 -643 -925 -787 -289 172 -117 -1280 -1464 -1274 -362 480
781 480 300 240 198 -118 3 1049 1457 1148 542 -472 -920 -379 -47 286 -433 -1008 -1057 -972 -371 167 -70
802 -70 163 -91 -129 502 1179 1237 1168 301 -91 149 467 915 94 -989 -1070 -1312 -877 -175 -509 -561 -304 -194
824a94K87Q28J14J97m29j1L0J23k04n10r54q23M66Q1O11l05n93O1O22P10J066
845A173m0j67l52R4K59N57l96o80l74q85l98K26L25K62p46k72J34L89Q12Q21M47
866A189m73O5j00K81K12j04m87p69k76J6L31m14m8n89j83K23M42O59K55R3rj2
888C02L6P32p2j70K4m59q5r8J42m49o90l76l4L59N39K72n82k4J46L10N72N33j50
911G78k03J4N7J87l7r2Or28n02q7j15K36k61o28J04M15O24Q04J16P9J55J53L10
934A185L41J52j54l86j005m42k17l29n9m79m88L25J08N69N42K80L29M17J60L54
954A203O03Jk31k92p43l00m22l90l06n57l48K80J4M59K61JL15N85L97Q39K14J37
976A720op50j54j08j1o28p12n04l38j6L19J53l46L37K26O88M99N84O5p0K46n09
$$ plain form
824 -194 93 921 1035 1232 803 792 822 945 741 231 -723 -1546 -1080 -999 -388 -693 -1286 -1225 -603 107 1173
845 1173 1133 966 614 708 967 1524 1128 448 74 -811 -1209 -983 -658 -396 -1142 -1414 -1280 -891 -79 742 1189
866 1189 716 781 681 962 1174 1070 583 -186 -462 -446 -115 -529 -577 -1166 -1349 -1126 -684 -25 230 323 314 302
888 302 338 1070 998 828 852 393 308 210 352 -97 -787 -1163 -1197 -838 -299 -27 -609 -633 -487 -177 395 928 778
911 778 575 589 646 833 796 704 710 -218 -720 -807 -922 -686 -947 -1575 -1471 -1056 -432 372 488 567 722 875 1185
934 1185 1526 1678 1524 1138 133 -309 -526 -855 -914 -1393 -1881 -1556 -1448 -879 -337 -57 272 689 849 1203
954 1203 1806 1807 1576 1284 541 241 -181 -571 -877 -1434 -1782 -1502 -1488 -1029 -768 -767 -452 133 530 1369 1583 1720
976 1720 1714 964 810 702 691 63 -649 -1153 -1491 -1507 -1188 -1035 -1381 -1044 -818 -130 369 953 1018 948 1194 685
998F85N49J85k28m61q45p17N8j87Q4l15l38K23K93N90L59J15K14N09J98M34J99
1019A604k01n46j0p34m0k15p3n72k75n91Q3K18L85M11J84M83L61L14N13J02r7
1040A304k41j45l78n2m89k37l98n18k77J30o9N39K7K35O06K63K80L01Q0K58J22
1061A341m08k78m11k23j12k56o21k06j47L21M77r3K20l1L37O41J56L39Rk51k39
1082E65j36rj57j03o79k38o3l9M86j37j53K49O3L18N54k25PK17Q7J05n4l77K3
1105C04k86n03J43p8J66j98j77q8J94O78J47L1m79K11K08J71J90l20k05rl58P4
1127a84K54k71J59m22KN1J72K62M77n29m0J09J37J48R3j36k15j4m3o2j87k6M4
1150b21m0m03M50K2K45J01r2m2L10J22J17J6l22k9j87k81Q4J6n9L4l12p9M9K77
$$ plain form
998 685 1234 1419 1191 730 -115 -832 -774 -961 -877 -1192 -1530 -1307 -1014 -424 -65 50 264 773 971 1405 1604
1019 1604 1403 857 847 113 73 -142 -215 -787 -1062 -1653 -1570 -1352 -967 -556 -372 111 472 786 1299 1401 1304
1040 1304 1063 918 540 488 -1 -238 -636 -1154 -1431 -1301 -1370 -831 -804 -569 37 300 580 881 961 1219 1341
1061 1341 933 655 244 21 -91 -347 -968 -1174 -1321 -1000 -523 -616 -396 -427 -90 551 707 1046 1055 804 565
1082 565 429 420 263 160 -519 -757 -820 -859 -373 -510 -663 -414 -351 -33 521 296 303 520 607 712 658 281 304
1105 304 18 -485 -342 -420 -254 -452 -629 -717 -523 155 302 333 -146 65 273 444 634 314 109 100 -258 -184
1127 -184 70 -201 -42 -464 -462 -411 -239 23 500 -29 -69 40 177 325 418 282 67 53 10 -52 -239 -265 -221
1150 -221 -261 -664 -214 -192 53 154 62 20 330 452 569 585 263 234 47 -234 -150 -134 -193 -159 -471 -550 -501 -224
1174b24K55l4J20J97P0O0J89k0j17m7k54j10j32k47j93k61j06L44j92L30Q6K63
1196b3M5K30J89M80k12j78L1l55O1j13k16o6l49j61k65n8L22l9L47PK79N22P6
1219E54J24j40P6j78L05qn05k90m9k88l19J47k87Q3R5K7L66L19K27J89qL8J46
1242F24L1l9N4k97l76L6k46j92n7j32mn3K38K5K30K51r3l1J54L29Q9J85j04k25
1266C97j44J02m17n2o7Jj56j97K0L91l36L74M3N8p1K75R8j4Mj10j19j39M22j40
1290B23j69p1n5k43r0j6J12K63j71k62K43J62P1J59j84K67j10R6K36k55Q2k41
1312D7p3R8q7j70K44ml28J24j48o5L46J6k51Q9M39l5J58k52k2l76O31k14L1j18
1336H0j47p9k69K02K2J48p6r9O1N6J20j4K28k61K7K05N0j43q2l57K08R3k5O2k34
$$ plain form
1174 -224 31 -3 117 314 384 444 633 613 496 449 195 85 -47 -294 -487 -748 -854 -510 -702 -372 -286 -23
1196 -23 22 252 441 921 709 531 562 207 268 155 -61 -127 -476 -637 -902 -960 -638 -677 -330 -323 -44 478 554
1219 554 678 538 614 436 741 733 228 -62 -111 -399 -718 -571 -858 -775 -680 -653 -287 32 259 448 440 478 624
1242 624 655 616 670 373 -3 33 -213 -405 -462 -594 -598 -651 -413 -388 -158 93 0 -31 123 452 541 726 622 397
1266 397 253 355 -62 -114 -181 -180 -336 -533 -513 -122 -458 -84 -41 17 -54 221 319 305 309 199 80 -59 363 223
1290 223 54 -17 -72 -315 -405 -421 -309 -46 -217 -479 -236 -74 -3 156 -28 239 129 225 461 206 288 47
1312 47 -26 72 -15 -185 59 55 -273 -149 -297 -362 -16 0 -251 -162 277 242 400 148 126 -250 381 167 198 80
1336 80 -67 -146 -415 -213 -191 -43 -119 -218 -157 -101 19 5 233 -28 -1 204 254 111 29 -328 -120 -27 -52 10 -224
1361b24J97Q5j89K21p5j45K34J04l22J95K2j85n9l04L29n5O8M7L5J79M0J23l88
1384f7K17j04J19n1n6l3l33J55K31l48k05K14J36Q2rK6J95K78k38J2J6J66o5j69
1408A69j55k4j56oL6j02j80k5J35J61J28J2j24J90J11K80p0J11j41m75J41j05
1430h9J83l03K33k14k81R8K14j74LJ26P8J02N2R0L66k05k8P5j45J04m9jj64p4
1454cj54j74mj01rL42k01J62lQ3O2N9k1K84J18n9o2p6k03J29l8Q7j11m40q4J34
1480b83j39P6L7j03K69j21J12MM13p4L52j8K2j88J13k63J15n56j75R4ol7k80K71
1504c65q6J03J58L72k15M47l2R2l2J64j58j37q8o3j86k00j27j60J92k96J49j18
1526e86L71J76L1R8K77j86K11NjJ79m31j35Q8k11l9j48l29K2P3R7K92k41K88O7
$$ plain form
1361 -224 -27 58 -131 90 15 -130 104 208 -114 81 103 -82 -141 -445 -116 -171 -103 -56 -21 158 198 321 -67
1384 -67 150 46 165 114 58 25 -308 -153 78 -270 -475 -261 -125 -43 -52 -26 169 447 209 221 237 403 338 169
1408 169 14 -10 -166 -172 -136 -238 -418 -443 -308 -147 -19 -7 -131 59 170 450 380 491 350 -125 16 -89
1430 -89 94 -209 24 -190 -471 -373 -159 -333 -330 -204 -126 -24 28 118 484 279 251 326 181 285 236 235 71 -3
1454 -3 -157 -331 -335 -436 -445 -103 -304 -142 -145 -62 0 59 38 322 440 381 319 243 40 169 131 218 107 -333 -417 -283
1480 -283 -422 -346 -309 -412 -143 -264 -152 -148 265 191 543 525 547 359 472 209 324 -232 -407 -313 -319 -356 -636 -365
1504 -365 -451 -348 -190 182 -33 414 382 474 442 606 448 311 223 160 -26 -226 -353 -513 -321 -617 -468 -586
1526 -586 -215 -39 -8 90 367 181 392 397 396 575 144 9 97 -114 -153 -301 -630 -608 -535 -438 -146 -387 -99 -32
1550c2J37J48L2P5R9rj02O6k06n4k01l41J6oP5J29j43k4K04J21j18K93m0j13K14
1575B20K2k48J31q5Q2k0j10j22P9rj32j6k1j7J32M6j76K41j90J27J65P0l3P4q9
1600A21J31k43J88q4K0k72P7r5K2J70p3j50L3k3m5P0Q6J39K39j76o2Q6R9j24J6
1625A50j21j17l5J24j24R9R0p9k33K93l36K73p2K07n9J24o5N8N9j68O0j12j9k2
1649b5Q1j29j95M3n6K49j24K27j59Q7J42j57K3j31L20l5l24K94l30L26P1o5p4
1672E9O7r9j15J10k58J48l3J20m4n6Kj2K46r1J54j74j02L68k22r6J54j09J33m6
1696A04k10J47j03J8k65L39p6k11LN7R3K11j38N8m8J48L8j30J90m3l17P2J97k13
1720g9K71k80J2j71O8J72k48K82O8n4J25pj87P1K2j2K02p0j15L1j58k61L7J83
$$ plain form
1550 -32 105 253 285 360 459 450 348 414 208 154 -47 -388 -372 -378 -303 -174 -317 -341 -137 -16 -134 159 119 6 220
1575 220 242 -6 125 40 122 102 -8 -130 -51 -60 -192 -208 -229 -246 -114 -68 -244 -3 -193 -66 99 169 136 210 121
1600 121 252 9 197 113 133 -139 -62 -157 -135 35 -38 -188 -155 -178 -223 -153 -67 72 311 135 73 159 258 134 150
1625 150 29 -88 -123 1 -123 -24 66 -13 -246 47 -289 -16 -88 119 60 184 119 177 236 68 128 16 -3 -25
1649 -25 56 -73 -268 -225 -281 -32 -156 71 -88 -1 141 -16 7 -124 196 161 -163 131 -199 127 198 133 59
1672 59 126 27 -88 22 -236 -88 -121 -1 -45 -101 -99 -111 135 44 198 24 -78 290 68 -28 126 17 150 104
1696 104 -106 41 -62 -44 -309 30 -46 -257 -254 -197 -104 107 -31 27 -21 127 165 35 225 182 -135 -63 134 -79
1720 -79 192 -88 -76 -247 -179 -7 -255 27 95 41 166 159 -28 43 65 53 255 185 70 101 -57 -318 -281 -98
1744i8K08m56J63k3K95k75R2K59k45P4R6l9J56k55K61j25M3p3k0k4n3j65J66O5
1768B7q7k50K63J1R3q5J04n2K6m5n2l5kJ98k09L26k03j15J80o2k7j05N2L7k6p0
1794a08l4J78m6j29j88K12J29Q2l3k26L11k17L6P0K9jj07K15k08r8K0M5J22J30
1818A84m47K91j14J22j52Q9J02J62j78k7K71k12M1j66J14j29k10J71J43k77J55
1839f7j26L7k87K79m5K61J10j37J23j6M0Qk05j67K26n9Q8j58n0k67Q0q8L08M6
1863f6k35J77L81j87K22j66P1j34J74%j7k87L20l05k38K18J21q2j13k5m0K7j2
1886a96J38J7r7L19m6J15q1q9J00m0j09m1J28j48L0K9m31J60p2MK38j24K32j18
1910h2J06J37J60m3R1k32k24L28j38j07J82j88k80m6P9k4K5J18RRr1L07P3j16
$$ plain form
1744 -98 110 -346 -183 -206 89 -186 -94 165 -80 -6 90 51 207 -48 213 88 131 58 38 14 -39 -204 -38 27
1768 27 -60 -310 -47 -36 57 -28 76 24 50 5 -47 -82 -84 114 -95 231 28 -87 93 31 4 -101 -49 -12 -38 -108
1794 -108 -142 36 -10 -139 -327 -115 14 96 63 -163 148 -69 -33 37 66 65 -42 173 -35 -133 -113 -68 54 184
1818 184 -263 28 -86 36 -116 -27 75 237 59 32 303 91 132 -34 80 -49 -259 -88 55 -222 -67
1839 -67 -193 -156 -443 -164 -209 52 162 25 148 132 172 180 -25 -192 34 -25 63 -95 -145 -412 -332 -420 -112 -66
1863 -66 -301 -124 257 70 292 126 197 63 237 237 220 -67 253 -52 -290 -72 49 -33 -146 -171 -211 -184 -196
1886 -196 -58 -41 -138 181 135 250 169 80 180 140 31 -10 118 -30 0 29 -402 -242 -314 -310 -72 -196 36 -82
1910 -82 24 161 321 278 369 137 -87 241 103 -4 178 -10 -290 -336 -257 -281 -256 -138 -129 -120 -211 96 169 53
1934E3m1J93J18j27L9m0J37j15k68Q4O9N1k62l4j34J60nK34q9J49r6k1L8J59l26
1959g4K29j49J35n8Q4m5J44m08q2J76O4j09p3O9M9j7J62j9m1r9L57k33q1J56j54
1984a7K99k69l6P7k83K75j12k0j6J12j62K49k27J3l3J89j48K83J17j27l8j44J02
2007H4j01M0qq0J7M6l8j61O5J93q6J20j27J30k55J13oJ11j4j41J69j28L14j88
2031F9r2R7m1k06J30p5J20j76R3Q7k8L2PJ27r8Q4J5J73r7l79J50J0j71JL80k41
2057b9Q7J50j5l63KK1K79m50M02j31K38j81P4j8m7J84M0O6m50M08l43q6M0N3O6
2082ck32j17J75K88k53K1N3L4K5m1J89j12j3k6k6O4Q7m0k3l31K49L18l97r3N0
2107a54K11j99Q5K82l7m7J88m01J50O6j98kJ16J39j52j5K4%k37J26j35K17j18
$$ plain form
1934 53 12 205 323 196 235 195 332 217 -51 33 102 153 -109 -143 -277 -117 -122 112 23 172 76 55 93 252 -74
1959 -74 155 6 141 83 167 122 266 -142 -224 -48 16 -93 -166 -97 -48 -65 97 78 37 -62 295 62 -19 137 -17
1984 -17 282 13 -23 54 -229 46 -66 -86 -102 10 -152 97 -130 -117 -150 39 -109 174 291 164 126 -18 84
2007 84 -17 23 15 -65 -48 -2 -40 -201 -136 57 -29 91 -36 94 -161 -48 -54 57 43 -98 71 -57 257 69
2031 69 -23 74 33 -173 -43 -118 2 -174 -81 6 -22 10 17 144 46 130 145 318 221 -158 -8 2 -169 -168 212 -29
2057 -29 58 208 193 -170 -168 -147 132 -318 84 -47 191 10 84 66 19 203 243 309 -141 267 -76 -162 -122 -69 -3
2082 -3 -235 -352 -177 111 -142 -121 -68 -34 -9 -50 139 27 14 -12 -38 26 113 73 50 -281 -32 286 -111 -204 -154
2107 -154 57 -142 -57 225 188 141 329 -72 78 144 -54 -56 60 199 47 32 56 56 -181 -55 -190 27 -91
2130i1l2J99o7J52j00J43j58k60M92j57j00nOj71J82n0j79J33O2j12K29j37kQ4
2154F1j87L85j59j29L49k43QM2o8l6k05K13j61J13Kq4J13j47J34q9M6N1J46M9
2178B04q4k01P0q5J99n7R2j86J49j14j74N9K5KK5K7P1q7j38K29j22K04j93K35
2202A50k01oJ89J08j63j06J19J01j90j25rO5K6r8mQ3j61J48k04M18k8j91J69r3
2226ck92K84K90l46J35j04m0L35k12k2j73K35k16K4j1j58K92j00j65L74LJ47r5
2249A82j73J70J03l10J17j9j9J26k54m1K57l77J97J05JJ16k21Q4p9O8j35K42k7
2272A13N4k22m7J11M7j07j54J04L5L3J17J23j11L0k69k9J2j2J82r5j4L2J15o9
2296b1J7J13M4l68J49J33j28K9q7j12L07r3j51J81l8j30K29k49k9J92r2o9J66
$$ plain form
2130 -91 -123 76 9 161 61 204 46 -214 278 121 21 16 22 -149 33 -17 -196 -63 -1 -113 116 -21 -23 61
2154 61 -126 259 100 -29 320 77 85 127 59 23 -182 31 -130 -17 -15 -99 14 -133 1 -88 -42 9 155 204
2178 204 120 -81 -11 -96 103 46 138 -48 101 -13 -187 -128 -103 -101 -76 -49 22 -65 -203 26 -96 108 -85 150
2202 150 -51 -57 132 240 77 -29 90 191 1 -124 -133 -68 -42 -140 -144 -61 -222 -74 -278 140 112 -79 90 -3
2226 -3 -295 -11 279 -67 68 -36 -76 259 47 25 -148 87 -129 -105 -116 -274 18 -82 -247 127 130 277 182
2249 182 9 179 282 -28 89 70 51 177 -77 -118 139 -238 -41 64 65 181 -40 44 -35 33 -102 140 113
2272 113 167 -55 -102 9 56 -51 -205 -101 -66 -33 84 207 96 126 -143 -172 -160 -172 10 -85 -99 -67 48 -21
2296 -21 -4 109 153 -215 -66 67 -61 -32 -119 -231 76 -17 -168 13 -25 -155 74 -175 -204 -12 -104 -173 -7
2319gj8J64r6J05j88Q2j41J01j23J13k01N6K89k42j77K45J98p8l4j92K6K10J23
2342B15k40K82k64J4j38K5K7m7J76j74n6J81pr2R1K38k44j65J75P5Q7k5Rk4k10
2367i1K99r7r1rj33K94m01K04j3O0j58Q9R4j0K16k81j11K80M3j1J3k62J74j61
2391f3%j04L10k26Q3l1l5J08j28K7K71j85J31k56J08O7J24l46L31k94Q5L1R7p5
2415C0k33n3J25K23k18K51k2l0o0m0K12k05L50k59j19J64Rk2j22j30j5J76o0k83
2439c31L55q4K3J2k0M6RJ13k25J22k02L49j06L7j46J95p4k02N7J19p7M0j8k76
2463b84K12R3M2jK2Ro5K06l00P1m0P4M6j01J7n6Ll1N1n1R1r1N4K06r6r2J31k0
2491A00o9Lp8O4J33j91K02j60L8j21J52k33R1O4j23K43k06J85J0j35nk8J20j4
$$ plain form
2319 -7 -25 139 43 148 -40 42 -99 2 -121 -8 -209 -153 136 -106 -283 -38 160 82 48 -144 -118 92 215
2342 215 -25 257 -7 7 -131 -106 -79 -126 50 -124 -180 1 -6 -98 -7 231 -13 -178 -3 72 159 134 143 119 -91
2367 -91 208 111 20 11 -122 172 -229 -25 -38 22 -136 -47 47 37 253 -28 -139 141 184 173 186 -76 98 -63
2391 -63 -63 -167 143 -83 0 -31 -66 42 -86 -59 212 27 158 -98 10 77 201 -145 186 -108 -23 8 105 30
2415 30 -203 -256 -131 92 -126 125 103 73 13 -27 185 -20 330 71 -48 116 125 103 -19 -149 -164 12 -48 -331
2439 -331 24 -60 -37 -25 -45 1 10 123 -102 20 -182 167 61 98 -48 147 73 -129 -72 47 -30 10 -8 -284
2463 -284 -72 21 63 62 84 93 28 234 -66 5 -35 39 85 -16 1 -55 -52 -83 -32 -83 8 -83 -29 177 81 -11 120 100
2491 100 31 34 -44 20 153 -38 164 4 42 -79 73 -160 -69 -5 -128 115 -91 94 104 -31 -36 -64 56 42
2515D2L1n1R5k11J04m5o5p8K42m7k58K99k22K17O0j92O1J21j51r7L57l19k0J73
2539D6o2J00l45L57r3P4q4K18m4k05N0M8j10l50L33K03j39j55K6j8L56j09j55
2562e8K05j68J79j57J38O0k21K47j93Q8j53J28l36K63n9k1Pm1J52j9O2j9j10L6
2586A0L40k23o3j26J39J29j06k50k12L03k0j5p2R5J58j30l5J69M5m7k79J28J57
2609I5l00L33j00J4q2m3J75j48M5J32k47k8j64J27L65o3L2j92L3K42j56j84J26
2632A2n1j04J19J03j14l6k5J67R0k27J05J18r3Q8k40J35P5l00L00M2Ll05J01j13
2656a50K07J49j30j89J37j36j38J70N2mj0n8P4J26R0r4j98J38p6R3P8j08j16J50
2680E7k1k31K27j03J69j97J58j8j92p0M50K2l05J34k12M0J15K18l65j9J71N5l5
$$ plain form
2515 42 73 22 117 -94 10 -35 -100 -178 64 17 -241 58 -164 53 113 -79 -18 103 -48 -145 212 -107 -127 46
2539 46 -16 84 -261 96 3 77 -7 211 167 -38 12 60 -50 -400 -67 136 -3 -158 -132 -150 206 97 -58
2562 -58 147 -21 158 1 139 199 -22 225 32 120 -33 95 -241 22 -37 -58 -51 -92 60 41 103 84 -26 10
2586 10 350 127 64 -62 77 206 100 -150 -362 -59 -79 -94 -166 -71 87 -43 -78 91 136 89 -190 -62 95
2609 95 -205 128 28 42 -40 -83 92 -56 -11 121 -126 -154 -318 -191 174 111 143 -49 -16 226 70 -114 12
2632 12 -39 -143 -24 79 -35 -71 -96 71 161 -66 39 157 64 152 -88 47 122 -178 122 164 167 -138 -37 -150
2656 -150 57 206 76 -113 24 -112 -250 -80 -28 -32 -42 -100 -26 100 190 96 -102 36 -40 53 131 23 -93 57
2680 57 36 -195 32 -71 98 -99 59 41 -151 -221 229 251 -54 80 -132 -92 23 241 -124 -143 28 83 48
2703D8j1J8j37J32j64O8J65j42J12j38J29J9k6j81M4K54k47L7k9Q1O7j63J86P4
2727A96j51j34J73m6J01q9l2j19K38k14j52L01R3j02k21L62q5r3R6j03P5L3o5
2750F2j00j9P5J13k38K00O9k49J86j46k5K19l06J5j9K30k47K78j1j81P1j5mk8
2774g0j41K66j85m1L3J99p9K36k72m0J48P8l7O0k17L40k24r3Q6o3Q5j96K02k6
2798D9k19O5J48j56Q7N7j0J16J37l70K4J70j66P4J53q2k33J74k44J58m3K20J26
2821B35k16J77j74J5R4o6M9l6l44M61P6j69j01L2J01L1j14k06J07Ok44K34j60
2844b12K03R6p0l0%L56j44k37P5P3P9l02R3QJ00j9j15M6l19L22j83Q1K2Q1j10
2869a06N2O1J06j37J33K1k01J58q0j09N5K44l12J54J1o5J6O2P2j88lJ06m6j30
$$ plain form
2703 48 37 55 -82 50 -114 -46 119 -23 89 -49 80 99 73 -108 -64 190 -57 -20 -49 32 99 -64 122 196
2727 196 45 -89 84 38 139 50 18 -101 137 -77 -229 72 165 63 -158 204 119 26 122 19 94 127 62
2750 62 -38 -57 18 131 -107 93 162 -87 99 -47 -72 147 -159 -144 -163 67 -180 98 87 -94 -23 -38 -42 -70
2774 -70 -211 55 -130 -171 -138 61 -18 218 -54 -94 54 132 95 155 -62 278 54 -39 47 -16 69 -127 75 49
2798 49 -170 -105 43 -113 -26 31 21 137 274 -96 -72 98 -68 6 159 77 -156 18 -226 -68 -111 109 235
2821 235 19 196 22 37 131 65 114 78 -266 195 271 102 1 33 134 165 51 -155 -48 -42 -286 -52 -212
2844 -212 -9 87 17 -13 -13 343 199 -38 37 110 189 -113 -20 -12 88 69 -46 0 -319 3 -180 -99 -77 4 -106
2869 -106 -54 7 113 -24 109 130 -71 87 7 -102 -47 197 -115 39 50 -15 1 63 135 -53 -56 50 4 -126
2893a26K00K6N9l64J57k4O0J0O8Om14K58q1J46n9k9O5J31J49q3q6M2r3j8n7k0
2919g7L6M9MJ19j25J68j44o5J45r9j37J67k31K9R2J25J05p9j75n8K30j09l0Q7
2943B7K8j63KR2o8K20j23k04K99j22O4k21L28k24k12L40j07J21j3M2j00J24J2
2966A42j59j16L7O7L8J48p9k24P4j49K63k74J69L4K4K35k12p6J61j02N2q6P2p7
2990c8M6k87L63o2J49q6j84J35K2K00l21l0P8l24K01J55j37O7J81n8j56J46o7
3013gnJ3m4l7J96j29j40J13M5K30l47J03J06l7K65j34j49J9k3n6o7J48r9l4l5
3038a05K65j88LJ61k32N9J0r3R0l5J10o0j63K68o0lj04n3L93k93J83J5L5r6j21
3063a4r1k22K17K30j65J15j98J83M3l0O6J86k55P3o0j31Q5OL5m7r7n6J58k1r8
$$ plain form
2893 -126 74 100 159 -205 -48 -72 -12 -2 66 72 -342 -84 -165 -19 -78 -107 -42 89 238 155 69 111 18 0 -57 -77
2919 -77 -41 8 12 131 6 174 30 -35 110 11 -126 41 -190 -161 -69 56 161 82 -93 -151 79 -30 -60 27
2943 27 55 -108 -106 -14 -82 138 15 -189 110 -12 52 -169 159 -65 -277 63 -44 77 64 106 6 130 142
2966 142 -17 -133 -96 -29 9 157 78 -146 -72 -221 42 -232 -63 -29 -5 230 18 -58 103 1 53 -33 39 -38
2990 -38 8 -279 84 22 171 85 -99 36 58 258 -63 -93 -15 -339 -138 17 -120 -53 128 70 -86 60 -7
3013 -7 -12 1 -43 -80 116 -13 -153 -40 5 235 -112 -9 97 60 325 191 42 61 38 -18 -85 63 -36 -70 -105
3038 -105 160 -28 -25 136 -96 -37 -27 -120 -30 -65 45 -15 -178 90 30 27 -77 -130 263 -30 153 168 203 107 -14
3063 -14 -105 -327 -110 120 -45 70 -128 55 98 68 134 320 65 138 78 -53 32 38 73 26 -71 -127 31 10 -88
3088h8K9R9j21K29o3p8P8p1k69K72J16j73j51Q1J98o8q5j4q5J16J45k7j70K52
3112A52k8k8j95o4J04n3K72J19l68J33l3k75J73J83k61k3K80j20l7J94l8q1q9
3135h3K41j0Mm01K18J71j52M3pJ90o4J16k51Oj27L1L53m80K36k6J44j23j00N0
3159b1n1j6L52j87j32j06J04rm1k5n2m1J87l9J02N9q0J04k42J65o7J13m3K28k01
3184F1j23J81j19k6j32J28Jk39J48l8J25k7n0r9J58j5KK12j34r9J46k09R8J20
3208G0J16j44j08K86j52m0M4k30K51m4J26k52K07l45J56o9K3J62p5J74j93K00
3230A63j63R4r4j39P8%L3J32j13k03J66p9Q5l6P3J99j35l09K51n3J41J02k76K26
3254A43j85J63j45PJ0P2j97N9J4M8r6J70N4k73J64k99J70L0Q0j20jN6M4J0RQ3
$$ plain form
3088 -88 -59 40 -81 148 85 7 85 14 -255 17 133 -40 -191 -110 88 20 -65 -79 -164 -48 97 70 -100 152
3112 152 124 96 -99 -163 -59 -112 160 279 -89 44 11 -264 -91 92 -169 -192 88 -32 -69 125 87 6 -83
3135 -83 158 148 152 -249 -31 140 -12 31 24 214 150 266 15 21 -106 -75 278 -202 34 8 152 29 -71 -21
3159 -21 -72 -88 264 77 -55 -161 -57 -66 -107 -132 -184 -225 -38 -77 25 84 4 108 -134 31 -36 77 34 262 61
3184 61 -62 119 0 -26 -158 -30 -29 -268 -120 -158 -33 -60 -110 -209 -51 -66 -64 148 14 -85 61 -148 -50 70
3208 70 186 42 -66 220 68 28 72 -158 93 49 175 -77 130 -215 -59 -128 -105 57 -18 156 -37 163
3230 163 0 94 0 -139 -61 -61 -28 104 -9 -212 -46 -125 -40 -76 -3 196 61 -248 3 -50 91 193 -83 143
3254 143 -42 121 -24 -17 -7 65 -132 -73 -59 -11 -107 63 117 -156 8 -291 -121 -91 -11 -131 -132 -76 -32 -22 -13 70
3280G0Ol10J92Q4M5k40J71o7N1j87J86m5J81j1q8L6j48l6J29o7M8J25j25l6m4
3305h0Q3p5J92j39K7k7k10K77j43j22J46nj03J41n4K66k99KrJ05J75j87o4Q2J29
3330A08j35j78J15l3P1j6j38J71M6M4K08k06j61r1L17l38N01m42P4J92j82J5p1
3353a29O8J72r8j78j5o4K13J66j1l41L90k19j7J27k28K28K77l51L1n6k2Rm1J28
3377C9Q4R8l69J65j04NL24Rl14K50L8j7j52p2N7P3j45J75k20O3K64k60k1q6j0
3402a26O6N9J61q4p9r7J18r5R1r2K9J58j66m5P5j21K06k76j02K63J42q5rj9J21
3427I3j40J94J6j48O4J56q6k09j08K4K88N3k87KJ25P6k16K15r8k9K3P6k5J04k78
3452a15J90p5J27K8k12M3k02K53N1j93J21l9J5M4l0j3m4Q5m2J3j17K50n4k22K31
$$ plain form
3280 70 76 -234 -42 42 87 -153 18 -49 2 -185 1 -44 137 126 38 74 -74 -110 19 -48 0 125 0 -36 -80
3305 -80 3 -72 120 -19 8 -19 -229 48 -95 -217 -71 -76 -179 -38 -92 174 -125 -123 -132 -27 148 -39 -103 -21 108
3330 108 -27 -205 -90 -123 -52 -68 -206 -35 11 55 263 57 -104 -195 122 -216 285 -157 -83 109 -73 -58 -129
3353 -129 -61 111 13 -165 -180 -244 -31 135 124 -217 173 -46 -63 64 -164 64 341 -10 21 -35 -57 -48 -89 39
3377 39 123 221 -148 17 -87 -82 242 251 -63 187 225 208 56 -16 41 114 -31 144 -76 -13 251 -9 -30 -116 -126
3402 -126 -60 -1 160 76 -3 -100 18 -77 14 -78 -49 109 -57 -102 -27 -148 58 -218 -320 -57 85 0 -9 -28 93
3427 93 -47 147 163 15 79 235 149 -60 -168 -144 144 197 -90 -88 37 113 -103 112 14 -15 8 84 59 163 -115
3452 -115 75 0 127 155 -57 -14 -216 37 88 -105 16 -23 -8 36 6 -7 -51 34 -8 5 -112 138 84 -138 93
3477I3J9j74l8J91mq5n4J48k8N1j72mR0Kj52j6M8K48k43J28Pj04K83n9j96R8L8
3504A15j55O5Q0J09k53r0jmm0K11o0j42K38l17L76j27N0M8j76R7r1O6R2n9o9P4
3530C7J9j95P7M8o1j8J76lj04k15K09R1j4N6n4P6k50M4J5kq9j67L07r1K12q0n9
3557c5N6l7N1j67J32p9J18J34k09oj06J53l0O0o5o0j00J43K5K9K1J4k34J79N1
3582C8J48l06j21K62O7j20J8n8M7P1j25R4j97K90J15j70j62L2j60J40J15p1J8
3605c5R6j1j22K26n4L3J68j94j49J82l8m5q4j64R3J69m3k8r6J55j92m8J71J71
3629A61K3j73K67k67j09K97k35K25p4j31J73j36o9J00L3j70p2K0k2J22m9J82M7
3652A43j39q2J40P0k69JJ14J54l8j78J00O7j75R2M7M1q3K9j31J12n5m9kK0J69
$$ plain form
3477 93 112 -62 -100 91 87 2 -52 96 68 119 -53 -57 33 35 -117 -133 -85 163 -80 48 55 -49 234 175 -21 77 115
3504 115 -40 25 105 214 -39 -129 -130 -134 -174 37 -23 -165 73 -244 132 5 55 103 -73 24 -67 -1 91 32 -37 37
3530 37 56 -139 -62 -14 -75 -93 83 80 -24 -239 -30 61 47 103 49 125 -125 -81 -66 -68 -157 -324 -17 -108 104 24 -35
3557 -35 21 -16 35 -132 0 -79 39 173 -36 -42 -148 5 -25 35 -30 -90 -190 -47 -22 7 28 42 -192 -13 38
3582 38 186 -120 -241 21 88 -32 -14 -72 -25 46 -79 15 -182 108 223 53 -109 -77 -237 -97 18 -53 -35
3605 -35 61 50 -72 154 100 133 301 107 -42 140 102 57 -27 -191 -98 71 28 0 -96 59 -133 -181 -10 161
3629 161 184 11 278 11 -98 199 -36 189 115 -16 157 21 -48 52 85 -85 -157 -137 -159 -37 -86 96 143
3652 143 4 -78 62 132 -137 -136 -22 132 94 -84 16 83 -92 0 47 88 5 34 -97 15 -40 -89 -91 -71 98
3677I8q1l6j9J43m50J16K80K3o5j70L06k79J93q2L8j08J28k88J26K15N6r9J40
3700A85j60J26j94K29k70Q5j1Q0mO9j74q9K7R8J56l89J43K12n2Q9j45J8L5J28
3724A92O4k57M1k92K17L26l45L1o9J1l0O9K53j34l31J47O0J47k1pj78N6J10j51
3748i1J06j09K18j15j25K10l4k2j66M1K22j86oL3n8R2J70k25J25L7j25R9r8M5
3772C8l9k2m0j25J32oJ09o1j78R9j9L74m24M44k18j29R5J29k6k11K23l12OQ0J80
3797I9n8j6mm1j23M4J48Nj95J43N1j98K79q2JMk45p0M47l52K55j93J4Q1j32N9
3823g9O5q5N2L1k6j3j12P6J57r9J85q9P8m3J98l29L9k39J58j33L19o2o6J8p4J45
3849G2q7r2K79q2K8j62J3L24l61K32L6q8j25r9j81M11l55K74j82R5L4J1j41jJ67
$$ plain form
3677 98 17 -19 -38 105 -345 -229 51 74 9 -161 145 -134 59 -23 15 -93 35 -253 -127 88 144 45 185
3700 185 25 151 -43 186 -84 1 -10 70 66 135 -39 -128 -101 -3 153 -236 -93 119 67 156 11 29 64 192
3724 192 256 -1 40 -252 -35 291 -54 -23 -92 -81 -111 -42 211 77 -254 -107 -47 100 79 72 -106 -50 60 -91
3748 -91 15 -94 124 9 -116 94 60 38 -128 -87 135 -51 -57 -24 -82 10 180 -45 80 117 -8 91 -7 38
3772 38 -1 -23 -63 -188 -56 -62 47 -14 -192 -93 -112 262 -162 282 64 -65 30 159 133 -78 145 -167 -161 -81 99
3797 99 41 25 21 -20 -143 -99 49 54 -141 2 53 -145 134 52 53 57 -188 -258 189 -163 92 -101 -87 -6 -138 -79
3823 -79 -14 -99 -47 -16 -42 -55 -167 -91 66 -33 152 63 141 98 296 -33 6 -233 -75 -208 111 49 -17 1 -73 72
3849 72 -15 -107 172 90 118 -44 -31 293 -68 164 200 112 -13 -112 -293 118 -237 37 -145 -50 -16 -5 -146 -147 20
3874B0j8K3j5j44K04o2j87Q5n0K45j22Kj61K63k55K71j86J00l4j17K46L7j00k01
3898a56O8l2J37N4m9K9P8K14l69J00J53j94J5j62J46q9N0l8J52j39j10r2K08J12
3922H6n3R7j93n8l5K70n9j90J17l3M5r8J62O6Nl2k1j67L09k66J39J5k6q4J21O8
3948A85l1k10k6O6l5K7j56K30n8NQ1P8l95M25o5k76K38k11J63l9k6Q2p6j1J26
3973I1j40p6N5M5k4rO8k69K79j0j7N5J6j04P4o4l1m0K05J01k50J50M0n3n1J72
3999B13j95k0qK1j56J86J6p3r6m8L00qj77P6j6K25k21j39J9Q6L4N6j09nr3K12
4025H0m8k9j37L33j46q9O7j22M33m08L03l70J77j81J05j5Q2K5j21J05N8k17N7
4048e8K6R2q0L1j12K52k61L80j43k11K38l28L46j34J54K8j28j65Qm0J07r6P0m4
$$ plain form
3874 20 2 25 10 -134 70 8 -179 -94 -144 101 -21 -19 -180 83 -172 99 -87 13 -21 -138 108 145 45 -156
3898 -156 -88 -120 17 71 22 51 129 343 -26 74 227 33 48 -114 32 -57 -7 -45 107 -32 -142 -234 -26 86
3922 86 33 130 -63 -121 -156 114 55 -135 -18 -51 -6 -104 58 124 129 97 76 -91 218 -48 91 106 80 -4 117 185
3948 185 154 -56 -82 -16 -51 -24 -180 50 -8 -3 78 156 -239 186 121 -155 83 -128 35 -4 -30 52 -24 -35 91
3973 91 -49 -125 -70 -25 -49 -58 10 -259 20 10 -7 48 64 -40 34 -30 -61 -101 104 205 -45 105 145 92 41 213
3999 213 18 -2 -10 11 -145 41 57 -16 -112 -160 140 132 -45 31 15 240 19 -120 -101 -15 19 75 -34 -39 -132 80
4025 80 32 3 -134 199 53 -36 31 -91 342 -66 237 -133 44 -137 -32 -47 35 60 -61 44 102 -115 -58
4048 -58 -32 60 -20 11 -101 151 -110 270 127 -84 154 -174 172 38 192 220 92 -73 -65 -105 2 -94 -24 -68
4072f8J21j82J04m7J88J8k63K73Q8j45oQ6o3Pk04m0qJ6J49j03j54K17K8j13Q8
4097a3M8R5j1j84j0J48J0j28j21R0O6K5k8KQ2k07J99L5r2N4N1j70J8L0n7k9J75
4124G8o6J24l7k01M4M3L9j27K12N8k84J96k53o2K43Mk30l9K17J45nj25K15P2k81
4149b0J4k08J65J80m5L8j47L0K21l40j69M32j04M1n6j5J7J9L3j8l8j58J20JJ41
4174A34O6k13O8K0q5m1o3P8k44N36l37J36N4j61N7M0j1j79K79O8j92n9L6K20j55
4199E2J48k27q4N7n2L15l32J24O3k73M41k58J33M0l09K84j94K89j12M1l6k93K17
4222C4j02J35j05j21K1n7K99j72L11l19J34J1j8l6J15j11j82J54l3o3R3M9m6k1
4246c0o1K16j28O5Lp4Q3rN9j74k0nJ26J19j45m7L6j38K41J21j47r6l9kj35K32
$$ plain form
4072 -68 53 -129 -25 -72 116 134 -129 144 232 87 81 167 104 111 -93 -133 -141 -125 24 -79 -233 -16 12 -101 -13
4097 -13 35 130 119 -65 -75 73 83 -45 -166 -76 -10 15 -13 -11 71 -136 63 98 6 60 111 -59 -41 -11 -68 -97 78
4124 78 12 136 99 -102 -58 -15 24 -103 109 167 -117 79 -174 -236 7 11 -219 -258 -41 104 99 -26 189 261 -20
4149 -20 -6 -214 -49 131 86 124 -23 7 228 -112 -281 151 47 88 32 17 34 53 86 68 30 -128 -8 -7 134
4174 134 200 -13 55 75 -10 -51 -114 -36 -280 256 -81 55 109 -52 5 45 34 -145 134 202 10 -49 -13 207 52
4199 52 200 -27 -111 -54 -106 209 -123 1 64 -209 232 -26 107 147 -162 122 -72 217 105 146 110 -183 34
4222 34 -68 67 -38 -159 -138 -195 104 -68 243 -76 58 69 51 15 130 19 -163 -9 -42 -105 -12 37 -9 -30
4246 -30 -91 125 -3 62 65 -9 74 65 124 -50 -70 -75 51 170 25 -22 14 -124 117 238 91 -5 -44 -46 -181 51
4272E1j43P7j43K47j77J37rJ55k97p1N8J77k32L17j05j27J69r7J17k38J36J72
4294A74j23Q7j26k34K50L24l06j31K54r1K2k32L7O1q8J50O6m8j92J05K6J4j04
4317a05L4m3J54L1j24j02J08J55k26K38j54M4j70J46J57j30q5lO1J47k20j33L1
4340a89J35J23o4J79l65K45J45j04k03K62p6j66J62o1p2J19o0p5j14J75j30J02
$$ plain form
4272 51 -92 -15 -158 89 -88 49 40 195 -102 -173 -115 62 -170 147 42 -85 84 -13 104 -134 2 174
4294 174 51 138 12 -222 28 352 46 -85 169 78 100 -132 -95 -34 -122 28 94 46 -146 -41 -15 -1 -105
4317 -105 -71 -114 40 71 -53 -155 -47 108 -118 120 -34 10 -160 -14 143 13 -72 -75 -14 133 -87 -220 -189
4340 -189 -54 69 5 184 -181 64 209 105 -98 164 88 -78 84 23 -49 70 10 -65 -179 -4 -134 -32
$$ [...]
8191A07
##END NTUPLES=NMR FID
##END=
