##TITLE=1H_Ser LOV-307
 CDCl3, 8 sc, 
 20.12.2019
##JCAMPDX= 6.0         $$ Bruker NMR JCAMP-DX V2.0
##DATA TYPE= NMR FID
##DATA CLASS= NTUPLES
##ORIGIN= UXNMR, Bruker Analytische Messtechnik GmbH
##OWNER= root
$$ XWIN-NMR		Version 3.5
$$ Fri Dec 20 15:53:22 2019 Russian Standard Time (UT+4h)  she@DPX200
##.OBSERVE FREQUENCY= 200.1315
##.OBSERVE NUCLEUS= ^1H
##.DELAY= (6, 6)
##.ACQUISITION MODE= SIMULTANEOUS
##.ACQUISITION SCHEME= undefined
##.AVERAGES= 8
##.DIGITISER RES= 18
##SPECTROMETER/DATA SYSTEM= spect
##.PULSE SEQUENCE= zg30
##.SOLVENT NAME= CDCl3
##.SHIFT REFERENCE= (INTERNAL, CDCl3, 0, 15.7039)
##AUDIT TRAIL= $$ (NUMBER, WHEN, WHO, WHERE, WHAT)
$$ ##TITLE= Audit trail, XWIN-NMR		Version 3.5
$$ ##JCAMPDX= 5.01
$$ ##ORIGIN= Bruker BioSpin GmbH
$$ ##OWNER= she
$$ F:/spectra/data/she/nmr/H-F/1/audita.txt
$$ ##AUDIT TRAIL=  $$ (NUMBER, WHEN, WHO, WHERE, WHAT)
(   1,<2019-12-20 15:51:55.18 +0400>,<she>,<DPX200>,
      <created by zg, POWCHK disabled, PULCHK disabled
       configuration hash MD5:
       00 E9 B6 7A A2 85 ED C7 34 08 36 98 17 FE 4E 26
       data hash MD5: 16K
       1C 6E 9B E6 D5 61 32 7B 82 D0 D4 22 F7 79 3D 36>)
$$ ##END=
$$ 
$$ hash MD5
$$ FD AA CA 77 7C 36 8B 3B 90 9E F2 74 9E AD 80 E8
##$RELAX= 
##$RELAX= 
##$RELAX= 
##$RELAX= 
##$RELAX= 
##$RELAX= 
$$ Bruker specific parameters
$$ --------------------------
##$DU= <F:/spectra>
##$EXPNO= 1
##$NAME= <H-F>
##$PROCNO= 1
##$TYPE= <nmr>
##$USER= <she>
##$AMP= (0..31)
100 100 100 100 100 100 100 100 100 100 100 100 100 100 100 100 100 100 
100 100 100 100 100 100 100 100 100 100 100 100 100 100 
##$AQSEQ= 0
##$AQ_mod= 1
##$AUNM= <au_zg>
##$AUTOPOS= <>
##$BF1= 200.13
##$BF2= 200.13
##$BF3= 200.13
##$BF4= 200.13
##$BF5= 200.13
##$BF6= 200.13
##$BF7= 200.13
##$BF8= 200.13
##$BYTORDA= 1
##$CFDGTYP= 0
##$CFRGTYP= 5
##$CHEMSTR= <none>
##$CNST= (0..31)
1 1 145 1 1 1 1 1 1 1 1 1 1 1 1 1 1 1 1 1 1 1 1 1 1 1 1 1 1 1 1 1 
##$CPDPRG= <>
##$CPDPRG1= <>
##$CPDPRG2= <>
##$CPDPRG3= <>
##$CPDPRG4= <mlev>
##$CPDPRG5= <mlev>
##$CPDPRG6= <mlev>
##$CPDPRG7= <mlev>
##$CPDPRG8= <mlev>
##$CPDPRGB= <>
##$CPDPRGT= <>
##$D= (0..31)
0 1.2 0 0 0 0 0 0 0 0.06 0 0.03 0 0 0 0 0.0002 0 0 0 0 0 0 0 0 0 0 0 0 
0 0 0 
##$DATE= 1576842714
##$DBL= (0..7)
120 120 120 120 120 120 120 120 
##$DBP= (0..7)
150 150 150 150 150 150 150 150 
##$DBP07= 0
##$DBPNAM0= <>
##$DBPNAM1= <>
##$DBPNAM2= <>
##$DBPNAM3= <>
##$DBPNAM4= <>
##$DBPNAM5= <>
##$DBPNAM6= <>
##$DBPNAM7= <>
##$DBPOAL= (0..7)
0.5 0.5 0.5 0.5 0.5 0.5 0.5 0.5 
##$DBPOFFS= (0..7)
0 0 0 0 0 0 0 0 
##$DE= 6
##$DECBNUC= <off>
##$DECIM= 24
##$DECNUC= <off>
##$DECSTAT= 4
##$DIGMOD= 1
##$DIGTYP= 9
##$DL= (0..7)
0 120 120 120 120 120 120 120 
##$DP= (0..7)
150 150 150 150 150 150 150 150 
##$DP07= 0
##$DPNAME0= <>
##$DPNAME1= <>
##$DPNAME2= <>
##$DPNAME3= <>
##$DPNAME4= <>
##$DPNAME5= <>
##$DPNAME6= <>
##$DPNAME7= <>
##$DPOAL= (0..7)
0.5 0.5 0.5 0.5 0.5 0.5 0.5 0.5 
##$DPOFFS= (0..7)
0 0 0 0 0 0 0 0 
##$DQDMODE= 0
##$DR= 18
##$DS= 0
##$DSLIST= <SSSSSSSSSSSSSSS>
$$ [...]
##$SUBNAM2= <"">
##$SUBNAM3= <"">
##$SUBNAM4= <"">
##$SUBNAM5= <"">
##$SUBNAM6= <"">
##$SUBNAM7= <"">
##$SUBNAM8= <"">
##$SUBNAM9= <"">
##$SW= 24.9337058887773
##$SWIBOX= (0..15)
0 0 2 0 0 0 0 0 0 0 0 0 0 0 0 0 
##$SW_h= 4990.01996007984
##$TD= 16384
##$TD0= 1
##$TE= 0
##$TE2= 300
##$TE3= 300
##$TEG= 300
##$TL= (0..7)
0 120 120 120 120 120 120 120 
##$TP= (0..7)
150 150 150 150 150 150 150 150 
##$TP07= 0
##$TPNAME0= <>
##$TPNAME1= <>
##$TPNAME2= <>
##$TPNAME3= <>
##$TPNAME4= <>
##$TPNAME5= <>
##$TPNAME6= <>
##$TPNAME7= <>
##$TPOAL= (0..7)
0.5 0.5 0.5 0.5 0.5 0.5 0.5 0.5 
##$TPOFFS= (0..7)
0 0 0 0 0 0 0 0 
##$TUNHIN= 0
##$TUNHOUT= 0
##$TUNXOUT= 0
##$USERA1= <user>
##$USERA2= <user>
##$USERA3= <user>
##$USERA4= <user>
##$USERA5= <user>
##$V9= 5
##$VALIST= <valist>
##$VCLIST= <CCCCCCCCCCCCCCC>
##$VD= 0
##$VDLIST= <DDDDDDDDDDDDDDD>
##$VPLIST= <PPPPPPPPPPPPPPP>
##$VTLIST= <TTTTTTTTTTTTTTT>
##$WBST= 1024
##$WBSW= 4
##$XGAIN= (0..3)
0 0 0 0 
##$XL= 0
##$YL= 0
##$YMAX_a= 112642
##$YMIN_a= -63054
##$ZGOPTNS= <>
##$ZL1= 120
##$ZL2= 120
##$ZL3= 120
##$ZL4= 120
##$ABSF1= 10
##$ABSF2= 0
##$ABSG= 5
##$ABSL= 3
##$ALPHA= 0
##$AQORDER= 0
##$ASSFAC= 0
##$ASSFACI= 0
##$ASSFACX= 0
##$ASSWID= 0
##$AUNMP= <proc_1d>
##$AZFE= 0.1
##$AZFW= 0.1
##$BCFW= 1
##$BC_mod= 2
##$BYTORDP= 1
##$COROFFS= 0
##$CY= 11.3945322036743
##$DATMOD= 1
##$DC= 2
##$DFILT= <>
##$DTYPP= 0
##$F1P= 16.9975609425685
##$F2P= -3.02152046262296
##$FCOR= 0.5
##$FTSIZE= 0
##$FT_mod= 4
##$GAMMA= 1
##$GB= 0.15
##$INTBC= 1
##$INTSCL= 1
##$ISEN= 128
##$LB= 0.24
##$LEV0= 0
##$LPBIN= 0
##$MAXI= 10000
##$MC2= 0
##$MEAN= 0
##$ME_mod= 0
##$MI= 1.114404
##$NCOEF= 0
##$NC_proc= 0
##$NLEV= 6
##$NOISF1= 3.799351
##$NOISF2= 2.8
##$NSP= 1
##$NTH_PI= 0
##$NZP= 0
##$OFFSET= 15.70392
##$PC= 1
##$PHC0= -10145.23
##$PHC1= 12.8008
##$PH_mod= 1
##$PKNL= yes
##$PPARMOD= 0
##$PSCAL= 0
##$PSIGN= 0
##$REVERSE= no
##$SF= 200.130013532006
##$SI= 16384
##$SIGF1= 3
##$SIGF2= 2
##$SINO= 400
##$SIOLD= 16384
##$SREGLST= <1H.CDCl3>
##$SSB= 0
##$STSI= 0
##$STSR= 0
##$SW_p= 3612.71676300578
##$SYMM= 0
##$S_DEV= 0
##$TDeff= 0
##$TDoff= 0
##$TI= <>
##$TILT= no
##$TM1= 0
##$TM2= 0
##$TOPLEV= 0
##$USERP1= <user>
##$USERP2= <user>
##$USERP3= <user>
##$USERP4= <user>
##$USERP5= <user>
##$WDW= 1
##$XDIM= 8192
##$YMAX_p= 0
##$YMIN_p= 0
$$ End of Bruker specific parameters
$$ ---------------------------------
##NTUPLES= NMR FID
##VAR_NAME=  TIME,          FID/REAL,        FID/IMAG
##SYMBOL=    X,             R,               I
##VAR_TYPE=  INDEPENDENT,   DEPENDENT,       DEPENDENT
##VAR_FORM=  AFFN,          ASDF,            ASDF
##VAR_DIM=   8192,          8192,            8192
##UNITS=     SECONDS,       ARBITRARY UNITS, ARBITRARY UNITS
##FACTOR=    0.0002004,     1,               1
##FIRST=     0,             0,               0
##LAST=      1.6414764,     0,               0
##MIN=       0,             -63054,          0
##MAX=       1.6414764,     112642,          0
$$ Real data points
##PAGE= N=1
##DATA TABLE= (X++(R..R)), XYDATA
$$ [...]
1922a59J18O7K54Q8k10l88L81Qk60M48Q1l21j58J96K42p7j61j7R5n6j92p4J17
$$ -159 -41 26 280 368 158 -230 151 159 -101 347 428 107 -51 145 387 310 149 132 227 171 -21 -95 22
1945B2M40j73j52j09j27L37j9j17P7l44J64j62K60Q9m34K87J00j36m74M03j85
$$ 22 462 289 137 28 -99 238 219 102 179 -165 -1 -163 97 186 -248 39 139 3 -471 -68 -253
1966b53R5k18r9M35j21r9Q3l2j85j17J91l27K38kM1l1QK7j68M82l03J43j7L6k2
$$ -253 -158 -376 -475 -40 -161 -260 -177 -209 -394 -511 -320 -647 -409 -411 -370 -401 -393 -366 -534 -52 -355 -212 -229 -193 -215
1991b15p8J56J03k07Q8r7o1J78J60k90J32OJ73l16J41J19R3j70j38K42k72J44
$$ -215 -293 -137 -34 -241 -153 -250 -311 -133 27 -263 -131 -125 48 -268 -127 -8 85 -85 -223 19 -253 -109
2013a09J6l70N66q7k52J44J99L9j18k63J82K08k59k2L49J09j86n25M51J50J11
$$ -109 -93 -463 103 16 -236 -92 107 146 28 -235 -53 155 -104 -126 223 332 146 -379 72 222 333
2034C33m57M38N5K9j76lR3k33j98N84j6K51n15j60M42M3n70p2N55K16l24n85P82
$$ 333 -124 314 369 398 222 219 312 79 -119 465 449 700 185 25 467 510 -60 -132 423 639 315 -270 512
2057E12n0j66l78L54j08N8l71K36N53n48R4P5J87l44j97K90L73p91J07K72j8O3
$$ 512 462 296 -82 272 164 222 -149 87 640 92 186 261 448 104 -93 197 570 -221 -114 158 140 203
2079B03l36%M81p4n26m8L67o2k50J11J92k99P5kj74J05K78l40J13J41k86J30Q8
$$ 203 -133 -133 348 274 -252 -300 67 5 -245 -134 58 -241 -166 -168 -342 -237 41 -299 -186 -45 -331 -201 -113
2102a13j75k38j7N90m34J11K8J7m18k9L86J26k02j85K02J37J06j06j35p2K59l75
$$ -113 -288 -526 -543 47 -387 -276 -248 -231 -649 -678 -292 -166 -368 -553 -351 -214 -108 -214 -349 -421 -162 -537
2124e37Q4K05K4K9m1j26K30k52K94M0l53K95L65m73j05M1K79J67k93j27L21L4
$$ -537 -453 -248 -224 -195 -236 -362 -132 -384 -90 -50 -403 -108 257 -216 -321 -280 -1 166 -127 -254 67 101
2146A01J97m75mM78k79J38K99j95m85jM98oj52K62J19j83j92n7J71K20o9j19O2
$$ 101 298 -177 -181 297 18 156 455 260 -225 -226 272 266 114 376 495 312 120 63 234 454 385 266 328
2169C28K47k52n87L21L85j97k48K00M72m72J02l5n7k29Q5L05p7N1Lk14J84K30
$$ 328 575 323 -264 57 442 245 -3 197 669 197 299 264 207 -22 63 368 291 342 345 131 315 545
2191E45n64L0Q68n38m09K1M88K02o06J92K04O1o95L74k6K34l18J2M6K81p89M64
$$ 545 -19 11 879 341 -68 -47 441 643 37 229 433 494 -201 173 147 381 63 75 121 402 -387 77
2213G7J73j64k0m63M00J43o3M2j80m3k07nM93j81l14q2K16j87p0O7L17R7o51L8
$$ 77 250 86 66 -397 3 146 83 125 -55 -98 -305 -310 183 2 -312 -394 -178 -365 -435 -368 -51 46 -605 -567
2237e67K31L36m61J02K19r2k10q7N39L19p21k23P7L49J15k71K3K48Rj69n0L06
$$ -567 -336 0 -461 -359 -140 -232 -442 -529 10 329 -392 -615 -538 -189 -74 -345 -322 -74 -65 -234 -284 22
2259B2k32K15k23L10k50J67J0K06j38o9k04K98j44j03M04j43Q1l32J1N82k34k79
$$ 22 -210 5 -218 92 -158 9 19 225 87 18 -186 112 -32 -135 269 126 207 -125 -114 468 234 -45
2281d5J46j39k08K37K01J63o22M9K12l09M04J85k70J22Q3l08K79j16Q1K04l57
$$ -45 101 -38 -246 -9 192 355 -267 -218 -6 -315 89 274 4 126 209 -99 180 64 145 349 -8
2302hJ86k18J37L27Ol8j89m00O53k94J07L10L3l81N7j03J79k13m3L97k88p1j1
$$ -8 178 -40 97 424 430 392 203 -197 456 162 269 579 612 231 288 185 364 151 108 505 217 146 135
2325A35K46p5m83J52M46l66Ll28M96m38J17J28P9r4P3k34k30L26j89j19J30J77
$$ 135 381 306 -177 -25 421 55 58 -270 226 -212 -95 33 112 18 91 -143 -373 -47 -236 -355 -225 -48
2347d8l6m62K56j12J30J07k8O9l58j21L83O7j62J18Q1n7l8k87K13L67k25m15N85
$$ -48 -84 -546 -290 -402 -272 -165 -193 -124 -482 -603 -220 -153 -315 -197 -116 -173 -211 -498 -285 82 -143 -558 27
2370B7K33k52l25J55K51j56l14J02L23o7j37k48M24L1n67K08K43k6j72L5Q1L5
$$ 27 260 8 -317 -162 89 -67 -381 -279 44 -23 -160 -408 16 47 -520 -312 -69 -95 -267 -232 -151 -116
2392a16k21J08M39n00p6k04L19J67L3j63j2J85j41j57M10J42j62k97j06L15J11
$$ -116 -337 -229 210 -290 -366 -570 -251 -84 -51 -214 -226 -41 -182 -339 71 213 51 -246 -352 -37 74
2413G4j83K11M6K19k6k86Q8n6J14P3j16M2M7RJ24j62NJ16m1N7j09j29L5J14q2
$$ 74 -109 102 148 367 341 55 143 87 201 274 158 200 247 256 380 218 223 339 298 355 246 117 152 266 184
2438A84j5j18K76P7k47J0J41j63J2j51PP6p0k39K8L59N3j89m2m1j2K84j29r3j26
$$ 184 169 51 327 404 157 167 308 145 157 6 13 89 19 -220 -192 167 220 31 -11 -52 -64 220 91 -2 -128
2463a28K93k41K79k58K10j64o6M4k4rJ69j83K12j91R7j15j12P4Q6N3k01L09o9
$$ -128 165 -76 203 -55 155 -9 -75 -31 -55 -64 105 -78 134 -57 40 -75 -187 -113 -27 26 -175 134 65
2486F5k67m8K26l55J97L08l7n45L63p4J34k7k33L4J88k96J14o0p7L55l41n0L34
$$ 65 -202 -250 -24 -379 -182 126 89 -456 -93 -167 -33 -60 -293 -259 -71 -367 -253 -313 -390 -35 -376 -426 -92
2509i2k68M24j61j85M8J51l02%L85j79m3n8o6L57m2j08J91m3r2Rlm25O14P8k85
$$ -92 -360 64 -97 -282 -234 -83 -385 -385 0 -179 -222 -280 -346 11 -31 -139 52 9 -83 -74 -77 -502 112 190 -95
2534i5Q9k7R6j8j47j29N36k81J7l5P3M0k57K37K12K7k18o4L06l09j06M52m5j72
$$ -95 -6 -33 63 45 -102 -231 305 24 41 6 79 119 -138 99 311 338 120 56 362 53 -53 399 354 182
2558A82k6j02K7J18n0k41J50k8p8K64K2j66R7k18M38j57R5l3P8l90J91K38l14
$$ 182 156 54 81 199 149 -92 58 30 -48 216 238 72 169 -49 389 232 327 294 372 -18 173 411 97
2581I7J43J79j49k16k7K60k01J4J49k31j9O0Oj01L98k09k29M32k00k5L1r2k6k44
$$ 97 240 419 270 54 27 287 86 100 249 18 -1 59 65 -36 362 153 -76 356 156 131 162 70 44 -200
2605b00K53K52l87Q9J2P8M9l99j59M57M2k12k2K16k21j21K53j98P2J03k52K35
$$ -200 53 305 -82 7 19 97 146 -253 -412 45 87 -125 -147 69 -152 -273 -20 -218 -146 -43 -295 -60
2627f0l74j5L80J62k45J16m92K50Q9k65N04k42j72J83j30K82j8J20l72L8K44J10
$$ -60 -434 -449 -69 93 -152 -36 -528 -278 -189 -454 50 -192 -364 -181 -311 -29 -47 73 -299 -261 -17 93
2649I3n43L42K16k72p0r2L59j31K04q0j32j6K11k08K34l7pj69L13l38J51k2K41
$$ 93 -450 -108 108 -164 -234 -326 33 -98 106 26 -106 -122 89 -119 115 78 71 -98 215 -123 28 6 247
2672B47l04r2K52m6p1q0R4R7N4P4j77j42N05j00m18J85K24L19l18j07J83l40J83
$$ 247 -57 -149 103 57 -14 -94 0 97 151 225 48 -94 411 311 -107 78 302 621 303 196 379 39 222
2695B22K58l04J20j56J7l9q6p3K17R0l04J83j00lN6k25L59j62N1k47Q8K24j61
$$ 222 480 176 296 140 157 118 32 -41 176 266 -38 145 45 42 98 -127 232 70 121 -126 -38 186 25
2718B5K84j81j97L23k52k77M35k00l3J85j69j12l6J18J74m47L86J67j66k39K78
$$ 25 309 128 -69 254 2 -275 160 -40 -73 112 -57 -169 -205 -87 87 -360 26 193 27 -212 66
2739F6Q4j00l32oK61j53J46l68K04M31l60j24J06J55l91J15J46o6k30lL54l7l61
$$ 66 150 50 -282 -288 -27 -180 -34 -402 -198 233 -127 -251 -145 10 -381 -266 -120 -186 -416 -419 -65 -102 -463
2762d63J83J51P0r5j73J79j72j01K78l3R0l19p0K89J97j04l28K73K06p11M55K57
$$ -463 -280 -129 -59 -154 -327 -148 -320 -421 -143 -176 -86 -405 -475 -186 11 -93 -421 -148 58 -653 -198 59
2784E9m28M54k73L56p5p2K20Jl91k9N4L14j8o4Q3J53k29j46J29J30K3l57L86k44
$$ 59 -369 85 -188 168 93 21 241 242 -149 -178 -124 190 172 108 191 344 115 -31 98 228 251 -106 280 36
2808C6o3J72j64K9J30J01o3J18j10J03l92L56J83k75P8Pk98L11k13j67M03j67
$$ 36 -27 145 -19 10 140 241 178 296 186 289 -103 253 436 161 239 246 -52 259 46 -121 282 115
2830A15n6QL67m15K61R7j96k49L16m15L15j91K25j99R9M2l8J02K23m70R1m1L49
$$ 115 59 67 434 19 280 377 181 -68 248 -167 148 -43 182 -17 82 124 86 188 411 -59 32 -9 340
2853C40n22N5K48K7j33l14L02k13K39r0j12M09k61l37J43M37j58m00o7K45j71
$$ 340 -182 -127 121 148 15 -299 3 -210 29 -61 -173 236 -25 -362 -219 218 60 -340 -407 -162 -333
2874c33L19r9O6k76Q3Q1m3q7K06j9k09K31l35K18J57j72J58p3Q7j91K3N5M95n10
$$ -333 -14 -113 -47 -323 -240 -159 -202 -289 -83 -102 -311 -80 -415 -197 -40 -212 -54 -127 -40 -231 -208 -153 342 -168
2898a68Nj30K45k24J58J42j65K37k55K28j62O3j12K82j78J42j49J05n7j48jp2
$$ -168 -163 -293 -48 -272 -114 28 -137 100 -155 73 -89 -26 -138 144 -34 108 -41 64 7 -141 -142 -214
2920b14J64J58o5R3j30j35N2R8Q1P3j23j58M96n94K42Q6j34K84l28J14J36r9k1
$$ -214 -50 108 43 136 6 -129 -77 21 102 175 52 -106 390 -204 38 124 -10 274 -54 60 196 97 76
2943G6J97k46J55j05p2J09j31k21M28O8l97J94J30J1J92j64J15J29l41l8J95N5
$$ 76 273 27 182 77 5 114 -17 -238 190 258 -139 55 185 196 388 224 339 468 127 89 284 339
2965C39m6l58M7k14N6M74n45L36K40k67j76J79%j46o2J96L92n09j15K72k69l10
$$ 339 293 -65 -18 -232 -176 298 -247 89 329 62 -114 65 65 -81 -143 53 445 -64 -179 93 -176 -486
2987d86M50J96k5k30K69k74N3J2j70K62P9j04j51j19J40pN6j35L7j80M49l09L45
$$ -486 -36 160 135 -95 174 -100 -47 -35 -205 57 136 32 -119 -238 -98 -105 -49 -184 -147 -327 122 -187 158
3010A58j94K19m53N2N9J9K35j89J2K39j08j31k45K53k74R5J58K3Jj32m0K4J55
$$ 158 -36 183 -270 -218 -159 -140 95 -94 -82 157 49 -82 -327 -74 -348 -253 -95 -72 -71 -203 -243 -219 -64
3033f4R6m45L90K3k0J45p6p8K60m91K50k72K07K3j31K10Qp4J19kl4k09J19L75
$$ -64 32 -413 -23 0 -20 125 49 -29 231 -260 -10 -282 -75 -52 -183 27 35 -39 80 78 44 -165 -46 329
3057C29l29k41M61j59k4k08j5L48j98j53J92K28M9J32l14J51l30K20N3N4j6l17
$$ 329 0 -241 220 61 37 -171 -186 162 -36 -189 3 231 280 412 98 249 -81 139 192 246 230 -87
3079h7R9L8j79O9O0K41j53Q4J95l78J48J79l23j70L33q9J04j75o3M8%M7J57K20
$$ -87 12 50 -129 -60 0 241 88 172 367 -11 137 316 -7 -177 156 67 171 -4 -67 -19 -19 28 185 405
3103D05l45j12J55J60k56j43K11L31n29J51K2J17j10p4J82q5l02P4L7J97m4j04
$$ 405 60 -52 103 263 7 -136 75 406 -123 28 50 167 57 -17 165 80 -222 -148 -111 86 42 -62
3125f2j54j79M81l72O27n77M6J27J94j71q9L55l74k01K14J08L9j46J80j75j59
$$ -62 -216 -395 86 -286 341 -236 -190 -63 131 -40 -129 226 -148 -349 -135 -27 12 -134 46 -129 -288
3146b88L95j04k88K00j63Q4P7J41r7J2Q2L1k46J33o5J56k30J78n6j8L43k85j48
$$ -288 107 3 -285 -85 -248 -164 -87 54 -43 -31 51 82 -164 -31 -96 60 -170 8 -48 -66 277 -8 -156
3169a56K84j33j73K69k85J44l2n0L2j37N31n94R7K17o7J58J20k16j57J73P6l0
$$ -156 128 -5 -178 91 -194 -50 -82 -132 -100 -237 294 -300 -203 14 -53 105 225 9 -148 25 101 71
3191G1KM2m51J38N66k56j43N6M0J9J81n00K69J95p9M8Jr5j83K68l87L07J51k12
$$ 71 73 115 -336 -198 368 112 -31 25 65 84 265 -235 34 229 150 198 199 104 -79 189 -198 109 260 48
3215D8L49n08J22N7j50J22j6m3q6K87l9k8R1l61J88J54k69P7J11j73r9J44J83
$$ 48 397 -111 11 68 -82 40 24 -19 -105 182 143 115 206 -155 33 187 -82 -5 106 -67 -166 -22 161
3238A61k32K27j58J61k24J90k03k34K45j4K1J28l7k76L43o1j0K4J04j8n73M90
$$ 161 -71 156 -2 159 -65 125 -78 -312 -67 -81 -60 68 31 -245 98 37 27 51 155 137 -436 54
3260E4k12R1KM39p23K06J35k47M76l64M44l82K4J98n09K07K84k59o7J68l33L76
$$ 54 -158 -67 -65 374 -349 -143 -8 -255 221 -143 301 -81 -57 141 -368 -161 123 -136 -203 -35 -368 8
3282Hj70K22m02K28m7M4j15n8L41k27J01j31J89j25J27K1K6j45pq2K69j01K43
$$ 8 -162 60 -342 -114 -161 -117 -232 -290 51 -176 -75 -206 -17 -142 -15 6 32 -113 -120 -202 67 -34 209
3305B09l07j26Q9o4K22j13j96K00J87n4j81J18K96l86K0q9N10m84J07M78l81o7
$$ 209 -98 -224 -135 -199 23 -90 -286 -86 101 47 -134 -16 280 -106 -86 -175 335 -149 -42 436 55 -12
3327a2j78N2J35m9QL02j32L5m8k27L22n3k58L08J29j85n5R3P5k62pK19j04L5q
$$ -12 -190 -138 -3 -52 -44 258 126 161 113 -114 208 155 -103 205 334 149 94 187 262 0 -7 212 108 143 135
3352A35n6J42j56Q6R2l27J32L00m05M8j03K97k39J61KM0k22J15j84p4M00N9k99
$$ 135 79 221 65 151 243 -84 48 348 -57 -9 -112 185 -54 107 109 149 -73 42 -142 -216 184 243 -56
3375e6L92m63L82k37j10Q3J77l36L03l17J72m7J23p6N8J01j11j47J41J31m50K39
$$ -56 336 -127 255 18 -92 -9 168 -168 135 -182 -10 -57 66 -10 48 149 38 -109 32 163 -287 -48
3397d8k36L55p0j92M13n45K20J56l41L69l45Q3oO3p4j50K50O8r5j45Q9K15j22
$$ -48 -284 71 1 -191 222 -323 -103 53 -288 81 -264 -181 -187 -124 -198 -348 -98 -30 -125 -270 -181 34 -88
3420h8j10K46j66l9R1J07j59J73J17k98J73Rr1k9J32K0j84R4J9K37m01L34k09
$$ -88 -198 48 -118 -157 -66 41 -118 55 172 -126 47 56 -35 -64 68 88 -96 -2 17 254 -147 187 -22
3443b2j23L48l59K77j71L12k64N5j9l9L1j20K48q4K39j0q2l07K5J22j86J63n9
$$ -22 -145 203 -156 121 -50 262 -2 53 34 -5 26 -94 154 70 309 299 217 -90 -65 57 -129 34 -25
3466b5L44k71J1J70k86Om9L92p1k27r4L1N15j51k76k2L60o80L65J92k51j62J06
$$ -25 319 48 59 229 -57 -51 -100 292 221 -6 -100 -69 446 295 19 -3 357 -323 42 234 -17 -179 -73
3489g3Q9MJ02j92J54O0m3j2O5j30J56k29J15q4k09J24L28n5l45R6K69r0N5k98
$$ -73 16 20 122 -70 84 144 101 89 154 24 180 -49 66 -18 -227 -103 225 170 -175 -79 190 100 155 -143
3513a43J51Kj61L10k13k32M11l51Q4k1J20K9k49J61K06j67j26n5L5J24K00k95
$$ -143 8 10 -151 159 -54 -286 125 -226 -142 -163 -43 -14 -263 -102 104 -63 -189 -244 -209 -85 115 -180
3535a80J00j9nj0j04J08K10j46j28Q6k14N15j52n3o9q1j18J19j16r3J29L06n8
$$ -180 -80 -99 -104 -114 -218 -110 100 -46 -174 -88 -302 213 61 8 -61 -142 -260 -141 -257 -350 -221 85 27
3558B7P6j67M89n48j98M22k60J47J27k27J40O9m6l45K31l1O6MO2j18n9O3l8M23
$$ 27 103 -64 425 -123 -321 101 -159 -12 115 -112 28 97 51 -294 -63 -94 -28 -24 38 -80 -139 -76 -114 309
3582C09l42M72m23N6n4j40L2J21J82l0j78K35P1l34j7l4J51k0j56L23J13l27L8
$$ 309 -33 439 16 72 18 -122 -90 31 213 183 5 240 311 -23 -40 -74 77 57 -99 224 337 10 48
3605D8O4L55n04P0J79l05J08q8o0n3N58k5j75Q1k36J51K39m89J48P6l31R6L19
$$ 48 112 467 -37 33 212 -93 15 -73 -133 -186 372 347 172 253 17 168 407 -82 66 142 -189 -93 226
3628B26n31K86J94n6j95L00l44J36j50J87j43m8K76k59j41L44n8j40N5mj94K41
$$ 226 -305 -19 175 119 -76 224 -120 16 -134 53 -90 -138 138 -121 -262 82 24 -116 -61 -65 -259 -18
3650a8q6N2j28J32j92K09j75l47O24j05j95K29k72k05K84J89J05J8j93r9j2K45
$$ -18 -104 -52 -180 -48 -240 -31 -206 -553 71 -34 -229 0 -272 -477 -193 -4 101 119 -74 -173 -185 60
3672F0L8n10J6L73j60R1K84k63L2L7l8Q1n6L8J1M02k76j83KM0j93J46J04M2l28
$$ 60 98 -412 -396 -23 -183 -92 192 -71 -39 -2 -40 41 -15 23 34 436 160 -23 -21 19 -174 -28 76 118 -210
3697b10j34J00K92n9N5m6J80J10k36l94L37l7L47l16J07m5k54L03k52K93l2K8
$$ -210 -344 -244 48 -11 44 -2 178 288 52 -342 -5 -42 305 -11 96 51 -203 100 -152 141 109 137
3719A37J67k09j78K24j82M63m49J61n8o9L09k33j64K17M6l3J77k9k24j59J27K84
$$ 137 304 95 -83 141 -41 422 -27 134 76 7 316 83 -81 136 182 149 326 297 73 -86 41 325
3741C25j27J2R7j21l48J05m3J04R7m8l0o9J75j56J69j11k61L39k6M8k80J61o5
$$ 325 198 210 307 186 -162 -57 -100 4 101 53 23 -46 129 -27 142 31 -230 109 83 131 -149 12 -53
3764e3O7j12j74L16j57j01L42j68K12j99K02k82K27l70J43J30k28N5J88q2No0
$$ -53 14 -98 -272 44 -113 -214 128 -40 172 -27 175 -107 120 -250 -107 23 -205 -150 38 -44 -39 -99
3786i9J14k92K5K95j84K1j72L46k47qK81l20K17L25m35Q4J38j49m7p6M27j63k97
$$ -99 15 -277 -252 43 -141 -120 -292 54 -193 -201 80 -240 -23 302 -133 -49 89 -60 -107 -183 244 81 -216
3809b16J12m6J49r5j72j29K26O1J20J08k04N3k25L72m53N88j72k73K72O0j33k71
$$ -216 -104 -150 -1 -96 -268 -397 -171 -110 10 118 -86 -33 -258 114 -339 249 77 -196 76 136 3 -268
3831b68K81J55r9J85n86L63j67m1N48k94R6l60J91l5M36j75kl15KJ24j8R9qj06
$$ -268 13 168 69 254 -332 31 -136 -177 371 77 173 -187 4 -31 405 230 228 -87 -85 39 21 120 112 6
3855Fo8L31l88N7J0l2K74k52J29O0J2Q0k69o4K63k7k95L19k84K61k27J21K14k0
$$ 6 -62 269 -119 -62 -52 -84 190 -62 67 127 139 219 -50 -114 149 122 -173 146 -138 123 -104 17 231 211
3879B11n17O7L77P8k06j8j54J92J84j34j54j90Q4O5L05l27J6j58L57j95l2m8K63
$$ 211 -306 -239 138 216 10 -8 -162 30 214 80 -74 -264 -180 -115 190 -137 -121 -279 78 -117 -149 -197 66
3902F6j8k47r9M40l64J76r7o3J05J50K17n54L13j27K12O7k00J31k20QJ70N3j23
$$ 66 48 -199 -298 142 -222 -46 -143 -206 -101 49 266 -288 25 -102 110 177 -23 108 -112 -104 66 119 -4
3925dJ34r8J58k7l31L4o5j23L33l52L26J6j04Q1j56K5J45N7k04J76nN7j21M8L67
$$ -4 130 32 190 163 -168 -134 -199 -322 11 -341 -15 1 -103 -22 -178 -153 -8 49 -155 21 16 73 -48 0 367
3950C67p81M76LJ54j59m30M06R9k79j95N22l26J83j30P5k45L52n2k40L77k02k03
$$ 367 -414 62 65 219 60 -370 36 135 -144 -339 183 -143 40 -90 -15 -260 92 40 -200 177 -25 -228
3972b28J28N9J14j13J13J71k95Q4j08J81J77j82j15K40J10p1l86M63k71O2j26
$$ -228 -100 -41 73 -40 73 244 -51 33 -75 106 283 101 -14 226 336 265 -121 342 71 133 7
3993Gk3P8j84J0K10l14K27J14k4l13L43k9K86l27k33L75l02L06J0l78j10K65o5
$$ 7 -16 62 -122 -112 98 -216 11 125 101 -212 131 102 388 61 -172 203 -99 207 217 -161 -271 -6 -71
4016g1J71m8J9l8n9l74K98K52l37QJ39L48m81K32j91L12k70k4j57L43j82J82k38
$$ -71 100 52 71 33 -26 -400 -102 150 -187 -179 -40 308 -173 59 -132 180 -90 -114 -271 72 -110 72 -166
4039a66j43L91k05R5N2p4K94l79Q6J1k7r9q9M9K40l19J73K19j87j25J6j05L18
$$ -166 -309 82 -123 -28 24 -50 244 -135 -49 -38 -65 -164 -253 -204 36 -283 -110 109 -78 -203 -187 -292 26
4062B6M6n2k32O8j8P7M3KK60n06p9L42j00l4J33j68K91j68O8q7L04j33l59m2M39
$$ 26 72 20 -212 -144 -162 -85 -42 -40 220 -286 -365 -23 -123 -157 -24 -192 99 -69 -1 -88 216 83 -276 -318 121
4087A21l52L91k75K03q9k07l3M48k92J68K01j65l2qk72R8J00k24R1K1L63j41j30
$$ 121 -231 160 -115 88 -1 -208 -241 207 -85 83 284 119 87 79 -193 -95 5 -219 -128 -107 256 115 -15
4110a5Q0K4m2M4J9oK57k55j75KK39j03Jj16J41K07k87R5j75K0Q4M0k1j35J69l06
$$ -15 65 89 47 91 110 104 361 106 -69 -67 172 69 70 -46 95 302 15 110 -65 -45 39 79 58 -77 92 -214
4136b14O34n15n4K6J50j00J18K1j28J58k41L46k02J98j87L62l96j34J44j55J48
$$ -214 420 -95 -149 -123 27 -73 45 66 -62 96 -145 201 -1 197 10 372 -24 -158 -14 -169 -21
4157b1J61j83J80j21k00J51j25l7K51Q7k73M81m18J45k12J87M3k35q0o6K98r4
$$ -21 140 -43 137 16 -184 -33 -158 -195 56 143 -130 351 -67 78 -134 53 96 -139 -219 -285 13 -81
4179h1j04L88j53Jk28O9n3J20L9o6O1r3K41m70J18K78k56K82k08j17K25J0J91
$$ -81 -185 203 50 51 -177 -108 -161 -41 -2 -68 -7 -100 141 -329 -211 67 -189 93 -115 -232 -7 3 194
4202A94n3j45j81j0M01j76L14m21j99K87m4k03M64l89K98j65K38j66P8k36K3J31
$$ 194 141 -4 -185 -195 206 30 344 -77 -276 11 -33 -236 228 -161 137 -28 210 44 122 -114 -91 40
4224D0j56K63k46J58J97k17k56J53r5K24P2k6j70K76j89L84k74K06j69j95r1k8
$$ 40 -116 147 -99 59 256 39 -217 -64 -159 65 137 111 -59 217 28 412 138 344 175 -20 -111 -139
4246a39L68k04K00r5P2l6k19k2J58m18L85l0j34j08J97K50l39j31J66L07k47R6
$$ -139 229 25 225 130 202 166 -53 -75 83 -335 50 20 -114 -222 -25 225 -114 -245 -79 228 -19 77
4268G7J83J43m34J79O1Jj36k23mq1J67J0m1K80l41o3K26O8n9k0M4M6J12l48M8
$$ 77 260 403 -31 148 209 210 74 -149 -153 -234 -67 -57 -98 182 -159 -222 4 72 13 -7 37 83 195 -153 -105
4293a05M8p9J68oO3k53P5J85j5j36J20j06q8J02l05P03m38j96M36L1k60nr6J24
$$ -105 -57 -136 32 26 89 -164 -89 96 81 -55 65 -41 -129 -27 -332 371 -67 -263 173 204 -56 -61 -157 -33
4317c3l4L60l49L74j87n68N22k28O8J55m8K2k73K63l24J08p4n1L39R9j94N0J9
$$ -33 -67 293 -56 318 131 -437 85 -143 -75 80 32 54 -219 44 -280 -172 -246 -297 42 141 -53 -3 16
4340A6q8R2j54j9J9mJ95j76j55L16j7J27n1R7j82j07M25q8l07J37l62M54j63K18
$$ 16 -72 20 -134 -153 -134 -138 57 -119 -274 42 25 152 101 198 16 -91 334 246 -61 76 -286 168 5 223
4364B23p1M6k03j44J68M1k11J76p9J05o1n4P6k33K72n1Q9J17k30J68Kj42J29k92
$$ 223 152 198 -5 -149 19 60 -151 25 -54 51 -10 -64 12 -221 51 0 89 206 -24 144 146 4 133 -159
4388a59L26j55j10J76K53m74J42Lk14K05M09j20l78k02L06O4K22k03j06l66K65
$$ -159 167 12 -98 78 331 -143 -1 2 -212 -7 402 282 -96 -298 8 72 294 91 -15 -381 -116
4409a16L87k23j23j31K06l19K38L05Mj62k73O4L45k20KJ58m70O8O3K50O1m27J87
$$ -116 271 48 -75 -206 0 -319 -81 224 228 66 -207 -143 202 -18 -16 142 -328 -260 -197 53 114 -313 -126
4432a26P8J3m7J33k45J24L0j87J6J00m0k8K06j92J90l31M9L09O7j37J21j22l9
$$ -126 -48 -35 -82 51 -194 -70 -40 -227 -211 -111 -151 -179 27 -165 25 -306 -257 52 119 -18 103 -19 -58
4455e8k73L08j07O0m6P1L76l96k6K93k48o6l21L47J8K48k61N6N8o0J75k32K50
$$ -58 -331 -23 -130 -70 -116 -45 331 -65 -91 202 -46 -112 -433 -86 -68 180 -81 -25 33 -27 148 -84 166
4478A66j73k54N05m52L00j05p0l3J99nj55O1K18k44J41m4k53M28J8j24q5L0l8
$$ 166 -7 -261 244 -208 92 -13 -83 -116 83 78 -77 -16 202 -42 99 55 -198 230 248 124 39 69 31
4501C1L3N5k37J5R3K58K8l14P1O5l38L85k33L05k02J44k9j71M5K25j47lJ93j90
$$ 31 64 119 -118 -103 -10 248 276 -38 33 98 -240 145 -88 217 15 159 130 -41 4 229 82 79 272 82
4525H2j17K75K3j76j55L6j13Q0K81l80K96q0l61N96j77m1J29m1k29K6j67O7K56
$$ 82 -35 240 263 87 -68 -32 -145 -65 216 -164 132 52 -309 287 110 69 198 157 -72 -46 -213 -146 110
4548A10o0j6j21M61k86q1j46j1o7K57o7qm8J72j20J26K9l64N43l23lj79K21%J68
$$ 110 50 34 -87 374 88 7 -139 -150 -217 40 -27 -35 -83 89 -31 95 124 -240 303 -20 -23 -202 19 19 187
4573A87o5q5k59L24j86Q7rk48L20j5L26m03J40J46l74l7K54r1lk6j93J2J82o4
$$ 187 122 37 -222 102 -84 3 -6 -254 66 51 377 -26 114 260 -114 -151 103 12 9 -17 -210 -198 -16 -80
4597h0Q4L2j72Rm1K12j4K2Q6l4k29L07l5j41N0n6j66M75n10L14k38J88J5r3J31
$$ -80 4 36 -136 -127 -168 44 30 52 138 104 -125 182 147 6 56 0 -166 309 -201 113 -125 63 78 -15 116
4622A16oJj74N1j89M25l77J05k9J60N4k09n8k04M27Q0k97J44j02R4l2mj01K37
$$ 116 110 111 -63 -12 -201 224 -153 -48 -77 83 137 -72 -130 -334 93 173 -124 20 -82 12 -20 -24 -125 112
4646A12J52j47L6n14N26q8q7M3j52K21j47L10k48j28J3L9k12L92j38M9k81O21
$$ 112 264 117 153 -361 165 77 -10 33 -119 102 -45 265 17 -111 -98 -59 -271 121 -17 32 -249 372
4668C72n25J18K38k94l3R9j11K10l4k43J87k0p3O8O1j37j03m4K69J52k39l13N95
$$ 372 -153 -35 203 -91 -124 -25 -136 74 40 -203 -16 -36 -109 -41 20 -117 -220 -264 5 157 -82 -395 200
4691B00k30J02k81L94l04j59K25J20j66o3L28k23O6k24K19J50j17j09J17j77L05
$$ 200 -30 72 -209 185 -119 -278 -53 67 -99 -162 166 -57 9 -215 4 154 37 -72 45 -132 173
4712A73k02r7J08l0r3O8J54j44J44j30j77L96m37j7L51j10k12J53j93L83M3J0
$$ 173 -29 -126 -18 -48 -141 -73 81 -63 81 -49 -226 170 -267 -284 67 -43 -255 -102 -295 88 131 141
4734A41N9j01J02k01j31J26j22l1L10j02j81L1R7J57j26j86M09l09K80m39K48
$$ 141 200 99 201 0 -131 -5 -127 -158 152 50 -131 -100 -3 154 28 -158 251 -58 222 -217 31
4755C1K64n41L74m06K26l7J04J3J12n8r3J23o0j20P4J59r3j50K28n4n1l31L14
$$ 31 295 -246 128 -278 -52 -89 15 28 140 82 -11 112 52 -68 6 165 72 -78 150 96 45 -286 28
4778B8J03J02l02j99K27K18p6l43K58J95k75k6K47k35J32j03RK12J75l34p4n1
$$ 28 131 233 -69 -268 -41 177 101 -242 16 211 -64 -90 157 -78 54 -49 -40 172 347 13 -61 -112
4800a12J55j06J07j04Qk19J39J23J02k19k11K84K09p1k62rK69r9M7l9j99J24Q2
$$ -112 43 -63 44 -60 -52 -271 -132 -9 93 -126 -337 -53 156 85 -177 -186 83 -16 31 -8 -207 -83 -1
4823aJ81m90n3L46j82L33k35J04J95L0j69j85J00J00k42J96n7N6J21l00k48P1
$$ -1 180 -310 -363 -17 -199 134 -101 3 198 228 59 -126 -26 74 -168 28 -29 27 148 -152 -400 -329
4845c29K49j14J24L14m50J34K8q3J72k22K72o9j18l9L52M8j93j87K92k10K10l34
$$ -329 -80 -194 -70 244 -206 -72 -44 -127 45 -177 95 26 -92 -131 221 269 76 -111 181 -29 181 -153
4867a53M48k15q8K28j34j45K48l26K10j57L1r0Q7J54j98O3j3k25K70K15k6l8j88
$$ -153 295 80 -8 220 86 -59 189 -137 73 -84 -53 -143 -56 98 -100 -37 -50 -275 -5 210 184 146 -42
4890d2J33j01J82R9l78Mm7J09K9L5J66r3O1n8k7J02r7j10L94l33M8J1J48j39J51
$$ -42 91 -10 172 271 -107 -103 -150 -41 -12 23 189 96 157 99 72 174 77 -33 361 28 76 87 235 96 247
4915B47j19l28J56K72l76Q9j97N14k94L78l90O5J08k94K41M9r0j05j24L23k04
$$ 247 128 -200 -44 228 -148 -59 -256 258 -36 342 -48 17 125 -169 72 121 31 -74 -198 125 -79
4936g9Q3%j22q2L41j98L1J71M6J23k86K04l97J80l16J22J80r5j58M16j22m2k53
$$ -79 4 4 -118 -200 141 -57 -26 145 191 314 28 232 -165 15 -301 -179 1 -94 -252 164 42 0 -253
4959b53R0n9k9K06k8m9P6L0J04j33K35l39J40k19L57J06m11J46K2k0m2J56j54
$$ -253 -163 -222 -251 -45 -73 -122 -46 -16 88 -45 190 -149 -9 -228 129 235 -176 -30 -8 -28 -70 86 -68
4982f8J4L40j79k53J48p4J56r8J39l50P2K22K8j64J86L9k14J92j88J48j27o7J0
$$ -68 -54 286 107 -146 2 -72 84 -14 125 -225 -153 69 97 -67 119 158 -56 136 -52 96 -31 -98 -88
5005h8N4P8k19L0J83j96k0J60j08J56J83k13R1j98K08o5j19J67m7J5J15j39M7
$$ -88 -34 44 -175 -145 38 -158 -178 -18 -126 30 213 0 91 -107 101 36 -83 84 37 52 167 28 75
5028G5J48k74K15k29N3J59J5O0j67K20m7k71M15l28l65L42k27J89j22l5N50m71
$$ 75 223 -51 164 -65 -12 147 162 222 55 275 228 -43 372 44 -321 21 -206 -17 -139 -174 376 -95
5050i5J35j08J14K8J3l15J54l02J10M47j31qj82K52k16K28M7J15k59J64l0o6k62
$$ -95 40 -68 46 74 87 -228 -74 -376 -266 181 50 42 -140 112 -104 124 171 286 27 191 161 95 -167
5073a67k32N45l3j09m3k4l7J30q6P9j78J23o3Q4K96k01k59L02j8j98N2p6o0J77
$$ -167 -399 146 113 4 -39 -63 -100 30 -56 23 -155 -32 -95 -11 285 84 -175 127 109 -89 -37 -113 -173 4
5097DO8R8q3m1J11j46j32M6K50j53j55O5J4L69r9k21K39J9k15o7m0l7O4R5j21
$$ 4 72 170 87 46 157 11 -121 -75 175 22 -133 -68 -54 315 216 -5 234 253 38 -29 -69 -106 -42 53 -68
5122f8j68N29k57k66L44j59q5K18J36j66j46K62k37K52l9L1j38j76J45J57l40
$$ -68 -236 293 36 -230 114 -45 -130 88 224 58 -88 174 -63 189 150 181 43 -133 12 169 -171
5143a71L66j26k21J52J02j47J8j61M13j9k89Q8k31J37M7J35k57J94r9M0j12J21
$$ -171 195 69 -152 0 102 -45 -27 -188 225 206 -83 5 -226 -89 -42 93 -164 30 -69 -29 -141 -20
5165b0J3J45R3r9q3j55J48M06l27oj52J71k7J29m09K87J07n25J81K18j0k47L77
$$ -20 -7 138 231 132 49 -106 42 448 121 115 -37 134 107 236 -173 114 221 -304 -123 95 85 -162 215
5188B15k45K43P7j72j99k31M59j08o0k79M01k46R6OJ0J07j00k40M08k09M0K21
$$ 215 -30 213 290 118 -81 -312 147 39 -21 -300 101 -145 -49 -43 -33 74 -26 -266 142 -67 -27 194
5210A94k41K86l3o6j98j91N2J99j40J20k68Nl0K35p6P2o1J25O5M7m6q6k03J82
$$ 194 -47 239 206 140 -58 -249 -197 2 -138 -18 -286 -281 -311 -76 -152 -80 -141 -16 49 96 50 -36 -239 -57
5234e7M32m88J22j22J67nQ4L3R4m37L47m39L39j68J00j09Q0j74R2M11m71L54k32
$$ -57 375 -113 9 -113 54 49 133 166 260 -177 170 -269 70 -98 2 -107 -27 -201 -109 302 -169 185 -47
5257d7K8j16k43N66j52l28M29j51K05k69J02o0J77l08J71N5q7K14q9J98l53J30
$$ -47 -19 -135 -378 188 36 -292 137 -14 191 -78 24 -36 141 -167 4 59 -28 186 97 295 -58 72
5279G2Pr1k95L08J41J67l15r6L9K51k57j84N98m17L65l04J00k83K15K10m45K11
$$ 72 79 -12 -307 1 142 309 -6 -102 -63 188 -69 -253 345 -72 293 -11 89 -194 21 231 -214 -3
5301cp4P1P3k24M85q4j91K3k21k02J35L70k33p8L63j15l0j93K37j78M0j24J34
$$ -3 -77 -6 67 -157 328 244 53 76 -145 -347 -212 158 -75 -153 210 95 65 -128 109 -69 -29 -153 -19
5324a9J6j68J68o8N13K5n76K38j96O9J16l39l4J57k79R7K17J0K95k22j89J39J25
$$ -19 -3 -171 -3 -71 442 467 -109 129 -67 2 118 -221 -255 -98 -377 -280 -63 -53 242 20 -169 -30 95
5347I5j91J85j21J51j75j4k00J53K9j28P5J51J30n5m1kq8K42Q5Ko23L19k6j14
$$ 95 -96 89 -32 119 -56 -70 -270 -117 -88 -216 -141 10 140 85 44 42 -46 196 281 283 -340 -21 -47 -161
5371a61J70j87K77k04L6K50l76N29k47r0l6lj21J22K45j7k00r2K15lk60J87j66
$$ -161 9 -178 99 -105 -69 181 -195 334 87 -3 -39 -42 -163 -41 204 187 -13 -105 110 107 -153 34 -132
5394a32k82L79j54L11j96m9JL33l76K44k7j28r3N25l99M4N9k03K5K51j15R0q3
$$ -132 -414 -35 -189 122 -74 -123 -122 211 -165 79 52 -76 -169 356 -43 1 60 -143 -118 133 18 108 25
5417B5K4j33K7L71m46M1L30l70K40k73J46pQ4j59r6j9K37j12K33k53J49J6O5N7
$$ 25 49 -84 -57 314 -132 -91 239 -131 109 -164 -18 -25 59 -100 -196 -215 22 -90 143 -110 39 55 120 177
5441A77r0J20l79j40J14J82M2J16k82K59k66q0L10K43l30J8n4L70p13N61l29l7
$$ 177 87 207 -172 -312 -198 -16 26 142 -140 119 -147 -227 83 326 -4 14 -40 330 -383 178 -151 -188
5463a88J04k8J38p8N7l2M41m72Np7K21k07J76nK02j47N4p6j74j20J67J09J35p0
$$ -188 -84 -112 26 -52 5 -27 414 -58 -53 -130 91 -116 60 55 257 110 164 88 -86 -206 -39 70 205 135
5487A35k89j51J15j74K48O8R8l23M32j93J29j11j80M5J39o5j08J15K62k69J82
$$ 135 -154 -305 -190 -364 -116 -48 50 -273 159 -34 95 -16 -196 -151 -12 -77 -185 -70 192 -77 105
5508A05J62m48M11j83J3m4J18J20j83k80L94k33P5k65L08Qk68L0J30Q6k8Q8l0
$$ 105 267 -181 230 47 60 16 134 254 71 -209 185 -48 27 -238 70 78 -190 -160 -30 56 28 116 86
5531H6m7L6K54j30l91K28j35K79k73p8L6M7Mp4N54l74J02r1K23l33l37M91j73
$$ 86 39 75 329 199 -192 36 -99 180 -93 -171 -135 -88 -84 -158 396 22 124 33 256 -77 -414 77 -96
5554i6j5J64j85J4J51o4q5M40m63L16j06J20o0J40l41Q2j32M14j25m98M02m4n0
$$ -96 -111 53 -132 -118 33 -31 -116 324 -139 177 71 191 131 271 -70 12 -120 294 169 -329 73 29 -21
5577b1l0k9J57L7k14R8j92L06m38K48N6k59L08j4r8J37l09K11L46q4m07J02L7
$$ -21 -51 -80 77 114 -100 -2 -194 112 -326 -78 -22 -281 27 13 -85 52 -257 -46 300 216 -191 -89 -52
5600e2J38j82k37N96k09J99l96MP4Q5k33K38J28q0k80J26LK51n10K73J3j02J99
$$ -52 86 -96 -333 263 54 253 -143 -139 -65 20 -213 25 153 73 -207 -81 -78 173 -337 -64 -51 -153 46
5623D6p7Q1k48K69j04o1L4J63l4O3l37L22k68J49j77J93k3j23J33N4J14j60K4
$$ 46 -31 50 -198 71 -33 -94 -60 103 69 132 -205 117 -151 -2 -179 14 -9 -132 1 55 169 9 33
5646C3O9K0l06J78P6j29K6J47Q8l48O3K77j25mK43l62NK38K8K6k54J34j65K66
$$ 33 102 122 -184 -6 70 -59 -33 114 202 -146 -83 194 69 65 308 -54 -49 189 217 243 -11 123 -42 224
5670B24j07J8l2q0j68J89n2K99k92M7Qj08p6M65j90j65k63K89K51o6p9j68J33
$$ 224 117 135 103 23 -145 44 -8 291 -1 46 54 -54 -130 335 145 -20 -283 6 257 191 112 -56 77
5693G7j08j33L84k57K06l34L01K9j9j77k79K13Q5L40n90J89p4J42ko0n8L4n3J55
$$ 77 -31 -164 220 -37 169 -165 136 165 146 -31 -310 -97 -12 328 -262 -73 -147 -5 -7 -67 -125 -91 -144 11
5717A1j1J2j81QLK45j04p2j22K00j1kN0k6r6K6P1Q2J41j58k55k9K75l5j46J95
$$ 11 0 12 -169 -161 -158 87 -17 -89 -211 -11 -22 -24 26 0 -96 -70 1 83 224 66 -189 -218 57 22 -124 71
5743G1k44O4K66J19k76j83m8L32J16k49J97j41J91j70J42j30j07j42M11l35L98
$$ 71 -173 -109 157 276 0 -183 -231 101 217 -32 165 24 215 45 187 57 -50 -192 219 -116 282
5764B82m78J54L48k15r8K66j62l79M57j27L4j62K36j93P2J47j19j16n3oJ87l44
$$ 282 -196 -42 306 91 -7 259 97 -282 175 48 82 -80 156 -37 35 182 63 -53 -106 -112 75 -269
5786b69K83q9n0K42J11l90J96Jj9J80J05j66o8J44p7J39j59k44J95j71l13M15
$$ -269 14 -75 -125 117 228 -162 34 35 16 196 301 135 67 211 134 273 114 -130 65 -106 -419 -4
5808dJ6N3K21l06J30M3P4j84j56M7K09k29M4k82K53J88k46m7J06K91k47K3j34
$$ -4 12 65 286 -20 110 153 227 43 -113 -66 143 -86 -42 -324 -71 117 -129 -176 -70 221 -26 -3 -137
5831a37J58J32k30J68P3M4l52n0J83K7Ro2K19k49m8K00m34L62M1k09j05J70M09
$$ -137 21 153 -77 91 164 208 -144 -194 -11 16 25 -37 182 -67 -115 85 -349 13 54 -155 -260 -90 319
5854C19m18k0K11k61j2M3J53J82j34j64K8k04L90P2m4j69J05j02J36J39j31j31
$$ 319 -99 -119 92 -169 -181 -138 15 197 63 -101 -73 -277 113 185 141 -28 77 -25 111 250 119 -12
5876a2o2rR4q4N1o6K4j43N93l97J16M3m12J85P6K6l78M05j0k09l7L35j52Q3N8
$$ -12 -74 -83 11 -73 -22 -88 -64 -207 386 -11 105 148 -264 -79 -3 23 -355 50 40 -169 -206 129 -23 60 118
5901A18k86J64k6l4l5L25o9O6l70O2L65j60Rl43Q1J94j36m8M41l96m2nL50l78
$$ 118 -168 -4 -30 -64 -99 226 157 223 -147 -85 280 120 129 -214 -133 61 -75 -123 318 -78 -120 -125 225 -153
5925a53L89r3M9j94L5l9L22j96J16k24k58L28pn8j47M75j03k27J3P6p9J36M9M6
$$ -153 236 143 192 -2 33 -6 316 120 236 12 -246 82 75 17 -130 345 242 15 28 104 25 161 210 256
5949B56l27Q0P6k34J35l2m01M59P2k32J75j8j08J68Q5l17k05L56p5P7k36K90J27
$$ 256 -71 9 85 -149 -14 -46 -447 12 84 -148 27 9 -99 69 154 -163 -368 -12 -87 -10 -246 44 171
5972A71n13K54J66L6p5O8j23J04jN5k19J27j51O6Q0m67M87rJ07Qp2k13Nj80L80
$$ 171 -342 -88 78 114 39 107 -16 88 87 142 -77 50 -101 -35 45 -422 65 56 163 171 99 -114 -109 -289 91
5997I1o4J83j6j34K31k44k7j72n5K52l98K96O5K50l49q0L79n09Q9M56k85r4j12
$$ 91 27 210 194 60 291 47 20 -152 -207 45 -353 -57 8 258 -91 -171 208 -301 -212 244 -41 -135 -247
6020b47J57J53k62J18L23m18J89j93J21j74J55rK35J13l04O5l6J91l31pp0j12
$$ -247 -90 63 -199 -81 242 -176 13 -180 -59 -233 -78 -87 148 261 -43 22 -14 177 -154 -161 -231 -343
6042c43J53K40M5o8O0P4k50N5j1L96j66k52K52k34ON8J70Pm07k1L21r3p4K45l38
$$ -343 -190 50 95 27 87 161 -89 -34 -45 351 185 -67 185 -49 -43 15 185 192 -215 -236 85 -8 -82 163 -175
6067a75P0Q7Lj67o3K04L9o1j95L03j05k14J33M47j11l98L72k2l84K65k50J67k44
$$ -175 -105 -18 -15 -182 -245 -41 -2 -63 -258 45 -60 -274 -141 306 195 -203 169 147 -237 28 -222 -55 -299
6090b99L81j34p7Q0j49L14k83J1L00k65J53j89K21N6k90N8J12lRr5Q7J52k59L01
$$ -299 82 -52 -129 -49 -198 116 -167 -156 144 -121 32 -157 64 120 -170 -112 0 -3 6 -89 -2 150 -109 192
6114A92nj40l11K98l9p5J06m2P0K2j81n5J99k41K71O8q2m8O9k77J82l8K49l70
$$ 192 187 47 -264 34 -5 -80 26 -16 54 76 -105 -160 39 -202 69 137 55 7 76 -201 -19 -57 192 -178
6138a78J64J93Pm76K58Jl81N11k08O3l6L8j08J76p1LK16m06N1J91O0J21j4j52
$$ -178 -14 179 186 -290 -32 -31 -412 99 -109 -46 -82 -44 -152 24 -47 -44 172 -234 -183 8 68 189 175 23
6162B3J09j2Q3k1j6j93J21j58J46q0po7R1J13q7O6j66N8J76j52L7j79J97k06J16
$$ 23 132 120 203 182 166 -27 94 -64 82 2 -5 -72 19 132 45 111 -55 3 179 27 64 -115 82 -124 -8
6187hj19K95K83o00M77l58l45L71J26o2J12j3l3k40K70o8J39l07K46J62l66Q5
$$ -8 -127 168 451 -149 328 -30 -375 -4 122 60 172 159 126 -114 156 88 227 -80 166 328 -38 47
6209D7j70J47j56P4lR4qJ36l9N9m60R9rK03j28J1J26k52J98L1R6j81J57J42l57
$$ 47 -123 24 -132 -58 -61 33 25 161 122 181 -279 -180 -189 14 -114 -103 23 -229 -31 0 96 -85 72 214 -143
6234a43K33k56K13l4k58Q9J68K68j15l73k2p9J67K45j38l9O0J39j16j07J95J17
$$ -143 90 -166 47 13 -245 -156 12 280 165 -208 -230 -309 -142 103 -35 -74 -14 125 9 -98 97 214
6256B14l48j89M01j95J17j5J0l18L31Q7j70K2J20j26j13K86l88K53k8o9J80J60
$$ 214 -134 -323 78 -117 0 -15 -5 -323 8 95 -75 -53 67 -59 -172 114 -274 -21 -49 -118 62 222
6278B22k8k84NL51r6m81J67J40J01L9k61nL9m4J96k8JJ24o3k0k11K42l0J05q0
$$ 222 194 -90 -85 266 170 -311 -144 -4 97 136 -125 -130 -91 -135 61 33 34 158 95 75 -136 106 76 181 101
6303A01k73K66l32J55KL34j66j39K0J42m4j9O8j42L32m68K66k58Q1L29j43lj11
$$ 101 -172 94 -238 -83 -81 253 87 -52 -32 110 66 47 115 -27 305 -163 103 -155 -74 255 112 109 -2
6326bO0P6q3j31m5K60l22K17j15l8J10L4J50N5l84M79p17L48L21l1j00Q0j02j50
$$ -2 58 134 51 -80 -125 135 -187 30 -85 -123 -13 21 171 226 -158 321 -396 -48 273 242 142 222 120 -30
6350c0R2k59J39j17L92l45J14J44j43k20N1L28k01m6K29p4rj03n9L20l09O25n30
$$ -30 62 -197 -58 -175 217 -128 -14 130 -13 -233 -182 146 -55 -101 128 54 45 -58 -117 203 -106 519 -11
6373a1J74j6k85j8M8n8RJ56n1r8L92j30j91n4L35q1k10OL02r9j39K31j59Ro8O9
$$ -11 163 147 -138 -156 -108 -166 -157 -1 -52 -150 242 112 -79 -133 202 121 -89 -83 219 120 -19 212 53 62 -6 63
6399F3R8m32K77J16J08n11J01K60l07J72J30r2K09J95n08J29J16l66J43r4L24
$$ 63 161 -271 6 122 230 -281 -180 80 -227 -55 75 -17 192 387 -121 8 124 -242 -99 -193 131
6420A31k48K10Q0k73l0K05L9rj27O7P6k38R4K1j24j57N07l28J81k39L32l39J8
$$ 131 -117 93 173 -100 -130 75 114 105 -22 45 121 -117 -23 -2 -126 -283 224 -104 77 -162 170 -169 -151
6443a51L19m36L55k11K14k25J08l0qK52j5k33r5K44n1P8K0M3l7k13L25l59J71
$$ -151 168 -268 87 -124 90 -135 -27 -57 -65 187 172 -61 -156 88 37 115 135 178 141 -72 253 -106 65
6466F5K02o25K42K20%j40j15J74J33k20J84j16N6m0J00J2j10K1J3L52n24K33j03
$$ 65 267 -358 -116 104 104 -36 -151 23 156 -64 120 4 60 20 120 132 22 43 56 408 -116 117 14
6489A4k4Q7j64k08K36N3r5J64l72J54m1J10j56K53J06k3j80o0J06L1j27K90m9
$$ 14 -10 77 -87 -295 -59 -6 -101 63 -309 -155 -196 -86 -242 11 117 94 -86 -146 -40 -9 -136 154 105
6512A05j8K37n00K99j12j02K19j85J14J52q1o6j76M3n1J81R3P8j06J1O0k10j69
$$ 105 87 324 -176 123 11 -91 128 -57 57 209 128 62 -114 -71 -122 59 152 230 124 135 195 -15 -184
6535a84R5k04K64J74j09k15M14k18m6n5K14l6q4j23K6K6l07M30j48j8J66m33L84
$$ -184 -89 -293 -29 145 36 -179 235 17 -29 -84 130 94 10 -113 -87 -61 -368 62 -86 -104 62 -371 13
6558A3K8j08m5j26K21J55j6r2n0J3p4K19j33j24L77k78K62r7oJ4k68J09N9J04
$$ 13 41 -67 -112 -238 -17 138 122 30 -20 -7 -81 138 5 -119 258 -20 242 145 139 153 -115 -6 53 157
6582A57j38R9N5p5M5K2q5L8J44l38m1K03l45J72P8J56l8k24j23J07J89k64J98
$$ 157 19 118 173 98 143 165 80 118 262 -76 -117 86 -259 -87 -9 147 109 -115 -238 -131 58 -206 -8
6605hL4P9j10k24L07J16k13k1K21r0k05j32K73N3j15m9p2r6L57nj50k21KJ89N8
$$ -8 26 105 -5 -229 78 194 -19 -40 181 91 -114 -246 27 80 -35 -84 -156 -252 105 100 -50 -271 -269 -80 -22
6630b2J02r9j13l4j31M50j1j54k77M61p2l14M40j16j40j65K71j58%K77j44L0K3
$$ -22 80 -19 -132 -166 -297 153 142 -12 -289 172 100 -214 226 110 -30 -195 76 -82 -82 195 51 81 104
6653A04k53R9K71r7j68J86j1J59l79J30l11K76j58K64j56Q0R5j40n1l6q5L07J02
$$ 104 -149 -50 221 124 -44 142 131 290 -89 41 -270 6 -152 112 -44 36 131 -9 -60 -96 -181 126 228
6676B28j80L09k60k60R7J18l27L86j04j48n1K84j81L4J14n4k1q6J41L56n90J06
$$ 228 48 357 97 -163 -66 52 -275 111 7 -141 -192 92 -89 -55 59 5 -16 -102 39 395 -195 -89
6698h9j3r9n9L74j99K41j45k39M00r7j01M8m6K09L9j10j13J4n5k6jL26k62q9O3
$$ -89 -102 -201 -260 114 -85 156 11 -228 172 75 -26 22 -24 185 224 114 1 15 -40 -66 -67 259 -3 -92 -29
6723b9K72ol05k92K95R8j1r2L9j83J46J4p5Q0J66j57J42k35J66l1L2O8j46J19
$$ -29 243 237 -68 -360 -65 33 22 -70 -31 -214 -68 -54 -129 -49 117 -40 102 -133 33 2 34 102 -44 75
6747G5l89K58j66L88Nl89L80j54kK44j74j13q3OK44j50k39J80J02J16k31Q0J80
$$ 75 -314 -56 -222 166 171 -218 162 8 6 250 76 -37 -120 -114 130 -20 -259 -79 23 139 -92 -12 168
6770A68q1n4K67k48l51J52K19J8q9j82j6J12J57k54m6K65j85J54p8J50p6J44j03
$$ 168 87 33 300 52 -299 -147 72 90 1 -181 -197 -85 72 -182 -228 37 -148 6 -72 78 2 146 43
6793D3j04O3J51j89J3jJ09j36o3M5n5K0m7K21r5J10pM5K05l78J25n5j53K28l9
$$ 43 -61 2 153 -36 -23 -24 85 -51 -114 -69 -124 -104 -151 70 -25 85 78 123 328 -50 75 20 -133 95 56
6818E6pjJ45j15Lk92j5M26j64o6j1j79L27J24k32r4K06Lk13J18M7L7j42K88j50
$$ 56 49 48 193 78 81 -211 -226 200 36 -30 -41 -220 107 231 -1 -95 111 114 -99 19 66 103 -39 249 99
6843I9j75J34k72J53L98l36o1K73l02J23J14O4r3p14R13l56J7l58L72K34l87q0
$$ 99 -76 58 -214 -61 337 1 -60 213 -89 34 148 212 119 -595 318 -38 -21 -379 -7 227 -160 -240
6865b40K71o8Q6j3p7J82J32l31q9L30l79r7J62M46k40j15P5n8O5L9j98J95j92
$$ -240 31 -37 49 36 -41 141 273 -58 -147 183 -196 -293 -131 315 75 -40 35 -23 42 81 -117 78 -114
6888a14J94j12K20k22J25j3m17J61K21o9j63J22R4k08J02p4J90K25k06n0J4L6
$$ -114 80 -32 188 -34 91 78 -339 -178 43 -26 -189 -67 27 -181 -79 -153 37 262 56 6 20 56
6910E6K4o7r7J00j21J94l34K33n6k14L31K01m90K30j56J38J65m87L18j37L45l04
$$ 56 80 13 -84 16 -105 89 -245 -12 -68 -282 49 250 -240 -10 -166 -28 137 -350 -32 -169 176 -128
6932a28L1O8Q3o8N4R0k40K23l20K73j79M48m19P0k1R7R0r2r2r2L63l92K13L4l28
$$ -128 -97 -29 54 -14 40 130 -110 113 -207 66 -113 335 -84 -14 -35 62 152 60 -32 -124 239 -153 60 94 -234
6957b34N53n6k46L52l10q4M3j10j88L37r0k6K47j53j96J73K7q6n6j14K12P6j17
$$ -234 319 263 17 369 59 -25 18 -92 -280 57 -33 -59 188 35 -161 12 39 -47 -103 -217 -5 71 -46
6980d6K19k87J39K55r5l8j67M6Q8Rj82J09J3j71J30J24q3MJ50l00J73j12k89K32
$$ -46 173 -114 25 280 185 147 -20 26 114 123 -59 50 63 -108 22 146 63 67 217 -83 90 -22 -311 -79
7004g9J55Q4j71k08K2J61m8k44L93J41l95P7L60n10M38m62K94Rj3K01l05j75L08
$$ -79 76 160 -11 -219 -197 -36 -84 -328 65 206 -189 -112 248 -262 176 -286 8 17 4 205 -100 -275 33
7027C3o7n5K03j16K73m01J86l39M60k90P5N4j49P9L33l24M9k95J22K46j63L19
$$ 33 -34 -89 114 -2 271 -130 56 -283 177 -113 -38 16 -133 -54 279 -45 4 -291 -169 77 -86 233
7049B33k62l7q0K25K3q3J82j80j37L37k58K0R9M8o7q8L80m11n3R8J33o8k2l4J37
$$ 233 -29 -66 -146 79 102 19 201 21 -116 221 -37 -17 82 130 63 -25 355 -56 -109 -11 122 54 32 -2 135
7074A35m42L35J0m0l5J39m26J89M35M8l82j26J98jR4k99J26K86K0l63J24J7j03
$$ 135 -307 28 38 -2 -37 102 -324 -135 300 348 -34 -160 38 37 131 -168 -42 244 264 -99 25 42 -61
7097f1P5O9j41L21k9r7J9n2p6l8j31L13j62N6P6J84k09J15k68k44K57J14j31N2
$$ -61 14 83 -58 263 234 137 156 104 28 -10 -141 172 10 66 142 326 117 232 -36 -280 -23 91 -40 12
7121A2Q4j60K13j36j09J13K8M5m8K6q9m3r1J92K70m59j78J06K38K70l21l62M63
$$ 12 96 -64 149 13 -96 17 45 90 42 68 -21 -64 -155 37 307 -152 -330 -224 14 284 -37 -399 64
7144F4j22k09P0K47j86q4M86j26j41j21J46j8J96M2k40k2j64L7n5M57l51j28J45
$$ 64 -58 -267 -197 50 -136 -220 266 140 -1 -122 24 6 202 244 4 -18 -182 -145 -200 257 -94 -222 -77
7167g7J94J07k00j82P3j31O1M49l32K8k12L89l06J34J9j06R2K5p1O1N3K8j91J33
$$ -77 117 224 24 -158 -85 -216 -155 294 -38 -10 -222 167 -139 -5 14 -92 0 25 -46 15 68 96 -95 38
7191C8k42K04L19o81L21L68k29j8l26M05L17n03K60j78j38L98j07m32M59l23K47
$$ 38 -204 0 319 -362 -41 327 98 80 -246 159 476 -27 233 55 -83 315 208 -224 235 -88 159
7212A59k47j14K54P8j78L3l31J98J82j02J92jJ03L4j81j51K64NJ37l09PJ31j47
$$ 159 -88 -202 52 130 -48 -15 -346 -148 34 -68 124 123 226 260 79 -72 192 197 334 25 32 163 16
7235A6j34J57Q3O4l39Q2k26L39K6N3m36K72KL10m02J42O3l9R3q2o2J93l3k1l33
$$ 16 -118 39 122 186 -153 -71 -297 42 68 121 -315 -43 -41 269 -133 9 72 33 126 44 -18 175 142 121 -212
7260b12o7L63n3j46J48J99k45j5K4n2o3J94j57J83k47J18J2J02%j30R1j51kQ4
$$ -212 -279 84 31 -115 33 232 -13 -28 -4 -56 -119 75 -82 101 -146 -28 -16 86 86 -44 47 -104 -106 -22
7284b2j86J62J46M4N3k00L3R3l7l38K06J27m1n7K7k38K67o6n9L00l81j7L66q3
$$ -22 -208 -46 100 144 197 -3 30 123 86 -252 -46 81 40 -17 10 -228 39 -27 -86 214 -167 -184 182 99
7308I9m3j3L6l18K17M7k35K11K36l17K08l2l5J25J23l84M11j30j73Q3m66P35m74
$$ 99 56 43 79 -239 -22 25 -210 1 237 -80 128 96 61 186 309 -75 336 206 33 116 -350 385 -89
7331h9MK79j09Q4l13L89k44k3J34j46K02l59qK47l98M94j46m5oL66m60M63l73
$$ -89 -85 194 85 169 -144 245 1 -22 112 -34 168 -191 -199 48 -350 144 -2 -47 -53 313 -147 316 -57
7354e7l9L14m22J79J1l9Q7J97j89J21j52L65l19J5Mk88M7L47l82J04J68j56K83
$$ -57 -96 218 -204 -25 -14 -53 34 231 42 163 11 376 57 72 76 -212 -165 182 -200 -96 72 -84 199
7377A99k08J17q6J57l19l4M56n27M21j59j74m0L61k65J22K58m37L70m06L98j60
$$ 199 -9 108 22 179 -140 -174 282 -245 176 17 -157 -197 164 -101 21 279 -158 212 -194 204 44
7398D4j67J18k4Q1Ml04J89R4k01j15L17Q0j75k3K25j38k67K75j9j58K34k38K36
$$ 44 -123 -5 -29 52 56 -248 -59 35 -166 -281 36 116 -59 -82 143 5 -262 13 -6 -164 70 -168 68
7421F8N0j23jo5%k5j70L23j26K18P9j94oN8j59J05m4r6J22j15K44p5J35l24N7
$$ 68 118 -5 -6 -71 -71 -96 -266 57 -69 149 228 34 28 86 -73 32 -12 -108 14 -101 143 68 203 -121 -64
7446f4p0K0k73M39r9Q6k17L9L22j64Q3m1K53l42j76M52j52q1m7k8J0q8J98j13
$$ -64 -134 -114 -387 52 -47 39 -178 -139 183 19 102 61 314 -28 -204 248 96 15 -32 -60 -50 -138 60 -53
7470e3M08m89l0J22k9O2l09L03J19r1J81k57L7J16J8j04J14J49L8o35K02J83l6
$$ -53 355 -134 -164 -42 -71 -9 -318 -15 104 13 194 -63 -26 90 108 4 118 267 305 -330 -128 55 19
7493A9J2J0k9J71k68M21j04l28J66J00l8j21K9k24K30j23o3J35J68l51K94r3M1
$$ 19 31 41 12 183 -85 336 232 -96 70 170 132 11 40 -184 46 -77 -140 -5 163 -188 106 13 54
7516E4K2k78L55j86L4j83k9R3K30m5J25j60n0j28r1M14j28j55j39K82L21l48K6
$$ 54 76 -202 153 -33 1 -182 -211 -118 112 67 192 32 -18 -146 -237 177 49 -106 -245 37 358 10 36
7539C6j18N5j93K02j2J37k78K60p9J93k23J45j55J02j41J28L8J14M7q3j75N1J03
$$ 36 -82 -27 -220 -18 -30 107 -171 89 10 203 -20 125 -30 72 -69 59 97 211 258 175 0 51 154
7562A54k70j5K21Q3j10k23n1J47j1l3o0M25m45K40l1n9K03j96Q0q0M0J22k63N27
$$ 154 -116 -131 90 173 63 -160 -211 -64 -75 -108 -168 257 -188 52 21 -38 165 -31 49 -31 9 131 -132 395
7586C95m55l6NJ64P5M1l24K27l45K96J8k35J66M13k28l84M1K92k90K75K19l70
$$ 395 -60 -96 -91 73 148 189 -135 92 -253 43 61 -174 -8 405 177 -207 -166 126 -164 111 330 -40
7608d0J81j92N6rK41k53K71j13n59M07j71K20j30J5J58j33j22K95o8m5K7k36J72
$$ -40 141 -51 5 -4 237 -16 255 142 -417 -10 -181 39 -91 -76 82 -51 -173 122 54 9 36 -200 -28
7631b8j81j3K47j39J36n2J82n8k29n0K80q8j50L09k71K27j47J56l8M1j32j76M76
$$ -28 -209 -222 25 -114 22 -30 152 94 -135 -185 95 7 -143 166 -105 122 -25 131 93 134 2 -174 302
7654C02k53J40n1J1o4l20J45j31N11j14q9J74j93o9l42O54l69J38j14N8o4p5p4
$$ 302 49 189 138 149 85 -235 -90 -221 290 176 87 261 68 -1 -343 311 -58 80 -34 24 -40 -115 -189
7677a89J20K17m01K24K36k05j42J03j4j92K58J32Lk85R5k9rl7N6K04k6o1K04l39
$$ -189 -69 148 -253 -29 207 2 -140 -37 -51 -243 15 147 150 -135 -40 -69 -78 -115 -59 145 119 58 262 -77
7701g7m7L47j26m08M26J8k41K10L3j03k12J98J02K33k30k15K4J09J4N7q4J52J00
$$ -77 -124 223 97 -311 115 133 -108 102 135 32 -180 18 120 353 123 -92 -68 41 55 112 28 180 280
7724B80m46L39j4l28J03N0l7k1J29mo5k6O0j56k90L56J73L6k42N2K52k57R7m6
$$ 280 -166 173 159 -169 -66 -16 -53 -74 55 51 -14 -40 20 -136 -426 -70 103 139 -103 -51 201 -56 41 -5
7748eJ56j70p4J96j35p6J70N2l76O53l57o0j15J97j9j11n9jk24J77o3J54k96L48
$$ -5 151 -19 -93 103 -32 -108 62 114 -262 391 34 -26 -141 56 37 -74 -133 -134 -358 -181 -244 -90 -386 -38
7772c8p8p3O4K93J05l28j18J10J77k30L2N1k27K43k87K27P9j72J85O9j76J2K68
$$ -38 -116 -189 -125 168 273 -55 -173 -63 114 -116 -84 -33 -260 -17 -304 -77 2 -170 15 84 -92 -80 188
7795A88m51M74j58j07K62l67M07k82j66Q7M4P2oJ01l08K50o8m4L28l61J36M2j17
$$ 188 -263 211 53 -54 208 -159 248 -34 -200 -113 -69 3 -3 98 -210 40 -28 -72 256 -105 31 73 -44
7818d4J81r0l03K69J2Q6k71L03K14m56M15l98J7K8J31o6q3N2q3K30m3o7j8q0L02
$$ -44 137 47 -256 13 25 111 -160 143 357 -99 316 -82 -65 -37 94 28 -55 -3 -86 144 101 34 16 -64 238
7843B38k20J97j70J08K5l63l4L96n7l12K14R4J42m10L58l96K24J9k00M50k51J5
$$ 238 18 215 45 153 178 -185 -219 177 120 -192 22 116 258 -152 206 -190 34 53 -147 303 52 67
7865F7j6K86m86K05kj25j22n6K62j69r9j7M30l9K6k85J43k3M7j32K84k46j80Q7
$$ 67 51 337 -149 56 54 -71 -193 -249 13 -156 -255 -272 158 119 145 -140 3 -20 27 -105 179 -67 -247 -160
7889a60R4R5R1N4j18n5j86L19k03O0N5l39M22j53j9o1j8K32k35j26Q7J96r2J3
$$ -160 -66 29 120 174 56 1 -185 134 -69 -9 46 -293 129 -24 -43 -104 -122 110 -125 -251 -164 32 -60 -47
7913d7l3O4l5L2K68k48j19j34K49o3R5J09p2j47K12pj10l32N83j15l62J49Q4m2
$$ -47 -80 -16 -51 -19 249 1 -118 -252 -3 -66 29 138 66 -81 131 124 14 -318 265 150 -212 -63 21 -21
7937b1k9J92K50n04Q7j42O1J37k61J64K76J12l04jj1M1j27L0k2l2J69j01J58j25
$$ -21 -50 142 392 -112 -25 -167 -106 31 -230 -66 210 322 18 17 6 47 -80 -50 -72 -104 65 -36 122 -3
7961cj3J8o5J47J63k38L42k49m4j30l34L84l4K78j1r9K62j57j76k15L3J20R0r7
$$ -3 -16 2 -63 84 247 9 351 102 58 -72 -406 -22 -56 222 211 112 374 217 41 -174 -141 -21 69 -28
7985b8j51N8J24l21M91Ll02P6j29K8L0L02l06K56m18L09k0o4J68k5lj50P9j32
$$ -28 -179 -121 3 -318 173 176 -126 -50 -179 -151 -121 181 -125 131 -287 22 2 -62 106 81 78 -72 7 -125
8009a25J93O4M7l14o2L29k28N1L38l68J46o1l8kM4n3Q8r8qK34Q5l24lJ18j05J82
$$ -125 68 132 179 -135 -197 132 -96 -45 293 -75 71 10 -28 -30 14 -39 49 -49 -57 177 262 -62 -65 53 -52 130
8035A30j61j74K17Q5M4k46q6j12M68l0j42J38l21K50j70L37r3m32K28O7J93j45
$$ 130 -31 -205 12 97 141 -105 -191 -303 165 135 -7 131 -190 60 -110 227 134 -298 -70 -3 190 45
8057D5n34J96K39K0O2j32%q9L56r4k91O9N1J23m51M74K5j40J69k18J76n3J1l1
$$ 45 -489 -293 -54 -34 28 -104 -104 -193 163 69 -222 -153 -102 21 -430 44 69 -71 98 -120 56 3 14 -17
8081a7j29r1K22P4l97K18N0J53j02m5L9K55rl6m6j43j1m5J57Jm6n1l5j43j05J72
$$ -17 -146 -237 -15 59 -338 -120 -70 83 -19 -64 -25 230 221 185 139 -4 -15 -60 97 98 52 1 -34 -177 -282 -110
8107a10J44L8j24K9J56k86K23j30P6L58l36p6j61J10k1k1J53k60M16O9k7j1j09
$$ -110 34 72 -52 -23 133 -153 70 -60 16 374 38 -38 -199 -89 -110 -131 22 -238 178 247 220 209 100
8130A00K40n98K63m1LJ26k39N08k89j3P1j74Q7j69L06l33K56o3N8kl09L03k27
$$ 100 340 -258 5 -36 -33 93 -146 362 73 60 131 -43 44 -125 181 -152 104 41 99 97 -212 91 -136
8153a36J6J30k74K69N5j77m2K17j51J30j92J64N1R8j84Ro3j8K42m6j98K10j76
$$ -136 -120 10 -264 5 60 -117 -159 58 -93 37 -155 9 60 158 -26 -17 -80 -98 144 98 -100 110 -66
8176f6P0l31L28k44%M51j02k82K48k51N8N5k5J51j02
$$ -66 4 -327 1 -243 -243 208 106 -176 72 -179 -121 -66 -91 60 -42
8191d2
$$ Imaginary data points
##PAGE= N=2
##DATA TABLE= (X++(I..I)), XYDATA
0@%%%%%%%%%kJ0j6J6j6K4l2L2m0M8n6O6p4Q8j04J20j36J53j75J99k23K52k85L19
$$ 0 0 0 0 0 0 0 0 0 0 -2 8 -8 8 -8 16 -16 16 -24 24 -32 34 -40 48 -56 64 -72 81 -94 105 -118 134 -151 168
33A68l56L96m40M90n47O09o75P47q27R17j015J122j243J380j536J715j921K165
$$ 168 -188 208 -232 258 -289 320 -355 392 -435 482 -533 589 -654 726 -810 905 -1016 1149
51A149k459K813l255L831m607N722p468J0613j8040O6283N8060j18686k9267N9196
$$ 1149 -1310 1503 -1752 2079 -2528 3194 -4274 6339 -11701 54582 112642 -6044 -35311 23885
65B3885M8059m5809l1006K5095K8616k5199j6551J7494J2132k4844p356K4864
$$ 23885 71944 26135 -4871 20224 48840 23641 7090 24584 36716 11872 4516 29380
77B9380O059l7140j4368L5772K4969l3636l2337K2945L9199j1872m2830r806K8864
$$ 29380 35439 -1701 -16069 19703 44672 11036 -21301 1644 40843 28971 -13859 -23665 5199
90E199J3982j5669j1805Q288M940n615J194N813j1149j3811J2616K3282p855k7960
$$ 5199 19181 3512 -8293 -5 4935 -680 514 6327 -4822 -18633 -6017 17265 9410 -18550
104a8550l00K9533J0416k1594j3789J5275J1483j2135p734J2614N398j4192n105
$$ -18550 -18850 10683 21099 -495 -14284 991 12474 339 -7395 5219 10617 -3575 -8680
117h680J6056Q718j4248j0095R627O680r699q370J0545J1309p234j4140P50J2593
$$ -8680 7376 16094 1846 -8249 1378 8058 -1641 -10011 534 11843 4609 -9531 -8781 3812
131C812K300r540m960N322K972m159k825K676K13n881l610R284J0262q161j8113
$$ 3812 6112 -3428 -8388 -3066 -94 -4253 -7078 -4402 -4189 -10070 -13680 -4396 5866 -2295 -20408
146b0408J153J7378M730j4561n852J3601P908j0235q842Q009J0116l998q974L323
$$ -20408 -19255 -1877 2853 -11708 -17560 -3959 3949 -6286 -15128 -7119 2997 -1001 -9975 -6652
160f652P094j867l824L107L277m708j655R118N106q649q760M905Q855j375o250
$$ -6652 442 -1425 -5249 -2142 1135 -3573 -5228 3890 8996 347 -8413 -3508 5347 3972 -2278
175b278K954Q651p32j0647l113R484N244n438l915L796Q0m988R78Q489J51r264
$$ -2278 676 9327 8595 -2052 -5165 4319 9563 4125 210 4006 4086 -902 76 8565 8716 -548
191e48k445R300K966j1794o259J1457R403r262r293R892J0596r762j2894O226
$$ -548 -2993 6307 9273 -2521 -8780 2677 12080 2818 -6475 3417 14013 4251 -8643 -2417
205b417J2732l040r331K981O990m957p221O736R872n760j1806L297J1799l799
$$ -2417 10315 7275 -2056 925 7915 2958 -4263 2473 12345 6585 -5221 -1924 9875 6076
219F076j1804L106J3567j271j2942q03J1306K251r643m435P476L213o721k856
$$ 6076 -5728 -2622 10945 9674 -3268 -4071 7235 9486 -157 -4592 2884 6097 -624 -3480
233c480P909L140q982n429P030O618n998p111M191M819m667m718M795O222m006
$$ -3480 4429 7569 -1413 -6842 188 6806 808 -6303 -2112 2707 -1960 -6678 -1883 4339 333
248C33o863J883O735j739p621J261P009q99p207J662Q561n00q496k299O837L409
$$ 333 -6530 -4647 2088 349 -7272 -6011 998 99 -7108 -5446 3115 2615 -5881 -8180 -1343 2066
264B066m972l702L206K709k884p06M633K005n053l744N181L409n016l705M137
$$ 2066 -2906 -6608 -3402 -693 -3577 -4283 350 2355 -2698 -6442 -1261 2148 -2868 -6573 -2436
279b436N386j737m771O26N065Q03n445l225M410L323k778k181K977K186k791j228
$$ -2436 2950 1213 -3558 -2932 2133 2936 -2509 -5734 -1324 1999 -779 -2960 17 2203 -588 -1816
295a816L410K712l962m079K558M493j571m361K636P096j618p213J26N951L89n671
$$ -1816 1594 4306 344 -3735 -1177 3316 1745 -2616 20 7116 5498 -1715 -1589 4362 4751 -920
311i20j229N546J225l565j40M691N04o172j948O104L250n827n133N454N138l408
$$ -920 -2149 3397 4622 1057 917 5608 6112 -60 -2008 4096 7346 1519 -3614 1840 6978 3570
327C570m881M223M969m026o422J592O132j192n430J238N815q90o661N26P444q95
$$ 3570 -1311 2912 7881 3855 -2567 -975 5157 3965 -1465 -227 5588 4698 -1963 -1437 6007 5112
343E112q193j412P935J879o721k403N852L247n269l282M892L216n870l935M718
$$ 5112 -3081 -4493 3442 5321 -1400 -3803 2049 5296 27 -3255 1637 4853 -1017 -4952 -234
358b34M103m807l743N698M799o264n547M728N980m185p012L243O630j642o427
$$ -234 3869 -938 -4681 1017 5816 -448 -5995 -1267 4713 528 -6484 -3241 3389 1747 -4680
373d680J075P055q16o888l18O687q5o650n28O133J403n034j638N212K196n502
$$ -4680 -3605 3450 2634 -4254 -4572 2115 2030 -4620 -5148 985 2388 -2646 -4284 928 3124 -2378
389b378l026M294L187m240l717M329L780l352l494L943L468l905l963K880L495
$$ -2378 -5404 -1110 2077 -2163 -5880 -1551 2229 -1123 -4617 -674 2794 -1111 -5074 -2194 1301
404A301j942m141J594N155p08m564L40M978k13n731n95N085J060l943j171M094
$$ 1301 -641 -4782 -3188 1967 1259 -3305 -2965 2013 1800 -3931 -4526 559 1619 -2324 -3495 599
420E99K378l177k718K862K520k092l414J726L687j274k562J415L431j166l233
$$ 599 2977 -200 -2918 -56 2464 372 -3042 -1316 2371 1097 -1465 -50 3381 2215 -1018
435a018P00K441n62k306N1K724R59k608n35K792P56l123j805L586J141l490j872
$$ -1018 -318 2123 1561 -745 -694 2030 2989 381 -154 2638 3394 271 -1534 2052 3193 -297 -2169
452b169L565K983k480l138K085L305j839m119N86L859M29m381k8M595O74l924
$$ -2169 1396 4379 1899 -1239 846 4151 2312 -1807 -1221 2638 3067 -1314 -1342 3253 3927 3
468Cj457L922P54l051j653K684K190k829k084L122L078k868k690K257K628l244
$$ 3 -1454 2468 3222 171 -1482 1202 3392 563 -1521 1601 4679 1811 -879 1378 4006 762
484G62l153K740L645k391k804K274L078j784m137Q58M025j158m455L67M658L78
$$ 762 -2391 349 3994 1603 -1201 1073 4151 2367 -1770 -912 3113 1955 -2500 -2133 2525 2903
500B903m900n15M486O96m739j768L609J409l964j671L540K257k389k876K076K610
$$ 2903 -1997 -2512 1974 2670 -2069 -3837 -228 1181 -2783 -4454 -914 1343 -1046 -3922 -1846 764
516G64k654l068K196L384k533k694K501L385k395k309J469K957j281l227J319
$$ 764 -1890 -4958 -2762 622 -1911 -4605 -2104 1281 -1114 -3423 -1954 1003 -278 -3505 -2186
531b186L289q26l678J293M718n71m071N73L507j99m044j66L738J447k502j630
$$ -2186 1103 277 -3401 -2108 2610 2039 -2032 -1459 2048 1849 -2195 -2361 1377 2824 322 -1308
547a308K023J521j748j680J273J356j715j492J283J006j231o07O62J059j034j524
$$ -1308 715 2236 488 -1192 81 1437 -278 -1770 -487 519 -712 -1319 -657 402 -632 -2156
563b156N54J210o17k295P49K301L12j693p71K010l2k387j63K486Q89j762r06J704
$$ -2156 -1602 -392 -1009 -3304 -2555 -254 58 -1635 -2406 -396 -428 -2815 -2978 -492 397 -1365 -2271 -567
581e67J466q43j080J292K151j315k270R30K476k23j515O65J980k14r09m41Q88
$$ -567 899 56 -1024 268 2419 1104 -1166 -236 2240 2017 502 1167 3147 2933 2024 1583 2471
598B471O17j019p19P51J648j135j131P40J213j114j582J192P47j342k183R51J498
$$ 2471 3088 2069 1350 2101 3749 2614 1483 2223 3436 2322 740 1932 2679 1337 -846 105 1603
615A603l65k091Q53J924j133k778k40K999k81l448K19L527k40l426l94L410J199
$$ 1603 1238 -853 0 1924 791 -1987 -2227 772 491 -2957 -2738 789 549 -2877 -3271 139 1338
632A338k738j779J971J234j275j257K265J443j814r84J971J087j996j108J927
$$ 1338 -1400 -3179 -1208 26 -1249 -2506 -241 1202 -612 -1596 375 1462 -534 -1642 285
647B85J655k381j311J788K349n97k416Q2K152l2k362KK106K7k374j74K375M77
$$ 285 1940 -441 -1752 36 2385 1788 -628 -546 1606 1574 -788 -786 1320 1347 -1027 -1201 1174 1651
665A651k210k26J515l8k181q00K435J477k788j808K664K134k153j808J423J208
$$ 1651 -559 -785 730 692 -1489 -2289 146 1623 -1165 -2973 -309 1825 -328 -2136 -713 495
681D95j828r10J889J837j245j452Q41J343p55m56J319J146j571j651J690J709
$$ 495 -1333 -2243 -354 1483 238 -1214 -373 970 215 -241 1078 2224 653 -998 692 2401
697B401j88q09O00R32r90j118q8J628P03j129q29R29J448q12j133nJ124n37j214
$$ 2401 2213 1404 2004 2936 1946 828 740 2368 3071 1942 1113 2042 3490 2678 1545 1540 2664 2127 913
716I13J01J360o02j575P3J808j7j136o43J056n92k371j33K951P15k194j474K317
$$ 913 1014 2374 1772 197 270 2078 2061 925 282 1338 746 -1625 -1758 1193 1908 -286 -1760 557
734E57O00j575j018J191J020j027j412N67J625j56j181N80Q39l7j783K54J404
$$ 557 1157 -418 -1436 -245 775 -252 -1664 -1097 528 372 -809 -229 610 573 -1210 -956 448
751D48m49n65j08J261K0r19o48J880R22k566j304K010J637j865j696K174J787
$$ 448 -1 -566 -674 587 607 -312 -960 920 1842 -724 -2028 -18 1619 -246 -1942 232 2019
768B019j836k431J334K630j280k491O31J894l84k013O44K587r46k505J151K151
$$ 2019 183 -2248 -914 1716 436 -2055 -1424 470 86 -1927 -1283 1304 358 -2147 -996 1155
784A155p97k485P30K573o79j665K30K121K18j971p83J386R04q55mP48J32j891
$$ 1155 358 -2127 -1397 1176 497 -1168 -938 1183 1401 -570 -1353 33 937 82 78 826 958 -933
802i33K94K313N98j667j112P05R79q39r93J477J434q19k360J23K066O66k186m61
$$ -933 -639 1674 2272 605 -507 198 1177 338 -655 822 2256 1437 -923 -800 1266 1932 -254 -715
820g15J291j30j491L25J720J15j510o62J239R8o83p19Q82K04j324J3J700N16j217
$$ -715 576 446 -1045 -720 1000 1115 -395 -1057 182 280 -403 -1122 -240 -36 -1360 -1347 353 869 -348
839c48m81M41j21p74M76J213K18j082j241N54J925K55r14q54M57J83q2k45N16
$$ -348 -829 -388 -509 -1283 -807 406 624 -458 -1699 -1145 780 1035 121 -733 -276 -93 -175 -420 96
858I6M99q9r33J67P32K87o85l95Q22l35o20K27J690n94j623K88J102M79j334p4
$$ 96 595 506 -427 -260 472 759 74 -321 501 166 -454 -227 1463 869 -754 -466 636 1115 -219 -293
878b93L76J83p30m63J041J91r80K48J091l98j481j67J501M30j519n08J102J008
$$ -293 83 266 -464 -927 114 305 -675 -427 664 266 -1215 -1382 119 549 -970 -1478 -376 632
896F32r06j116M71Q65o5j172j6J222r5j122M8J164J3p75j01P22L38j242j15L66
$$ 632 -274 -1390 -919 -54 -119 -1291 -1307 -85 -180 -1302 -1254 -90 -77 -852 -953 -231 107 -1135 -1250 -884
916h84O72m53k15R65K56j451n92J329O27j498JJ387L99j670m85J550J539j705
$$ -884 -212 -665 -880 85 341 -1110 -1702 -373 254 -1244 -1243 144 543 -1127 -1612 -62 1477 -228
934b28j592P64J672m57j497P31J427m79j360O29J754q40j395L18Q56r3m55M56
$$ -228 -1820 -1056 616 159 -1338 -607 820 341 -1019 -390 1364 524 -871 -553 303 210 -245 211
952B11L89J82o52l77P95N10n34m64Q98p9n46KP64L60j242j39O81N65p74q08M05
$$ 211 600 782 130 -247 548 1058 524 60 958 879 333 335 1099 1459 217 78 759 1324 550 -258 147
973A47J476l30j310K65J650k89j598J85J196j31n73m53O86M07p02n25J319J06
$$ 147 1623 1293 -17 248 1898 1609 11 196 1392 1261 688 235 921 1328 626 101 1420 1526
991A526o98q64N34M95l43k23L64L46r36J33O12l37n49k49M48L36o44j89N34O05
$$ 1526 828 -36 498 993 650 427 791 1137 201 334 946 609 60 -189 259 595 -49 -238 296 901
1011I01m33p95k14J284j35j082k89Q17L37m45n11O96N94r49o88L26Q14m71j057
$$ 901 468 -327 -541 743 608 -474 -763 54 391 -54 -565 131 725 -224 -912 -586 228 -243 -1300
1030a300M72P45l16o39N46L60n79l79j02M17K71o71O0L17j94k08P6P06L0j210
$$ -1300 -828 -83 -399 -1038 -492 -132 -711 -1090 -1192 -775 -504 -1175 -1115 -798 -992 -1200 -1124 -418 -388 -1598
1050a598j25R26J96o19k66P00J31j03p02N97P77o15q65M84J041j19j020L14J166
$$ -1598 -1723 -797 -601 -1220 -1486 -786 -655 -758 -1460 -863 -86 -701 -1566 -1082 -41 -160 -1180 -866 300
1069C00M9j004J67R11j15o21l84Q68M98o43m60Q08O17m45m97L19M88n57m30O13
$$ 300 349 -655 -488 423 308 -313 -697 171 669 26 -434 374 991 546 49 368 856 299 -131 482
1089D82L74n36j22J71J004n13q42M44Q64m32j056J35J053j96m80k18J115k91p75
$$ 482 856 320 198 369 1373 860 18 462 1326 894 -162 -27 1026 830 350 132 1247 956 181
1108A81O2N66M18q05j70N32N63q25l58Q61L24l10r58R53N71p18o48P43P14m34
$$ 181 243 809 1227 422 252 784 1347 522 164 1025 1349 1039 81 1034 1605 887 239 982 1696 1262
1128A262n47J93N75m81p73M05M32j7j128L26P20m07o75J81O32k64r40J34L05L60
$$ 1262 715 908 1483 1002 229 634 1066 1049 -79 247 967 560 -115 66 698 434 -506 -372 -67 293
1148B93n29q14O76L94p29p82Q79j19l27p99O89O22m67p16M72M93j91m45j53Q09
$$ 293 -236 -1050 -374 20 -709 -1491 -612 -731 -1058 -1857 -1168 -546 -1013 -1729 -1257 -764 -955 -1400 -1553 -744
1168g44J95q65J65O24Q6n74N8O05k08k23r3M12J90N3l20R6O22j00j51j97M48m39
$$ -744 -549 -1414 -1249 -625 -539 -1113 -1055 -450 -658 -881 -974 -562 -372 -319 -639 -543 79 -21 -172 -369 79 -360
1190c60k52O06L52n78R8R1J33j01m16J90j85M24n34l21P64J82k11l85P14P1p53
$$ -360 -612 -6 346 -232 -134 -43 90 -11 -427 -237 -422 2 -532 -853 -89 93 -118 -503 211 282 -471
1211d71k77O80M20p02N5R6M63K17m24q6Q13n48k62K48M70p8l44N66K5O9o47M80
$$ -471 -748 -68 352 -350 -295 -199 264 481 57 -29 784 236 -26 222 692 614 270 836 861 930 283 763
1233G63O47n66K59l67O40Q6q86O3O94K13p77k28Q23j48o40j72J10N79k07o48R8
$$ 763 1410 844 1103 736 1376 1462 576 639 1333 1546 769 541 1364 1216 576 404 514 1093 886 238 336
1254C36R82p72n47K83J76l79j47O1J48o1o07K52K04k6k09J02J31j40j76m8L06
$$ 336 1318 546 -1 282 458 79 -68 -7 141 80 -527 -275 -71 -97 -306 -204 -73 -213 -389 -437 -131
1275a31N5l03m13P12K78q58j50Q81k05n02k12M99N22l37m80%R48l59o83K18N14
$$ -131 -76 -379 -792 -80 198 -660 -810 71 -134 -636 -848 -349 173 -164 -644 -644 304 -55 -738 -520 -6
1296fl75n28k12P83J32j64j72J01k94M9l25J88J07M3l86N6K59j86RJ77K4n25K30
$$ -6 -381 -909 -1121 -338 -206 -370 -542 -441 -735 -686 -1011 -823 -716 -673 -1059 -1003 -744 -930 -921 -744 -720 -1245 -1015
1319a015J35L07n7ll80Q22J34p83q6J293P7p25m99R23O77n27o79N63R88n10o88
$$ -1015 -880 -573 -630 -633 -1013 -191 -57 -840 -926 367 444 -281 -780 143 820 293 -386 177 1165 655 -33
1340c3K55J040o45j002N85Q04r8m30M83K28m81o48O76L04j66l66N1N64k77o40
$$ -33 222 1262 617 -385 200 1004 906 476 959 1187 706 58 734 1038 872 506 557 1121 844 204
1360B04M33O07l06q84l67J157L04j176O5R21O3j193M7Q08N19q58k08l0Q22p24
$$ 204 637 1244 938 54 -313 844 1148 -28 37 958 1021 -172 -125 683 1202 344 136 106 928 204
1380B04m55N07N23l58m11j29O47j5n45J89K74o11N5L97M13n02p30L39M69j37p10
$$ 204 -251 256 779 421 10 -119 528 513 -32 157 431 -180 -125 272 685 183 -547 -208 261 124 -586
1401e86M35N68o8r58j8P41j1p26L02L24k04l05j49O99j09n62k14J07N40k56P1
$$ -586 -151 417 349 -609 -627 114 103 -623 -321 3 -201 -506 -655 44 -65 -627 -841 -734 -194 -450 -379
1422c79l25L37n98J50M68k64K04K22l64k14O7L08j01Q1Q0k67o9M9M00j59Ol03
$$ -379 -704 -367 -965 -815 -347 -611 -407 -185 -549 -763 -696 -388 -489 -408 -328 -595 -664 -615 -215 -374 -368 -671
1444f71L21k61K87j66J74J02n49M82O4P03q17P0L37k20k44R9kN95p6m40m02Q59
$$ -671 -350 -611 -324 -490 -316 -214 -763 -281 -217 486 -331 -261 76 -144 -388 -289 -291 304 228 -212 -614 245
1466B45K28n33J39K25L9l47k55P51k56K52k96j17J51k40J74M45R8p48j64R63J17
$$ 245 473 -60 79 304 343 -4 -259 492 236 488 192 75 226 -14 160 605 703 -45 -209 754 871
1487H71m41m39N42M02j008m3Q43K08n83l29M77J53k70m22N54O63r44n34N56J029
$$ 871 430 -9 533 935 -73 -116 727 935 352 23 500 653 383 -39 515 1178 234 -300 256 1285
1507A285r36m40N54L89n22l61L79J88k37l83N75K44n42J61j56N51m87o64K32O31
$$ 1285 349 -91 463 852 330 -31 348 536 299 -84 491 735 193 354 198 749 262 -402 -170 461
1527D61m31r2p1O19n09n0j5K05K90m20j98o0M96m38m10M74R6k3p99O09M79m93
$$ 461 30 -62 -133 486 -23 -73 -88 117 407 -13 -211 -271 225 -213 -623 -149 -53 -76 -875 -266 213 -280
1549b80k35N6J03m20q0M91L14n21j01j10J102o71l90K48n2n8l57L45M67k43kJ68
$$ -280 -515 -459 -356 -776 -856 -365 -51 -572 -673 -783 319 -352 -742 -494 -546 -604 -961 -616 -149 -392 -394 -226
1571b26k49r9K29Q7k41L53l72l25N28J05j84j62O7J21K62K07l44P3J17m4m07K06
$$ -226 -475 -574 -345 -258 -499 -146 -518 -843 -315 -210 -394 -556 -489 -368 -106 101 -243 -170 -53 -97 -504 -298
1593b98M23m19N7K27K99l52J75L14J1l75k50R6P51k16n02N41L7P8k69j20M22L47
$$ -298 125 -294 -237 -10 289 -63 112 426 437 62 -188 -92 659 443 -59 482 519 597 328 208 630 977
1615I77n07J19J87l16M4j14K75K91l31k72j70N00mq82P09Q4j0n46K90K75m85k77
$$ 977 470 589 776 460 504 390 665 956 625 353 183 683 679 -203 506 590 580 34 324 599 114 -163
1637a63M93J25k75k52j6O15k13o99J31Q75l31m47j3N76j15k43k63L11J83k55k03
$$ -163 330 455 180 -72 -88 527 314 -385 -254 621 290 -157 -170 406 291 48 -215 96 279 24 -179
1658a79O3L81l48J44j6J67l59j15K01L69m50j95L37k02j14mL07n2l77m15L82K95
$$ -179 -116 265 -83 61 45 212 -147 -262 -61 308 -142 -337 0 -202 -316 -320 -13 -65 -442 -857 -475 -180
1680a80j60k64l42M94J33j40n50O20L7N3n26N8jM53m26J20K38J95n56K50M99m58
$$ -180 -340 -604 -946 -452 -319 -459 -1009 -389 -352 -299 -825 -767 -768 -315 -741 -621 -383 -188 -744 -494 5 -453
1702d53k94N14J88k39J69j5j9P6J3j70N18j60J05k28N59m0n78J52M16l9m41n6
$$ -453 -747 -233 -45 -284 -115 -130 -149 -73 -60 -230 288 128 233 5 564 524 -54 98 514 475 34 -22
1724b2M40K53j82j66r7L71j94l30j56L27L22m67j00K30L52m23K6j42K97k33l01
$$ -22 418 671 489 323 226 597 403 73 -83 244 566 99 -1 229 581 158 184 42 339 106 -195
1745a95K67J74k75j00l7M88l79O7P1N37n23j31K26N34p28P1N97o7l26l18M85K06
$$ -195 72 246 -29 -129 -166 322 -57 10 81 618 95 -36 190 724 -4 67 664 597 271 -47 438 644
1767F44j08m72pO39j42k51p5M56l00l48m1N9J61j14j0q9K88m06Q6l15M29k03j18
$$ 644 536 64 57 696 554 303 228 684 384 36 -5 54 215 101 91 2 290 -116 -30 -345 84 -119 -237
1790b37K48r9k97j49M21P0l91m88N54M0k01j66O0J32N22p84Q1L09J46k83M0M8
$$ -237 11 -88 -385 -534 -113 -43 -434 -922 -368 -328 -529 -695 -635 -503 19 -765 -684 -375 -229 -512 -472 -424
1812d24K32l58J82k7J96L80o36J87M62k71l23M61J22K87l48j73L46K1m12J19k1
$$ -424 -192 -550 -368 -395 -199 181 -455 -268 194 -77 -400 61 183 470 122 -51 295 316 -96 23 2
1833BJ45j1j25J2l9k88J14J67nk58j08O31j68n58m4O88m31R8m03K88J20l4j94
$$ 2 147 136 11 23 -16 -304 -190 -23 -28 -286 -394 237 69 -489 -533 155 -276 -178 -581 -293 -173 -207 -401
1856d01j77M83J75m59K07K19L20j97O2q7M19l48l08K31j72K93k8L77l93K66l23
$$ -401 -578 -95 80 -379 -172 47 367 170 232 145 564 216 -92 139 -33 260 232 609 216 482 159
1877A59K84l9p9J17j3p6P2p6j3K73j67j11j26L01J40k53o7J61o6l59j51L80P6
$$ 159 443 404 325 442 429 353 425 349 336 609 442 331 205 506 646 393 326 487 421 62 -89 291 367
1900C67j48j53n1L72l96J1j45K22k27K09j31Q2j15J34p6j03R5j26M27l00k32j67
$$ 367 219 66 15 387 -9 2 -143 79 -148 61 -70 12 -103 31 -45 -148 -53 -179 248 -52 -284 -451
1922d51M12K63m6m13j69N96P9o54N15J27p6o54L33K08j89l16K57J8O0NJ7J3j63
$$ -451 -39 224 178 -235 -404 192 271 -383 132 259 183 -471 -138 70 -119 -435 -178 -160 -100 -95 -78 -65 -228
1945b28l29K72j01K15k20L2j70N46j73k29P2l06M82l59L32Q3Q9n04L1k7K71m70
$$ -228 -557 -285 -386 -171 -391 -359 -529 17 -156 -385 -313 -619 -137 -496 -164 -81 8 -496 -465 -492 -221 -691
1967f91N15l70K50L3j26L19Op5M4p0J49l44q0N07k60K09l6K14L7j91j01J17j24
$$ -691 -176 -546 -296 -263 -389 -70 -64 -139 -95 -165 -16 -360 -440 67 -193 16 -20 194 231 40 -61 56 -68
1990f8j6K16j62P1M54m83j80M46J66j19j87K61Lj21j40J52K04K3m49o4M56O4k55
$$ -68 -84 132 -30 41 495 12 -168 278 444 325 138 399 402 281 141 293 497 520 71 7 463 527 272
2013B72l84M32J83k14l68N63J51j64j16j24J97l8k08Q5K50k52k22O2N68n17j88
$$ 272 -112 320 503 289 -79 484 635 471 355 231 428 390 182 267 517 265 43 105 673 156 -32
2034c2j2L56j65J12j12K38o02p9K21L44K5p49L17L81j81j30l08O90k23j07l36
$$ -32 -44 312 147 259 147 385 -217 -296 -75 269 294 -455 -138 243 62 -68 -376 314 91 -16 -352
2055c52K89K07l46j39K27R8k65J8J48R9l34j16K98j51l47L50M30Po70j20P99j1
$$ -352 -63 144 -202 -341 -114 -16 -281 -263 -115 -16 -350 -466 -168 -319 -666 -316 114 121 -549 -669 130 119
2077A19n19k94O82J05m55n1k28O07n9n17J91N82j75m27J46Q3O3m98M45m2L23n38
$$ 119 -400 -694 -12 93 -362 -413 -641 -34 -93 -610 -419 163 -12 -439 -293 -210 -147 -645 -200 -242 81 -457
2099d57L24O8k88L60j55P3j20j25K80M4j47j3J17Q5J62k22n6M35l60p4K47j62
$$ -457 -133 -65 -353 7 -148 -75 -195 -320 -40 4 -143 -156 -39 46 208 -14 -70 365 5 -69 178 16
2121A6K25oj64P5R9j38k28K06mR5M27j20j92j89P81l65l73jK49R0J52l58j66M28
$$ 16 241 235 71 146 245 107 -121 85 81 176 603 483 291 102 883 518 145 144 393 483 635 277 111 539
2145E39l97J10j76L51k01k10M21J62l02k4k5R8l43O93l62j70Q3j81K64k11J45
$$ 539 142 252 76 427 226 16 437 599 297 273 248 346 3 696 334 164 247 66 330 119 264
2166B64k88J83k68j9J49n4M90o31k85L32N26j38j93J6j51L2m94N26J24j82r9r9
$$ 264 -24 159 -109 -128 21 -33 457 -174 -459 -127 399 261 68 84 -67 -35 -529 -3 121 -61 -160 -259
2188b59J56K30o40K41L60l93k56K91O37n09k25m0O07m13j03M0N48l44l66J17M83
$$ -259 -103 127 -513 -272 88 -305 -561 -270 367 -142 -367 -407 200 -213 -316 -276 272 -72 -438 -321 162
2209A62l59l02N0N10m43n7l17M12J38j00l33L03J41k69MM12k31k28J78K35k3k35
$$ 162 -197 -499 -449 61 -382 -439 -756 -344 -206 -306 -639 -336 -195 -464 -460 -48 -279 -507 -329 -94 -117 -352
2231c52K12q2L99n66K41N12p6l98k7N5K65m54J29J85L03k14l66M58K08k4k08J67
$$ -352 -140 -222 177 -389 -148 364 288 -110 -137 -82 183 -271 -142 43 346 132 -234 224 432 408 200 367
2253C67K09l33k83L96l49K87J0j26K0J09m6Q%K26l50r6K39kj77j04M51j42l81
$$ 367 576 243 -40 356 7 294 304 178 198 307 261 269 269 495 145 49 288 286 109 5 456 314 -67
2276f7QL96l54J80K5j74J37p9R0N4J61l60K64p8j06JM05l21l91J33J97J69m60
$$ -67 -59 337 -17 163 188 14 151 72 162 216 377 17 281 203 97 98 503 182 -209 -76 121 290 -170
2299a70M10k3J8N0k08J77J57k06k96J75K9l12O3J38J12j16l19K31p4M4L7J94o7
$$ -170 240 217 235 285 77 254 411 205 -91 84 113 -199 -136 2 114 -2 -321 -90 -164 -120 -83 111 44
2322D4j81k24J4N7k8L3K33k86j60j70J96L31n44M38m8K22j70J41j86J87j49J04
$$ 44 -137 -361 -347 -290 -318 -285 -52 -338 -498 -668 -472 -141 -685 -247 -295 -73 -243 -102 -288 -101 -250 -146
2344a46k09J13J64n20K27J15J13o8JK66j08k67K57l8L3r4J04L55k97KK43j92m5
$$ -146 -355 -242 -78 -598 -371 -256 -143 -211 -210 56 -52 -319 -62 -100 -67 -161 -57 298 1 3 246 54 9
2367Ip4Nj42L66m06J96O9j88oK83k44K00O3m45K75N3l5K52k55N9J05m23M94j58
$$ 9 -65 -60 -202 164 -242 -46 23 -165 -171 112 -132 68 131 -314 -39 14 -21 231 -24 35 140 -283 211 53
2391E3j10m9R4J24K72k11J3o0K97k34J15J45n4m4P7kj97R5n7K11j30J44j27j12
$$ 53 -57 -106 -12 112 384 173 186 126 423 189 304 449 395 351 428 426 229 324 267 478 348 492 365 253
2415B53j93K74L0q5j11K84j90J3k67j30N01j26m30L1K28J01j37L8J62m13J67J08
$$ 253 60 334 364 279 168 452 262 275 8 -122 379 253 -177 -146 82 183 46 84 246 -167 0 108
2437A08k58o8J00K7M05k81k39K50k46k6kj51J51K2K7R5l7k50j91O12k65J37R7
$$ 108 -150 -218 -118 -91 314 33 -206 44 -202 -228 -230 -381 -230 -208 -181 -86 -123 -373 -564 48 -217 -80 17
2460A7p6q8k56K80k50K95k08J76PJ70j83J94l18q4k62K91P5K76l30J70k53K51
$$ 17 -59 -147 -403 -123 -373 -78 -286 -110 -103 67 -116 78 -240 -324 -586 -295 -220 56 -274 -104 -357 -106
2482a06j52J17J00m85K29%l4K40L25m22K04L8k18j89L13k72J80J34j25p8J85m9
$$ -106 -258 -141 -41 -526 -297 -297 -331 -91 234 -188 16 54 -164 -353 -40 -312 -132 2 -123 -201 -16 -65
2504f5n9J98K08Q6n95M01K60m48J2K30j69L9j06K25P2Nk8J69k51M3j95K20O1K14
$$ -65 -124 74 282 368 -227 174 434 -14 -2 228 59 98 -8 217 289 294 266 435 184 227 32 252 313 527
2528E27m39J74p1O8p7l33O72l81M80m84L0l02N05J46n05K32l4K0j50K65k66k01
$$ 527 88 262 191 259 182 -151 521 140 620 136 166 -136 369 515 10 242 208 228 78 343 77 -124
2550a24M21j07n5m53Q10r1o0l99K3Q3j07M0j35J49J61P8k17o5J26j59k47J15o
$$ -124 297 190 135 -318 492 401 341 -58 -35 48 -59 -19 -154 -5 156 234 17 -48 78 -81 -328 -213 -219
2573b19M67m39j11J99Q8l7q6Q3j69l6J18K04j16l46K54j03K08k03k6Jj95J33N11
$$ -219 248 -191 -302 -103 -15 -52 -138 -55 -224 -260 -142 62 -54 -400 -146 -249 -41 -244 -270 -269 -464 -331 180
2596A80m45M30j88m15J49N6k4j20M80l52l8J32k4j31L42m41L29q1R2j63N1J24
$$ 180 -265 165 -23 -438 -289 -233 -257 -377 103 -249 -287 -155 -179 -310 32 -409 -80 -161 -69 -232 -181 -57
2618e7J25k14J23R2k6j76R3qk32K26j18K47q3K18K5l20M3K36l20J52L26k89J12
$$ -57 68 -146 -23 69 43 -133 -40 -48 -280 -54 -172 75 -8 210 235 -85 -42 194 -126 26 352 63 175
2641A75j8K25n12L83j82mL4k03nM19j82L12m50R9K67j77j02K6k46L18l97N01k15
$$ 175 157 382 -130 253 71 67 101 -102 -107 312 130 442 -8 91 358 181 79 105 -141 177 -220 281 66
2664F6L16l66L74N7n24O05l18j01r4K74j92K27j92K53l18K14m2M5l05J32k9k27
$$ 66 382 16 390 447 -77 528 210 109 15 289 97 324 132 385 67 281 239 284 -21 111 82 -145
2686a45J93k8K45k96j42r1K90K72l54j82L48r6K08l36J02m4o3R6j17L0j93K74
$$ -145 48 20 265 -31 -173 -264 26 298 -56 -238 110 14 222 -114 -12 -56 -119 -23 -140 -110 -303 -29
2708b9r2O0L5k24J26n6L16j20k40N7K97j22j25J13k2j96q9K23n3j20J06j36m9
$$ -29 -121 -61 -26 -250 -124 -180 136 16 -224 -167 130 8 -117 -4 -26 -222 -311 -88 -141 -261 -155 -291 -340
2731c40n2L12p3K89k39nk25K5K56j76mJ78lQ2k69K23R2L11o10L04j49k02J27j3
$$ -340 -392 -80 -153 136 -103 -108 -333 -308 -52 -228 -232 -54 -57 25 -244 -21 71 382 -228 76 -73 -275 -148 -161
2755a61n7O5K53j69J56l64L65K0om00K70m6J91J99k59K76k70j1j4P7K99l17P5
$$ -161 -218 -153 100 -69 87 -277 88 108 102 -298 -28 -74 117 316 57 333 63 52 38 115 414 97 172
2778A72n8q2L24j98k1k53M34k03L58o2k58K10j15J34l75l2O28j90p3j15j83J43
$$ 172 114 32 356 158 137 -116 318 115 473 411 153 363 248 382 7 -25 603 413 340 225 42 185
2800A85R4k49L18l10j18K00j36J33R9J67j85ml09J14K04k75L58l1j96nj54k2J05
$$ 185 279 30 348 38 -80 120 -16 117 216 383 198 194 -115 -1 203 -72 286 255 59 54 -100 -122 -17
2823a7p9K11q5k81J17O0k1J14j94L58l67J43L00m58r6K20J96k0k98K9j59L11k84
$$ -17 -96 115 30 -251 -134 -74 -95 19 -175 183 -184 -41 259 -199 -295 -75 121 101 -197 -168 -327 -16 -300
2846c00L50K9Q4m32L05mk82J8N9L60j86j29k21M55n10L30j42Q5l2j1K65k4j5j48
$$ -300 50 79 163 -269 36 32 -250 -232 -173 187 1 -128 -349 106 -404 -74 -216 -131 -163 -174 91 67 52 -96
2870i6P2Q5l78J05J40J26k11k24L65k1j20L40J7K5k59j28K91o4j72J47j62J56
$$ -96 -24 61 -317 -212 -72 54 -157 -381 -16 -37 -157 183 200 225 -34 -162 129 65 -107 40 -122 34
2892C4M6j5nj78L57j20j61L58k18j18K97j71L2q5N1rj62o5Q9p0J30k94L48J11
$$ 34 80 65 60 -118 239 119 -42 316 98 -20 277 106 138 53 104 95 -67 -132 -43 -113 17 -277 71 182
2916A82J00k38K4J18l99L50K56m87L37k75J84K05j74Q3k70J78j26K4K80n6l2l06
$$ 182 282 44 68 186 -213 137 393 -94 243 -32 152 357 183 266 -4 174 48 72 352 296 264 -42
2938d2M6j24N2m6J46L76r7m51K92K62j11m10j86N13j40j70N7K01Qp63L99L62j60
$$ -42 4 -120 -68 -114 32 408 311 -140 152 414 303 -107 -293 220 80 -90 -33 168 176 -587 -188 174 14
2961A4j39K62k2q4j76Mk02J87M75n26J16k78J70J06o5J9J81j35O4k60L14P1n25
$$ 14 -125 137 115 31 -145 -141 -343 -156 319 -207 -91 -369 -199 -93 -158 -139 42 -93 -29 -289 25 96 -429
2984d29K94j32J55j28Q6J14k34j50M17l59k6L00J83k74O0O5J25k75j9Q0N2l37
$$ -429 -135 -267 -112 -240 -154 -40 -274 -424 -7 -366 -392 -92 91 -183 -123 -58 67 -208 -227 -147 -95 -432
3006d32K56K49r7n5j4q7M76n51r0L81j2j49J96K68k16o4R0J66l74O1k76L22j40
$$ -432 -176 73 -24 -79 -93 -180 296 -255 -345 36 24 -125 71 339 123 59 149 315 -59 2 -274 48 -92
3029i2M06m32r4J88l4K03k4j11k41M31p8kO7j15n7R4kJ34L5K46l75oj1j04M5J36
$$ -92 314 -118 -212 -24 -58 145 121 10 -231 200 122 120 187 72 15 109 107 241 276 522 147 141 130 26 71 207
3055B07K40l22MJ77l19J34K37j64l94L39j78R8j59K09r6K3K92j13k24l54N05k20
$$ 207 447 125 129 306 -13 121 358 194 -200 139 -39 59 -100 109 13 36 328 215 -9 -363 142 -78
3077g8m1o5K79K53k45j33q1K47j08k72J47M36j54n53K96q7J56j06K48J16l38J59
$$ -78 -119 -184 95 348 103 -30 -111 136 28 -244 -97 339 185 -368 -72 -159 -3 -109 139 255 -83 76
3099G6J33m0l24J07J32m8r3pl3N1m5k37J90l41L05P0K22o31M00o1J79j48j94L22
$$ 76 209 169 -155 -48 84 36 -57 -64 -97 -46 -91 -328 -138 -479 -174 -104 118 -513 -113 -174 5 -143 -337 -15
3123a5J5k30L6K94Q7m50l9K35J72k84J6J35o3q7K86k15j04K11O7j47J65J71n7
$$ -15 0 -230 -194 100 187 -263 -302 -67 105 -179 -163 -28 -91 -178 108 -107 -211 0 67 -80 85 256 199
3146A99j12k97L54j16M6J30o0J67l76J33K23p9k92J11J65m3k78J68M15l29j3j67
$$ 199 87 -210 144 28 74 204 144 311 -65 68 291 212 -80 31 196 153 -125 43 458 129 116 -51
3168e1J78j42M2J94m6Oj5Q9k98K28j55K54k07r2J04j22L5j68L06n0K90m70M42
$$ -51 127 -15 27 221 175 181 166 255 -43 185 30 284 77 -15 89 -33 2 -166 140 90 380 -90 352
3191C52m61J49R4Nj65L27j18r0j62L77l57QK22l5J03p3q5j55Q6j40k47M78m7J23
$$ 352 -109 40 134 139 -26 301 183 93 -69 308 -49 -41 181 146 249 176 91 -64 22 -118 -365 113 66 189
3215A89Q1j05j50j12J19J72j45JR5m56K71o8J53q9K51l1m32O0j42J19j3K26l76
$$ 189 270 165 15 -97 22 194 49 50 145 -311 -40 -108 45 -44 207 176 -256 -196 -338 -219 -232 -6 -382
3238c82L23mp7j18L22j01j37J59K26n6j70J41j90K1j22r5J84L3k22J82N8j5j09
$$ -382 -59 -63 -140 -258 64 -37 -174 -15 211 155 -15 126 -64 -43 -165 -260 -76 -43 -265 -83 -25 -40 -149
3261a49K40k93K46J23k05r4j2l8J56K12o4K98m92j33J2L15K9j41J86j15k06J57
$$ -149 91 -202 44 167 -38 -132 -144 -182 -26 186 122 420 -72 -205 -193 122 151 10 196 81 -125 32
3283C2J84j18j36L11l68J96j76J83k02J96P5l11J55N0k05M06j88j51J64j2j1l8
$$ 32 216 98 -38 273 -95 101 -75 108 -94 102 177 -134 21 71 -134 272 84 -67 97 85 74 36
3305C6Q9o9N3j76K49K29k03j96M20o5k10J38j6k52j04P6J11n7J51j53J48J68m9
$$ 36 125 56 109 -67 182 411 208 12 432 367 157 295 279 27 -77 -1 110 53 204 51 199 367 318
3328C18l83l1J61K46o60L50L4J15j26k30J50j70L75M6j25j00P6r5K48l23p1Q1
$$ 318 -65 -96 65 311 -349 1 35 150 24 -206 -56 -226 149 195 70 -30 46 -49 199 -124 -195 -114
3350a14N6j44L96k18l33M41j23L35l78k53N42m43J13M9J83q4o0m11N48l03j3J57
$$ -114 -58 -202 194 -24 -357 84 -39 296 -82 -335 207 -236 -123 -74 109 25 -35 -446 102 -201 -214 -57
3372e7P4J86l08j95L10k77K20p6j82M05k40m5P2l58L50L3O1j01J43O5j75q1j28
$$ -57 17 203 -105 -300 10 -267 -47 -123 -305 100 -140 -185 -113 -471 -121 -88 -27 -128 15 80 -95 -176 -304
3395c04L03r2O9o4L5l40M88J3n3j82M18j99l10O09l13l4k44K73P8j18P3j9j39
$$ -304 -1 -93 -24 -88 -53 -393 95 108 55 -127 291 92 -218 391 78 44 -200 73 151 33 106 87 -52
3418e2M3q5j70J77KK59l61M7K65j21K7J70o6p6j93M9K00L65l91K20l39K9p0L97
$$ -52 -9 -94 -264 -87 -85 174 -187 -140 125 4 31 201 135 59 -134 -85 115 480 89 309 -30 -1 -71 326
3442C26l51K29l89J15J56l16L17K20k6k9l72n0L14nk1l43M25k11K11l57J79K32
$$ 326 -25 204 -185 -70 86 -230 87 307 281 252 -120 -170 144 139 118 -225 200 -11 200 -157 22 254
3464B54l30j00O1k9J21J9j57K52kJ07l87q4L20K21J57o14J65O4m0q9k52M11j66
$$ 254 -76 -176 -115 -144 -23 -4 -161 91 89 196 -191 -275 45 266 423 -191 -26 38 -2 -91 -343 68 -98
3487i8J98k18K38j63k04J41J56L26m54j28K20r8q9K70j05P9k44Q7j74j04J48j8
$$ -98 100 -118 120 -43 -247 -106 50 376 -78 -206 14 -84 -173 97 -8 71 -173 -86 -260 -364 -216 -234
3509b34J62k3O8l68L33m5k26M71k3j38K6r3j41J71r8O6Q6Kl52L82J01j99k64L42
$$ -234 -72 -95 -27 -395 -62 -107 -333 138 115 -23 3 -90 -231 -60 -158 -92 -6 -4 -356 26 127 -72 -336 6
3533FM6k45J63KJ16j4oL46N3l46N8j47q7K10Rk42J61L10l94j88N41k4l23j36K21
$$ 6 52 -193 -30 -28 88 74 68 414 467 121 179 32 -55 155 164 -78 83 393 -1 -189 352 328 5 -131 90
3558I0Q1k04J19p1l4K80j96L3J49lk33k9K68k73L12K3j76k19Q8K04j95J77j67
$$ 90 171 -33 86 15 -19 261 65 98 247 244 11 -18 250 -23 289 312 136 -83 5 209 14 191 24
3581B4n5J49j36J4L57l79O7j41P0O9q3J49r8L05l44j4K5J40k25o8O7J61l58N30
$$ 24 -31 118 -18 -4 353 -26 41 -100 -30 39 -44 105 7 312 -32 -46 -21 119 -106 -174 -107 54 -304 226
3605B26k83k5K1l8l05L39Mn3J78j66r6Q8q7o7L63j35Q1j54P8L4j56K83o2N0o9
$$ 226 -57 -82 -61 -99 -404 -65 -61 -114 64 -102 -198 -110 -197 -264 99 -36 45 -109 -31 3 -153 130 68 118 49
3630D9o0K16l77n6K14k48K66j80K95J61n08J09j98j19M70r8Q8k91o6J72K47k55
$$ 49 -11 205 -172 -228 -14 -262 4 -176 119 280 -228 -119 -317 -436 34 -64 24 -267 -333 -161 86 -169
3652a69J36L01l76J24j43J34J72j22l49J78m7K56l65J55j24K28j33L2K7L13n8
$$ -169 -33 268 -108 16 -127 7 179 57 -292 -114 -161 95 -270 -115 -239 -11 -144 -112 -85 228 170
3673A70k93j33K63qR6j76J09N6l89K06J96o1k39K49K56k58JK85l15M18j77r0k53
$$ 170 -123 -256 7 -1 95 -81 28 84 -305 -99 97 36 -203 46 302 44 45 330 15 433 256 166 -87
3696h7P1J00K55j29l56L16J7n16K39J60L4Mk37P5J91k24M24j72l30K3N76m57K38
$$ -87 -16 84 339 210 -146 170 187 -329 -90 70 104 108 -129 -54 137 -87 337 165 -165 -142 434 -23 215
3719B15m04J22o2M49l62J29O2l62K83J26J1j17Ll51K43o6m5K05j67J58M3l38P7
$$ 215 -189 -67 -129 320 -42 87 149 -213 70 196 207 90 93 -258 -15 -81 -126 79 -88 70 113 -225 -148
3742a48L01o3q7Q6k2m08N02k04K25l25j12R1K25o8p1j8O7k79J68j05L06j8o8k9
$$ -148 153 90 3 89 67 -341 161 -43 182 -143 -255 -164 61 -7 -78 -96 -29 -308 -140 -245 61 43 -25 -54
3766e4k34M72k83J18k46Q9K76k71k15L14j18j82M42m3j94j1L39J1j47r7k54M38
$$ -54 -288 184 -99 19 -227 -138 138 -133 -348 -34 -152 -334 108 65 -129 -140 199 210 63 -34 -288 150
3788A50l79M17j09m6j10R5q2J63K2J70k96K49l11L50J58m69Q8JO3j76j80L46M2
$$ 150 -229 188 79 33 -77 18 -64 99 121 291 -5 244 -67 283 441 -28 60 61 124 -52 -232 114 156
3811A56j85j60M16K5m11K47J60l73K27j54J56n9q5K77m81L15l21J88l3P2K01j29
$$ 156 -29 -189 227 252 -159 88 248 -125 102 -52 104 45 -40 237 -244 71 -250 -62 -95 -23 178 49
3833D9r6j73N10o33M88l02N1K57Q9k19N8j20Q7K3J00M0k56J77k39J62Q7k51Q5
$$ 49 -47 -220 290 -343 145 -157 -106 151 240 21 79 -41 46 69 169 209 -47 130 -109 53 140 -111 -26
3856b6K1k40L71l37K56l13J60J29R0l90M73j20k97J86m9R6j98J33K50k25j14m3
$$ -26 -5 -245 126 -211 45 -268 -108 21 111 -279 194 74 -223 -37 -86 10 -188 -55 195 -30 -144 -187
3878a87J21J77j20j41J71Q1N8m24R5R6K0k72K41J65k05K9K2J09K12k88J37j25
$$ -187 -66 111 -9 -150 21 102 160 -264 -169 -73 -53 -325 -84 81 -124 -95 -73 36 248 -40 97 -28
3900b8m38O81k32j29j30K84j28m9M3k11L14l60K96Q7m8k04K97k86L55l80J79J73
$$ -28 -466 215 -17 -146 -276 8 -120 -169 -126 -337 -23 -383 -87 0 -48 -252 45 -241 114 -266 -87 86
3922H6k41K73l32M3l5j62N27O8j5k56k02N80k48p1j93R9L3L92k65L00k61j91n3
$$ 86 -155 118 -214 -171 -206 -368 159 227 212 -44 -246 334 86 15 -178 -79 -46 346 81 381 120 -71 -124
3945a24j9R4q6K68k45L13m3o1j30L7L14k70Qr1K40m17O8L22R1l96m2L3L62l14
$$ -124 -143 -49 -135 133 -112 201 158 97 -33 4 318 48 56 -35 205 -212 -144 178 269 -127 -169 -136 226 -88
3969h8j5J49j2L41k63K7l01L93j39j41J43j17J38j12rk2j7n1P7k94J55O1J8L0
$$ -88 -103 46 34 375 112 139 -162 231 92 -49 94 -23 115 3 -6 -28 -45 -96 -19 -313 -158 -97 -79 -49
3993d9J01o4M1K55k10J89l08J22j3j28J43N9j13J43m74L08o9j92K89k19L28j8
$$ -49 52 -12 29 284 74 263 -45 77 64 -64 79 138 25 168 -306 2 -67 -259 30 -189 139 121
4015A21j90K6J27k39K92j05k35J93J98j9j92j5j41J94j2j08J49k8J51k51N4J06
$$ 121 -69 -43 84 -155 137 32 -203 -10 188 169 -23 -38 -179 15 3 -105 44 16 167 -84 -30 76
4037G6k04J64k25k0J18R5Q7k32K49K2k54L15N8k64O2j6J34j18Nk33j18J87O2L16
$$ 76 -128 36 -189 -209 -91 4 91 -141 108 130 -124 191 249 -15 47 31 165 47 52 -181 -299 -112 -50 266
4061B66j89Q9j58o4RJ08j16o1L83J9k63K21%k53J50J01j48l34MJ72K04l1j7n7
$$ 266 77 166 8 -56 -47 61 -55 -116 267 286 23 244 244 -9 141 242 94 -240 -236 -64 140 109 92 35
4085C5j89J17N3N8J58Q3k38M4J83m41o0L45l09L28q3K71k25k09L08j37j14J83
$$ 35 -154 -37 16 74 232 315 77 121 304 -137 -197 148 -161 167 84 355 130 -79 229 92 -22 161
4107A61k21N8M9k73Q7k6J86M3j31J5r4K37K5l5p7M0j00r4K07M9m37N14k58j46
$$ 161 -60 -2 47 -226 -139 -165 21 64 -67 -52 -146 91 116 81 4 44 -56 -150 57 106 -331 183 -75 -221
4131b21J13L71k22j41P6k55J4J85Q3J4J53n40M49m26L85j6N8k16K84J96m27J89
$$ -221 -108 263 41 -100 -24 -279 -265 -80 3 17 170 -370 79 -347 38 22 80 -136 148 344 -83 106
4153A06q1j52q6K42K6j63K64k69kJ89j03m2m9J73l11J95k8k32R4J68J49k8k70
$$ 106 25 -127 -213 29 55 -108 156 -113 -115 74 -29 -71 -120 53 -258 -63 -91 -323 -229 -61 88 60 -210
4176b10M58k63k80J93P9j87K14J60j41rp0J34j34J96o2k5m4j86L29l18j80M65
$$ -210 248 -15 -295 -102 -23 -210 4 164 23 14 -56 78 -56 140 78 53 9 -177 152 -166 -346 119
4198A19n3O9k9P1l07J9K14k97L87J16k64Pj63K66J05k36k00L16k20J53j53K6L01
$$ 119 66 135 106 177 -130 -111 103 -194 193 309 45 52 -111 155 260 24 -176 140 -80 73 -80 -54 247
4221B47n0j26R2k54Q4r8M48k39l17L25j61J08k98L71Q7l0m30J18K94k02K10l81
$$ 247 197 71 163 -91 -7 -105 343 104 -213 112 -49 59 -239 132 219 189 -241 -123 171 -31 179 -202
4243b02K02m5j9O7k80K55J83k43o9J55L74n11K45R8j06j65K22j43k50K28L41l08
$$ -202 0 -45 -64 3 -277 -22 161 -82 -151 4 378 -133 112 210 104 -61 161 18 -232 -4 337 29
4265B9k70K35j55P3r8P0O3R1k7L9r4J80n29K6l8L60J91l48J85k17L03k23J07J73
$$ 29 -241 -6 -161 -88 -186 -116 -53 38 11 50 -44 136 -393 -367 -405 -45 146 -202 -17 -234 69 -154 -47 126
4289A26r4P5p6n7P6o3m5J05l58L80j18j56M8j45J07O8NJ14J56j07k07K91k15J07
$$ 126 32 107 31 -26 50 -13 -58 47 -311 69 -49 -205 -157 -302 -195 -127 -122 -8 148 41 -166 125 -90 17
4313A7K70j94Q3n7k39j49M93j11l42K57m4QK62l71J97O0j35K08M4j62K54l46P0
$$ 17 287 93 176 119 -120 -269 224 113 -229 28 -16 -8 254 -117 80 140 5 213 257 95 349 3 73
4336G3L6L7j28K50j16J63Qo6l09pJ29k04K41J6n5J81j57J03K5q8l24K59O9J0m36
$$ 73 109 146 18 268 152 315 323 257 -52 -59 70 -134 107 123 68 249 92 195 220 132 -192 67 136 146 -290
4361b90M42m02K38J30K22k50O5k05l4p6K88j92k01N09j73J59j81J17j07l0K4k6
$$ -290 152 -250 -12 118 340 90 155 -50 -84 -160 128 -64 -265 244 71 230 49 166 59 29 53 27
4383B7J87j82M4j85J87k30L64m10J35J01k34J89rO5R4j51l29J92K1J24K67jn25
$$ 27 214 32 76 -109 78 -152 212 -198 -63 38 -196 -7 -16 49 143 -8 -337 -145 -124 0 267 266 -259
4406b59K38j63K51q9p9K49j24k28K6N23n55L37m6k29K5K99k49l1Q8n38P40k74
$$ -259 -21 -184 67 -22 -101 148 24 -204 -178 345 -210 127 81 -148 -123 176 -73 -104 -16 -554 186 -88
4428h8O8Kj56o8K00r2J03J84j71j26K62k3j75K27n1o0k41K04l6K81k69J75j92
$$ -88 -20 -18 -174 -242 -42 -134 -31 153 -18 -144 118 95 -80 147 96 36 -205 -1 -37 244 -25 150 -42
4451d2o4J7K66J14l27KL61j70k19M4qK63j09j50No3J78n7K36j03q5k10J42k5K02
$$ -42 -106 -89 177 291 -36 -34 327 157 -62 -18 -26 237 128 -22 -17 -80 98 41 277 174 89 -121 21 -4 198
4476A98r7j69J90l2j62O2O8j04QMR1p1K22l72R0K59q3J02k32r6M71m30K91k62
$$ 198 101 -68 122 90 -72 -10 58 -46 -38 -34 57 -14 208 -164 -74 185 102 204 -28 -124 347 -83 208 -54
4500e4P7M04n58J53j29J60l5k05J1J34K57k02k25K87l43J22K19j22Q5j27L89l92
$$ -54 23 427 -131 22 -107 53 18 -187 -176 -42 215 13 -212 75 -268 -146 73 -49 36 -91 298 -94
4522i4m9L5k82N04J44k8k43j52K19k92N08l37J23j29Q6q5j2n4L78j55N2j41j86
$$ -94 -143 -108 -390 114 258 230 -13 -165 54 -238 270 -67 56 -73 13 -72 -84 -138 240 85 137 -4 -190
4545a90K46k97J89J09j82J24j3J38ql82J54K48l1n6k84K07J92k32r4Q7J61M1l14
$$ -190 56 -241 -52 57 -125 -1 -14 124 116 -266 -112 136 105 49 -235 -28 164 -68 -162 -75 86 127 -187
4568a87o0K07J66J61k46r9R6M6J31l88L22R1l91J67o7L27j36LJ59l28o2K02j01
$$ -187 -247 -40 126 287 41 -58 38 84 215 -173 149 240 -151 16 -51 276 140 143 302 -26 -88 114 13
4591A3k32K57P7k14J0K4J98j50J52j37k9N4r7K28k02L0q5M51m45L4kJ72k88K13
$$ 13 -219 38 115 -99 -89 -65 133 -17 135 -2 -31 23 -74 154 -48 -18 -103 348 -97 -63 -65 107 -181 32
4615C2L24q1j89j36J23J30Q0k16k9J57l13k7K71k43K31l1M3p0O2k81K99j07k43
$$ 32 356 275 86 -50 73 203 283 67 38 195 -118 -145 126 -117 114 83 126 56 118 -163 136 29 -214
4638b14J25j53J42k31L62k15J95k4L1MJ94k63K01j77k63J55P6Q6k47J29K68k95
$$ -214 -89 -242 -100 -331 31 -184 11 -13 18 22 216 -47 154 -23 -286 -131 -55 31 -216 -87 181 -114
4660a14K14q9o5K55l30J77k68J10N0J03k98L94j65Nk57J58J56k48K16J80k31J81
$$ -114 100 11 -54 201 -129 48 -220 -110 -60 43 -255 139 -26 -21 -278 -120 36 -212 4 184 -47 134
4682A34L2m91J98j2M01n08J29l6J54l3J18k22K39J37k54N2J58l75K96j99K75k62
$$ 134 166 -325 -127 -139 262 -246 -117 -153 1 -32 86 -136 103 240 -14 38 196 -179 117 -82 193 -69
4704f9Pj0J78J72l42j75K30J36n8k1K53k92L3m3j17K50P6k22J13n6L85n50j49
$$ -69 -62 -72 106 278 -64 -239 -9 127 69 48 301 9 42 -1 -118 132 208 -14 99 43 428 -122 -271
4727b71J61J27J90m00L51R3l52K07Q6k74M3J97k14Q1L1Q5J6k88M45m53M49k44
$$ -271 -110 17 207 -193 158 251 -101 106 192 -82 -39 158 -56 25 56 141 157 -131 314 -139 310 66
4749F6j0k56Q5L97j10Lj17j21K22o7K56o96L38J60J8k64J04J10k75LL10k10K03
$$ 66 56 -200 -115 282 172 175 58 -63 159 92 348 -348 -10 150 168 -96 8 118 -157 -154 156 -54 149
4772A49k39k91J77Q8K24l38K21j8J9R5k14K36j55k90K19J85l81J79J97l95N20
$$ 149 -90 -381 -204 -116 108 -230 -9 -27 -8 87 -127 109 -46 -336 -117 68 -313 -134 63 -332 188
4793A88j21Q8j37l52K36j3K97l00M7J35Qn1j2J09K8p1K70J4n76j41Q4K84j58k40
$$ 188 67 155 18 -334 -98 -111 186 -114 -67 68 76 25 13 122 150 79 349 363 -213 -354 -270 14 -144 -384
4817c84M36K15l66O8j30K70K89n82L36j45j10k77M07R4M8j06j12j22J80O0j25
$$ -384 52 267 -99 -31 -161 109 398 -184 152 7 -103 -380 27 121 169 63 -49 -171 9 69 -56
4838e6K15j12p2m0M9j47k45M48k0L9j63Q5J25k64J12J73r7j25M28j95j41k9J18
$$ -56 159 47 -25 -65 -16 -163 -408 40 20 59 -104 -19 106 -158 -46 127 30 -95 333 138 -3 -32 86
4861H6j0K65n92J28K14j34J16K0lj74k08K32j22J06K84l81m5P37m44j92J12L40
$$ 86 76 341 -251 -123 91 -43 73 93 90 -84 -292 -60 -182 -76 208 -173 -218 519 75 -117 -5 335
4883C35j61l78j2L32j20K75m98J92J47j82J12P7k24P4J8j74j27kJ67K56j15n2
$$ 335 174 -204 -216 116 -4 271 -227 -35 112 -70 42 119 -105 -31 -13 -187 -314 -316 -149 107 -8 -60
4905f0P2J49k24Q8k25K47L5m3k06R0L5l6j20L75n73n5O54r3l28M1K88j83J84o4
$$ -60 12 161 -63 25 -200 47 82 39 -167 -77 -42 -78 -198 177 -396 -451 203 110 -218 -177 111 -72 112 48
4929D8N0k19J33K9R3k30NJ19%l53L70p0K70o7l78K82k44K2K31Pk7j09k41K07K4
$$ 48 98 -121 12 41 134 -96 -91 28 28 -325 45 -25 245 178 -200 82 -162 -140 91 98 71 -38 -279 -72 -48
4954d8N0M1j31J28K65l06q2K70l08L27m99J30L3J96l7%R0K32m33K40j48J97m23
$$ -48 2 43 -88 40 305 -1 -83 187 -121 206 -293 -163 -130 66 29 29 119 351 -82 158 10 207 -216
4977b16R3J97k0O1j60J85k45J48n4J74k58L85m30M25n12J88J04J25Jk67J48P5
$$ -216 -123 74 54 115 -45 140 -105 43 -11 163 -95 290 -140 285 -227 -39 65 190 191 -76 72 147
4999A47p0j32j76K41J87l06j2K47K7j1p3j58n7L15j62K75j42k17K3P1k2L5mN4
$$ 147 77 -55 -231 10 197 -109 -121 126 153 142 69 -89 -146 169 7 282 140 -77 -54 17 -5 30 26 80
5023H0m3P9l7O8l03L56j40k10j9j03L86j61m0l62N51k7j87K9J43l0O4k87K66k92
$$ 80 37 116 79 147 -156 200 60 -150 -169 -272 114 -47 -87 -449 102 75 -112 -83 60 30 94 -193 73 -219
5047b19N1J47%m0J14j86K50J28k50J01j72r4K08k46n6J59J47j72Q1L4K45l12P2
$$ -219 -168 -21 -21 -61 53 -133 117 245 -5 96 -76 -170 38 -208 -264 -105 42 -130 -49 -15 230 -82 -10
5070a0N2R3p7k46L06j72J13j01P4Q9J42j60R4j21J48l45N7K5k0J56l23J91J93
$$ -10 42 135 58 -188 118 -54 59 -42 32 121 263 103 197 76 224 -121 -64 -39 -59 97 -226 -35 158
5093A58p3k28j13M14k08K3m9J71N9l5l7j93M4P6lR9q4K97k15m2L0J2L4j95K56
$$ 158 85 -143 -256 158 -50 -27 -76 95 154 119 82 -111 -67 9 6 105 21 318 103 61 91 103 137 -58 198
5118A98k19r1J76k75L27k63J28jk37M98Jl54J58r1N33p02K26k22M29k90N8J62
$$ 198 -21 -112 64 -211 116 -147 -19 -20 -257 241 242 -112 46 -45 488 -214 12 -210 219 -71 -13 149
5140A49k60L67j19Ll31L63k08k04L03j57M1j86n9L63Q7k8k10J94l6l35L50R2m8
$$ 149 -111 256 137 140 -191 172 -36 -240 63 -94 -53 -239 -298 65 152 124 -86 108 72 -263 87 179 131
5163A31L79m62k77K95J10k02k47N30l12L58rj56k69Q6L6J16j34q4j10J29J80q1
$$ 131 510 48 -229 66 176 -26 -273 257 -55 303 294 138 -131 -45 -9 107 -27 -111 -221 -92 88 7
5185Gj18J17k03J01K96j3o08L93j81rL04k66N0J82k35M68j80k85L41l25j12J92
$$ 7 -111 6 -197 -96 200 187 -421 -28 -209 -218 86 -180 -130 52 -183 285 105 -180 161 -164 -276 -84
5207h4O7j38P8J09K78n14K32k2K39k53j51M92k86j05n5O4p6K44k74J99J35k33
$$ -84 -17 -155 -77 32 310 -204 28 6 245 -8 -159 333 47 -58 -113 -49 -125 119 -155 44 179 -54
5229e4l5J60L29m30o0N8n6L3j41J02J93k0r2Q3n7j62K13j76O3j2J64j75J31Rk12
$$ -54 -89 71 400 -30 -90 -32 -88 -55 -196 -94 99 79 -13 70 13 -149 64 -112 -49 -61 103 -72 59 68 -144
5254a44nK09J44p6k47R3j91L24R9k51J51k3J62j89j18K53j88P4k61N05l27pJ9
$$ -144 -149 60 204 128 -119 -26 -217 107 206 -45 106 83 245 56 -62 191 3 77 -184 321 -6 -13 6
5277FJ0J63k26Kk33J72K41K69n80K22m5k64R4L38j63j1p0Q4k7J75k67j44J08K56
$$ 6 16 179 -47 -45 -278 -106 135 404 -176 46 1 -263 -169 169 6 -5 -75 9 -18 157 -110 -254 -146 110
5301A10j60K25l78K91k0J35l14L6l4J45n9j92J89q6lj27K06J43m4k05j20M4K61
$$ 110 -50 175 -203 88 68 203 -111 -75 -109 36 -23 -215 -26 -112 -115 -242 -36 107 63 -142 -262 -218 43
5324D3j78L09l98Q0j06L61l16P6q6K81m9J52P8j66L9l3J06j09l06R2J04J46j24
$$ 43 -135 174 -224 -144 -250 111 -205 -129 -215 66 17 169 247 81 120 87 193 84 -222 -130 -26 120 -4
5347dJ96J1k25m6K16O3j39J21l55K84j46J25j53J29k69J99q6O1k90M47J53l95
$$ -4 192 203 -22 -68 148 211 72 193 -162 122 -24 101 -52 77 -192 7 -79 -18 -308 139 292 -103
5369a03J32L9k11R1k13P5K14r0J55j20K28Lk41K10l6No6l92N03k29k98N14J5q0
$$ -103 29 68 -143 -52 -265 -190 24 -66 89 -31 197 200 -41 169 133 138 72 -320 183 -46 -344 170 185 105
5393A05j9N3j54l8%K00l95J92K53j17p2K4j65K74j3j97j64L00j22J02rj79K13
$$ 105 86 139 -15 -53 -53 147 -248 -56 197 80 8 32 -133 141 128 -69 -233 67 -55 47 38 -141 72
5416G2k61n8L48k24l34N20M6o9O9j70J61J62oj90K7K33l50K4j61QR6J82o00L00
$$ 72 -189 -247 101 -123 -457 63 109 40 109 -61 100 262 256 66 93 326 -24 0 -161 -153 -57 125 -475 -175
5440a75L17j99j82J56K33l86K74j53L8NK84k40j21j46J8K83j98J15J26j43J28
$$ -175 142 -57 -239 -83 150 -236 38 -115 -77 -72 212 -28 -149 -295 -277 6 -192 -77 49 -94 34
5461C4k75M7K66j53j6P9J72j13L1k85K1J4j5J5O2LM9K39j1k45j9k12M78k52M76
$$ 34 -241 -194 72 -81 -97 -18 154 41 72 -213 -192 -178 -193 -178 -116 -113 -64 175 164 -81 -100 -312 166 -86 390
5486C90j52k12q6J80n4P3k3l99N11k21l0pk18K69j88L73o1j64J64K43n67L34j79
$$ 390 238 26 -60 120 66 139 116 -283 228 7 -23 -30 -248 21 -167 206 145 -19 145 388 -179 155 -24
5509b4jn8J3O5Q4m4J38j80j2n8J9J76k12K96kk59K05p7K36j89k20K1Q1q3n6K50
$$ -24 -25 -83 -70 -5 79 35 173 -7 -19 -77 -58 118 -94 202 200 -59 146 69 305 116 -104 -83 -2 -85 -141 109
5535A09k75J58K8k99L03k0j14N8K9J58k01J08j76K17j51P4p1J99m74N03j98K28
$$ 109 -166 -8 20 -279 24 4 -110 -52 -23 135 -66 42 -134 83 -68 6 -65 134 -340 163 -35 193
5557A93l59L81j43on3k04J94k72J10p8K01p1J14J52K9j43j63J14L53k69L6k45
$$ 193 -166 215 72 66 13 -191 3 -269 -159 -237 -36 -107 7 159 188 45 -118 -4 349 80 116 -129
5579a29J05j55Q5j8L15k20L2J50j69K23j59P7k51J71K43k61K29n9n21L78j65k3
$$ -129 -24 -179 -94 -112 203 -17 15 165 -4 219 60 137 -114 57 300 39 268 209 -312 66 -99 -122
5601a22K06K09r1l22j5p2L19m02J41R5j71L75n7J6k36J18N3k06L87l11J11Jj29
$$ -122 84 293 202 -120 -135 -207 112 -290 -149 -54 -225 150 93 109 -127 -9 44 -162 225 -86 25 26 -103
5624a03j5K32k13n8K61j8J65q7j97q3J4K77l58N38k57K16n35L4K08J00k69J27
$$ -103 -118 114 -99 -157 104 86 251 164 -33 -116 -102 175 -183 355 98 314 -221 -187 21 121 -148 -21
5646b1j50L68k4k09P7j99J36j03J96M3j58J1J00J60k32K51j22j57r7J5J26N5L5
$$ -21 -171 197 173 -36 41 -158 -22 -125 71 114 -44 -33 67 227 -5 246 124 -33 -130 -115 11 66 101
5669A01j14N0o2O3J9o1j0K0M5k34K16J93j91K05o71L00OKj6N3K56K1k33R2j0j40
$$ 101 -13 37 -25 38 57 -4 -14 6 51 -183 33 226 35 240 -431 -131 -125 -123 -139 -86 170 191 -42 50 40 -100
5695a00j66L27k41R1K7L53k98J38j99K6J90j95L9J02k73L39l01L29J24k18j59
$$ -100 -266 61 -180 -89 -62 291 -7 131 -68 -42 148 -47 -8 94 -179 160 -141 188 312 94 -65
5716f5J74j5l35L01k15l56N56j67L75j81L5J11m49K76k81K07m6q8R6K51j79O0
$$ -65 109 94 -241 60 -155 -511 45 -122 253 72 107 218 -231 45 -236 -29 -75 -163 -67 184 5 65
5738F5J57k62r2M04k63k09K75J41r7k3k79N49m41L23k24l1J33k40K24K54k23l7
$$ 65 222 -40 -132 272 9 -200 75 216 119 96 -183 366 -75 248 24 -7 126 -114 110 364 141 104
5760A04r3k89K04K49k96r1K79R7l13J67k1J59l12L20J01m90L79j35k75J36m1K41
$$ 104 11 -278 -74 175 -121 -212 67 164 -149 18 -3 156 -156 164 265 -225 154 19 -256 -120 -161 80
5782H0K00k68rl6q0K0K18j98J1r8R8j27M25k43K6Q3j52J63NL8k67R8N9n85N18
$$ 80 280 12 3 -33 -113 -93 125 -73 -62 -160 -62 -189 236 -7 19 102 -50 113 118 156 -111 -13 46 -539 -21
5807b1O2j48r8M37n4l00K0n9o3K43n9o7K1J48J40m75J56K25l40O2MJ62P5J44k33
$$ -21 41 -107 -205 232 178 -122 -102 -161 -224 19 -40 -107 -86 62 202 -273 -117 108 -232 -170 -166 -4 71 215 -18
5832a8Q6j84j68K05p9L0o7J80n2j5k4L09j47J10J36n69M85l08J2L3l2q6N5M17
$$ -18 68 -116 -284 -79 -158 -128 -195 -15 -67 -82 -106 203 56 166 302 -267 218 -90 -78 -45 -77 -163 -108 309
5856C09m92N7K51J02k51j57L80m49L51k39k6J43J6k4j18R1K28k78J32r3K36j09
$$ 309 -183 -126 125 227 -24 -181 199 -250 101 -138 -164 -21 -5 -29 -147 -56 172 -106 26 -67 169 60
5878F0l01J89Q7qm1k8J35J47k69k7J23q6K1J09m19L04M53l60N5J08j0m98M61j33
$$ 60 -241 -52 35 27 -14 -42 93 240 -29 -56 67 -19 2 111 -308 -4 449 89 144 252 242 -256 205 72
5902G2m3K9L7j86P5K17j80J89L8j23p3j00N3k01L2K58n7jK18m81K97n5P4K75k78
$$ 72 29 58 95 -91 -16 201 21 210 248 125 52 -48 5 -196 -164 94 37 36 254 -227 70 15 89 364 86
5927H6j31o7J43m1J28k45r7M11j70j39j5J13J14m20L92l37J94Q8j00K19j20r0
$$ 86 -45 -112 31 -10 118 -127 -224 187 17 -122 -137 -24 90 -330 62 -275 -81 7 -93 126 6 -84
5949h4ML22j44l88L57O8k27L09k53n0K30j61l3j18L06K0j35j71M7J86%j22K18
$$ -84 -80 242 98 -290 67 135 -92 217 -36 -86 144 -17 -50 -168 138 158 23 -148 -101 85 85 -37 181
5972A81j70K8J0j35k18L48k11L84l38m2L32k30K51n2j04%j06MJ46O3J13k93J94
$$ 181 11 39 49 -86 -304 44 -167 217 -121 -163 169 -61 190 138 34 34 -72 -68 78 141 254 -39 155
5995A55Q4k60k5K9n5J2L57k72m6K22j97J9k92m1M01K76l79N0L2j55o3L3R7q7M3
$$ 155 239 -21 -46 -17 -72 -60 297 25 -21 201 4 23 -269 -310 91 367 -12 38 70 -85 -148 -115 -18 -105 -62
6020f2J39p4QL7O8j70J23K7j51J87k2j1o4j63P5N4J18j10N8k9Q4K6k99J88L30
$$ -62 77 3 11 48 116 -54 69 96 -55 132 110 99 35 -128 -53 1 119 9 67 38 122 148 -151 37 367
6045C67n13j30M49q2j46K49j39k06M6Q6j80K74J24j36l38L81n2m01M40j14j00
$$ 367 -146 -276 173 91 -55 194 55 -151 -105 -19 -199 75 199 63 -275 106 54 -347 93 -21 -121
6066a21m4K25l4J40J9n71M16J68k69j58M14l3k70R3k87L01j1O3q8k02L01K4k00
$$ -121 -165 60 26 166 185 -386 30 198 -71 -229 185 152 -118 -25 -312 -11 -22 41 -47 -249 52 76 -124
$$ [...]
8191g
##END NTUPLES=NMR FID
##END=
