##TITLE=1H_Ser LAV-302
 CDCl3, 8 sc, 
 20.12.2019
##JCAMPDX= 6.0         $$ Bruker NMR JCAMP-DX V2.0
##DATA TYPE= NMR FID
##DATA CLASS= NTUPLES
##ORIGIN= UXNMR, Bruker Analytische Messtechnik GmbH
##OWNER= root
$$ XWIN-NMR		Version 3.5
$$ Fri Dec 20 15:47:11 2019 Russian Standard Time (UT+4h)  she@DPX200
##.OBSERVE FREQUENCY= 200.1315
##.OBSERVE NUCLEUS= ^1H
##.DELAY= (6, 6)
##.ACQUISITION MODE= SIMULTANEOUS
##.ACQUISITION SCHEME= undefined
##.AVERAGES= 8
##.DIGITISER RES= 18
##SPECTROMETER/DATA SYSTEM= spect
##.PULSE SEQUENCE= zg30
##.SOLVENT NAME= CDCl3
##.SHIFT REFERENCE= (INTERNAL, CDCl3, 0, 15.7039)
##AUDIT TRAIL= $$ (NUMBER, WHEN, WHO, WHERE, WHAT)
$$ ##TITLE= Audit trail, XWIN-NMR		Version 3.5
$$ ##JCAMPDX= 5.01
$$ ##ORIGIN= Bruker BioSpin GmbH
$$ ##OWNER= she
$$ F:/spectra/data/she/nmr/H-F/1/audita.txt
$$ ##AUDIT TRAIL=  $$ (NUMBER, WHEN, WHO, WHERE, WHAT)
(   1,<2019-12-20 15:46:22.26 +0400>,<she>,<DPX200>,
      <created by zg, POWCHK disabled, PULCHK disabled
       configuration hash MD5:
       00 E9 B6 7A A2 85 ED C7 34 08 36 98 17 FE 4E 26
       data hash MD5: 16K
       D1 5E DC F6 76 1F 00 75 88 EF 9C BA 05 2E FF 97>)
$$ ##END=
$$ 
$$ hash MD5
$$ 6B E8 42 39 2B C5 57 48 1F ED 25 FD 67 B5 B2 FF
##$RELAX= 
##$RELAX= 
##$RELAX= 
##$RELAX= 
##$RELAX= 
##$RELAX= 
$$ Bruker specific parameters
$$ --------------------------
##$DU= <F:/spectra>
##$EXPNO= 1
##$NAME= <H-F>
##$PROCNO= 1
##$TYPE= <nmr>
##$USER= <she>
##$AMP= (0..31)
100 100 100 100 100 100 100 100 100 100 100 100 100 100 100 100 100 100 
100 100 100 100 100 100 100 100 100 100 100 100 100 100 
##$AQSEQ= 0
##$AQ_mod= 1
##$AUNM= <au_zg>
##$AUTOPOS= <>
##$BF1= 200.13
##$BF2= 200.13
##$BF3= 200.13
##$BF4= 200.13
##$BF5= 200.13
##$BF6= 200.13
##$BF7= 200.13
##$BF8= 200.13
##$BYTORDA= 1
##$CFDGTYP= 0
##$CFRGTYP= 5
##$CHEMSTR= <none>
##$CNST= (0..31)
1 1 145 1 1 1 1 1 1 1 1 1 1 1 1 1 1 1 1 1 1 1 1 1 1 1 1 1 1 1 1 1 
##$CPDPRG= <>
##$CPDPRG1= <>
##$CPDPRG2= <>
##$CPDPRG3= <>
##$CPDPRG4= <mlev>
##$CPDPRG5= <mlev>
##$CPDPRG6= <mlev>
##$CPDPRG7= <mlev>
##$CPDPRG8= <mlev>
##$CPDPRGB= <>
##$CPDPRGT= <>
##$D= (0..31)
0 1.2 0 0 0 0 0 0 0 0.06 0 0.03 0 0 0 0 0.0002 0 0 0 0 0 0 0 0 0 0 0 0 
0 0 0 
##$DATE= 1576842381
##$DBL= (0..7)
120 120 120 120 120 120 120 120 
##$DBP= (0..7)
150 150 150 150 150 150 150 150 
##$DBP07= 0
##$DBPNAM0= <>
##$DBPNAM1= <>
##$DBPNAM2= <>
##$DBPNAM3= <>
##$DBPNAM4= <>
##$DBPNAM5= <>
##$DBPNAM6= <>
##$DBPNAM7= <>
##$DBPOAL= (0..7)
0.5 0.5 0.5 0.5 0.5 0.5 0.5 0.5 
##$DBPOFFS= (0..7)
0 0 0 0 0 0 0 0 
##$DE= 6
##$DECBNUC= <off>
##$DECIM= 24
##$DECNUC= <off>
##$DECSTAT= 4
##$DIGMOD= 1
##$DIGTYP= 9
##$DL= (0..7)
0 120 120 120 120 120 120 120 
##$DP= (0..7)
150 150 150 150 150 150 150 150 
##$DP07= 0
##$DPNAME0= <>
##$DPNAME1= <>
##$DPNAME2= <>
##$DPNAME3= <>
##$DPNAME4= <>
##$DPNAME5= <>
##$DPNAME6= <>
##$DPNAME7= <>
##$DPOAL= (0..7)
0.5 0.5 0.5 0.5 0.5 0.5 0.5 0.5 
##$DPOFFS= (0..7)
0 0 0 0 0 0 0 0 
##$DQDMODE= 0
##$DR= 18
##$DS= 0
##$DSLIST= <SSSSSSSSSSSSSSS>
$$ [...]
##$SUBNAM2= <"">
##$SUBNAM3= <"">
##$SUBNAM4= <"">
##$SUBNAM5= <"">
##$SUBNAM6= <"">
##$SUBNAM7= <"">
##$SUBNAM8= <"">
##$SUBNAM9= <"">
##$SW= 24.9337058887773
##$SWIBOX= (0..15)
0 0 2 0 0 0 0 0 0 0 0 0 0 0 0 0 
##$SW_h= 4990.01996007984
##$TD= 16384
##$TD0= 1
##$TE= 0
##$TE2= 300
##$TE3= 300
##$TEG= 300
##$TL= (0..7)
0 120 120 120 120 120 120 120 
##$TP= (0..7)
150 150 150 150 150 150 150 150 
##$TP07= 0
##$TPNAME0= <>
##$TPNAME1= <>
##$TPNAME2= <>
##$TPNAME3= <>
##$TPNAME4= <>
##$TPNAME5= <>
##$TPNAME6= <>
##$TPNAME7= <>
##$TPOAL= (0..7)
0.5 0.5 0.5 0.5 0.5 0.5 0.5 0.5 
##$TPOFFS= (0..7)
0 0 0 0 0 0 0 0 
##$TUNHIN= 0
##$TUNHOUT= 0
##$TUNXOUT= 0
##$USERA1= <user>
##$USERA2= <user>
##$USERA3= <user>
##$USERA4= <user>
##$USERA5= <user>
##$V9= 5
##$VALIST= <valist>
##$VCLIST= <CCCCCCCCCCCCCCC>
##$VD= 0
##$VDLIST= <DDDDDDDDDDDDDDD>
##$VPLIST= <PPPPPPPPPPPPPPP>
##$VTLIST= <TTTTTTTTTTTTTTT>
##$WBST= 1024
##$WBSW= 4
##$XGAIN= (0..3)
0 0 0 0 
##$XL= 0
##$YL= 0
##$YMAX_a= 117683
##$YMIN_a= -66956
##$ZGOPTNS= <>
##$ZL1= 120
##$ZL2= 120
##$ZL3= 120
##$ZL4= 120
##$ABSF1= 10
##$ABSF2= 0
##$ABSG= 5
##$ABSL= 3
##$ALPHA= 0
##$AQORDER= 0
##$ASSFAC= 0
##$ASSFACI= 0
##$ASSFACX= 0
##$ASSWID= 0
##$AUNMP= <proc_1d>
##$AZFE= 0.1
##$AZFW= 0.1
##$BCFW= 1
##$BC_mod= 2
##$BYTORDP= 1
##$COROFFS= 0
##$CY= 11.3945322036743
##$DATMOD= 1
##$DC= 2
##$DFILT= <>
##$DTYPP= 0
##$F1P= 16.9975609425685
##$F2P= -3.02152046262296
##$FCOR= 0.5
##$FTSIZE= 0
##$FT_mod= 4
##$GAMMA= 1
##$GB= 0.15
##$INTBC= 1
##$INTSCL= 1
##$ISEN= 128
##$LB= 0.24
##$LEV0= 0
##$LPBIN= 0
##$MAXI= 10000
##$MC2= 0
##$MEAN= 0
##$ME_mod= 0
##$MI= 1.114404
##$NCOEF= 0
##$NC_proc= 0
##$NLEV= 6
##$NOISF1= 3.799351
##$NOISF2= 2.8
##$NSP= 1
##$NTH_PI= 0
##$NZP= 0
##$OFFSET= 15.70392
##$PC= 1
##$PHC0= -10144.81
##$PHC1= 12.8008
##$PH_mod= 1
##$PKNL= yes
##$PPARMOD= 0
##$PSCAL= 0
##$PSIGN= 0
##$REVERSE= no
##$SF= 200.130013532006
##$SI= 16384
##$SIGF1= 3
##$SIGF2= 2
##$SINO= 400
##$SIOLD= 16384
##$SREGLST= <1H.CDCl3>
##$SSB= 0
##$STSI= 0
##$STSR= 0
##$SW_p= 3612.71676300578
##$SYMM= 0
##$S_DEV= 0
##$TDeff= 0
##$TDoff= 0
##$TI= <>
##$TILT= no
##$TM1= 0
##$TM2= 0
##$TOPLEV= 0
##$USERP1= <user>
##$USERP2= <user>
##$USERP3= <user>
##$USERP4= <user>
##$USERP5= <user>
##$WDW= 1
##$XDIM= 8192
##$YMAX_p= 0
##$YMIN_p= 0
$$ End of Bruker specific parameters
$$ ---------------------------------
##NTUPLES= NMR FID
##VAR_NAME=  TIME,          FID/REAL,        FID/IMAG
##SYMBOL=    X,             R,               I
##VAR_TYPE=  INDEPENDENT,   DEPENDENT,       DEPENDENT
##VAR_FORM=  AFFN,          ASDF,            ASDF
##VAR_DIM=   8192,          8192,            8192
##UNITS=     SECONDS,       ARBITRARY UNITS, ARBITRARY UNITS
##FACTOR=    0.0002004,     1,               1
##FIRST=     0,             0,               0
##LAST=      1.6414764,     0,               0
##MIN=       0,             -66956,          0
##MAX=       1.6414764,     117683,          0
$$ Real data points
##PAGE= N=1
##DATA TABLE= (X++(R..R)), XYDATA
0 0 0 0 0 0 0 0 0 0 0 0 -1 8 -8 8 -8 9 -16 16 -17 24 -25 32 -35 41 -49 57 -65 73 -81 92 -103 116 -132 147
34 147 -164 184 -203 226 -250 276 -308 341 -377 417 -462 510 -567 634 -708 792 -892 1011 -1157
53 -1157 1338 -1572 1889 -2341 3044 -4300 7227 -31788 25654 66715 -27449 -49262 7360 22182
67 22182 -53938 -66956 10251 47998 -21001 -60661 -5195 37402 -17230 -60671 -14027 39395
79 39395 5005 -42974 -19133 21032 -5748 -41520 -8624 39335 15422 -34669 -21725 23331
91 23331 12622 -29568 -18890 27410 26770 -13466 -14074 20087 16512 -20864 -16173 32095 41742 -2852
105 -2852 -24022 7422 27960 5027 -7958 18232 32999 4175 -16402 9214 34903 14215
117 14215 -14998 -1041 27876 20899 -3741 1385 24212 17574 -8317 -6169 20448 23291 -2340
130 -2340 -8544 14809 23273 -2020 -15538 7642 26814 8084 -14719 -3625 15436 5314 -13250
143 -13250 -686 23218 12899 -17086 -16538 10262 14689 -9504 -16003 5517 12967 -6278 -13005
156 -13005 6084 12316 -11290 -22262 1749 18727 1555 -16167 -2380 11898 -4348 -19375
168 -19375 -916 20390 5042 -18914 -7823 15392 5757 -17390 -6539 21652 15599 -14346
180 -14346 -13512 13905 15261 -9952 -11478 16454 20620 -7346 -15861 11468 22946 -1324 -14562
193 -14562 8142 23731 3377 -12186 5025 19989 2649 -12568 6575 26230 10320 -12066
205 -12066 -2507 16814 7651 -9441 2202 22681 12128 -11863 -6265 16950 13793 -8501 -7069
218 -7069 15132 15595 -6879 -10318 10823 17281 -2741 -11124 5695 14831 -1338 -11860 2545
231 2545 14495 2414 -10337 -291 12436 3663 -9108 -3410 8287 3147 -8222 -1826 11125
244 11125 6725 -8273 -7485 5422 6458 -5065 -5380 6177 7382 -4670 -8360 3584 9434 -914
258 -914 -8245 610 8766 1205 -7752 -1646 8132 3118 -6933 -3593 7483 5402 -5805 -5236 5154
273 5154 5983 -4655 -6599 4024 7468 -2890 -7685 1448 6551 -2014 -7547 901 6884 -1955 -9979
288 -9979 -2121 7359 715 -9485 -4080 7326 1610 -10831 -6981 5944 3271 -10319 -9452 5776
302 5776 6812 -7812 -12645 355 6450 -5240 -11795 -627 7467 -3272 -12810 -3999 5983 -159
316 -159 -10326 -4432 5406 -474 -10876 -5913 5556 2447 -7772 -5175 4375 2090 -8894 -6817
330 -6817 5475 5787 -5572 -7071 3870 6449 -4347 -7965 3668 8849 -1671 -7732 1645 9049
344 9049 735 -7116 673 9980 3716 -6074 -1514 8641 5709 -4487 -2023 8531 7122 -2699
358 -2699 -3508 6065 7837 -1132 -3096 5225 7914 83 -3299 4404 7919 711 -3171 3656 8185
373 8185 1544 -4108 2195 8417 2786 -4607 664 8358 3952 -4426 -1602 6727 4955 -3522 -3217
388 -3217 5458 6137 -2691 -4696 2931 5293 -1426 -4634 1942 5329 -911 -5392 565 4459 -610
403 -610 -5214 -136 4141 -983 -5996 -1849 4402 485 -5671 -2983 3759 1060 -6677 -5223 3053
418 3053 3098 -5302 -6002 1931 3364 -4901 -7236 -110 3961 -2900 -7771 -1853 4150 -1249 -7449 -3128
434 -3128 3488 86 -6935 -4741 2666 1079 -5360 -4479 2418 1657 -4724 -4933 1539 1837 -4222 -4897
450 -4897 1541 3234 -3310 -4677 1656 4359 -2669 -5996 778 5783 -258 -6087 -58 6263 1479
465 1479 -5907 -2124 6286 3796 -3814 -3015 5118 5055 -2965 -3409 4298 6370 -484 -3296 2927 5995
481 5995 812 -2250 3342 6215 1411 -2373 1703 5894 1958 -1723 1786 6289 2385 -2679 330
496 330 5302 2950 -2054 251 5286 3539 -2597 -1940 3676 3948 -1923 -2450 2929 4171 -1398 -3893
512 -3893 1136 3655 -565 -4265 -388 2749 -682 -4065 -1378 2350 -69 -3436 -1967 1310 -451
527 -451 -4072 -3167 712 -363 -4273 -3089 1133 726 -4369 -4633 -231 815 -3818 -4345 -34 2437
543 2437 -2755 -6399 -1430 2816 -344 -5345 -2860 2480 159 -5293 -3658 2720 2222 -3300 -3804 1116
559 1116 2194 -2644 -3450 1174 2693 -2245 -3182 1311 3462 -1267 -3759 663 3253 -717 -3747 1174
575 1174 4837 -21 -4447 -151 5444 1956 -3692 -748 5287 1986 -4371 -1875 5614 4704 -2707
590 -2707 -2687 4457 4893 -2435 -3551 3366 5425 -676 -3113 2521 5977 722 -3379 1061 4734 1339
606 1339 -1758 2004 5200 1257 -3022 389 5101 2747 -253 1437 4243 1234 -2099 1181 6348
621 6348 4980 -341 -39 3650 3434 -338 1031 5066 5156 629 -568 2954 4617 2172 867 2834
637 2834 4163 1848 873 2959 4466 2747 973 2219 2808 2378 1473 2475 3185 1815 0 917 3299
654 3299 3242 802 214 1610 1671 289 -84 2174 2650 194 -2451 -682 2288 1373 -1075 -1671 520
671 520 237 -2446 -2116 1103 1623 -3241 -4759 -1477 1212 -1055 -3329 -1489 -367 -3319 -5293 -1967
687 -1967 1390 -627 -4424 -3292 -847 -2369 -4247 -1533 1695 -1453 -6264 -4542 444 31 -3453
702 -3453 -2332 1767 -106 -5994 -4701 2442 3241 -3291 -5610 311 2760 -2057 -3685 1480 3733
717 3733 -1724 -5079 220 4634 1444 -2426 -34 3137 443 -2023 1523 4962 1568 -2702 -283
732 -283 3605 2422 -394 1557 4428 1761 -2247 296 4890 3970 -524 -169 3188 2543 -725 570
748 570 4785 4116 -681 -1831 2181 3696 1321 134 1768 1604 -938 -1053 1994 3707 1401 -966
764 -966 -899 312 415 790 1880 1350 -747 -2020 -665 437 351 23 90 -419 -1586 -1994 -799 587
782 587 541 -821 -1805 -1379 -391 104 -817 -1034 -794 -571 -1595 -2119 -67 927 -897 -3450 -2395 19
800 19 460 -1029 -1419 -151 -1431 -2928 -2118 1381 1212 -1565 -2469 -1760 -1217 -2323 -595 1441 229
817 229 -3262 -3417 -258 524 -1769 -2243 867 46 -3812 -4029 861 2332 -1748 -4394 -1147 1169 -2188
834 -2188 -3863 -67 2352 -1179 -4968 -1729 2173 259 -3309 -2325 1002 -604 -3715 -1805 2163
849 2163 680 -3272 -2920 478 521 -2129 -1156 1304 183 -3210 -1757 2381 2136 -1802 -2285 558 1001
866 1001 -1554 -1454 2544 2652 -1023 -2516 131 2655 1237 -728 690 1763 -269 -1280 591 3002
882 3002 2104 230 -119 879 489 299 1626 2751 1051 -375 -45 1330 1417 735 1179 1672 686 -278
900 -278 334 1731 1515 23 -224 587 1102 452 71 249 703 248 -269 17 797 1026 -385 -1219 -718
919 -718 247 -53 -451 -381 82 -760 -1828 -1330 199 292 -571 -1138 -968 -818 -1353 -1167 -146 -390 -1684 -1675
939 -1675 -609 -373 -1540 -1292 -93 -402 -2455 -2431 25 1009 -1753 -2724 -850 718 -965 -2709 -534
956 -534 1431 -312 -3038 -1447 1098 962 -1666 -1279 590 432 -1631 -1346 883 1224 -895 -744 1030
973 1030 939 -670 -570 1286 1285 -651 -598 1173 1611 34 -622 1312 1815 -3 -723 1341 2477 622
991 622 -774 448 2348 1073 -179 515 1953 1144 -409 117 1783 1853 397 166 1406 1650 708
1008 708 143 1213 1592 711 395 1166 1306 417 306 999 1386 588 355 1335 1441 -137 -404 825 1564
1027 1564 476 -310 608 1061 561 -322 -390 882 1190 26 -458 190 474 3 -421 -83 480 -138 -386
1046 -386 -106 353 -399 -621 -248 -9 -619 -829 -47 30 -699 -1139 -469 145 -487 -1565 -489 153 -512 -1756
1066 -1756 -1128 122 -212 -1532 -1720 -100 -79 -1231 -2029 -521 360 -813 -1954 -713 313 -491 -1647
1083 -1647 -1290 1 47 -1358 -1335 -134 -28 -767 -852 -239 299 -594 -923 -298 -48 -785 -519 312 399 -850
1103 -850 -1309 407 576 -270 -943 136 849 -237 -760 -186 1310 1046 -703 -332 1138 874 159 -553
1121 -553 695 1271 537 -501 834 1066 570 139 358 1036 507 263 790 1055 818 52 913 1272 601
1140 601 -38 727 1474 706 205 513 1247 589 31 60 1362 871 -30 -261 993 1243 -15 -228 466
1159 466 981 87 -157 409 597 -36 -31 214 685 210 -332 -31 426 173 -350 -33 304 -399 -248 107 556
1180 556 -451 -1089 -100 237 -335 -1380 -610 512 256 -1152 -1472 59 108 -847 -1305 -242 383 -685
1198 -685 -1494 -961 289 -452 -1358 -1183 -104 -210 -1173 -1062 -525 -310 -1144 -1042 -451 -191 -1479 -1046 -464
1217 -464 -416 -957 -1102 -234 115 -880 -1360 -26 386 -855 -1726 -404 538 -373 -1347 -486 891 99 -1246
1236 -1246 -621 1065 659 -839 -424 964 735 -671 -754 864 1240 -138 -393 649 951 254 478 868
1254 868 1012 95 -125 848 898 130 462 1172 1127 260 316 1375 1668 562 -194 769 1517 892 20 1091
1274 1091 1688 1112 -267 365 1176 812 459 805 640 327 88 523 686 369 27 446 573 -361 -279 445
1294 445 584 -239 -823 10 898 136 -826 -590 163 15 -820 -251 56 89 -675 -774 -435 -122 -129 -664 -823
1315 -823 -828 -1087 -766 -467 -621 -659 -681 -939 -1333 -974 -228 -211 -996 -1038 -602 -719 -1246 -802 170 -141 -1032 -1317
1337 -1317 -602 -182 -724 -478 -252 -717 -1508 -1074 -2 -47 -1035 -1058 208 -146 -1253 -749 1152 572 -1288
1356 -1288 -1571 564 1004 -791 -924 334 1086 -819 -1457 667 1767 455 -962 -339 659 -36 -406
1373 -406 665 1430 -377 -858 435 1510 456 -56 824 1009 -352 -777 718 2396 856 -674 498
1390 498 1540 643 -366 1070 2223 885 -813 -308 1566 967 30 563 1218 473 -528 404 1710
1407 1710 956 -314 15 1122 1016 54 492 1551 222 -1014 38 1706 1147 -188 105 1093 381
1424 381 -892 -9 1980 1386 -831 -1206 372 664 7 112 792 511 -1212 -796 429 717 189 -99
1442 -99 -188 -413 -1428 -359 706 531 -1001 -940 -55 -478 -1027 -336 690 -3 -1809 -1519 -202 -79 -568
1461 -568 -847 -194 -905 -1184 -492 510 -354 -817 -448 -527 -979 -1372 284 507 -670 -1719 -739 701 -29
1480 -29 -1657 -325 615 -228 -1798 -313 1517 371 -1303 -1196 413 603 -611 -65 1344 323 -1848
1497 -1848 -1025 1221 1105 251 124 916 -33 -865 -15 2141 1370 -571 -419 823 1005 -490 455 2056
1515 2056 1328 -836 -978 936 1765 58 -172 1211 1238 -249 -543 1272 1742 216 -467 322 702 187
1533 187 19 1395 1268 -629 -618 1177 1360 65 -489 999 1262 -775 -870 1584 1776 -336 -1374 241
1551 241 1305 -4 -577 187 937 -505 -1022 102 1286 160 -734 -10 38 -488 -791 317 781 -426
1569 -426 -1156 -385 96 -256 -686 209 396 -901 -1434 -264 789 -18 -937 -697 -438 -780 -910 -283 475
1588 475 227 -760 -765 -556 -371 -319 -82 -139 -1277 -1132 135 -208 -739 -339 -11 -191 -1207 -801 378 387 -634
1609 -634 -909 -256 81 -327 -636 359 559 -511 -780 -238 279 219 -172 10 135 -465 -406 532 773 -526
1629 -526 -335 256 724 -268 -373 1027 1118 -116 -879 82 1203 376 -458 324 933 363 -483 504 1152
1648 1152 852 -195 38 773 557 49 338 862 693 -76 434 909 373 -48 440 892 410 -447 375
1667 375 1031 459 -295 -243 1027 446 -237 2 893 448 -151 -448 468 659 250 -160 231 354 -324 100
1687 100 232 283 -457 -154 299 336 -247 -383 144 -70 -677 -667 33 -191 -506 -523 -188 -3 -566 -729 -563
1708 -563 -16 -545 -681 -630 -344 -258 -501 -787 -243 -74 -482 -734 -572 -148 -465 -448 -872 -513 20 -383 -750
1729 -750 -670 -238 -344 -607 -638 6 -182 -477 -389 -470 236 -306 -296 -31 -143 -486 -36 207 -202 -446 -132 241
1751 241 -50 -310 -227 374 596 -88 -408 429 760 10 -163 34 673 445 -254 150 386 597 162 221 414
1772 414 491 808 300 516 350 484 696 513 325 -34 245 494 656 171 524 608 684 -41 242 647 796
1793 796 97 -247 643 585 200 -2 506 548 314 188 509 742 229 15 74 523 359 283 215 323 174 49
1815 49 81 157 39 -503 134 104 -41 -547 -79 457 50 -433 -191 72 -44 -424 -824 -333 -176 -584 -691
1836 -691 -152 152 -121 -702 -587 -210 -77 -704 -797 -308 33 -336 -406 -338 -331 -554 -827 -466 -154 -328 -515 -527
1858 -527 23 -86 -616 -279 -217 -291 -506 -263 88 -399 -333 -198 340 -29 -472 -182 6 -83 -335 -397 -111 376
1880 376 -176 -522 -115 352 11 -166 -49 739 -16 -169 -150 382 425 481 -245 76 278 266 397 183 98 99
1902 99 167 551 405 258 604 477 515 317 413 584 749 175 -111 516 646 298 -166 521 816 486 -120
1923 -120 280 582 821 143 60 407 374 83 172 55 270 363 263 246 217 -133 104 175 17 237 172 203 364
1946 364 -369 -200 94 238 -268 -353 -153 221 -187 -793 -303 289 178 -254 -519 37 -469 -681 -364 240
1966 240 108 -643 -575 -209 -70 -351 -353 -291 -334 -370 -466 -275 -497 -214 -307 -490 -536 -321 -352 -222 -254 -342 -496 7
1990 7 155 52 -273 -440 -241 -290 -539 -353 396 22 -27 -457 -34 -22 -28 -3 -266 61 197 8 -507 220 526
2013 526 274 -298 -339 404 712 -180 -58 277 43 141 95 578 619 333 379 312 37 -61 488 549 186 -20 69
2036 69 540 208 80 306 863 447 -76 255 802 773 240 -72 543 488 266 189 355 712 98 -226 329
2057 329 630 289 260 210 129 -298 386 957 562 -110 -151 211 151 -28 -277 755 536 -282 -763 -178 628
2078 628 241 -267 163 28 -364 -812 -52 232 -136 -625 -212 129 -226 -130 -86 223 -366 -464 -66 352 -233
2099 -233 -515 -172 -175 -445 -493 -181 348 -289 -784 -432 -64 -385 -449 -368 -136 -445 -792 -169 -242 -29 -254 -232
2121 -232 -433 -645 13 299 -52 -373 -349 -369 -226 -240 163 619 236 -1011 -623 -158 393 47 -183 242 374
2142 374 -443 -480 207 846 372 -205 178 159 -22 168 695 736 -7 -413 609 544 128 -123 610 937 -320
2163 -320 -419 469 997 188 -368 180 784 122 62 472 1016 542 -353 13 552 598 489 379 322 81 -18 432
2185 432 747 178 -345 101 252 176 -159 653 634 52 -228 142 270 -15 -252 -128 308 -129 -443 -187 335
2206 335 579 -478 -586 -86 96 -358 175 197 -99 -453 -421 201 146 -229 -66 -68 -530 -647 -262 222 82
2227 82 -657 -693 -276 26 -514 -409 -70 -123 -600 -704 -263 -140 -308 -250 -517 -700 -227 -58 -116 -256 -356 -561
2249 -561 -457 -518 -305 112 -60 -563 -825 -75 26 -220 -177 125 79 -169 -584 -308 375 8 -218 -169 -300
2270 -300 -251 -235 34 456 299 -578 -148 241 92 -238 239 416 -54 -278 493 764 518 5 279 425 37
2291 37 94 291 577 432 -344 -98 752 772 70 54 389 495 -186 360 615 191 133 -105 355 173 164 442
2313 442 633 429 139 120 703 410 123 241 332 272 -143 -107 467 692 -224 55 119 127 -92 -90 233 361 -264
2336 -264 -209 230 142 -5 -82 223 -77 -317 -227 64 238 -109 -374 -348 -13 -373 -441 -20 167 -419 -757 -320
2358 -320 -215 -33 -544 -290 -295 -271 -239 -154 -129 -134 -279 -260 173 11 -187 -302 -265 -525 -337 -72 -262 -228 -211 -127
2382 -127 -456 -389 -75 207 -298 -44 -336 -113 -36 -595 -167 154 -147 -204 -100 -194 87 -355 89 348 -4
2403 -4 -222 321 199 96 -165 -14 614 395 -87 -144 262 463 -85 -9 205 536 134 218 238 12 255 82
2425 82 169 58 433 217 152 277 107 428 520 558 38 152 326 462 143 -81 142 349 27 111 -86 619
2447 619 247 -275 41 379 177 162 87 560 152 -185 405 179 42 81 -37 156 62 -243 132 -185 -119 -154
2469 -154 -14 291 -160 -149 -4 -102 114 -298 -252 130 -103 -290 -283 24 -44 -124 -224 -223 178 -301 -371 -471 -147
2492 -147 46 -120 -495 -681 -211 -362 -284 -283 -1 -72 -607 -334 -274 -124 -395 -82 1 -332 -141 -81 -483 -463 -252
2515 -252 -128 -27 -40 -107 -119 -63 81 -199 -185 180 -64 -184 -199 -79 77 168 -31 -64 294 88 -54 229 -188
2538 -188 103 302 -43 430 154 168 108 319 407 176 -14 -155 761 163 136 4 45 173 259 672 256 -161
2560 -161 332 131 247 374 -163 -37 279 488 -110 333 491 307 -234 105 392 194 103 130 257 78 114
2581 114 18 136 10 -51 -150 -76 74 151 227 419 96 -111 -4 -43 59 -207 -200 -69 111 238 23 26 105 -19
2605 -19 -329 -221 94 -160 -205 10 -12 -97 -237 -457 -324 -94 -288 -459 -238 -496 -235 -276 -403 -399 -119 -358
2627 -358 -147 -196 -100 -175 -151 30 -370 -202 -31 -250 -26 -350 -140 180 -120 -213 -273 -92 108 24 -328 -37
2649 -37 -4 16 -55 -503 -232 222 -217 -331 111 211 34 -62 -169 144 85 -23 -84 120 316 -161 -194 206 85
2672 85 83 14 6 115 19 432 356 157 1 -5 226 59 -37 -66 249 450 164 -8 559 551 24 -47 92 383 193
2697 193 270 123 238 80 -90 164 433 15 353 148 63 83 -125 87 -112 -51 243 129 61 -232 18 139
2719 139 221 -79 -313 -199 320 -457 -115 83 -241 -113 -113 -314 367 -81 -535 -264 34 -130 -219 -294 -229 -261
2741 -261 -211 238 -131 -391 -445 -295 -72 -218 -361 133 65 -472 -468 -75 -64 -209 -196 -112 -314 -22 -530 -38 -68
2764 -68 -98 -280 -149 -48 -101 -91 -89 160 -123 -471 316 111 -598 -24 138 -128 -265 -228 367 42 -4 -320 212
2787 212 376 -410 -190 83 576 -171 -47 -76 344 200 -103 4 173 129 -353 86 589 71 -127 315 228
2808 228 153 155 201 420 74 -267 39 396 524 -141 63 452 214 -247 -41 618 218 176 120 19 78 -139
2830 -139 245 512 332 -241 -102 74 353 149 274 600 344 -235 191 359 123 44 -152 412 145 -470
2850 -470 53 529 94 -311 -419 -50 154 -431 -195 431 -108 -537 -464 511 151 -494 -274 59 -232 -233 -167
2871 -167 244 -381 -558 -582 -173 139 -272 41 139 -323 -339 -528 -3 434 -89 -788 -361 -224 -274 -78 -51 67
2893 67 -705 -413 -18 -48 30 -90 136 -196 -888 -82 199 253 -594 -57 206 -113 -274 -186 505 191 -514 -218
2915 -218 -43 -1 -184 34 199 -122 -263 28 355 296 -437 40 254 5 -60 304 628 32 -466 -384 434
2936 434 132 39 -64 458 410 50 -67 396 387 -144 21 57 319 171 281 374 644 92 154 167 433 371 3
2959 3 558 98 -184 -66 281 380 -66 -22 524 289 133 -62 121 373 146 -157 194 671 0 -53 89 282
2981 282 -82 -268 265 -4 -239 -235 149 -68 -26 -226 461 -12 -150 -338 -55 -102 -178 -451 -91 52 -250 -542
3003 -542 55 163 -93 -182 -430 242 -250 -378 -132 -59 -211 -124 -30 -26 -173 -221 -87 -46 -479 -160 -54 43 -470
3026 -470 -517 80 212 -313 -152 -249 181 -130 -605 -113 69 21 -113 -58 288 -86 -277 -140 -46 -61 -227 7
3048 7 243 -48 56 12 52 151 -91 -32 143 75 -225 80 195 255 -225 154 224 163 -181 -176 307 437 -185 419
3072 419 209 124 11 -459 151 99 59 127 68 56 161 235 76 227 325 -40 144 313 -5 255 254 53 39 411
3096 411 118 154 -167 18 305 223 -129 -39 -229 -52 144 -17 -70 193 280 190 87 10 38 -25 329 -44 -35 104
3120 104 380 -185 -316 -112 238 51 -385 -357 138 -83 -42 -418 120 237 -347 -247 -253 100 -49 -219 -311 -99
3142 -99 -288 -198 -153 -209 -425 -452 -245 -266 -46 142 -268 -77 -146 -228 71 -216 39 -133 -16 -452 -240 96 -219
3165 -219 -154 -6 -200 -110 12 187 -127 78 -58 270 -22 251 -47 -85 -209 196 80 139 161 88 51 179
3187 179 202 138 -117 240 -38 98 385 31 198 294 313 99 62 209 288 104 119 -89 211 223 434 57 -49
3210 -49 160 197 347 14 323 382 117 36 -176 13 338 227 272 246 -96 176 -106 125 31 -102 264 -100
3232 -100 27 -41 55 209 -122 8 161 143 -81 -268 -109 251 191 132 272 4 -40 110 20 -281 -93 -13 -422
3255 -422 124 -196 -56 -62 122 -213 -179 32 -254 196 -21 -223 86 -157 -266 -178 187 -378 -344 48 -422 -348
3277 -348 -160 -218 -280 -166 114 -113 -88 -284 -208 -21 -223 -259 -21 -166 -79 -121 -139 -257 168 42 -397 -123 36
3300 36 -229 -98 -213 260 189 351 156 -173 -101 247 -58 92 427 240 468 -174 350 264 82 78 184 36
3322 36 239 91 305 -27 131 181 161 370 260 -26 312 332 392 238 175 342 145 339 95 328 105 180
3344 180 112 189 50 301 -50 -7 95 358 157 86 179 158 -319 175 193 4 249 39 -126 -9 55 98 164
3367 164 116 353 15 51 112 -264 -100 -9 -150 -264 -104 -55 -159 -502 10 209 -268 -110 102 -103 -390 -285
3389 -285 -37 -60 88 8 -196 -509 -167 -60 -20 -256 -62 -64 67 -44 -246 -249 -28 -21 -425 -355 52 192 -310
3412 -310 35 -171 -283 -243 154 -268 -526 -157 91 -331 163 -149 -58 267 -124 -142 143 118 32 274 50 132
3434 132 142 38 -41 151 -86 297 -31 23 198 0 -18 188 331 -140 55 311 177 -192 182 156 219 63
3456 63 -7 348 187 166 -287 297 311 59 61 419 114 154 155 -25 447 92 -82 -50 80 14 181 119 181 120 -131
3481 -131 343 -104 -7 -155 -33 281 -173 17 71 228 102 -16 133 -80 -402 -180 324 5 -347 -498 131
3502 131 362 76 -147 -112 275 -28 -532 -59 238 -166 -285 -126 -220 -148 -130 210 -4 -256 -377 12 -207
3523 -207 -199 -259 -368 -60 -361 -390 -473 270 -229 -497 -157 16 -112 -545 -107 328 31 -288 -270 -336 -283 -421 -298
3546 -298 13 44 -30 -252 154 -216 -360 -156 -127 -178 -10 415 -39 -199 -79 -96 185 128 -407 -116 62 235
3568 235 -121 27 43 207 -437 -289 365 134 178 163 139 -121 -223 19 245 37 -117 22 202 128 -210 175
3590 175 313 407 -187 -28 307 306 -141 112 338 139 35 -1 -41 9 110 276 251 -17 -194 70 99 75 93
3613 93 -119 37 76 13 117 205 -54 -1 7 582 74 157 -86 84 92 -190 48 95 -176 -267 -28 -10 -37 -15 -381
3638 -381 57 -81 -208 -206 192 -306 -74 -112 31 110 -333 -253 127 -18 -351 -224 96 -315 -56 138 29 -63
3660 -63 -604 -120 -196 24 -147 -301 -440 56 -103 93 174 -25 -299 -300 -135 -6 -170 62 -7 27 -242 -139
3682 -139 -144 -49 -38 -340 138 -172 -172 -398 261 179 -173 -253 132 42 -210 6 -50 135 -150 -229 410 139 57 -124
3706 -124 14 240 -164 437 214 122 49 -134 217 202 -33 -151 296 120 135 -3 129 182 412 59 -11 -37
3728 -37 52 367 247 211 40 418 214 -238 -76 115 50 -204 -135 99 126 25 80 -90 124 140 -100 134 95
3751 95 -174 -33 -184 134 192 289 -44 -18 145 0 56 4 189 -170 -49 -1 10 -168 54 274 -39 -173 -171
3774 -171 -58 79 -250 -161 249 -49 -99 -347 -224 113 -66 68 -112 99 199 -341 -54 37 -146 -158 -27
3795 -27 121 -176 -264 -151 -182 -89 -283 -41 125 -246 -55 -120 -211 -211 -362 14 -75 -172 -123 -106 28 -66 -139 -287 -130
3820 -130 -8 -169 129 -129 33 -67 438 96 -117 146 270 187 -147 165 -155 24 -356 254 334 390 2
3841 2 54 78 507 495 -25 -2 -184 72 -91 4 61 4 15 272 -45 -130 220 80 192 223 -161 202 103 -116
3865 -116 183 317 344 257 21 453 286 90 39 203 233 277 160 -41 -328 137 40 32 17 -49 -20 79 209 -78
3889 -78 -47 209 -50 -84 -125 125 57 -135 -88 16 100 -24 -2 -253 278 206 -196 -112 -107 -42 -163 10 -95 -58 11
3914 11 -100 -49 -126 -5 -123 -92 -59 -142 12 -45 51 -110 -210 -148 34 -124 -178 -361 -114 -307 -239 -273 -326 -185
3938 -185 -346 -32 48 -74 273 -394 49 -84 -64 -163 -112 109 -76 174 -79 -89 -95 390 -56 144 8 -288
3960 -288 269 -60 78 345 38 -23 283 10 134 -57 171 52 403 336 -137 -119 -57 14 59 -284 60 101
3982 101 -180 72 -331 -44 215 238 -97 -15 -226 219 -45 84 184 80 68 78 243 419 -78 35 -110
4003 -110 24 -79 228 -41 20 -16 69 115 -139 198 110 156 201 99 373 -205 52 -178 -64 -193 168 187 -78
4026 -78 80 -204 181 -348 -30 -106 157 -44 -311 174 -84 -168 -218 -31 -1 99 -185 -168 -74 -253 -270 -121 89
4049 89 7 31 61 -15 -131 -238 -296 -258 72 -379 -394 6 -172 -183 -103 -21 117 45 -164 -119 31 200 -210 -73
4073 -73 60 9 -134 -47 -50 77 -39 -48 199 -68 197 58 59 175 31 270 73 -90 20 34 -8 27 -84 -6
4097 -6 282 225 145 276 -133 171 116 156 0 8 -188 457 492 116 93 27 101 322 215 -51 475 39 119 412
4121 412 90 187 -93 84 274 149 243 271 86 110 96 -122 296 194 169 -72 -86 -90 150 200 -77 -65 -210 183
4145 183 -88 -106 27 -99 23 100 -116 -215 50 -99 277 186 -251 -134 -180 -142 -108 20 -140 36 56 -234 -192
4168 -192 -1 -91 -10 67 -3 -108 -191 133 169 -260 -109 448 -46 -45 -173 -279 356 -295 -374 -273 48 192 -190
4191 -190 -232 -250 -281 -49 161 -87 -368 -77 -189 -23 -63 197 102 103 -284 -307 133 160 -130 -174 -186 -200 -236 15
4215 15 38 269 165 -313 229 193 58 -101 -249 -76 243 -235 -62 247 -37 -169 -74 200 203 129 251 -174
4237 -174 -163 -273 127 227 184 -118 51 215 -206 68 187 188 43 17 131 149 -10 121 190 75 7 119 7
4260 7 352 -16 -216 260 95 -23 -22 171 525 196 -107 -54 235 172 158 -87 -97 -108 -448 -27 -129 -56 -168
4283 -168 127 90 2 -350 33 175 -108 -11 47 52 -87 63 -86 267 -346 -489 107 207 89 -261 -223 134
4305 134 -23 -266 -78 -42 165 -202 -154 -67 73 126 -59 -31 113 -115 -155 -24 124 -162 -122 188 -382 -29
4327 -29 8 394 7 -18 -175 9 279 -255 -205 -142 290 5 43 161 16 76 160 34 -16 -144 58 24 -70 -96
4351 -96 -51 -377 71 52 -34 375 -104 -258 -220 6 275 -149 -268 -49 215 67 50 4 517 105 -115 255
4373 255 121 121 -64 26 164 -154 214 132 50 53 107 238 77 184 185 237 504 -50 282 154 78 -68 73 138
4397 138 385 -282 -191 -42 491 164 43 234 -14 95 -141 89 332 -130 -73 -16 -207 51 -271 -145 4
4418 4 -149 -326 197 -259 -163 -113 153 107 17 94 -107 10 -5 -302 60 63 -107 28 -261 143 -249 -278 -28 -79
4442 -79 -106 -170 -111 -220 -85 -2 -192 440 -63 144 -128 -27 -36 -375 -82 -73 -98 -154 -230 311 83 -179 22 273
4466 273 -106 13 -198 -201 174 131 132 -167 -54 130 309 18 42 178 -72 -378 -43 -155 183 -46 91 -84
4488 -84 193 -56 52 79 -32 -142 39 -54 -101 266 12 378 62 317 -10 40 -71 197 -233 167 274 334
4510 334 315 180 -147 536 167 -82 168 79 -46 247 282 32 233 479 38 -104 73 -113 177 272 54
4531 54 267 -225 293 -275 168 -84 81 91 -200 2 14 115 94 -242 173 -76 -107 -74 -261 207 -227 -148
4553 -148 -171 220 -64 -338 -343 -47 -197 -277 -391 -159 142 -354 2 -309 54 129 187 -26 -176 -73 -87 -139 -73
4576 -73 -203 64 -172 -21 -277 -143 93 73 -31 141 236 -253 -175 -98 79 228 14 -224 -266 65 82 -76
4598 -76 -79 66 11 131 -50 102 -52 109 -65 177 208 118 30 -180 108 165 -6 77 93 150 207 301 131 124 -140
4623 -140 112 62 46 -92 33 308 -214 -9 -26 337 290 118 104 137 -48 28 11 98 -65 25 -88 34 73 -59
4647 -59 -1 -120 107 -213 -158 -151 61 28 -306 171 -32 -50 293 204 132 -134 81 -101 11 -3 59 95 13 101 46
4672 46 -225 170 -101 59 -446 -35 123 76 -73 -21 29 105 -47 -74 35 -17 -5 -326 -219 -99 -45 -110 169
4695 169 -237 137 -147 90 -94 -88 44 83 -107 -355 244 154 -33 -293 -217 109 98 46 -217 137 -160 -31
4717 -31 194 67 -25 -34 68 -278 -27 181 -56 -108 -72 -69 -19 -91 486 -197 -26 11 -150 -29 -56 72 -108 -17
4741 -17 42 71 253 395 69 28 6 80 -107 112 211 136 167 133 132 -86 -105 188 5 -73 -357 71 294 -304 142
4766 142 -15 126 63 41 49 98 122 -141 24 20 271 195 79 247 106 233 50 264 221 49 -48 -11 68 -14 253
4791 253 40 -95 -332 28 72 -10 -3 -195 -74 -89 31 356 117 -381 -149 -187 -60 -239 -172 -54 -6 -373 -239
4814 -239 -156 -108 142 -288 52 7 -103 -89 -206 140 -139 166 155 -92 97 -115 -63 23 -334 -68 -78 -18 -388
4837 -388 -271 159 150 36 -213 120 -34 243 -153 -6 44 31 -100 35 52 -57 -159 255 -62 -191 114 -120
4859 -120 -146 -317 98 45 -61 63 -293 232 236 -74 136 -251 -129 68 -165 57 59 29 -119 133 226 -73 248
4882 248 -29 -91 2 -70 170 -92 139 79 -178 266 120 -65 -210 135 189 226 -233 62 -108 -150 102 266
4904 266 17 20 74 -153 -48 -55 -167 74 6 277 137 -249 107 101 -1 -120 -144 184 39 -49 -30 -9 5 77 190
4929 190 -282 -195 -215 -203 -137 -270 -138 -101 91 36 159 -103 81 91 46 237 -55 -52 138 178 -242 -210 58 -201
4953 -201 252 145 131 195 -51 -11 -345 -22 199 -274 -186 72 -166 8 -50 119 -155 -306 -45 -29 67 95 -27
4976 -27 -16 -62 -79 -134 -149 -36 122 86 133 -113 157 2 -140 59 -28 -311 -32 33 -55 238 -98 -173 -370 26
5000 26 -68 -2 -1 58 104 78 146 312 -167 92 -42 158 -109 -135 332 82 -6 -224 -240 258 120 181 89 -68 106
5025 106 -37 218 285 257 124 73 92 -7 -108 42 33 283 153 -45 82 153 -87 -177 -8 19 286 60 -56
5048 -56 64 110 86 213 -113 -15 206 -62 -16 -238 -112 137 18 145 -357 -332 -35 -178 40 43 76 73 54 217
5072 217 -28 40 -88 -142 4 -217 112 194 42 -205 -22 -3 -27 -71 -8 21 11 284 -28 -353 52 64 -140
5095 -140 18 -76 -7 -163 171 -305 -76 -168 -75 -24 138 -6 21 47 -281 -384 -245 44 -235 119 53 136 17
5118 17 -140 235 5 90 15 208 94 -170 -43 -149 65 -181 358 -71 -38 -86 12 115 278 -70 -343 23
5140 23 409 -235 199 483 -32 172 -35 250 219 -2 399 104 154 138 235 -57 227 -37 -227 23 115 -192
5162 -192 -94 29 189 -127 -11 239 210 -348 132 39 252 109 333 203 84 264 -51 -72 101 -315 -168
5183 -168 16 -84 81 -128 123 -3 -224 -98 68 -141 -215 148 31 -26 -31 -131 78 -96 -250 -157 -395 138
5205 138 -116 -101 95 116 -48 -46 45 -57 -260 -15 183 -61 -257 -2 -126 173 -136 254 82 -95 97 -175
5227 -175 -34 -23 -414 -168 5 -50 133 17 23 -117 9 -136 21 89 -268 -99 -135 393 -36 72 51 -274
5249 -274 151 71 19 -52 49 -33 228 -222 -116 -199 60 -132 -80 113 16 434 -44 -7 -34 246 1 -154 4
5272 4 -9 -76 -23 10 16 205 26 134 -176 197 -540 80 23 14 9 55 -18 37 -390 81 -3 -169 126 -19 333 118
5298 118 41 383 -169 202 302 -57 11 73 -68 -230 268 -110 146 245 186 -91 207 49 165 -161 -208 31
5320 31 167 52 24 95 -332 -47 -16 -256 -118 -105 201 -138 -105 -35 -58 -71 -60 47 -106 -149 10 21 92 -75
5344 -75 -79 -10 -65 244 -131 -194 -335 22 -203 89 -181 -14 -80 -50 51 -59 198 -120 -96 -239 -72 -76 -43 61
5368 61 -100 -19 -219 -117 -28 -33 -86 123 239 3 23 -39 305 -26 -40 109 -124 93 44 -79 26 -66 330 -154
5392 -154 -96 -114 114 -320 -154 72 -100 222 302 128 142 -106 -60 310 176 -93 -227 229 5 209 201 116 -49
5415 -49 -76 14 -4 239 -271 -196 112 129 8 197 69 -21 -90 -217 124 -2 82 78 -297 -145 67 12 109 -138
5439 -138 -181 133 -20 -251 122 -38 -26 -63 179 -236 -122 -264 -108 70 153 119 25 23 -76 -228 -83 109 68
5462 68 -90 52 -175 146 -62 -69 352 -198 34 -50 -58 -156 -29 -71 40 -106 -24 63 -101 -228 -140 187 -198 136
5486 136 152 79 223 -15 -169 -64 -2 141 87 13 -158 107 -429 117 171 -170 152 125 -258 -21 51 -203 25
5509 25 -45 -1 28 217 -122 -49 -104 143 47 101 -28 -27 -167 84 176 116 59 36 66 -118 -127 -24 252 -60 -95 -70
5535 -70 38 250 -44 248 159 20 137 2 -43 -495 -131 35 161 155 -93 -62 -17 -107 160 6 -88 -31 257
5558 257 -13 -47 45 -28 -36 -75 -38 221 -152 -39 149 -89 86 -141 530 190 -104 -314 -31 -298 32 23 -144
5581 -144 384 -104 -261 -232 230 -89 106 -9 -333 93 -18 -132 94 88 -227 -9 179 -162 241 -95 193
5602 193 -26 -127 -184 -54 -49 -110 -92 -219 -14 66 155 54 -162 51 291 45 32 -109 -132 65 -258 -308 -67
5625 -67 9 211 -132 -104 116 -120 96 72 134 75 60 104 132 42 314 312 -144 -112 -82 -107 110 -28 56 179 -131
5650 -131 187 -233 109 -69 31 440 -110 441 340 70 3 303 -239 -125 -16 197 180 298 278 -42 119
5671 119 254 -61 256 244 -119 233 101 -72 74 -254 129 212 -218 97 88 224 62 95 -24 367 298 -201
5693 -201 -376 65 -118 -165 -30 -198 405 299 70 -31 121 -117 97 102 -64 -177 149 -30 -277 194 69
5714 69 86 -128 44 -273 9 250 106 32 36 -165 0 69 -299 90 -2 -58 -190 -156 -106 72 102 20 -451 -241
5738 -241 -338 -63 -287 -12 70 -379 -149 102 -135 -4 -7 144 -243 -397 -152 -42 68 -29 -242 -28 -55 -184
5760 -184 8 -17 -15 -205 21 137 124 -125 58 -35 -19 15 50 -118 124 -222 -104 -84 181 58 -51 148 -332
5783 -332 -175 -41 126 128 -26 54 -131 -103 -78 -156 39 212 -135 -156 -120 188 -11 -269 74 403 103 210 208
5806 208 72 307 114 131 352 -54 37 220 -346 -191 -17 150 173 246 17 -137 -118 204 -12 325 -96 103
5828 103 -133 79 -165 -60 -57 -101 -218 193 123 -229 -33 -24 -96 -124 115 153 130 179 178 135 -4 -179 -67 -116 -99
5853 -99 44 244 272 -55 -216 -349 112 44 105 -37 -134 -90 -14 -93 -256 -151 -121 76 -13 -129 179 185 90 -211
5877 -211 153 -18 -209 -58 -176 -307 31 -92 -176 52 -28 -78 -107 167 -267 126 118 243 80 18 163 55
5899 55 62 -3 28 -148 -297 17 -87 -98 -62 122 258 119 117 119 156 78 -187 42 -95 -115 176 -115 -530 -69 233
5924 233 198 -236 1 -133 -66 154 140 159 94 -54 187 320 48 -225 37 114 -93 222 137 28 167 -31
5946 -31 189 254 106 -286 -205 -45 -28 -72 127 -190 60 87 92 11 -206 97 -153 -130 28 167 -292 -48 -189
5969 -189 -212 267 -145 128 124 -16 -80 102 54 -168 -172 -322 -86 -117 5 -166 43 -267 -23 163 135 -99 -267
5992 -267 0 -211 -176 -120 206 -134 110 71 -213 29 -14 -107 87 -161 -182 -238 69 39 27 -169 28 80 88 260
6016 260 -2 -218 335 -121 -136 22 -182 29 -114 -78 144 93 164 161 -112 262 -239 -2 87 -223 213 112
6038 112 -76 -37 161 79 102 -232 -127 217 -70 217 -34 -168 103 247 121 186 -240 245 285 -20 100 -37
6060 -37 -18 -243 15 111 -8 -74 -65 146 -171 -73 -54 53 63 202 -162 -102 275 -33 46 335 224 -154 117 24
6084 24 -83 196 38 -50 -199 -147 -242 -57 107 -18 -147 -223 -229 15 -8 -300 -111 -140 57 4 69 16 -126 208
6108 208 -122 164 124 24 -252 -108 -41 -165 1 -52 211 89 -79 -340 -211 75 -28 -278 3 180 119
6129 119 6 129 205 4 -240 -71 -250 -40 289 -13 295 -35 -222 -109 -276 -226 -88 -41 -52 -55 -236 -19
6151 -19 -126 63 -2 -42 -104 82 -388 386 97 -146 34 291 174 412 -482 186 77 49 -319 -17 -170 393
6173 393 101 -119 -180 -34 50 71 87 -364 109 -185 104 -176 86 303 64 -249 83 -44 93 30 78 129
6195 129 -122 11 6 -42 -11 40 -87 96 254 257 327 -5 -103 -139 92 -9 -225 -191 98 114 96 -46 192 179 214
6220 214 129 -91 -71 -101 60 338 189 -204 -202 -188 -121 57 28 128 119 -62 -115 -117 256 23 -50 -137 20 17 -137 7
6246 7 0 -8 -57 146 -39 6 -39 119 -299 -131 225 237 -283 -66 -32 61 -148 -59 48 87 -201 44 -331 -331 54
6271 54 30 -10 -216 83 -61 -81 194 -31 -71 53 -13 -94 -130 -2 -22 115 198 210 110 18 215 122 161 -156 344
6296 344 -133 -63 10 149 -29 181 175 202 83 23 163 -198 -123 -15 -109 -137 84 431 -28 174 84 40 -56 94
6320 94 -196 -268 -133 -183 95 -76 -95 365 -122 -1 -186 -44 -166 -132 82 -291 -157 -206 -29 176 1 59
6342 59 -232 33 -34 -227 159 53 119 -112 -192 -142 24 76 248 -273 -202 3 133 -9 -78 -22 1 -165 -64
6365 -64 19 -19 -103 -243 -3 97 -3 13 -149 -157 62 30 -155 -71 -169 8 14 -166 -177 -9 39 154 -216 -219 -228 -163
6391 -163 -164 46 -71 17 49 171 -103 -120 -25 -103 -49 -192 -124 -181 152 -124 -17 239 -150 43 1 190 216 -66
6415 -66 278 -6 61 -302 48 -54 47 268 -152 157 -30 129 -52 316 -100 12 59 301 74 -71 92
6436 92 -94 69 -79 234 203 -28 25 24 177 286 151 186 44 53 58 -161 39 267 -292 107 308 314 87 -60
6460 -60 29 267 146 -49 116 42 -101 -164 190 -108 100 136 57 318 244 -225 -7 -219 48 -69 180 336
6482 336 -72 40 -21 127 -46 64 191 -197 -175 -55 -58 64 -288 -129 -18 2 -167 145 242 -337 155 -85
6504 -85 -205 -54 -30 318 287 16 44 208 16 78 73 165 42 25 -11 75 -55 54 -251 -202 30 -115 -52 -241
6528 -241 49 421 -39 81 125 128 -100 -172 197 26 242 -57 -119 35 -99 56 -82 38 252 24 40 78
6550 78 87 26 3 -33 -98 111 41 31 88 -155 -9 92 -3 28 18 -50 63 69 90 -43 -141 -79 161 118 25 35 -146
6577 -146 98 -106 -236 83 450 -94 150 -137 364 -198 4 191 -160 101 -418 430 134 -94 6 10 32
6598 32 48 -31 261 194 -193 80 -19 105 83 -106 -178 -85 244 66 47 19 -104 -23 212 272 266 -30 -70 -155 -149 -142 121
6625 121 161 191 11 169 318 -82 184 6 87 26 161 76 -82 40 92 -166 -368 108 6 -273 -272 101 -96
6648 -96 289 -99 -141 -21 129 -72 -214 83 412 130 -162 -80 20 -219 -46 95 71 246 165 -113 -175 -112
6670 -112 147 94 -201 43 124 88 -85 -29 97 53 250 228 209 75 92 432 -116 25 68 106 24 140 74 150
6694 150 -81 87 -263 119 -139 -279 262 276 83 -1 54 214 334 -14 53 -51 -107 146 153 -308 67 -18 138
6717 138 -269 -31 102 27 127 -75 13 -532 -127 147 -6 179 -140 -151 -95 -194 92 -58 158 -66 35 187
6739 187 112 136 -290 183 283 -66 95 295 -28 -161 -114 -7 81 364 19 34 -197 -17 42 -86 -42 -7 -187
6762 -187 -55 -113 237 -227 35 -204 311 -71 -96 -28 89 64 156 161 106 -37 -305 -45 -46 23 49 -183 21 22 -55
6787 -55 147 -162 55 50 -147 -221 -108 -298 72 -94 -174 -65 37 151 -170 69 -154 -4 37 -267 -45 120
6809 120 7 -90 -29 4 -9 -123 32 69 82 -86 89 146 -364 186 152 -239 80 87 333 125 -160 189 -104
6832 -104 -101 89 169 82 -246 88 185 17 84 456 267 -3 -2 -287 -41 30 -56 155 86 311 -39 154 -239 -183
6856 -183 35 130 -162 -11 75 -12 -16 133 -65 -1 95 130 161 -212 -140 -31 36 -354 47 265 229 190 153 -362 -208
6881 -208 -148 95 35 -202 -59 107 -6 -84 46 -147 -191 -210 -67 -134 -410 -104 143 -247 -249 -32 -40 -199 128
6904 128 30 -85 60 4 -89 -132 -29 236 37 63 -362 -68 74 -95 -379 28 37 157 -111 22 -91 -102 47
6927 47 -215 89 81 -120 295 119 -238 -45 317 313 225 -75 -217 56 -122 231 50 56 121 -83 -105 280 -13
6950 -13 -157 67 79 -83 116 189 256 134 367 108 30 275 -95 -200 -19 -122 47 4 58 -26 -193 -140 -86
6973 -86 103 376 151 -316 28 -109 -81 105 9 86 -351 1 -46 284 -289 -97 7 -71 43 -122 0 402
6995 402 82 -28 -19 -217 137 22 -197 -241 -92 161 170 -37 -143 61 98 -9 -297 -48 125 -136 151 165
7017 165 -3 128 -100 170 -210 36 -254 138 -173 -156 191 -60 38 -335 35 -165 -40 22 -81 -50 -35 -46
7039 -46 62 130 -215 94 115 -66 -72 -14 -54 166 234 68 -55 33 14 145 -82 175 -72 -63 -38 -72 -229 -118 -289
7064 -289 273 205 -20 43 -22 98 -169 -150 102 47 5 39 -133 -86 93 19 -291 126 215 -205 -107 -9 -295 417
7088 417 -179 184 -25 198 -184 155 6 191 64 -22 -69 153 -37 54 42 357 -283 -18 20 -187 40 -103
7110 -103 -151 -22 -231 -95 105 61 189 -7 77 28 90 -87 114 52 6 -40 -81 106 -206 10 60 105 123 -186
7134 -186 80 144 203 50 200 -149 217 -121 -55 -165 -120 130 23 19 -98 147 -259 -178 -227 122 -348 -7 -156
7157 -156 15 266 49 19 -479 -115 -303 -134 -29 71 -185 -58 -438 30 53 -91 -265 51 112 -310 308
7178 308 124 -408 -29 -90 -255 119 -226 -67 -194 20 -3 -99 40 287 109 1 -191 16 -29 -104 -179 115
7200 115 178 -281 -6 98 -12 -10 154 27 -128 81 -150 -9 -32 61 60 101 28 57 61 157 23 69 139 380 -49
7225 -49 -43 295 -282 176 -213 -45 12 53 136 -16 26 219 -30 1 336 -223 -51 5 352 -152 -54 -11 -99 -154
7249 -154 143 205 -119 104 -257 329 -94 -61 262 -74 46 1 21 106 77 -30 -74 -159 62 -194 -65 189 -88
7272 -88 -83 4 -108 -215 21 -320 330 48 -111 29 -206 33 0 82 -37 23 193 -50 177 373 13 -39 49
7295 49 -19 88 -77 -195 -9 -179 128 -17 -176 -311 183 -86 -177 -82 74 -29 -53 -174 -38 4 -10 -190
7317 -190 32 -239 241 -16 -238 -62 -32 34 267 32 -214 127 -169 170 464 -37 -58 195 89 23 -128
7338 -128 -7 -98 59 -246 44 160 -103 121 -92 22 325 -66 108 59 276 -185 -157 261 248 364 147
7359 147 305 49 128 67 -81 -120 183 125 257 150 -57 81 19 82 -131 95 -43 -131 21 -109 23 -68 -78
7382 -78 81 194 -166 102 69 -85 288 -89 11 151 -127 -196 42 -227 98 113 8 -12 -390 271 -123 -98
7404 -98 18 -210 -68 23 -185 -168 -288 87 11 -44 75 16 -165 -222 117 112 -123 -4 154 -24 223 60 218
7427 218 -149 -32 -177 52 36 293 31 -15 115 -114 -219 -352 -117 60 82 89 133 287 -92 16 15 -223 -7
7450 -7 -168 131 19 182 18 60 10 107 170 220 146 -170 196 -59 -250 139 -248 264 60 -191 69 -45 -284
7473 -284 -305 225 161 -150 84 -132 299 113 195 205 -189 34 0 217 230 -339 -35 95 18 225 120 387
7495 387 -113 73 -451 -29 253 -105 87 27 114 28 -172 -128 -114 -142 -174 24 -7 291 -159 42 -234 29 -63
7518 -63 -99 150 39 28 -50 80 -110 -21 -16 0 -370 67 142 -177 152 155 -67 -11 -36 -17 173 142 -394 -121 -299
7543 -299 19 -167 -225 -150 45 -238 -109 -265 -119 -50 -320 11 -41 46 -12 -52 -269 100 150 29 -93 -210 -121
7566 -121 37 -43 30 52 145 39 -201 -68 -224 -107 -67 58 -97 13 -144 117 -13 27 33 226 209 109 -177
7589 -177 -364 188 472 -39 -84 -127 -117 73 -60 -61 -408 45 -51 97 -313 26 23 64 -109 71 -182 95 -43
7612 -43 -148 -45 -107 140 372 -136 -174 -41 196 -70 -262 -39 156 -89 -40 188 176 185 140 89 91 240 -6 95
7636 95 172 140 -185 -191 229 -103 -186 -179 -14 -34 -147 -137 232 263 -31 -199 167 34 -86 -87 7 11 267 -41 -156
7661 -156 -220 -145 2 166 -294 -119 67 -60 -192 271 -32 -128 -24 79 60 -175 -44 3 118 31 457 -131
7683 -131 47 28 82 -55 35 -121 169 -283 -293 388 38 -90 85 -92 -57 -39 -83 -50 -15 117 -36 157 5
7706 5 -29 176 -2 77 -202 83 225 -65 41 121 9 154 -89 112 361 184 -63 -88 234 -52 152 -47
7728 -47 25 -39 -265 -95 -340 -311 98 16 227 17 -234 -78 15 150 -49 121 179 110 -156 148 249 219 221 85
7752 85 -65 308 -237 -256 246 11 7 -157 -57 143 -247 -246 186 -44 -18 -111 353 157 223 16 148 -210 132
7775 132 -110 2 -72 116 -255 56 -88 142 -67 -140 -22 -53 -77 112 188 42 -254 276 -161 -17 47 -52
7797 -52 204 -99 112 -254 58 182 72 197 59 22 56 -134 -138 -25 71 -29 -176 -26 129 -22 -40 167
7819 167 -268 -66 26 -148 -252 -74 64 258 -368 81 -88 -99 -166 -78 188 -154 42 18 -63 112 -245 36
7841 36 -60 30 -53 4 -142 68 -62 28 35 58 -85 -210 -4 -56 18 216 -222 -193 -18 124 128 89 -96 78 43
7866 43 112 -338 -98 97 -201 -133 87 -463 48 45 268 354 74 11 -275 187 -61 31 -337 -21 87 92 21 -4
7890 -4 -81 268 22 -22 125 141 -29 157 -2 -192 -297 -56 217 -85 243 230 39 20 9 12 -424 45 266
7913 266 97 -57 -126 -86 -31 -43 82 -73 28 24 -425 -101 40 6 -101 88 261 -150 -93 -94 225 3 105
7936 105 50 -80 -209 -311 243 -76 -318 84 -47 -140 -51 167 -264 31 -134 -220 34 -270 51 -36 -40 60
7958 60 224 87 320 173 23 -345 -133 73 15 -81 9 89 88 -251 3 112 45 99 -17 109 -77 -137 -28
7981 -28 41 219 171 -144 74 322 128 -152 -21 -49 -199 398 71 180 -8 -132 -5 188 296 -118 337
8002 337 102 26 83 261 -171 -101 31 -110 95 24 65 99 104 87 -137 9 178 14 -130 -226 120 59 230 -133
8026 -133 50 1 -382 13 -74 -110 -305 120 -67 -55 -12 -14 -52 242 -93 107 199 7 -328 -25 -29 148 68 193
8050 193 209 -167 -78 -47 52 -69 -123 -188 -191 -72 165 -9 -160 37 -214 42 -222 -202 327 -119 -70 67 -283
8073 -283 120 58 -240 39 -221 146 -11 30 -158 -229 -28 -63 -201 -79 189 104 195 82 44 21 -100 -82 296
8096 296 289 158 47 60 -446 -69 196 -102 -104 -186 3 306 299 -88 52 6 -102 -93 283 -172 101 -55 154 -181
8120 -181 -25 -54 74 43 -177 223 102 -96 19 86 35 -147 -295 97 -140 54 154 -185 -87 228 200 62
8142 62 84 219 212 64 -168 352 -213 62 144 -183 33 -89 104 6 -108 82 200 -58 -59 32 267 171 -57
8165 -57 -171 246 -16 163 -129 70 -35 -13 -180 -238 -40 -19 -129 161 -250 27 -110 207 59 -19 43 43 262
8188 262 85 149 -196
8191a96
$$ Imaginary data points
##PAGE= N=2
##DATA TABLE= (X++(I..I)), XYDATA
0 0 0 0 0 0 0 0 0 0 0 -7 8 -8 8 -8 16 -16 17 -24 25 -32 38 -41 49 -57 65 -76 86 -98 110 -124 140 -158 176
33 176 -196 220 -245 274 -305 337 -373 414 -457 506 -559 620 -688 767 -854 953 -1071 1210
51 1210 -1378 1584 -1846 2189 -2664 3364 -4502 6677 -12322 57095 117683 -6626 -29311 30639
65 30639 54061 -16612 -22896 52308 80513 2233 -35982 22053 64400 7710 -33599 15820
77 15820 65711 22632 -28922 -2431 41992 16962 -18541 10872 51909 20626 -30336 -13732
89 -13732 33856 22470 -20104 -9437 35072 28744 -15570 -17643 18375 16749 -17933 -12245 31017
102 31017 32021 -16758 -33967 4291 27048 1210 -15466 8124 20508 -8020 -25913 1914
114 1914 25450 1902 -25454 -7833 21463 11711 -15285 -10253 12694 6508 -17457 -13308 14346
127 14346 14625 -12237 -16747 7502 14530 -9765 -20349 3814 20223 -1464 -23216 -8804 12534
140 12534 2535 -15787 -4089 15716 3249 -25329 -20112 9191 11112 -14248 -19402 3322 9775
153 9775 -10568 -18593 324 6102 -15358 -23312 1248 15523 -5170 -23698 -9010 5969 -8313
166 -8313 -22037 -3952 14230 -3901 -26912 -13602 10212 817 -21915 -11117 14352 5452 -23978
179 -23978 -21074 8079 9349 -16541 -17439 9279 12416 -15855 -21829 6537 17286 -7778 -19837
192 -19837 4165 18803 -2335 -18083 1026 16842 81 -14174 4464 22343 4416 -17383
204 -17383 -4730 17085 9238 -7895 2527 21195 9367 -12990 -4751 18986 15006 -7204 -4959
217 -4959 17462 16545 -5734 -7936 14466 19003 -1786 -9738 8590 17283 383 -9274 5892 17284
231 17284 3572 -8988 2143 14237 4492 -8990 -2029 10278 4418 -6776 -983 10661 4315
244 4315 -10063 -7943 6176 6376 -5721 -6549 4413 5126 -7154 -9911 2054 6746 -4639 -11606
258 -11606 -2100 6020 -2715 -11010 -4037 5168 -380 -10680 -6071 4666 1418 -9162 -7953 2909
272 2909 3073 -7656 -8374 2133 4677 -6056 -9506 -83 5243 -3496 -8344 190 6146 -2611 -9670
287 -9670 -760 7865 1000 -8798 -2636 8069 2642 -8952 -4621 8798 6091 -7424 -5722 8824
301 8824 9225 -5737 -9468 5105 10641 -2017 -7968 3380 10940 -207 -8641 749 10874 3299
315 3299 -7256 -840 8723 3276 -6633 -1448 9836 5570 -5235 -2930 7283 4317 -5592 -3314
329 -3314 8198 7539 -4445 -5884 5427 7641 -3373 -6572 4693 8920 -2081 -8120 2134 8617
343 8617 -152 -7796 299 9425 2037 -7987 -2641 7253 3484 -6685 -3732 6255 4710 -5702
357 -5702 -5212 4496 5135 -4009 -5748 2842 5141 -3235 -6277 1726 4814 -2069 -6422 716 5157 -2032
373 -2032 -6982 -683 5144 -510 -7689 -2091 5364 414 -8065 -4616 3914 2022 -6561 -5273 3015
388 3015 3067 -5732 -7010 901 3127 -3953 -6743 -174 3110 -3425 -6965 -1053 3082 -2055 -6389 -1430
404 -1430 3175 -1851 -7201 -2027 3980 85 -6410 -3486 3741 682 -6608 -4255 4192 3355 -4872
419 -4872 -5347 2923 3854 -3940 -6089 2098 5486 -1712 -5940 366 6041 436 -5501 -708 5653 1443
435 1443 -4987 -1911 5436 3450 -3095 -2092 4446 3923 -2832 -2505 3868 4100 -2043 -2458 3856 4783
451 4783 -1531 -3003 3280 5537 -1377 -4495 2754 6944 86 -4760 1489 6976 1694 -5234 -584
466 -584 6974 4015 -4292 -2510 5612 5076 -2718 -3100 4404 5520 -1763 -3788 2680 5196 -240 -2989
482 -2989 2348 5303 -43 -3626 1262 4974 1139 -2760 666 5087 732 -3670 -478 4375 2141
497 2141 -3060 -648 4676 2121 -3470 -2178 3604 3517 -2019 -2663 2860 3563 -1845 -3565 1643 4118
513 4118 -837 -3555 149 3283 -194 -3420 -555 3094 451 -3123 -1157 2020 254 -3162 -2070
528 -2070 1973 651 -2965 -1994 2089 923 -3714 -3538 1248 2189 -2686 -3437 1188 2647 -2181 -4728
544 -4728 -168 4130 244 -4522 -1584 3458 990 -4177 -1965 3789 3254 -2794 -3115 2609 3386 -1280
560 -1280 -2338 2899 4009 -811 -1965 2880 4818 -106 -2392 2318 4882 1037 -1886 3046 6039
575 6039 1381 -2889 2241 7326 3401 -2613 1091 6573 3563 -2720 272 7382 5708 -1977 -1264
590 -1264 5903 5848 -1246 -2378 4596 6332 -216 -2548 3617 6195 409 -3535 1240 5340 1145 -2399
606 -2399 1115 3827 -184 -3954 -329 4203 1606 -2984 -1544 1495 -1162 -4628 -953 3522 818
621 818 -4986 -4473 68 -191 -3467 -3057 1018 240 -4710 -5282 -1447 897 -2564 -4532 -2523 -1168 -3310
638 -3310 -4553 -2217 -639 -2410 -4035 -2875 -1242 -1984 -3241 -2143 -1576 -2855 -3861 -2249 -168 -564
654 -564 -2887 -3125 -1337 -707 -1764 -1979 -49 162 -2118 -3743 -1217 1837 809 -2529 -1771 800 146
671 146 -1797 -1351 1525 1763 -2592 -3483 838 3578 392 -2347 -276 1851 -830 -2576 1174 4135
687 4135 1070 -3035 -1410 2365 1087 -1277 938 3792 523 -3691 -1594 3937 3294 -1456 -667 3076
703 3076 1417 -3463 -1623 5050 4806 -2369 -3792 2237 4575 -353 -2550 2300 4197 -1364 -3778
718 -3778 1487 5769 1511 -2909 -67 3353 1362 -1638 1528 4345 534 -2826 -138 4122 1976
733 1976 -1190 770 3346 564 -2565 310 4637 3042 -1917 -1607 2488 1783 -1089 -121 3151 1748
749 1748 -2609 -2731 1843 3219 74 -1545 1 469 -1551 -1399 1288 2306 -1031 -3078 -2215 -96
765 -96 -327 -459 81 -1247 -3032 -3485 -1861 -627 -1219 -1921 -2485 -2560 -3198 -2964 -1637 -1191 -1921 -3356 -3923
784 -3923 -3236 -1859 -1867 -2821 -3555 -2779 -2703 -3273 -3543 -1604 -1274 -3478 -4782 -3755 -748 -888 -2785 -3389 -2348
803 -2348 -2650 -3364 -2139 579 -240 -3103 -3592 -1595 -631 -1338 -717 989 -257 -3141 -2725 1244 1798
820 1798 -893 -1284 1309 1180 -2381 -1880 2795 4191 -580 -2746 1335 3416 453 -1435 1977 4708
836 4708 710 -2596 1293 4936 2570 -1314 -16 3367 2462 -697 1448 4553 2814 -1443 -558 3387
852 3387 3075 376 703 2932 1716 -665 633 4115 3574 -396 -1344 2339 2631 -232 -109 3062 2927
869 2927 -1042 -2024 1369 3643 1007 -953 459 1282 211 -1003 881 2568 1054 -1333 -1097 416
885 416 341 -59 1011 1357 -28 -1554 -423 801 917 -345 161 494 -367 -1343 -362 1149 562 -904
903 -904 -1039 43 605 -24 -308 -108 293 -296 -708 -8 644 445 -705 -1024 -268 590 180 -798 -359 28
923 28 -365 -1059 -527 680 668 -182 -872 -115 218 -228 -242 618 597 -845 -801 414 557 -443 -481 279 450
944 450 -1357 -759 1532 1644 -628 -2001 204 1871 289 -1215 600 1896 225 -2149 -333 2089
960 2089 1629 -951 -817 1515 1236 -784 -639 1672 1679 -595 -667 1304 1396 -117 -191 1697 1269 -223 -635
979 -635 1373 2154 237 -360 1385 2170 -59 -887 1064 2375 139 -839 585 2158 982 -765 -51
996 -51 1645 857 -781 -307 1573 1291 -525 -509 712 897 -621 -662 546 482 -124 -597 156 209 -635 -415
1016 -415 -94 25 -757 -909 19 85 -859 -1472 -167 503 -496 -1366 -1096 62 -663 -1577 -1124 -19 -154
1035 -154 -1506 -1871 -1183 -510 -954 -1480 -667 -339 -900 -1392 -898 -500 -609 -1255 -733 -378 -994 -1296 -764 -419
1055 -419 -995 -1346 -429 -79 -594 -1568 -712 344 -293 -1294 -727 529 144 -866 -881 429 452 -874 -1201
1074 -1201 368 834 40 -1169 -3 1186 346 -584 3 1124 1071 -92 -46 771 1013 136 103 989 1016
1093 1016 403 171 815 1073 324 126 1232 1116 219 132 1259 1663 700 -37 1172 1942 506 -434 531
1112 531 2117 1182 -447 479 1627 1700 2 -176 1048 1658 397 -214 703 1411 645 99 452 1175
1130 1175 572 -368 351 644 272 -104 102 543 73 -304 -25 324 115 -560 -303 338 -27 -1091 -320
1149 -320 219 77 -1100 -868 163 -118 -814 -1284 -635 60 -1202 -1169 -668 -108 -467 -1335 -823 -511 -899
1168 -899 -1165 -850 -472 -669 -1010 -600 -468 -871 -1098 -476 -274 -677 -1060 -410 -20 -453 -1239 -669 124 -149
1188 -149 -811 -1238 328 774 -952 -1083 183 685 -431 -1122 -106 954 300 -810 -521 856 848 -319
1206 -319 -30 543 673 -349 -84 701 661 31 313 780 393 117 -57 1174 1029 -52 -211 1078 1317
1225 1317 253 -487 885 1829 641 -139 515 1688 831 -440 532 1658 1124 -80 -332 1090 1258
1242 1258 -82 19 1089 1276 89 -409 558 989 277 -246 453 807 -158 -132 516 918 197 -21 356
1261 356 460 -510 -426 639 782 -306 -887 71 654 -170 -966 -144 1030 -260 -904 -288 390 1 -592
1280 -592 -503 -591 -398 -521 -288 -291 -657 -856 -680 -23 -777 -761 -215 -122 -922 -1631 -625 210 -368 -1115 -1214 -370
1302 -370 -495 -1081 -453 -322 -315 -1132 -1118 -385 -143 -313 -789 -550 -724 -687 -473 -469 -204 -178 -345 -576 -1234 -199
1324 -199 690 320 -792 -792 28 97 -594 -184 336 250 -446 -872 152 619 -81 -74 659 230 -381 76 1062
1345 1062 997 -245 -13 1167 872 -120 494 1739 1428 -841 -363 1778 2132 133 -537 1488 1812 49
1363 49 -420 1544 2580 810 -782 971 1758 926 39 1377 1800 438 -359 904 2215 900 122
1380 122 710 1471 329 -221 1232 2482 384 -1145 213 1457 596 -678 601 1525 387 -1461
1396 -1461 -452 1758 879 -830 -213 693 48 -1192 -137 1246 522 -1257 -814 295 289 -1011 -326
1413 -326 291 -672 -1596 -466 831 -46 -1821 -1024 301 -358 -1871 -697 584 231 -2162 -2133 -20
1430 -20 324 -617 -1098 -93 -512 -1832 -1388 512 597 -786 -924 -677 -841 -1054 -87 712 -65 -1480 -1263
1449 -1263 14 -205 -691 -88 698 -445 -1256 -1009 789 870 -295 -447 287 -238 -613 198 957 767 -865
1468 -865 -291 293 -8 -291 739 1205 -219 -1125 520 1549 503 -563 127 1220 140 -709 648
1485 648 2054 1017 -1254 -491 1061 1329 -6 302 1469 484 -1039 -231 1693 1485 98 -275 996
1502 996 49 -678 726 2132 1325 -906 -640 1005 997 -151 77 1804 1097 -1493 -1098 1408 1753 -108
1520 -108 -762 657 810 -687 -678 1044 1295 -732 -1168 344 769 -340 -398 455 392 -1262 -1029 685 835
1539 835 -645 -1072 112 297 -1227 -1077 486 1035 -1048 -1830 -303 559 -306 -1211 -219 375 -834 -1549
1557 -1549 -206 556 -389 -1571 -493 -180 -560 -948 -117 389 -723 -1687 -626 448 -495 -981 -167 -130
1575 -130 -1022 -1481 -92 657 173 -1007 -287 181 -379 -738 -207 516 -117 -586 -832 -85 -104 28 155 -204
1595 -204 -570 -263 328 475 -54 123 413 390 -386 -112 1001 998 -81 -548 425 1040 -225 163 887 975
1615 975 -290 -165 585 924 421 -242 738 810 123 -108 1267 1122 -216 -394 873 854 230 -3 734
1634 734 1138 -97 -563 562 1377 407 -811 190 1042 -99 -809 238 1267 569 -861 -179 710
1651 710 195 -287 149 435 24 -746 -112 366 -195 -552 -367 201 -166 -855 -14 354 -247 -919 -763 428
1671 428 299 -954 -839 43 -133 -1099 -813 202 210 -768 -894 -308 -161 -507 -641 -82 -277 -765 -697 -421
1691 -421 -183 -771 -467 176 -338 -927 -708 -23 141 -409 -933 -217 69 -68 -581 -24 348 -305 -620 -384
1711 -384 124 -35 -460 -537 -135 596 -144 -348 -16 112 94 -91 -360 145 480 -63 -243 305 559 31 -38
1732 -38 -34 519 551 3 132 294 493 198 117 390 342 357 355 503 813 464 296 930 695 527 309 838 555
1755 555 225 -176 496 1129 425 -262 349 803 565 121 260 803 426 79 -153 390 584 74 -1 237
1775 237 182 25 -143 -82 -5 -16 -1 -25 185 -68 -83 243 116 -303 -425 -28 -78 -440 -454 190 62 -291 -597
1798 -597 -250 49 -185 -544 -144 -115 -359 -560 -494 -318 -239 -682 -593 -139 -359 -785 -438 -200 -469 -673 -411
1819 -411 -313 -478 -374 -484 -385 -288 -588 -613 266 -49 -684 -685 -297 36 -279 -855 -284 233 -239 -630 -301 33
1841 33 19 -775 -478 145 132 29 -220 -195 378 57 -234 -89 128 239 -148 19 206 6 -61 305 409 216
1863 216 -228 430 609 186 48 441 639 187 -115 413 624 585 216 119 301 652 269 200 306 703 528
1884 528 202 469 447 532 264 57 130 683 369 118 456 436 95 415 228 291 -71 187 -155 421 187 152
1906 152 178 -83 314 108 121 153 -181 -76 -23 282 84 -463 89 5 116 -445 -223 126 97 -226 -246 344
1928 344 98 -367 -484 -203 -135 -440 -359 -129 -271 -714 -300 -237 -336 -592 -468 323 -231 -550 -568 -20 -165 -698
1950 -698 -433 -70 109 -526 -578 -375 391 -344 -591 -132 95 -156 -823 -367 -67 -126 -437 -472 36 -135 -473
1971 -473 -91 -385 -279 60 -257 -49 -85 -293 228 -9 -117 52 28 269 64 -343 -189 322 339 217 143
1992 143 112 247 382 128 262 642 276 104 -149 276 482 402 324 181 470 583 199 -191 401 982 315
2013 315 -424 253 796 701 212 205 630 416 -48 120 432 298 126 -18 160 190 -1 405 263 195 -390 74
2035 74 736 555 -89 -257 294 311 -332 -425 438 560 -430 -528 138 246 -561 -407 -166 81 -578 -501 196 343
2057 343 -448 -523 -416 -501 -443 -131 329 90 -1040 -1005 -154 61 -263 -839 -75 -164 -712 -1244 -41 390 -375
2078 -375 -943 -370 56 -319 -677 -96 212 -168 -844 -720 40 -13 -286 -320 -307 -455 -417 -245 95 -100 -267
2099 -267 -23 -46 -413 -421 -12 274 -384 -758 -344 205 134 187 225 128 66 -196 -157 448 202 -1 19 -30 84 450
2123 450 659 546 -164 -79 238 204 -22 601 701 428 -446 -245 519 716 108 178 416 180 -222 2 554
2144 554 930 425 -344 98 234 352 347 365 524 -186 -272 187 797 177 44 363 356 5 -266 687 877 -43
2166 -43 -409 297 295 -215 -463 367 366 -172 -694 -103 303 19 -487 -402 -261 -365 -324 77 493 -106 -647 -278
2188 -278 191 -791 -452 -85 11 -587 -1067 -267 319 9 -718 -724 -231 -241 -739 -338 495 -65 -868 -823 -15 28
2210 28 -459 -172 -84 -229 -796 -182 143 242 -620 -291 -65 -504 -523 -60 56 -224 -257 -530 -189 70 -277 -80
2232 -80 -240 -212 -348 -44 110 215 4 -76 213 206 423 320 477 -49 109 30 36 103 92 488 644 -27 -333
2255 -333 677 756 533 363 249 69 -79 -98 476 848 74 19 109 286 118 30 530 553 -229 -281 398 579
2277 579 367 412 488 769 -31 -247 696 1043 462 -213 -112 340 289 -257 -16 535 152 -610 -154 308 437
2298 437 -111 -260 186 128 -350 -262 253 -79 -343 -68 -359 101 -244 -232 61 -24 -451 -262 47 195 -575
2319 -575 -331 34 -196 -635 -279 360 244 -389 -711 -41 -80 -127 -527 72 -123 -574 -327 -454 -259 -389 -473
2340 -473 -394 -351 -527 -581 141 -234 -570 -363 -142 251 -195 -498 -328 55 -140 -337 -273 255 -210 -477 36
2361 36 306 78 -60 -196 -114 207 -54 230 -255 76 55 -16 46 -90 106 200 26 -12 512 408 33 -152
2383 -152 165 668 71 18 -61 425 282 -52 207 351 69 93 346 433 228 165 388 181 370 -175 296 92
2405 92 131 89 234 213 320 271 -4 499 176 51 92 468 455 -72 3 176 224 328 18 -183 345 251 28
2428 28 -218 -72 -102 211 -85 -39 -91 -158 -34 -36 1 -315 80 66 -380 -262 -11 -54 -240 -568 -199 4 -199
2451 -199 -385 -172 -490 -3 -173 -489 -63 -181 -369 -393 -446 -224 -467 -181 -87 -210 -338 98 -442 -115 -343
2472 -343 -688 -213 -89 -75 -517 39 -135 -139 -250 89 -241 5 -283 -426 243 92 -86 78 76 19 100 -154
2494 -154 250 265 -48 -60 135 325 284 1 -8 -1 -78 68 10 225 81 0 437 162 43 350 452 316 364 -107
2518 -107 277 218 440 225 28 458 621 144 192 216 364 404 106 -53 397 481 362 112 451 151 304 -35
2540 -35 -203 316 100 -22 306 152 -25 167 -175 305 227 -120 43 46 96 -77 114 307 -92 -150 93 -93
2562 -93 25 34 -26 19 -338 64 -230 -6 61 -363 98 126 146 -289 -549 41 -47 -81 114 -544 4 -335 -448
2585 -448 -303 -408 -192 -408 70 -442 -286 -417 -7 -103 -324 -358 -323 34 -266 -293 -77 -151 -382 -229 44 27
2607 27 -411 185 -303 -326 189 -288 -125 24 -130 -207 -116 -316 -191 210 -27 -569 -128 -146 91 -384 -142 -153
2629 -153 -24 92 124 -95 37 -116 266 -53 507 251 327 -84 -108 102 195 235 -120 -75 -130 221 92 -12
2651 -12 9 108 432 -22 -267 19 397 169 -93 143 356 325 -77 130 330 603 169 547 193 370 19
2672 19 47 264 133 -6 5 7 146 -196 -287 120 -29 -93 58 -109 36 -81 -331 163 270 -187 -355 -94
2694 -94 74 -70 150 -236 -113 -71 -348 -75 18 27 -261 -243 -182 -245 -510 160 -412 -185 -267 -300 -141 -403 68
2717 68 -70 -106 -364 -469 -288 -107 -152 -474 -54 82 4 -417 65 -96 -31 -240 -222 -118 -72 -219 -67 -33 -140
2740 -140 138 46 49 -368 -244 -32 20 -221 -179 72 49 -194 59 307 173 -32 -89 21 205 -173 -268 165 115
2763 115 510 193 210 268 85 362 496 179 345 11 291 254 -16 45 784 464 -241 -184 409 437 99 -234
2785 -234 -1 322 103 -245 392 334 318 21 -60 804 163 283 130 544 -258 164 232 606 77 -264 134
2806 134 443 100 -17 123 341 -9 -522 226 690 -17 -377 -98 271 -91 -589 -28 264 167 -239 -241 -138
2827 -138 244 -408 303 237 -312 -411 -206 418 -81 -321 -343 118 -359 -495 -224 43 -322 -637 -417 189 -211
2848 -211 -583 -222 -105 -262 -512 -589 104 -10 -255 -134 -11 -143 -358 -199 41 37 -315 -170 -253 -78 -478
2869 -478 -112 323 -137 -710 -81 212 223 -255 -278 318 36 -157 -99 283 543 -371 -103 63 -26 -314 -163
2890 -163 -41 124 -117 -149 232 89 300 121 111 -277 -63 186 562 355 -458 238 350 61 -374 153 547
2911 547 439 -96 -101 343 421 5 284 188 406 243 -81 472 302 -58 -96 51 157 114 172 536 78 -244
2933 -244 28 422 527 -12 -388 55 236 -243 132 374 451 -200 -262 98 554 247 0 303 85 -109 -234
2954 -234 -193 308 -113 -455 -102 55 -142 -124 163 51 -146 -197 -288 -19 -346 -192 399 -177 -333 -545 1
2975 1 203 -405 -342 -2 -355 128 -223 -47 41 -342 -352 -90 74 -156 76 -38 -180 -421 -343 -264 164 -166
2997 -166 -289 184 -81 -269 -451 -125 402 -228 -476 -235 52 105 -429 177 13 -233 -336 -324 207 208 -172
3018 -172 -393 191 -96 58 481 194 -65 -173 135 -83 97 -8 487 297 94 -174 473 282 50 -153
3038 -153 481 258 215 -299 45 570 -103 233 56 347 43 122 341 248 -28 -10 93 333 378 -207 328 257
3060 257 -186 -186 -165 407 189 -127 -38 131 177 144 83 263 333 -13 63 23 77 -140 17 -23 -99 212 65 176
3084 176 -12 -91 35 255 -152 -97 101 -49 -251 -341 -119 -107 -36 -210 -226 224 -320 -258 -240 23 16 -201 -101
3107 -101 -263 -117 -241 17 -198 -84 -184 41 85 -71 -310 -62 -112 -312 -428 -38 45 93 -316 2 -225
3128 -225 -52 -273 -54 184 11 -111 -112 -234 -166 -17 -49 -11 120 100 238 117 -186 35 -56 -187 -24 166
3150 166 314 214 94 15 -221 285 -125 16 81 175 5 -62 134 291 185 185 -36 389 239 61 339 192
3172 192 149 515 181 243 17 255 289 158 -22 4 195 545 226 -277 -307 239 26 -28 -52 36 223 195 218
3195 218 -172 518 345 45 107 207 134 125 179 -55 278 -27 -166 -15 5 234 -122 52 -7 14 -215 90 92
3218 92 -58 65 -72 -358 77 -98 77 -184 -327 -14 -405 -19 -207 33 -99 6 -81 -64 -283 -125 -135
3239 -135 15 -328 -325 87 -277 -133 -289 31 120 -105 -157 -312 -186 -117 -13 -184 -274 -39 -193 -327 -119 -92
3261 -92 -135 -154 -293 -356 -83 -106 224 -226 157 -409 -16 101 70 -65 42 -84 396 84 101 40 -115 266 119
3284 119 25 66 -73 -32 160 133 275 324 28 310 236 193 -83 -22 265 232 369 169 84 187 108 224 83 138
3308 138 267 157 147 383 62 51 233 259 77 95 51 -132 12 226 141 -187 406 95 -35 50 152 297
3330 297 -357 212 -30 80 -34 -52 8 -112 -50 85 -215 5 -363 94 98 33 -345 -148 -9 -73 -52 -176 -153
3353 -153 127 33 -182 -26 -171 -40 -308 35 32 -166 -124 -216 -113 -130 21 133 -401 -94 -270 -156 -26 -109
3375 -109 -130 -255 -167 -55 -17 89 138 -207 -189 -60 -188 -49 -237 -23 -6 -146 138 131 286 -152 112 -132 -244
3398 -244 -76 154 -89 105 156 -379 345 153 259 -93 -110 237 270 -227 135 286 244 290 182 -79 216 -106
3420 -106 -6 127 -44 275 261 -163 27 441 420 127 211 75 114 271 8 253 204 293 -18 297 326 276 -18
3443 -18 58 264 133 155 90 451 -9 22 -190 -124 303 77 76 128 124 -109 -89 92 244 99 -199 436 189 -117
3467 -117 -78 77 243 -265 202 59 -25 129 -197 -83 17 63 -283 167 -305 -58 -280 78 -186 52 -141
3488 -141 -159 -126 -182 51 -97 -94 -484 -218 230 174 -317 -386 -131 158 -394 -427 -231 -508 -311 -200 123 -200 -353
3511 -353 -520 137 47 -76 -225 -171 -283 -580 -391 -98 228 39 19 -205 -170 -158 51 196 144 202 -132 164
3533 164 42 30 137 -164 435 -107 -377 133 97 158 -70 318 426 125 133 55 229 -319 -7 -86 198 126 -84
3556 -84 376 -52 -46 99 244 296 233 -314 117 331 182 128 469 357 107 26 110 137 382 216 4 -48 177
3579 177 73 370 360 189 5 -48 208 -252 90 100 285 36 -169 -61 -57 125 126 -179 112 126 -130 -20 89
3602 89 204 -192 -168 104 39 -5 -145 87 -73 -172 -133 -76 -188 -290 -214 4 -134 -192 84 -66 -177 -420 14
3625 14 246 -251 -347 -353 120 -89 -313 -195 -47 201 -220 -109 -157 -342 -390 11 -195 -126 -352 -310 261 -183 -23
3648 -23 -20 269 -154 -268 -100 356 289 85 -272 -2 -157 14 -36 235 133 102 -136 -324 197 -109 -70 99
3670 99 -58 -138 147 -87 210 244 306 163 -266 -72 -27 312 -35 156 12 -105 77 -116 99 278 343 -39
3692 -39 125 154 258 251 -113 -77 -78 -253 87 -179 383 227 -151 160 67 -29 -21 242 120 -123 -142 156 477 48
3716 48 -172 64 -178 -173 -14 195 217 141 -246 47 254 289 189 -212 8 -77 -19 7 -163 242 -105 89 -171
3739 -171 -175 25 96 61 -165 -18 -3 -121 -175 -81 3 -193 -144 -460 -174 -68 -68 -221 -66 -195 -144 82 283 43
3763 43 100 44 38 -211 -441 -60 264 -75 -243 -584 7 67 -272 -106 -48 103 -256 -121 61 -30 -37 -469 -8
3786 -8 95 -119 298 98 189 -210 -181 -151 -246 -131 -303 72 -37 72 32 -104 51 73 33 -100 -201 0 -230
3809 -230 65 344 4 -141 39 100 27 91 177 215 238 94 383 144 193 219 142 200 74 376 -76 556 -153
3832 -153 199 344 420 -138 49 389 148 338 90 109 195 246 23 -155 179 385 1 145 199 251 -14 176
3854 176 -44 31 -333 75 249 -179 -362 66 -204 -163 -137 -126 -67 -63 -389 134 1 118 88 -14 1 -12 -175
3877 -175 95 -96 -108 -69 -115 -375 -64 -175 -295 -284 -166 -71 -95 -102 -152 -14 -48 -49 74 -121 202 -45 -241 -297
3901 -297 -46 172 -182 -200 -179 10 206 -180 -289 -153 198 -129 207 -94 -75 219 -89 -167 31 -13 -250 -230
3923 -230 81 -198 14 -34 53 34 -128 259 212 -209 -178 280 180 -54 -222 43 229 -60 -29 367 162 213
3945 213 368 -81 -68 -155 -34 145 28 -195 244 52 78 -40 22 306 42 90 461 128 146 66 72 -9 295
3968 295 169 124 32 83 260 95 72 247 60 -90 104 27 87 -196 -164 75 225 -80 0 56 -130 44 36 -150
3992 -150 -151 -84 102 -65 -53 -173 306 -162 -115 -277 -190 91 16 26 148 -26 119 282 61 -95 -166 70 -190
4015 -190 -321 -81 17 37 -194 -74 90 -180 -28 -162 73 56 92 -251 -219 -86 -14 -149 39 -69 78 -63
4037 -63 -70 -457 -1 -78 -27 -108 -95 -40 -77 2 -199 -139 -167 353 -102 50 -168 -88 -190 -82 81 -71 40 171
4061 171 74 -183 112 400 19 -51 -6 183 144 197 178 -31 142 149 268 -65 185 202 127 -28 130 294 -127
4084 -127 -36 -33 130 53 -45 106 -97 206 237 77 64 38 -57 307 392 13 321 136 -6 -111 103 66 -47 -88
4108 -88 -200 -8 82 16 94 30 185 23 -151 -23 220 185 -223 -142 -103 -53 84 -193 33 3 165 43 -66
4131 -66 -271 -100 -149 -296 -29 -205 -173 -72 28 -228 -131 37 -356 -280 -126 -50 -208 -252 -385 -60 379 -508
4153 -508 -530 -70 139 -390 61 -9 -96 136 34 -134 -85 -97 -410 56 -213 -144 -22 -296 131 -125 29 193
4175 193 75 -123 8 212 67 -59 -221 236 196 241 -27 75 193 17 -103 105 52 -7 -54 83 154 125
4197 125 -62 338 49 -195 20 256 10 81 -80 351 245 -55 67 -166 -44 -227 -78 304 202 -28
4217 -28 62 -131 246 208 91 -208 130 273 33 218 194 310 131 77 123 133 220 -1 -192 330 20 -23 144
4240 144 -135 59 278 133 -101 -166 65 322 87 -536 -170 347 47 55 14 242 -232 -48 -50 151 -264 -104
4262 -104 -76 -39 -197 -99 123 182 -243 -213 22 -5 -140 -75 -186 62 25 -280 -313 156 -333 -7 -45 -70 -199 -60
4286 -60 -232 230 123 -623 -178 -51 26 -94 -357 41 -167 -516 21 504 -32 -612 -251 122 -75 -107 -300
4307 -300 -60 364 26 -279 111 149 -435 447 152 -202 -45 -177 76 56 -194 181 -83 399 -45 -39 210
4328 210 -25 -31 123 99 370 96 -125 -181 -375 -62 98 -208 309 111 115 -56 75 102 -237 317 59 173
4350 173 51 56 270 58 -77 290 192 -245 110 162 209 -207 193 197 179 -78 134 317 236 -205 126 132 -60 -49
4374 -49 176 69 313 13 50 24 -105 -25 -172 -101 -34 -348 -96 408 -64 -101 -216 105 81 -146 -117 192 89
4397 89 -134 -90 25 -80 -402 6 -330 71 113 -233 -165 114 -42 -166 171 0 -43 -417 -238 -53 -124 -287
4419 -287 -106 15 134 -102 -59 187 11 30 175 10 -202 -130 166 239 -263 -139 47 -141 -87 -43 -5 110
4441 110 72 -238 30 -111 118 19 51 -9 24 180 -139 184 156 -56 242 347 5 25 285 100 43 -106 -89
4464 -89 116 -5 214 96 5 278 210 385 171 16 87 143 262 308 89 410 216 -9 -9 -170 184 76 25
4487 25 101 397 -35 -2 35 445 380 72 -203 -58 165 91 -448 -134 313 -6 5 355 94 -231 -54 93
4509 93 135 88 18 137 75 163 -110 140 101 -250 -43 12 -96 96 -155 -261 70 -62 -98 -136 35 -102 -89 -145
4533 -145 -47 28 168 -116 -223 -193 -75 6 29 -166 -151 0 -116 -122 62 107 112 -301 -195 77 220 -137 162 -226
4557 -226 231 -110 -169 -25 210 -97 -118 -371 -175 320 -170 157 32 192 -231 205 -80 -87 114 155 -21 -20
4579 -20 -158 86 -205 53 125 4 210 2 167 -14 117 93 -21 107 194 -314 49 -99 -120 187 -42 295
4601 295 78 208 -21 105 74 -66 -30 259 38 -38 -28 281 -54 69 123 -32 -65 161 212 -59 106 111 408
4624 408 -32 -104 193 150 72 -338 -235 -70 -4 0 -245 -165 -6 153 141 16 -92 -72 -50 148 -27 52 20 -313
4648 -313 -184 36 -325 -225 109 19 -64 -39 -177 -87 -234 -177 217 -209 -81 25 -61 -84 129 -316 -113 -57 -69
4671 -69 77 -178 -231 -150 352 -230 -160 185 -322 106 54 -101 63 21 -70 -84 -251 -107 -18 -56 73 -16 218 215
4695 215 -10 -119 -12 168 -169 201 67 -1 35 -35 -156 194 -279 41 -163 -351 -289 105 68 -21 220 -141
4717 -141 246 161 236 165 -59 22 198 93 -232 124 -78 216 39 -54 302 289 -174 83 288 184 263 -147
4739 -147 -210 174 23 -161 9 100 275 127 -265 -44 -208 -233 -76 53 119 165 -34 -5 2 -13 10 -162 16
4762 16 139 238 94 106 229 -148 -83 -160 116 -50 62 33 -223 -238 -215 -94 -31 42 15 -155 -50 51 -23 230
4786 230 -73 -125 -119 -45 191 -123 141 75 -96 -160 -374 -61 41 -84 -154 -277 -31 -129 -151 408 -35 -123 28
4809 28 136 -135 -12 -197 -89 -132 136 -154 -224 -126 -170 118 133 -115 65 66 165 29 -60 -13 253 34 -109 -184
4833 -184 358 103 -226 28 -187 112 -97 -120 -9 -179 101 214 -184 -57 133 -12 -402 -56 94 -172
4853 -172 292 -188 86 76 -98 125 -19 180 47 245 138 228 190 -291 329 -95 205 -60 97 -76 167
4874 167 -243 -45 -163 266 67 -216 -51 91 237 -160 -233 85 27 133 -113 -13 283 3 -31 -102 -37 -3
4896 -3 -11 -19 7 -31 69 243 347 149 13 -165 -280 -167 -87 21 -184 -224 -226 -192 152 -166 -466 -170 -2 203
4920 203 -302 -166 -213 -143 -284 65 62 31 -31 -95 -359 -267 -215 43 -197 -257 -48 -189 219 -164 -96 -312 -171 -48
4944 -48 -19 143 -62 -184 45 -204 -108 -212 -294 -62 44 8 -6 80 415 248 128 43 298 503 -148 111 -144
4967 -144 297 135 107 243 -31 26 252 256 143 -130 -125 459 127 -167 216 -28 -38 152 -111 151 44 128 205
4990 205 -121 -192 358 186 62 224 173 28 163 -197 159 89 -148 169 39 1 255 -156 52 221 -118
5011 -118 13 -125 330 -230 37 -131 105 144 71 -187 123 25 73 -158 19 119 -136 -321 -382 78 53 159
5033 159 97 288 85 -10 -268 46 -116 165 -20 145 -26 -200 31 -29 -318 91 -60 7 292 -113 81
5054 81 -141 -47 18 229 174 -32 -190 34 -118 31 -263 63 197 -161 -515 -240 -60 96 -49 -198 -192 155
5076 155 -125 -402 -19 -83 -420 -136 -11 -164 42 -91 6 -47 150 -192 337 177 -55 -90 202 107 -17 -211
5098 -211 322 -96 -78 331 7 -35 283 37 230 -287 39 235 67 196 3 -127 -91 77 130 53 29 70
5120 70 -112 0 101 17 216 151 93 12 44 -121 260 183 -24 174 188 39 -176 29 -198 119 56 -209 93
5143 93 82 -129 21 14 234 103 8 55 -146 264 -84 57 141 90 -303 -56 -58 19 -98 128 -20 -40 -16 -131
5167 -131 -69 -114 -249 84 233 -11 94 -256 10 305 -171 -199 -352 -60 -382 -83 -143 57 317 -200 -54
5188 -54 -166 -42 247 133 -470 -72 -63 197 -71 -130 -209 102 124 -47 102 12 -62 133 209 108 32 2 62 -133
5212 -133 51 -101 -233 57 154 -295 8 -284 171 135 -78 40 -159 -27 -7 206 85 -53 281 202 8
5233 8 -95 17 249 225 89 -26 64 -90 239 93 -3 279 -130 -6 136 121 -138 335 -11 -194 -114 -43 -327
5256 -327 142 199 84 141 115 -80 -76 87 -112 -21 24 105 143 60 314 121 -74 -281 -316 303 326 77 -165 168
5280 168 181 2 -57 -52 -58 154 105 62 158 107 -56 88 49 -71 -103 96 233 241 -386 -72 141 -14 -190 145 44
5305 44 -236 -78 199 -487 -77 -54 95 -49 -40 -123 -195 -81 -166 -67 -309 6 -287 361 170 -130 82 329 120
5328 120 -238 41 -5 -14 -89 -15 -311 -138 -200 217 -158 -86 -293 127 -307 -112 -142 -8 150 91 -176 23 -63
5351 -63 -103 17 -157 246 -148 -36 67 -70 93 -5 -164 -249 -181 183 148 30 -251 212 11 135 314 -131
5373 -131 16 34 127 223 302 182 148 -45 64 -128 121 -80 -134 43 173 76 -184 140 -102 143 161 -78 -309
5396 -309 200 -172 -193 331 176 -127 -174 278 -66 13 246 116 74 211 -40 51 7 61 -128 -437 -40 160
5418 160 11 -154 155 -59 152 115 -62 349 229 -10 280 -80 -27 95 120 29 -309 -219 -28 -35 -38 244 -166
5441 -166 160 -185 -315 -91 -34 -275 165 -55 -23 91 -33 -275 -111 35 131 -59 181 -15 -153 -37 -215
5462 -215 3 240 74 157 -225 -72 304 29 83 142 166 287 62 -283 105 18 -107 -175 83 -156 -29 62
5484 62 -91 93 162 -334 18 50 127 -232 293 221 213 23 333 32 -267 43 192 170 318 364 186 136 92 112
5508 112 217 126 6 184 267 162 -361 -119 42 99 428 225 -133 70 53 90 15 144 68 29 -131 -163 -59
5531 -59 -28 -27 62 -113 34 35 -134 -30 -142 145 -66 -134 -47 214 193 -37 -54 -326 24 -181 92 38 31 10 -227
5556 -227 12 130 -159 -297 -71 238 -70 -336 133 105 338 -216 30 -321 -24 122 -120 1 -321 -208
5576 -208 115 -170 -107 -389 188 -98 106 109 -78 -176 -138 -118 243 55 231 -59 179 -82 -69 -392 -15 290
5598 290 -209 -68 21 228 -145 42 -108 14 -118 82 -7 88 19 168 496 -264 -80 201 231 190 95 -230
5620 -230 -79 -170 378 104 216 -285 -124 17 95 60 99 12 211 -3 -52 125 -58 -7 34 155 -11 298 69
5643 69 -143 59 59 330 -179 -157 -120 -98 -34 5 -21 96 -193 251 -14 223 150 -18 78 -201 89 294 -132 -92
5667 -92 -112 86 30 32 121 26 -237 80 172 248 49 -29 201 -54 322 -31 -242 -73 -43 109 -118 -208 -100 -151
5691 -151 -148 -110 50 -48 13 61 267 -178 102 -187 -480 15 112 308 -144 -67 137 207 270 167 188 -358 -76 -182
5715 -182 -17 3 -29 -230 191 -239 32 -296 65 127 134 -83 -591 140 126 -247 -157 153 -1 -62 365 153 197
5738 197 130 -142 6 -290 -54 -241 186 131 -395 -142 260 211 128 73 72 -30 -7 228 129 79 23 306 26 490
5762 490 207 165 -87 -94 -74 18 60 -138 -94 -76 102 74 91 -249 33 232 206 268 0 -82 128 -78 188 61
5786 61 39 -275 -19 -51 -90 -77 46 57 40 9 215 -260 -48 197 69 193 130 19 -24 113 -57 -77 -55 184
5810 184 -104 250 13 21 -297 39 -24 8 -101 415 46 -204 -32 -285 34 207 -245 -196 -173 -16 144 -204
5832 -204 17 -62 26 88 -105 -65 -63 -70 -255 87 -68 -145 116 -8 -85 -16 -66 -240 -91 -85 -209 207 -192 -60 -14
5857 -14 12 16 -161 64 -249 140 -67 59 -25 135 -98 104 129 -90 224 35 207 -159 -108 -8 11 34 291
5880 291 -121 239 14 75 -168 151 -80 290 -51 100 68 254 68 -7 67 90 36 -219 -88 266 269 278 90
5903 90 -53 86 -83 66 26 19 174 251 -23 -55 106 38 492 -53 -9 -2 27 186 -4 189 -280 37 29 44 -82
5928 -82 -85 -214 128 -216 220 138 107 83 11 -367 -74 -255 -97 54 -79 -253 -131 -20 215 -46 90 90 -584
5951 -584 50 -108 146 -237 -161 -321 -123 12 106 -47 96 144 75 -326 71 -163 -18 25 -100 115 -146 -284
5973 -284 -12 107 383 63 -233 -346 106 -244 -144 61 -159 -54 -272 192 -52 145 -13 30 -76 -130 292
5994 292 -98 -21 116 79 438 -203 29 -117 143 -214 -114 96 -70 174 270 -56 -126 -43 -59 78 -161 62
6016 62 364 -180 135 54 -154 -201 384 136 439 -63 -43 11 -79 17 221 215 -33 171 67 31 174 93 -77 231
6040 231 -309 79 -64 36 -73 -2 205 300 -267 -47 -12 93 -39 253 92 17 184 77 46 -68 115 -46
6062 -46 12 -175 -132 129 68 -204 -70 -107 -47 -131 -142 -333 394 -101 -186 103 -19 110 -145 -24 -113 -6 159
6085 159 295 -20 -30 -180 -64 -450 -164 122 -50 -286 252 74 -45 74 -314 -55 36 -128 272 20 156
6106 156 95 33 29 136 128 -80 -137 -216 -181 -89 -61 199 132 -71 -247 -193 96 105 -80 -296 -48 202 102 193 256 107
6132 107 -21 167 -26 -153 50 -92 188 143 191 -153 82 -192 219 -59 -104 -130 -81 7 82 -50 -179 -59
6154 -59 96 -146 233 -157 -160 -13 -231 -51 37 -35 67 136 92 -100 -225 -18 63 -3 65 154 71 115 -43 -200
6178 -200 276 467 -122 -122 -86 -21 -103 -164 119 13 -56 62 71 77 193 -248 186 -3 -217 26 230 -22 259 258
6202 258 88 176 -109 163 26 173 -33 6 -372 97 -45 169 -22 23 -91 39 -101 -134 -92 0 -63 -257
6224 -257 266 -72 -31 105 127 191 -338 -141 122 52 -86 -35 36 -108 -105 -13 -135 80 -231 176 -25 -44 207
6247 207 -177 -152 2 -18 -73 121 124 343 376 300 -84 -65 -119 -77 222 124 186 66 110 -140 -90 -92 85 -224 50
6272 50 -111 96 215 42 -110 -287 -238 19 328 179 83 162 -75 32 -234 110 127 211 185 173 165 88 -32 -13
6296 -13 193 13 -89 -157 305 -419 -67 175 163 39 -110 -116 -443 -60 -161 -126 283 75 -2 254 88 88 291
6319 291 147 -132 138 -19 44 -62 67 78 206 -15 -1 31 -209 -35 -237 -105 13 129 -204 -205 114 -124
6341 -124 12 -315 121 -122 36 178 74 -143 76 38 102 17 -286 -170 39 -116 -238 143 -25 -136 3
6362 3 131 -14 140 -267 51 205 -290 30 -56 -342 100 19 -80 -337 46 -14 -184 -108 106 233 14 -301
6384 -301 88 -219 103 49 64 353 137 63 -134 -163 100 32 203 23 65 51 219 -67 96 -1 130 20 -112
6407 -112 90 -118 -37 198 33 155 -116 113 12 -21 -142 -49 164 -139 66 102 99 -19 -72 -160 127 -83 -21
6430 -21 214 -74 103 172 -77 -51 22 -61 -67 -36 96 -60 -57 -174 28 -22 43 -95 -102 -377 205 315 100 -205 -97
6455 -97 -157 -107 209 -305 -8 -75 -116 17 -166 98 26 -343 168 64 -206 -84 -54 -5 145 -81 -334 90 -265
6478 -265 -108 -16 265 -37 -34 -9 -92 -62 58 170 135 87 -179 50 144 249 -259 -80 -141 336 134 135 103 59 9
6503 9 230 16 103 -66 53 86 153 76 -1 295 8 -42 350 -95 -136 240 14 -239 -298 4 103 233 -172 -327
6527 -327 177 -102 -167 157 126 -108 -124 24 36 -180 -74 226 37 -45 -149 130 71 103 81 41 -287 13 -140
6550 -140 46 150 186 -73 133 603 180 118 -333 -256 -101 283 12 115 156 -124 -109 163 -224 -92 -69 189
6572 189 3 -49 -191 130 63 -103 120 138 94 -92 91 94 -88 68 160 105 -262 20 -99 38 -83 -74 -193
6595 -193 225 188 -15 65 -41 63 -288 -176 110 -286 66 21 -88 -74 -113 117 -146 137 -298 -198 271 -161
6617 -161 -81 -169 350 -177 -165 81 -22 -13 178 -285 -74 83 -52 -216 268 43 131 35 21 1 -71 143 -152
6640 -152 17 60 -59 -78 -161 190 -141 129 316 -94 103 -125 61 -60 35 -10 -47 -74 123 59 54 -19 -81 80
6664 80 129 -48 -25 296 253 -99 -51 371 -218 11 131 -97 109 -121 141 2 -7 13 0 23 -217 -132 90 167
6688 167 -44 -10 104 122 -192 302 -198 54 181 148 -19 -46 179 -195 -44 19 -108 123 126 -274 -105 -483
6710 -483 -77 -22 -91 -196 118 -72 75 -203 -133 -56 -20 94 -403 -4 -195 -210 -173 45 -64 0 64 -281 116
6733 116 -56 -111 89 132 -137 -82 -50 -145 -232 -51 182 -206 -229 -128 -88 -83 76 -44 -100 -116 -52 -306 357 349 -120
6758 -120 67 158 243 244 159 -30 276 252 -35 28 319 36 -396 -103 91 -131 137 111 -142 115 65 -354 208
6781 208 70 -296 69 150 154 -31 -127 239 78 11 -129 215 -165 103 -65 -7 29 121 67 -160 -56 433 -237
6804 -237 175 -88 165 137 -38 129 -56 301 -36 176 61 -22 145 32 133 -212 -26 162 88 56 218
6825 218 -36 -3 -38 44 24 72 215 -92 -13 -220 -67 -98 124 -74 -12 86 44 171 183 -74 -268 71 -119 -184
6849 -184 -218 83 -106 8 281 -282 49 -4 160 -164 26 178 300 -165 -119 -40 -101 93 -63 -180 72 144
6871 144 124 -144 -276 -19 109 257 -115 202 10 -102 137 -68 -178 -209 -9 16 34 -201 16 80 -242 284
6893 284 83 -70 -34 -42 -321 121 111 195 -29 118 78 -70 6 4 -115 4 -18 187 -407 29 176 -42 92
6916 92 81 -114 -46 -14 -126 -95 -30 -231 127 26 29 -157 48 -104 0 177 69 -208 -45 -11 126 176 303
6939 303 189 270 41 -292 -90 15 92 -298 164 -615 47 -11 -158 361 81 -157 -135 -127 -187 -149 -155 -99 0 -71
6963 -71 107 -66 103 95 -278 233 -17 -46 -159 -91 38 82 -36 -109 -236 24 -130 221 -60 30 169 -46 -143
6986 -143 24 -88 -38 240 -106 76 116 -330 13 55 -227 147 4 123 -45 -105 20 90 -30 216 -64 15
7008 15 -9 33 32 -234 436 -229 88 379 13 7 121 -54 111 -45 155 111 -208 -121 285 32 -96 -148 95
7031 95 -67 -316 280 -180 131 -159 -122 193 -26 -99 147 37 -203 89 -188 -129 117 -95 -2 80 30 63 -321
7054 -321 90 181 113 -118 145 138 246 -56 38 -28 198 244 -17 -141 19 104 -107 -243 56 -256 -159 304 220
7077 220 -14 10 -269 162 -69 -236 3 96 179 -168 148 232 24 -221 38 -76 -120 145 -65 -204 63 199
7099 199 139 34 61 -98 -28 -164 -44 -498 -133 -37 216 -27 -42 114 -306 20 -295 132 -95 -160 -122 -91 113
7122 113 -173 10 -205 269 -61 8 42 -203 3 -10 -118 -48 -82 -15 -115 -46 73 35 -76 195 -420 -58 -47
7145 -47 77 -42 2 -67 320 -289 -600 -65 73 100 323 157 67 -83 -147 76 264 13 78 105 -178 -301 -95
7168 -95 188 -113 57 81 30 -22 121 -36 -130 281 177 4 -120 -93 202 -48 -258 -81 318 65 -144 103
7190 103 46 -265 257 -135 -29 101 -36 -293 71 54 342 129 119 74 -113 45 -29 215 -15 54 -113 149
7212 149 -52 -103 8 -238 -67 -33 62 270 -339 51 161 271 188 -118 124 -123 -83 134 -147 128 -87 35
7234 35 -61 -248 125 112 10 -338 -1 -249 -152 -256 30 -109 123 46 -11 -54 -92 -143 -35 -24 -16 136 -118 -88
7258 -88 -115 257 45 72 168 -197 -199 7 -244 -57 349 154 -89 99 -282 233 177 -111 113 209 92 -19 -123
7281 -123 45 0 87 13 -111 70 -187 -192 -27 58 68 -110 -247 -106 -168 -185 22 307 39 -126 -13 -84 45
7304 45 199 97 234 -6 -88 115 384 -7 -175 87 -126 178 -212 -77 138 36 114 34 -50 149 -173 117
7326 117 38 177 -28 -35 57 193 -62 -344 68 -142 62 26 -181 33 -42 54 161 189 90 -22 106 -45 20
7349 20 195 -23 118 -106 10 -22 176 -157 108 -277 -113 -323 -163 42 -382 39 -147 224 -60 -11 -32
7370 -32 -113 156 -56 329 177 121 -126 22 -57 -90 134 -179 161 -47 -87 -25 -28 111 40 -32 -222 14 -282 -88
7394 -88 136 -130 -304 165 41 41 -72 -216 -250 -144 79 141 -207 103 -94 200 38 45 -201 -154 -8 -46 -138
7417 -138 -178 121 51 333 193 -136 175 215 -78 242 -9 22 -70 37 196 -51 30 63 26 -149 -492 -94 122
7440 122 19 -108 173 308 191 -29 183 405 -39 2 225 81 -182 -364 62 -322 247 160 171 -165 -26
7461 -26 32 -147 -154 105 44 -136 40 -21 -63 80 -161 -71 -151 113 -309 166 286 -179 26 26 -203 -64 -68 96
7485 96 -169 -113 169 46 -191 -200 -185 253 7 -100 -59 49 2 91 -161 14 -519 -207 263 -106 242 -101 333
7508 333 -11 -184 -33 220 -40 147 125 -193 34 -165 -30 -22 169 1 -183 92 -46 -473 -25 -219 -1
7529 -1 184 101 -35 -7 85 104 -187 79 -208 -16 -46 204 137 -14 106 82 135 -20 -465 160 -54 -162 107
7552 107 226 23 333 -85 14 4 -83 208 317 8 146 -114 -207 40 -57 -56 121 29 -184 -75 117 148 7
7575 7 -34 66 22 -26 58 246 190 33 -3 -141 -210 323 7 167 13 -8 52 -179 -123 -267 -119 -206 99 -52
7599 -52 -6 -117 -84 -48 -107 259 -347 -149 193 -42 43 -26 154 -88 -235 -62 78 -61 66 -105 89 -375
7621 -375 -362 -227 80 -75 28 -71 -56 50 -196 -315 188 204 -109 168 36 -53 -255 -209 -151 -29 -142 21
7643 21 -52 38 -170 72 7 156 327 -44 64 47 -41 -95 67 -36 91 -88 -121 5 289 22 78 -123 85
7666 85 90 -279 69 -98 -58 215 -151 166 -13 238 -2 148 -193 -39 11 90 -38 -62 64 87 -8 36 -101
7689 -101 -105 171 49 -124 -329 -137 94 -28 -81 58 259 51 0 -56 -205 359 -137 -81 -12 137 328 -70
7711 -70 -65 64 100 217 -59 4 1 -413 2 -36 -55 -13 -259 -160 -310 73 -143 58 94 44 25 114 143 -201 -39
7736 -39 -173 -89 4 99 -33 -115 -135 -48 43 -221 -182 210 5 70 221 121 -166 322 -2 -12 -376 70 103 76
7760 76 -163 -123 -202 340 86 -42 170 -33 36 68 -253 -263 247 40 107 -83 -61 -250 161 -218 150 -152 60
7783 60 13 17 86 -138 -250 27 88 84 -238 -129 78 -88 111 -33 79 -203 -186 -103 -160 -134 -34 -85 -170 -59 85
7808 85 132 83 31 -112 -208 77 145 -8 -20 -28 135 213 -7 -144 48 207 -60 123 225 -339 -321 -209 -192 82
7832 82 144 -177 215 3 -113 -6 61 76 56 -29 50 262 187 175 205 128 148 -176 -127 -67 -188 154 87 84 -160 -75
7858 -75 -54 301 -162 66 -81 -82 91 -177 31 -7 3 61 -234 232 174 303 31 297 0 -71 70 256 6
7881 6 -151 -130 31 -155 72 18 -159 49 -88 111 112 -62 -307 -99 56 -133 -170 122 10 -131 -277 -174
7903 -174 119 -217 -29 17 -248 202 -121 -344 189 -302 -42 128 -106 221 -10 37 -11 -84 -278 153 -88
7924 -88 22 65 -235 182 145 13 128 -166 70 231 -123 -108 -6 -6 -30 119 121 314 33 242 -35 181 165
7947 165 -230 55 -65 -37 33 -160 -196 28 223 8 7 164 407 133 267 289 141 128 -25 -128 -234 260
7969 260 -165 -4 8 -28 150 -164 14 -309 -132 183 -148 -130 -22 44 38 52 104 251 179 157 -117 -134 171 -179
7993 -179 144 -218 181 5 46 -82 -379 212 29 95 -152 43 35 70 -172 100 7 122 443 173 -66 -178
8015 -178 12 -96 -254 -161 27 301 117 55 -30 -10 -114 -216 108 -176 -53 63 99 -168 -199 -1 126 -232
8037 -232 87 -154 152 -164 119 150 60 -44 48 -100 -52 -113 76 -127 163 -291 -118 100 106 81 230 -54 -97
8060 -97 6 210 -131 -147 104 -234 -187 186 181 -113 314 127 -107 -22 -124 -23 -58 -214 -67 -124 123 -21 -37
8083 -37 -10 265 -76 -280 -16 18 24 -141 -285 124 25 184 47 -92 -14 -78 88 123 72 5 282 169 6 45
8107 45 292 39 -90 -155 -148 -30 201 16 4 -61 276 61 -92 57 23 26 3 -27 -9 43 -89 0 24 -287 -125
8132 -125 -72 -44 -67 -249 132 37 317 -47 161 -145 -123 -56 -258 243 66 119 -337 -49 54 89 -228 145 41
8155 41 -118 -45 -32 329 -12 38 -149 200 95 -59 1 -220 149 4 -190 122 233 219 -239 13 25 -275
8177 -275 96 80 -81 -43 6 109 -91 32 -265 -177 176 28 27 95
8191I5
##END NTUPLES=NMR FID
##END=
