##TITLE=1H_Ser K-006-4
 DMSO, 8 sc, 
 20.12.2019
##JCAMPDX= 6.0         $$ Bruker NMR JCAMP-DX V2.0
##DATA TYPE= NMR FID
##DATA CLASS= NTUPLES
##ORIGIN= UXNMR, Bruker Analytische Messtechnik GmbH
##OWNER= root
$$ XWIN-NMR		Version 3.5
$$ Fri Dec 20 16:05:46 2019 Russian Standard Time (UT+4h)  she@DPX200
##.OBSERVE FREQUENCY= 200.1315
##.OBSERVE NUCLEUS= ^1H
##.DELAY= (6, 6)
##.ACQUISITION MODE= SIMULTANEOUS
##.ACQUISITION SCHEME= undefined
##.AVERAGES= 8
##.DIGITISER RES= 18
##SPECTROMETER/DATA SYSTEM= spect
##.PULSE SEQUENCE= zg30
##.SOLVENT NAME= DMSO
##.SHIFT REFERENCE= (INTERNAL, DMSO, 0, 15.7039)
##AUDIT TRAIL= $$ (NUMBER, WHEN, WHO, WHERE, WHAT)
$$ ##TITLE= Audit trail, XWIN-NMR		Version 3.5
$$ ##JCAMPDX= 5.01
$$ ##ORIGIN= Bruker BioSpin GmbH
$$ ##OWNER= she
$$ F:/spectra/data/she/nmr/H-F/1/audita.txt
$$ ##AUDIT TRAIL=  $$ (NUMBER, WHEN, WHO, WHERE, WHAT)
(   1,<2019-12-20 16:04:39.51 +0400>,<she>,<DPX200>,
      <created by zg, POWCHK disabled, PULCHK disabled
       configuration hash MD5:
       00 E9 B6 7A A2 85 ED C7 34 08 36 98 17 FE 4E 26
       data hash MD5: 16K
       D5 1E E2 D3 4B 00 90 55 66 52 5B AB 0E 84 9A CC>)
$$ ##END=
$$ 
$$ hash MD5
$$ 31 9A C4 C6 9C 13 CE 40 AD 29 88 60 54 15 F8 02
##$RELAX= 
##$RELAX= 
##$RELAX= 
##$RELAX= 
##$RELAX= 
##$RELAX= 
$$ Bruker specific parameters
$$ --------------------------
##$DU= <F:/spectra>
##$EXPNO= 1
##$NAME= <H-F>
##$PROCNO= 1
##$TYPE= <nmr>
##$USER= <she>
##$AMP= (0..31)
100 100 100 100 100 100 100 100 100 100 100 100 100 100 100 100 100 100 
100 100 100 100 100 100 100 100 100 100 100 100 100 100 
##$AQSEQ= 0
##$AQ_mod= 1
##$AUNM= <au_zg>
##$AUTOPOS= <>
##$BF1= 200.13
##$BF2= 200.13
##$BF3= 200.13
##$BF4= 200.13
##$BF5= 200.13
##$BF6= 200.13
##$BF7= 200.13
##$BF8= 200.13
##$BYTORDA= 1
##$CFDGTYP= 0
##$CFRGTYP= 5
##$CHEMSTR= <none>
##$CNST= (0..31)
1 1 145 1 1 1 1 1 1 1 1 1 1 1 1 1 1 1 1 1 1 1 1 1 1 1 1 1 1 1 1 1 
##$CPDPRG= <>
##$CPDPRG1= <>
##$CPDPRG2= <>
##$CPDPRG3= <>
##$CPDPRG4= <mlev>
##$CPDPRG5= <mlev>
##$CPDPRG6= <mlev>
##$CPDPRG7= <mlev>
##$CPDPRG8= <mlev>
##$CPDPRGB= <>
##$CPDPRGT= <>
##$D= (0..31)
0 1.2 0 0 0 0 0 0 0 0.06 0 0.03 0 0 0 0 0.0002 0 0 0 0 0 0 0 0 0 0 0 0 
0 0 0 
##$DATE= 1576843478
##$DBL= (0..7)
120 120 120 120 120 120 120 120 
##$DBP= (0..7)
150 150 150 150 150 150 150 150 
##$DBP07= 0
##$DBPNAM0= <>
##$DBPNAM1= <>
##$DBPNAM2= <>
##$DBPNAM3= <>
##$DBPNAM4= <>
##$DBPNAM5= <>
##$DBPNAM6= <>
##$DBPNAM7= <>
##$DBPOAL= (0..7)
0.5 0.5 0.5 0.5 0.5 0.5 0.5 0.5 
##$DBPOFFS= (0..7)
0 0 0 0 0 0 0 0 
##$DE= 6
##$DECBNUC= <off>
##$DECIM= 24
##$DECNUC= <off>
##$DECSTAT= 4
##$DIGMOD= 1
##$DIGTYP= 9
##$DL= (0..7)
0 120 120 120 120 120 120 120 
##$DP= (0..7)
150 150 150 150 150 150 150 150 
##$DP07= 0
##$DPNAME0= <>
##$DPNAME1= <>
##$DPNAME2= <>
##$DPNAME3= <>
##$DPNAME4= <>
##$DPNAME5= <>
##$DPNAME6= <>
##$DPNAME7= <>
##$DPOAL= (0..7)
0.5 0.5 0.5 0.5 0.5 0.5 0.5 0.5 
##$DPOFFS= (0..7)
0 0 0 0 0 0 0 0 
##$DQDMODE= 0
##$DR= 18
##$DS= 0
##$DSLIST= <SSSSSSSSSSSSSSS>
$$ [...]
##$SUBNAM2= <"">
##$SUBNAM3= <"">
##$SUBNAM4= <"">
##$SUBNAM5= <"">
##$SUBNAM6= <"">
##$SUBNAM7= <"">
##$SUBNAM8= <"">
##$SUBNAM9= <"">
##$SW= 24.9337058887773
##$SWIBOX= (0..15)
0 0 2 0 0 0 0 0 0 0 0 0 0 0 0 0 
##$SW_h= 4990.01996007984
##$TD= 16384
##$TD0= 1
##$TE= 0
##$TE2= 300
##$TE3= 300
##$TEG= 300
##$TL= (0..7)
0 120 120 120 120 120 120 120 
##$TP= (0..7)
150 150 150 150 150 150 150 150 
##$TP07= 0
##$TPNAME0= <>
##$TPNAME1= <>
##$TPNAME2= <>
##$TPNAME3= <>
##$TPNAME4= <>
##$TPNAME5= <>
##$TPNAME6= <>
##$TPNAME7= <>
##$TPOAL= (0..7)
0.5 0.5 0.5 0.5 0.5 0.5 0.5 0.5 
##$TPOFFS= (0..7)
0 0 0 0 0 0 0 0 
##$TUNHIN= 0
##$TUNHOUT= 0
##$TUNXOUT= 0
##$USERA1= <user>
##$USERA2= <user>
##$USERA3= <user>
##$USERA4= <user>
##$USERA5= <user>
##$V9= 5
##$VALIST= <valist>
##$VCLIST= <CCCCCCCCCCCCCCC>
##$VD= 0
##$VDLIST= <DDDDDDDDDDDDDDD>
##$VPLIST= <PPPPPPPPPPPPPPP>
##$VTLIST= <TTTTTTTTTTTTTTT>
##$WBST= 1024
##$WBSW= 4
##$XGAIN= (0..3)
0 0 0 0 
##$XL= 0
##$YL= 0
##$YMAX_a= 97592
##$YMIN_a= -62399
##$ZGOPTNS= <>
##$ZL1= 120
##$ZL2= 120
##$ZL3= 120
##$ZL4= 120
##$ABSF1= 10
##$ABSF2= 0
##$ABSG= 5
##$ABSL= 3
##$ALPHA= 0
##$AQORDER= 0
##$ASSFAC= 0
##$ASSFACI= 0
##$ASSFACX= 0
##$ASSWID= 0
##$AUNMP= <proc_1d>
##$AZFE= 0.1
##$AZFW= 0.1
##$BCFW= 1
##$BC_mod= 2
##$BYTORDP= 1
##$COROFFS= 0
##$CY= 11.3945322036743
##$DATMOD= 1
##$DC= 2
##$DFILT= <>
##$DTYPP= 0
##$F1P= 16.9975609425685
##$F2P= -3.02152046262296
##$FCOR= 0.5
##$FTSIZE= 0
##$FT_mod= 4
##$GAMMA= 1
##$GB= 0.15
##$INTBC= 1
##$INTSCL= 1
##$ISEN= 128
##$LB= 0.24
##$LEV0= 0
##$LPBIN= 0
##$MAXI= 10000
##$MC2= 0
##$MEAN= 0
##$ME_mod= 0
##$MI= 1.114404
##$NCOEF= 0
##$NC_proc= 0
##$NLEV= 6
##$NOISF1= 3.799351
##$NOISF2= 2.8
##$NSP= 1
##$NTH_PI= 0
##$NZP= 0
##$OFFSET= 15.70392
##$PC= 1
##$PHC0= -10155.76
##$PHC1= 24.2008
##$PH_mod= 1
##$PKNL= yes
##$PPARMOD= 0
##$PSCAL= 0
##$PSIGN= 0
##$REVERSE= no
##$SF= 200.130013532006
##$SI= 16384
##$SIGF1= 3
##$SIGF2= 2
##$SINO= 400
##$SIOLD= 16384
##$SREGLST= <1H.CDCl3>
##$SSB= 0
##$STSI= 0
##$STSR= 0
##$SW_p= 3612.71676300578
##$SYMM= 0
##$S_DEV= 0
##$TDeff= 0
##$TDoff= 0
##$TI= <>
##$TILT= no
##$TM1= 0
##$TM2= 0
##$TOPLEV= 0
##$USERP1= <user>
##$USERP2= <user>
##$USERP3= <user>
##$USERP4= <user>
##$USERP5= <user>
##$WDW= 1
##$XDIM= 8192
##$YMAX_p= 0
##$YMIN_p= 0
$$ End of Bruker specific parameters
$$ ---------------------------------
##NTUPLES= NMR FID
##VAR_NAME=  TIME,          FID/REAL,        FID/IMAG
##SYMBOL=    X,             R,               I
##VAR_TYPE=  INDEPENDENT,   DEPENDENT,       DEPENDENT
##VAR_FORM=  AFFN,          ASDF,            ASDF
##VAR_DIM=   8192,          8192,            8192
##UNITS=     SECONDS,       ARBITRARY UNITS, ARBITRARY UNITS
##FACTOR=    0.0002004,     1,               1
##FIRST=     0,             0,               0
##LAST=      1.6414764,     0,               0
##MIN=       0,             -62399,          0
##MAX=       1.6414764,     97592,           0
$$ Real data points
##PAGE= N=1
##DATA TABLE= (X++(R..R)), XYDATA
$$ [...]
$$ plain form
1984 -736 -53 576 -116 -218 103 448 -194 -158 483 557 -367 -859 332 772 151 -686 -180 116 296 -200
2004 -200 411 259 -7 -289 74 560 415 -510 -399 326 627 87 -226 199 112 -120 232 587 232 -464
2024 -464 -477 428 635 118 -744 -250 253 181 -260 37 112 -131 -209 596 348 92 -778 -605 480 867 -181
2045 -181 -206 -86 239 -7 316 594 173 -850 -233 865 474 -10 -931 -361 611 118 0 374 208 -154
2065 -154 -348 552 707 -401 -990 -113 438 570 -110 -156 282 214 -89 468 532 -89 -567 -183 816 667 -210
2086 -210 -535 -101 499 266 272 132 -207 -352 -195 411 414 -199 -436 26 187 339 -248 -331 507 -14 161 93
2108 93 488 0 -606 -232 777 463 -57 -575 -124 617 49 -78 -132 265 5 -342 560 605 -488 -664
2128 -664 33 706 -13 -468 -483 373 259 -232 207 274 -384 -500 327 658 184 -571 -397 -52 109 -323 -71
$$ packed form
1984g36O83O29o92j02L21L45o42L6O41P4r24m92J191M40o21q37N06K96J80m96
2004b00O11j52k66k82L63M86j45r25J11P25L01n40l13M25q7k32L52L55l55o96
2024d64j3R05K07n17q62M94N03p2m41K97P5k43p8Q05k48k56q70J73J085L87j048
2045a81k5J20L25k46L23K78m21j023O17J098l91m84r21N70R72m93j18L74j66l62
2065a54j94R00J55j108n89Q77N51J32o80m6M38o8l03N57O4o21m78L84R99j49q77
2086b10l25M34O00k33Oj40l39j45J57O06Lo13k37M62J61J52n87q3Q38n21J75o8
2108I3L95m88o06L74J009l14n20n18M51P41n68j27n4L97k60l47R02M5j093j76
2128f64O97O73p19m55j5Q56j14m91M39O7o58j16Q27L31m74p55J74L45J61m32K52
$$ plain form
2149 -71 -528 -89 -464 177 565 454 -684 -966 0 571 671 -363 -439 -101 189 255 46 -148 -486 -517 264
2170 264 496 344 -300 -837 153 650 -58 -286 59 20 -276 -59 174 315 -317 -673 -101 670 -86 -688
2190 -688 -364 271 69 -236 103 527 -440 -730 54 477 -27 -985 -790 154 530 -333 -240 -155 -276 -192 106
2211 106 376 -475 -863 -120 220 502 -336 -526 -34 225 -2 -62 -113 131 -560 -274 285 303 230 -674 -480
2232 -480 139 832 -45 216 -63 -313 76 438 566 -36 -411 -311 467 915 -41 -756 -56 420 267 -195
2252 -195 -64 248 -216 -314 -41 559 64 -126 21 343 -136 -371 151 118 -280 -332 198 736 100 -638 -44
2273 -44 880 463 -237 -445 -16 494 340 220 215 -359 -474 399 721 202 -531 -528 139 872 4 -175 -85 137
2295 137 128 330 379 252 -36 -106 208 240 130 -32 -298 -339 32 207 306 -218 -107 -365 23 635 601 -87 -485
$$ packed form
2149g1m57M39l75O41L88j11j138k82R66N71J00j034p6L38K90O6k09j94l38l1P81
2170B64K32j52o44n37R90M97p08k28L45l9k96K17K33J41o32l56N72P71p56o02
2190f88L24O35k02l05L39M24r67k90P84M23n04r58J95R44L76q63R3Q5j21Q4K98
2211A06K70q51l88P43L40K82q38j90M92K59k27o0n1K44o91K86N59J8p3r04J94
2232d80O19O93q77K61k79k50L89L62J28o02l75J00P78M48r56p15P00M76j53m62
2252a95J31L12m64r8K73O00m95j90J47L22m79k35N22l3l98n2N30N38o36p38N94
2273d4R24m17p00k08M29N10j54j20nn74j15Q73L22n19p33LO67P33q68j79R0K22
2295A37rK02M9j27k88p0L14L2j10j62k66m1L71J75R9n24J11k58L88O12l4o88l98
$$ plain form
2318 -485 -111 417 376 -129 -310 91 302 274 95 -108 -216 -306 132 411 15 -448 -218 143 365 -128 -60
2339 -60 149 35 -518 -309 475 248 -605 -704 -154 421 274 -149 -562 -350 86 36 318 -144 -704 -258 326
2360 326 677 193 -732 -330 383 281 311 -54 122 -160 -59 123 45 68 -438 1 44 463 112 -290 279
2381 279 -140 -163 79 34 58 -259 -371 237 862 110 -523 -590 287 336 167 -300 -119 -324 72 512 156 -302
2403 -302 -916 -472 478 221 -121 -609 -269 197 73 -145 86 90 -536 -349 50 453 12 -319 127 75 -53
2424 -53 122 92 12 -146 -123 387 606 -456 -824 -107 269 459 -28 -628 -134 373 269 265 -143 -77 -526 -106
2446 -106 414 265 -453 -355 53 403 226 -376 126 294 -207 -263 165 238 -97 -603 -439 216 697 -40 -370
2467 -370 -180 327 529 -63 124 -293 -306 243 572 404 -295 -662 334 570 489 -222 -375 -37 44 174 -130
$$ packed form
2318d85L74N28m1n05j81M01K11k8j79k03j08r0M38K79l96m63K30L61K22m93O8
2339f0K09j14n53K09P84k27q53r9N50N75j47m23m13K12M36n0K82m62n60M46N84
2360C26L51m84r25M02P13j02L0l65J76k82J01J82p8K3n06M39M3M19l51m02N69
2381B79m19k3K42m5K4l17j12O08O25p52o33o7Q77M9j69m67J81k05L96M40l56m58
2403c02o14M44R50k57l42m88L40M66j24k18K31Mo26J87L99M03m41l31M46n2j28
2424e3J75l0q0j58K3N10K19j062l68P17L76J90m87o00M94N07j04mm08O6m49M20
2446a06N20j49p18R8M08L50j77o02N02J68n01n6M28P3l35n06J64O55M81p37l30
2467c70J90N07K02n92J87m17j3N49L29j68o99l67R96K36q1p11j53L38Q1J30l04
$$ plain form
2488 -130 187 13 -215 241 198 153 -94 -62 74 32 -42 -56 398 -200 -540 -89 606 21 -48 -452 28 289
2510 289 491 117 -438 -435 8 384 313 6 -369 -378 122 356 -102 -300 -233 -114 338 -108 293 -29 52 -268
2532 -268 132 -8 178 20 -398 -124 169 333 -183 -99 -119 -224 154 424 -69 -645 -156 277 881 277 -331
2553 -331 -589 25 317 58 34 -34 -229 7 43 292 72 -495 -194 384 265 -126 -477 -17 -36 317 5
2574 5 546 84 -385 -416 370 374 165 -203 -307 12 119 340 223 -258 -689 -277 686 553 79 -822 -178 662
2596 662 517 -176 -297 -157 -21 -86 342 -330 -68 -83 -634 331 301 -89 8 52 -75 76 -128 9 196 -312
2618 -312 -368 63 541 -88 -331 -419 186 468 -344 -347 -225 -135 427 131 147 -537 -397 295 590 295 -458 -598
2640 -598 152 304 109 -319 -363 25 181 -43 69 -167 -74 -32 -162 184 335 31 -231 -140 -102 -104 255 333 -334
$$ packed form
2488a30L17j74k28M56m3m5k47L2J36m2p4j4M54n98l40M51O95n85o9m04M80K61
2510B89K02l74n55LM43L76p1l07l75rN00K34m58j98O7J19M52m46M01l22Q1l20
2532b68M00j40J86j58m18K74K93J64n16Q4k0j05L78K70m93n76M89M33O04o04o08
2553c31k58O14K92k59k4o8j95K36L6K49k20n67L01N78j19l91l51M60j9L53l12
2574EN41m62m69l1P86Mk09l68j04L19J07K21j17m81m31M12R63j33m74r01O44Q40
2596F62j45o93j21J40J36o5M28o72K62j5n51R65l0l90R7M4j27J51k04J37J87n08
2618c12n6M31M78o29k43q8O05K82q12lJ22R0N62k96J6o84J40O92K95k95p53j40
2640e98P50J52j95m28m4L88J56k24J12k36R3M2j30L46J51l04k62R1L8kL59P8o67
$$ plain form
2663 -334 -449 -184 546 308 -137 -581 -253 335 698 -77 -349 -211 261 484 543 120 -118 -286 253 284 53
2684 53 -16 -423 25 -161 -106 80 267 88 -231 -84 157 231 -177 -530 -98 447 477 -35 -124 -360 -220 248
2706 248 310 186 -701 -462 217 658 221 -327 -102 167 300 220 -53 -10 -287 63 257 87 31 -181 -176 73
2728 73 -85 -87 38 84 95 67 -186 505 -160 -487 -345 -106 482 179 -278 -464 -9 170 592 184 -6 -204
2750 -204 -134 312 341 -160 -490 -314 353 358 -160 -227 -20 135 -120 416 277 125 -308 -156 389 37 62 -217
2772 -217 -21 242 47 93 246 -174 -273 -329 484 272 -347 -425 -24 333 621 70 -188 -167 -68 169 307 1
2794 1 -544 -171 -185 305 -129 -346 -256 -164 207 105 138 -272 25 -222 5 521 18 470 -174 -179 185 196 25
2817 25 -89 -332 -123 26 299 303 25 -439 -88 832 231 -268 -575 -433 96 201 142 -219 -293 162 183 203
$$ packed form
2663c34j15K65P30k38m45m44L28N88L63p75k72J38M72K23N9m23k38j68N39L1k31
2684E3o9m07M48j86N5J86J87j79l19J47K41P4m08l53M32N45L0n12q9k36J40M68
2706B48O2j24q87K39O79M41m37n48K25K69J33q0k73M3k77L50J94j70n6k12NK49
2728G3j58kJ25M6J1k8k53O91o65l27J42K39N88l03m57j86M55J79M22m08j90j98
2750b04P0M46K9n01l30J76O67Nn18o7K07J55k55N36j39j52m33J52N45l52K5k79
2772b17J96K63j95M6J53m20r9n6Q13k12o19p8M01L57K88n51k58K1R9K37J38l06
2794An45L73j4M90m34k17R0R2L71j02L3m10K97k47K27N16n03M52o44nL64J1j71
2817B5j14k43K09J49K73Mk78m64L51R20o01m99l07J42N29J05n9l61p4M55K1K0
$$ plain form
2839 203 72 76 -135 72 -64 -27 -307 -245 21 -252 1 83 227 47 -466 -370 96 282 -208 -307 -355 -226 421
2862 421 62 -236 -438 -327 82 471 125 -142 -226 -167 214 291 -113 -140 -173 9 84 25 -164 -128 -224 -23 85
2885 85 390 -21 -303 -236 41 137 190 -159 -81 -118 -24 344 282 -420 -771 -263 257 518 -338 -283 14 342 189
2908 189 -43 -121 -86 -227 -31 39 -62 -473 -171 73 218 72 86 243 127 -337 12 656 372 -327 -252 124
2930 124 407 110 133 -290 -301 114 246 385 126 -136 -281 416 149 -96 -355 -227 84 186 45 -92 -278
2951 -278 -291 -7 294 -72 -170 -387 170 492 198 111 20 208 221 37 -44 110 31 -334 -1 344 321 203 -189
2974 -189 -105 89 186 -59 -117 -99 -286 124 354 81 -56 -325 -150 438 164 -33 -293 -190 -253 137 66 -193
2996 -193 -75 -326 48 -145 355 192 240 18 91 142 76 111 30 130 175 514 -56 98 -200 164 447 139
$$ packed form
2839B03j31Mk11K07j36L7k80O2K66k73K53Q2J44j80n13R6M66J86m90r9m8J29O47
2862D21l59k98k02J11M09L89l46k67q4N9L81P7m04k7l3J82P5n9j89L6r6K01J08
2885H5L05m11k82O7K77R6N3l49P8l7R4L68o2p02l51N08N20K61q56N5K97L28j53
2908A89k32p8L5j41J96P0j01m11L02K44J45j46J4J57j16m64L49O44k84o99P5L76
2930A24K83k97K3m23j1M15J32J39k59k62j45O97k67k45k59J28L11J02j41j37j86
2951b78j3K84L01l66r8k17N57L22k94q7r1J88J3j84q1J54p9l65L33L45k3j18l92
2974a89Q4J94R7k45n8J8j87M10K30k73j37k69J75N88k74j97k60J03o3L90p1k59
2996a93J18k51L74j93N00j63M8k22P3N1o6L5q1J00M5L39n70J54k98L64K83l08
$$ plain form
3018 139 109 -65 -1 291 379 188 -71 -173 19 10 296 -22 -208 -256 -226 194 -81 -130 -282 255 -71 -38 288
3041 288 103 84 -63 37 126 207 -195 -523 -220 197 66 118 -291 -62 -409 112 544 171 -465 -426 275 192
3063 192 -33 37 14 -196 -69 139 195 116 -241 -242 -121 133 -39 -126 14 115 -272 80 -70 -150 -142 -14 169
3086 169 284 438 89 -242 -145 341 29 311 -290 117 64 203 337 -58 -171 -292 -75 142 22 -392 -222
3107 -222 108 147 172 9 27 -175 -193 209 251 -184 -237 -166 85 105 -248 34 -112 179 -146 173 298 125 -378
3130 -378 -496 83 317 177 -358 -131 -152 75 236 -90 -307 -13 53 151 303 365 106 -374 129 -15 25 -18
3152 -18 -327 -3 -51 -150 -4 -101 -204 -153 -227 476 147 -228 -197 -50 8 26 62 215 43 -154 157 -45 -317
3175 -317 -344 22 384 52 55 -239 -72 311 99 127 253 -28 -278 -67 328 306 100 -357 54 29 301 -153
$$ packed form
3018A39l0j74O4K92Q8j91k59j02J92rK86l18j86m8L0M20k75m9j52N37l26L3L26
3041B88j85j9j47J00Q9Q1m02l28L03M17j31N2m09K29l47N21M32l73o36L9P01q3
3063A92k25P0k3k10J27K08N6p9l57jJ21K54j72q7J40J01l87L52j50q0QJ28J83
3086A69J15J54l49l31R7M86l12K82o01M07n3J39J34l95j13j21K17K17j20m14J70
3107b22L30L9K5j63J8k02j8M02M2m35n3P1K51K0l53K82j46K91l25L19J25j73n03
3130c78j18N79K34j40n35K27k1K27J61l26k17K94O6R8J52O2k59m80N03j44M0m3
3152a8l09L24m8r9J46r7j03N1p4P03l29l75L1J47N8J8L6J53j72j97L11k02k72
3175c17k7L66L62l32Lk94J67L83k12K8J26k81k50K11L95k2k06m57M11k5K72m54
$$ plain form
3197 -153 24 181 -93 -68 -7 102 -267 77 182 217 346 -131 -264 -9 -49 109 203 45 -135 -394 42 443
3219 443 98 -129 48 -86 -67 180 33 -325 -83 179 -45 28 -270 -185 -294 -18 46 202 45 -8 -296 -123
3241 -123 2 15 399 -321 -88 -274 63 -29 -137 -220 -344 248 428 -290 -374 -201 -138 226 67 42 -336 76
3263 76 115 256 134 -204 -36 -70 153 65 -35 15 246 -109 53 156 5 110 -14 49 62 -7 -54 -230 -48
3286 -48 -251 -14 98 -76 -20 -267 -1 262 -64 -188 -157 222 -129 67 179 104 -65 -158 -143 -84 174 -14
3308 -14 -100 71 132 108 84 -263 -133 -216 127 -151 246 8 212 355 176 -12 -54 -86 193 175 155 115 -30 -32
3332 -32 -33 170 -146 -62 -323 -8 177 -10 -231 -219 -148 -293 173 63 -248 6 -102 -106 32 341 -62 -87 -127
3355 -127 -33 -3 250 59 -125 -215 7 152 275 -86 -205 72 -11 60 112 -13 165 232 274 264 -27 -29 -47 -253
$$ packed form
3197a53J77J57k74K5O1J09l69L44J05L5J29m77j33K55m0J58R4j58j80k59M36M01
3219D43l45k27J77j34J9K47j47l58K42K62k24P3k98Q5j09K76O4J56j57n3k88J73
3241a23J25J3L84p20K33j86L37r2j08q3j24N92J80p18q4J73O3L64j59k5l78M12
3263G6L9J41j22l38J68l4K23q8j00N0K31l55J62J03j51J05j24O3J3o9m7j76J82
3286d8k03K37J12j74N6k47K66K63l26j24L1L79l51J96J12p5j69r3J5N9K58j88
3308a4q6J71O1k4k4l47J30q3L43k78L97k38K04J43j79j88m2l2K79j8k0m0j45k
3332c2jK03l16Q4k61L15J85j87k21J2P1j45M66j10l11K54j08mJ38L09m03k5m0
3355a27R4L0K53j91j84r0K22J45J23l61j19K77q3P1N2j25J78O7M2j0k91kj8k06
$$ plain form
3379 -253 -158 -35 125 -262 40 62 315 208 174 407 -82 190 48 165 -258 -207 161 127 254 -77 -53 134
3401 134 -24 274 168 211 -15 -251 69 277 188 -148 -83 -81 -88 216 -2 101 -34 7 -40 8 126 214 -125 196
3425 196 143 -98 -100 190 169 206 118 31 -35 -186 -112 -161 304 179 47 -35 131 -54 -179 -61 -32 -252 -201 -49
3449 -49 118 403 8 -114 10 9 -1 -41 96 -70 -60 -226 88 125 -22 2 -34 385 99 -59 -337 149 -110
3472 -110 -78 -194 48 -15 73 -69 -117 -262 -193 -42 74 41 -103 -5 -51 -161 -77 8 250 -229 -131 -8 17 64
3496 64 107 173 -90 175 -127 -93 -232 -215 131 189 105 215 -105 -54 78 301 135 -37 10 -84 -88 42 76 -163
3520 -163 -152 -27 182 6 202 27 32 -145 17 51 53 -122 179 -204 -25 -219 -164 81 -55 -172 155 42
3542 42 -388 -51 -278 37 126 204 -58 163 170 -320 -89 118 58 -38 114 -60 187 -42 -379 -111 -80 -38 128
$$ packed form
3379b53R5J23J60l87L02K2K53j07l4K33m89K72j42J17m23N1L68l4J27l31K4J87
3401A34j58K98j06M3k26k36L20K08q9l36O5KpL04k18J03j35M1m7M8J18Q8l39L21
3425A96n3k41kK90k1L7q8q7o6j51P4m9M65j25j32q2J66j85j25J18K9k20N1J52
3449d9J67K85l95j22J24jj0m0J37j66J0j66L14L7j47K4l6M19k86j58k78M86k59
3472a10L2j16K42o3Q8j42m8j45O9J51J16l3j44R8m6j10Q4Q5K42m79R8J23K5M7
3496F4M3O6k63K65l02L4j39J7L46N8q4J10l20N1J32K23j66j72M7r4mJ30L4k39
3520a63J1J25K09j76J96j75Nj77J62L4Kj75L01l83J79j94N5K45j36j17L27j13
3542D2m30L37k27L15Q9P8k62K21Pm90K31K07o0r6J52j74K47k29l37K68L1M2J66
$$ plain form
3565 128 212 -197 152 -117 -18 -224 63 -112 51 -71 -166 -78 300 -27 -217 50 -264 109 -171 -10 19 108
3587 108 -211 -72 -420 56 -209 263 -37 93 -106 3 -57 -182 52 -51 -33 -248 -65 7 136 35 261
3608 261 -158 168 -119 61 33 66 82 -55 107 18 18 101 -93 -62 173 335 -35 -324 -124 -23 -33 -343 170
3631 170 65 -33 239 155 -164 -207 107 3 -134 25 -228 55 45 -119 247 177 -89 -176 39 -135 -12 -258
3653 -258 -3 84 59 32 220 -298 -13 -221 197 73 7 -137 104 211 -262 121 -71 -73 -179 248 -161 -248
3675 -248 -25 -96 -47 -7 -51 -12 89 69 -175 -111 234 165 115 216 17 -125 18 -39 -334 -75 20 -12 113 -42
3699 -42 260 90 -73 97 179 53 -36 100 -148 79 181 -89 -37 1 -6 284 -312 98 264 -53 -266 -196 193
3722 193 4 -213 -49 109 0 128 -123 284 106 -32 428 -322 101 -115 -133 109 225 -97 -166 10 55
$$ packed form
3565A28Q4m09L49k69R9k06K87j75J63j22r5Q8L78l27j90K67l14L73k80J61K9Q9
3587A08l19J39l48M76k65M72l00J30j99J09o0j25K34j03J8k15J83P2J29j01K26
3608B61m19L26k87J80k8L3J6j37J62q9%Q3j94L1K35J62l70k89K00J01j0l10N13
3631A70j05r8K72q4l19m3L14j04j37J59k53K83j0j64L66p0k66q7K15j74J23k46
3653b58K55Q7k5k7J88n18K85k08M18j24o6j44K41J07m73L83j92kj06M27m09q7
3675b48K23p1M9M0m4L9J01k0k44O4L45o9n0J01j99j42J43n7k95K59R5l2J25j55
3699d2L02j70j63J70Q2j26q9J36k48K27J02k70N2L8pK90n96M10J66l17k13P0L89
3722A93j89k17J64J58j09J28k51M07j78j38M60p50M23k16j8K42J16l22o9J76M5
$$ plain form
3743 55 3 62 -318 -112 273 106 -25 48 -64 46 -2 49 -5 -2 -167 -13 -204 -40 -174 -317 26 -100 193
3766 193 -51 -77 39 244 -37 -93 -132 -86 -137 119 -131 23 171 -52 -113 174 335 -106 -107 -199 46 -243 103
3789 103 -42 -149 332 166 -208 -292 -186 68 -72 -146 -59 -68 492 -193 169 40 145 -150 -239 -270 -48 -57 -217
3812 -217 -81 -36 113 -17 119 39 374 32 -90 41 -122 -63 -68 0 -81 226 195 31 -133 -9 16 -47 202
3835 202 173 -154 -146 307 -95 -105 164 334 38 164 -59 166 -87 -153 -227 -14 -27 301 -375 63 -164 -21
3857 -21 -243 76 83 224 75 -146 109 17 347 -154 -262 -76 13 -306 268 -28 130 -69 124 -142 -34 -155
3879 -155 -216 -188 54 -393 -162 35 56 -112 -309 33 32 40 347 -80 -192 -25 150 80 -59 81 -68 5 222
3902 222 -133 216 18 115 -287 -95 -129 -21 -261 149 294 11 114 -24 -93 136 327 5 258 -208 -239
$$ packed form
3743E5n2N9l80K06L85j67j31P3j12J10m8N1n4Lj65J54j91J64j34j43L43j26K93
3766A93k44k6J16K05k81n6l9M6n1K56k50J54J48k23o1K87J61m41jr2K45k89L46
3789A03j45j07M81j66l74q4J06K54j40p4Q7rN60o85L62j29J05k95q9l1K22rj60
3812b17J36M5J49j30J36q0L35l42j22J31j63N9nO8q1L07l1j64j64J24K5o3K49
3835B02k9l27QM53m02j0K69J70k96J26k23K25k53o6p4K13j3L28o76M38k27J43
3857b1k22L19PJ41j49k21K55r2L30n01j08J86Q9l19N74k96J58j99J93k66J08j21
3879a55o1K8K42m47K31J97K1j68j97L42jQL07m27j12J67J75p0j39J40j49P3K17
3902B22l55L49j98R7m02J92l4J08k40M10J45k83J03j38o9K29J91l22K53m66l1
$$ plain form
3923 -239 205 34 60 217 162 188 -35 -192 -218 152 275 49 -44 194 3 -62 -17 -36 74 416 -226 -35 -106
3946 -106 -58 203 329 2 109 56 229 201 -93 -40 -51 44 95 60 -88 23 6 -360 344 75 -359 35 -222
3969 -222 247 29 9 -276 -109 226 -61 -82 -173 46 -50 26 -67 73 -62 -105 -211 118 348 -75 115 334
3991 334 169 5 -115 -86 36 119 -239 45 148 -90 396 107 -133 -159 19 -8 -40 -45 67 -240 113 -107
4013 -107 64 -136 1 -136 -92 225 -123 202 74 178 -222 25 217 20 -66 -227 174 223 22 117 62 50
4035 50 193 167 225 -298 -15 -176 -252 240 95 -66 323 -130 -239 36 -184 -414 -14 99 16 99 -241 184
4057 184 200 -249 -105 36 -32 551 80 108 -410 24 93 -1 -76 -203 54 -166 36 -25 -19 78 -66 225 -258
4080 -258 -143 -163 25 334 -187 143 -328 4 -30 -105 -151 212 -123 323 102 151 -136 -100 -19 -11 117 -137 279
$$ packed form
3923b39M44j71K6J57n5K6k23j57k6L70J23k26r3K38j91o5M5j9J10L42o42J91p1
3946a06M8K61J26l27J07n3J73k8k94N3j1R5N1l5j48J11j7l66P04k69m34L94k57
3969b22M69k18k0k85J67L35k87k1r1K19r6P6r3J40j35m3j06L29K30m23J90K19
3991C34j65j64j20K9J22Q3l58K84J03k38M86k89k40k6J78k7l2nJ12l07L53k20
4013a07J71k00J37j37M4L17l48L25j28J04m00K47J92j97q6j61M01M9k01R5n5j2
4035E0J43k6N8n23K83j61p6M92j45j61L89m53j09K75k20k30M00J13q3Q3l40M25
4057A84J6m49J44J41o8N83m71K8n18M34O9r4p5j27K57k20K02o1OR7j44K91m83
4080b58J15k0J88L09n21L30m71L32l4p5m6L63l35M46k21M9k87L6Q1QJ28k54M16
$$ plain form
4103 279 -142 92 90 -83 -127 -128 122 295 112 -294 -294 118 247 -13 249 -278 359 4 -192 46 287 -101
4125 -101 -150 -31 301 -44 -172 276 34 96 54 67 -143 -62 -33 -103 -97 -107 98 -77 268 -110 -125 -147 -103 114
4149 114 -162 -42 66 -131 -102 305 121 23 -225 -144 78 -253 -186 -151 73 -148 53 -92 -67 180 -91 -123
4171 -123 -12 26 295 95 -132 160 -115 96 -17 -124 123 36 -74 -29 -21 90 174 180 155 -12 -130 109 212
4194 212 -426 49 220 -179 -187 435 69 -169 25 -157 -58 -64 320 135 -15 19 213 251 117 191 152 -18 208
4217 208 -234 -153 214 4 174 -118 87 -120 79 119 62 -155 -33 113 22 -51 4 64 251 25 -210 -6
4239 -6 -152 -71 -109 -325 204 -275 -114 282 -2 -92 79 -163 176 28 -117 100 -68 57 -89 69 96 -26
4261 -26 -587 -142 -189 -84 188 145 45 -360 81 -263 323 242 -2 127 63 -288 -57 53 -104 -106 113 118 151
$$ packed form
4103B79m21K34kj73m4jK50J73j83m06%M12J29k60K62n27O37l55j96K38K41l88
4125a01m9J19L32l45j28M48k42O2m2J3k10Q1K9p0Oj0K05j75L45l78j5k2M4K17
4149A14k76J20J08j97K9M07j84r8k48Q1K22l31O7L5K24k21K01j45K5K47k71l2
4171a23J11L8K69k00k27K92k75K11j13j07K47q7j10M5QJ11Q4Ok5j67j18K39J03
4194B12o38M75J71l99qO22l66k38J94j82R9oL84j85j50L4J94L8j34P4l9j70K26
4217B08m42Q1L67k10J70k92K05k07J99M0n7k17J22J46r1p3N5O0J87k26k35K04
4239fj46Q1l8k16N29m79J61L96k84r0J71k42L39j48j45K17j68J25j46J58K7j22
4261b6n61M45m7J05K72m3j00m05M41l44N86q1k44J29o4l51K31J10j57kK19NL3
$$ plain form
4284 151 -36 -134 114 -87 147 -51 12 117 46 -229 228 125 -99 109 -88 -8 -83 29 -318 -134 24 158
4306 158 -160 -31 -252 -8 -183 18 -87 -130 81 14 -170 -288 -44 177 -4 183 22 323 110 -27 -228
4327 -228 -91 67 -13 182 187 -14 145 -135 32 -108 176 -164 -77 -210 182 151 -30 -83 276 171 -131 94
4349 94 -86 97 36 -44 -175 112 24 342 47 -113 -144 -18 319 64 65 68 56 -92 -168 -206 187 -122 -271 180
4373 180 49 74 -224 73 -285 -46 -211 125 -207 -36 145 -16 37 301 182 258 -148 -79 47 62 158 -115
4395 -115 160 372 19 50 -303 152 -33 -357 193 -136 -1 -98 -92 107 -72 46 -206 -48 19 45 -144 198
4417 198 -364 -135 -13 240 -65 -433 135 95 -201 32 -189 98 -322 89 152 105 -118 -150 40 -89 50
4438 50 204 406 -16 -66 127 225 25 219 -265 -167 320 70 194 116 101 11 -132 35 -99 143 185 -24 221
$$ packed form
4284A51j87r8K48k01K34j98O3J05p1k75M57j03k24K08j97Q0p5J12l47J84J58J34
4306A58l18J29k21K44j75K01j05m3K11o7j84j18K44K21j81J87j61L01k13j37k01
4327b28J37J58q0J95Nk01J59k80J67j40K84l40Q7j33L92l1j81n3L59j05l02K25
4349I4j80J83o1q0j31K87q8L18k95j60l1J26L37k55JLj2j48p6l8L93l09j49M51
4373A80j31K5k98K97l58K39j65L36l32J71J81j61N3K64j19P6m06O9J26J5R6k73
4395a15K75K12l53L1l53M55j85l24N50l29J35r7OJ99j79J18k52J58O7K6j89L42
4417A98n62K29J22K53l05l68N68m0k96K33k21K87m20M11O3m7k23l2J90j29J39
4438E0J54K02m22n0J93R8k00J94m84R8M87k50J24p8j5r0j43J67j34K42M2k09K45
$$ plain form
4461 221 -173 139 -6 -123 248 177 -270 -38 122 -322 85 -143 -74 -14 124 80 110 71 -353 -363 -92 24
4483 24 -133 145 53 -2 -478 -8 225 -160 46 77 156 -150 135 -316 -101 -209 279 -390 78 580 -17 149
4505 149 -56 180 157 133 -156 217 57 217 175 180 194 32 -54 19 -154 -89 112 51 -72 210 -138 88 21 283
4529 283 561 -47 62 -158 -3 -138 -32 198 8 -153 77 -196 -130 115 -386 -61 157 -71 -57 -57 129
4550 129 231 140 313 17 -408 -148 12 103 -50 -42 -2 -74 -97 127 356 171 222 16 90 97 -260 131 -38 -186
4574 -186 163 -311 100 32 -160 -225 120 -23 250 283 -171 149 22 87 232 146 126 141 -69 -138 -80 107 133
4597 133 -176 108 115 -19 -408 -19 -140 -153 -38 185 -227 61 -167 -243 96 -94 -165 123 21 119 -162 -140
4619 -140 24 120 276 -39 79 132 -309 -227 -261 -60 8 -261 -105 -89 317 96 -193 178 64 88 -17 -166
$$ packed form
4461B21l94L12j45j17L71p1m47K32J60m44M07k28O9O0J38m4L0l9m24j0K71J16
4483B4j57K78r2n5m76M70K33l85K06L1P9l06K85m51K15j08M88o69M68N02n97J66
4505A49k05K36k3k4k89L73j60J60m2NJ4j62q6P3j73O5K01o1j23K82l48K26o7K62
4529B83K78o08J09k20J55j35J06K30j90j61K30k73O6K45n01L25K18k28J4%J86
4550A29J02r1J73k96m25K60J60R1j53QM0p2k3K24K29j85N1k06P4Pl57L91j69j48
4574a86L49m74M11o8j92o5L45j43K73L3m54L20j27O5J45q6k0J5k10o9N8J87K6
4597A33l09K84Pj34l89L89j21j3J15K23m12K88k28p6L39j90p1K88j02R8k81K2
4619a40J64R6J56l15J18N3m41Q2l4K01O8k69J56J6M06k21k89L71j14K4j05j49
$$ plain form
4641 -166 73 -65 294 92 75 -73 -68 58 -7 36 14 170 -28 -51 -130 125 -4 24 -57 43 137 -95 93 187
4665 187 -6 -121 169 168 -36 34 -161 -43 -87 68 -16 55 -112 -169 -73 21 117 230 173 317 108 78 226 99
4689 99 11 2 -34 -237 39 -166 154 -81 -128 -88 -56 -462 -113 63 -22 16 -11 246 135 333 -71 -10 101 261
4713 261 -18 50 -15 -85 -29 105 7 30 -118 93 105 101 343 41 -212 -15 -187 -41 144 143 -168 200 286 118
4737 118 -137 360 -253 26 167 292 -145 100 208 -27 -10 233 -126 314 -358 -125 106 119 -1 -134 -127
4758 -127 -113 1 -292 -24 -137 -120 143 94 200 326 -4 94 -12 -142 266 87 -37 -106 -23 -64 247 579
4780 579 -31 -78 222 -17 130 -36 15 -73 -292 22 -64 -248 224 -274 -97 -163 -154 112 106 -198 -144 -172 282 145
4804 145 -64 375 37 217 100 289 70 158 154 -119 127 300 301 -112 63 -74 125 126 225 -41 189 -14 -86
$$ packed form
4641a66K39j38L59k02j7j48NJ26o5M3k2J56j98k3p9K55j29K8q1J00R4k32J88R4
4665A87j93j15K90jk04P0j95J18m4J55q4P1j67n7R6R4R6J13n7J44k09l0J48j27
4689I9q8rl6k03K76k05L20k35m7M0L2m06L49J76q5L8k7K57j11J98m04O1J11J60
4713B61k79O8o5p0N6J34r8K3j48K11J2mK42l02k53J97j72J46J85jl11L68Q6j68
4737A18k55M97o13K79J41J25m37K45J08k35J7K43l59M40o72K33K31J3j20j33P
4758a27J4J14k93K68j13J7K63m9J06J26l30R8j06j30M08j79j24o9Q3m1L11L32
4780E79o10m7L00k39J47j66N1q8k19L14q6j84M72m98J77o6RK66ol04N4k8M54j37
4804A45k09M39l38J80j17J89k19Q8mk73K46J73Jm13J75j37J99JR9k66K30k03p2
$$ plain form
4827 -86 -210 89 -30 -54 -190 -299 38 -43 173 228 -58 185 59 -227 94 -327 -9 -15 117 21 32 -103 48
4850 48 -89 61 57 1 -45 141 -33 -170 20 257 -363 138 -71 115 136 266 41 159 -33 86 47 157
4872 157 -21 -224 7 -13 82 -22 -130 43 -238 233 93 -84 99 272 106 -80 -42 1 -257 -100 165
4893 165 -18 224 111 -110 -82 -7 85 -66 -211 -192 -38 -2 184 -2 -82 -99 73 184 -69 84 -59 -9 23
4916 23 56 -161 184 -24 -32 -54 56 62 84 79 7 -54 64 204 282 -159 139 256 -26 84 -200 -31 -204 72
4940 72 68 185 -139 -110 -27 -178 -136 -161 128 -153 -30 -123 -52 -209 23 197 -51 -237 -247 -380 130 145 89 -11
4964 -11 87 55 309 15 -28 -48 -241 11 -352 175 67 67 60 -86 -222 -216 -298 -113 -123 -57 110 259 112 21 46
4989 46 -106 -84 -231 -88 346 249 73 -197 81 -72 -95 -56 130 -158 108 128 -45 66 59 182 131 -93 -258
$$ packed form
4827h6j24K99j19k4j36j09L37q1K16N5k86K43j26k86L21m21L18oJ32r6J1j35J51
4850D8j37J50mn6m6J86j74j37J90K37o20N01k09J86K1J30k25J18j92J19l9J10
4872A57j78k03K31k0R5j04j08J73k81M71j40j77J83J73j66j86L8M3k58J57K65
4893A65j83K42j13k21K8P5R2j51j45J9J54L6J86j86q0j7J72J11k53J53j43N0L2
4916B3L3k17L45k08qk2J10OK2np2o1J18J40P8m41K98J17k82J10k84J69j73K76
4940G2mJ17l24K9Q3j51M2k5K89k81J23r3P1j57K32J74k48j86j0j33N10J5n6j00
4964a1R8l2K54k94m3k0j93K52l63N27j08%pj46j36Oq2J85j0O6J67J49j47r1K5
4989D6j52K2j47J43M34r7j76k70K78j53k3L9J86k88K66K0j73J11pJ23n1k24j65
$$ plain form
5012 -258 -152 299 183 -97 7 15 56 -108 126 -45 -162 136 -53 36 -218 -196 95 -122 74 160 102 -53
5034 -53 101 -66 96 37 -363 -85 136 6 110 18 -20 -87 190 -56 25 -65 -18 -104 -265 212 -66 263 140
5057 140 40 116 306 -162 -312 94 34 296 7 -364 254 -63 -34 -34 16 60 -193 176 -120 -249 169 -60
5079 -60 -201 131 59 -13 -122 125 236 -351 -160 -89 127 80 307 -107 -57 84 43 -51 38 160 40 165 -42
5102 -42 -61 -143 155 -252 181 152 -175 -140 7 -267 -84 -185 48 -214 -32 32 -187 -95 78 37 112 53 230
5125 230 -149 -97 144 85 -77 109 -42 3 152 -134 86 -126 -94 95 35 -31 -167 245 -11 55 64 -371 -48
5148 -48 -33 -69 66 -339 -41 -46 364 -17 -97 288 74 164 272 125 -201 -53 10 -48 -201 -123 224 -71 -3 -79
5172 -79 -53 -128 -190 60 134 -216 129 107 314 244 157 -110 57 79 168 129 49 192 -171 384 -36 6 26 302 14
$$ packed form
5012b58J06M51j16k80J04QM1j64K34j71j17K98j89Q9k54K2K91k17J96Q6n8j55
5034e3J54j67J62n9m00K78K21j30J04r2l8o7K77k46Q1r0M7q6j61M77k78L29j23
5057A40j00P6J90m68j50M06o0K62k89l71O18l17K9%N0M4k53L69k96j29M18k29
5079f0j41L32p2p2j09K47J11n87J91P1K16m7K27m14N0J41m1r4Q9J22j20J25k07
5102d2j9q2K98m07M33k9l27L5J47k74J83j01K33k62J82O4k19R2J73m1P5n9J77
5125B30l79N2K41n9j62J86j51M5J49k86K20k12L2J89o0o6j36M12k56O6Rm35L23
5148d8J5l6J35m05K98nM10l81q0L85k14R0J08j47l26J48O3n8j53P8L47k95O8p6
5172g9K6p5o2K50P4l50L45k2K07p0q7k67J67K2Q9l9q0J43l63N55m20M2K0K76k88
$$ plain form
5197 14 -312 26 -22 168 -31 209 -190 137 -95 -57 -61 -247 119 199 127 -251 82 -113 1 109 37 22 -32
5220 -32 -155 33 51 162 -248 -50 106 -105 142 -46 17 -172 -155 -90 264 415 -229 179 -193 193 267 54
5242 54 -238 221 8 -154 200 54 -85 -93 -15 -57 -109 173 -45 -63 -97 302 -73 -152 6 306 20 -36 86
5265 86 12 -141 -326 -280 -283 -171 -107 257 330 -315 112 -30 9 -154 -21 -185 -4 149 211 31 90 210 201 -160
5289 -160 -18 64 -190 242 -82 -16 -2 157 57 -62 155 102 150 -245 -214 90 144 159 121 -112 143 62 178
5312 178 -158 18 120 261 -139 -54 -146 226 6 -21 -39 -305 10 -46 -65 159 43 -168 -152 -316 102 -122
5334 -122 295 271 -34 -27 -42 -130 7 115 261 16 101 -89 210 59 389 9 49 75 -5 -96 118 326 102
5357 102 163 -259 -167 301 13 211 -206 -147 -5 -42 -120 -190 18 25 -123 -2 -66 162 109 124 -140 241 -20 -385
$$ packed form
5197A4l26L38m8J90j99K40l99L27k32L8mj86L66Q0p2l78L33j95J14J08p2j5n4
5220c2j23J88J8J11m10J98J56k11K47j88O3j89J7O5L54J51o44M08l72L86P4k13
5242E4k92M59k13j62L54j46j39qP8m2n2K82k18j8l4L99l75p9J58L00k86n6J22
5265H6p4j53j85M6lJ12O4L64P3o45M27j42L9j63J33j64J81J53O2j80N9J20rl61
5289a60J42Q2k54M32l24O6J4J59j00j19K17n3M8l95L1L04N4J5l8k33K55q1J16
5312A78l36J76J02J41m00Q5r2L72k20k7j8k66L15n6j9K24j16k11J6j64M18k24
5334a22M17k4l05Pj5q8J37J08J46k45Q5j90K99j51L30l80M0K6q0r1K14K08k24
5357A02O1m22R2M68k88J98m17N9J42l7p8p0K08Pj48J21o4K28n3J5k64L81k61l65
$$ plain form
5381 -385 -213 380 9 78 -217 121 -82 -97 -109 -225 -15 234 148 63 55 -131 -112 -56 68 21 -92 59 114 -166
5405 -166 242 242 236 290 -121 -8 20 111 124 -127 -354 85 -397 -197 284 -135 -166 -441 197 -133 -244 -148 3
5428 3 176 -260 61 -170 36 108 184 216 56 118 62 11 -157 -55 -180 -87 62 -68 131 -92 75 -4 145
5451 145 200 102 -13 22 13 121 -24 20 198 54 -54 315 -268 -74 -56 11 34 -23 24 -145 47 122 -89 60
5475 60 69 190 91 -19 121 -76 -151 117 119 99 -87 -40 194 -68 -110 -121 149 157 263 -142 -90 106 -57 85 -146
5500 -146 211 115 -599 -126 12 -180 48 240 -101 86 29 -38 -89 15 -116 -382 22 -120 139 45 -48 262
5522 262 -140 73 109 -47 59 93 -134 -121 319 48 -42 171 -61 -50 78 -73 153 41 -155 -47 -28 183
5544 183 -107 -359 41 -153 5 -297 -163 -124 27 34 48 -48 426 62 -270 -180 26 178 31 -189 0 -36
$$ packed form
5381c85J72N93l71O9k95L38k03j5j2j16K10K49q6q5qj86J9N6J24m7j13J51N5k80
5405a66M08%oN4m11J13K8R1J3k51k27M39m82K00M81m19l1k75O38l30j11R6J51
5428CJ73m36L21k31K06P2P6L2j60O2n6n1j68J02j25R3J49j30J99k23J67p9J49
5451A45N5r8j15L5rJ08j45M4J78j44j08L69n83J94J8O7K3n7M7j69J92P5k11J49
5475F0RJ21r9j10J40j97p5K68Kk0j86M7K34k62m2j1K70QJ06m05N2J96j63J42k31
5500a46L57r6p14M73J38j92K28J92l41J87n7o7n1J04j31k66M04j42K59r4r3L10
5522B62m02K13L6j56J06L4k27J3M40k71r0K13k32J1J28j51K26j12j96J08J9K11
5544A83k90k52M00j94J58l02J34L9J51PJ4r6M74l64l32R0K06J52j47k20J89l6
$$ plain form
5566 -36 -5 185 239 50 187 42 -88 202 67 119 -215 -158 -100 -209 75 7 -42 -51 78 145 71 -59 -270 35
5590 35 -209 209 -137 -253 -43 28 139 -92 25 -54 -18 -60 -168 189 110 -132 -39 -263 -103 38 -161 234
5612 234 -97 -158 99 -21 131 -296 -219 62 36 -53 -34 25 265 -100 -116 -171 -77 202 89 -31 148 138 -138
5635 -138 -62 -19 61 40 87 160 -116 300 -49 5 -8 -75 -151 -297 -45 105 89 103 34 -133 79 326 -119 -137 51
5660 51 -272 -140 145 -299 132 -151 -207 -130 -186 -19 -60 -66 -25 55 -10 -211 -3 134 -28 -125 -63 -37 172 106 113
5685 113 78 27 -239 103 185 47 -18 -21 122 374 -289 -57 -62 -115 85 -126 -135 191 93 91 -181 53 38 235 -1
5710 -1 72 -75 328 -112 333 29 114 -41 108 68 192 -46 -61 180 -112 -58 140 10 292 -46 -148 -235 81
5733 81 232 -357 173 -63 42 131 -205 14 -176 -155 169 -108 13 83 -52 -87 -280 96 -293 9 -149 -120
$$ packed form
5566c6L1J90N4j89J37j45j30K90j35N2l34N7N8j09K84o8m9rJ29O7p4j30k11L05
5590C5k44M18l46j16K10P1J11k31J17p9L6m2j08L57p9k42R3k24J60J41j99L95
5612B34l31o1K57j20J52m27P7K81k6q9J9N9K40l65j6n5R4K79j13j20J79j0k76
5635a38P6M3Q0k1M7P3k76M16l49N4j3o7p6j46K52J50j6J4o9j67K12K47m45j8J88
5660E1l23J32K85m44M31k83n6P7n6J67m1oM1Q0o5k01K08J37j62r7O2K6K09o6P
5685A13l5n1k66L42Q2j38o5lJ43K52o63K32nn3K00k11rL26r8kk72K34j5J97k36
5710aP3j47M03m40M45l04Q5j55J49m0J24k38j5K41k92N4J98j30K82l38j02q7L16
5733H1J51n89N30k36J05Q9l36K19j90K1L24k77J21P0j35l5j93L76l89L02j58K9
$$ plain form
5755 -120 207 -36 -59 -160 -139 -75 -51 200 139 -179 -190 136 -87 -45 211 -77 26 182 80 -12 -128 -153 65
5778 65 -164 -83 65 -304 -42 -149 7 218 -122 26 309 65 -237 6 194 -86 158 300 -70 102 -91
5799 -91 -34 -125 -110 29 -276 -104 -32 -95 -311 164 208 -27 81 208 11 113 -188 208 106 145 235 -77 180
5822 180 -77 -345 -77 41 93 110 -180 46 186 -24 148 -121 -200 157 103 39 21 55 37 -71 18 235 295
5845 295 -121 128 45 -260 122 -134 147 -95 -87 39 -300 22 162 28 -46 45 -1 31 -33 216 42 -168 179
5868 179 -65 129 185 -183 -20 127 -33 19 2 -171 -102 32 -160 -282 -68 -42 202 91 -148 -114 91 -124
5890 -124 -142 -264 -143 166 -8 -80 -252 136 -300 270 -230 223 -331 196 80 82 -150 -273 2 130 52 -152
5912 -152 -162 136 131 85 197 -91 -362 166 299 5 149 242 144 -134 130 -191 27 231 79 47 -232 -158 -90
$$ packed form
5755a20L27k43k3j01K1O4K4K51o1l18j1L26k23M2K56k88J03J56j02r2j16k5K18
5778F5k29Q1J48l69K62j07J56K11l40J48K83k44l02K43J88k80K44J42l70J72j93
5799i1N7r1J5J39l05J72P2o3k16M75M4k35J08J27j97J02l01L96j02L9R0l12K57
5822A80k57k68K68J18N2J7k90K26J40k10J72k69p9L57n4o4j8L4j8j08Q9K17O0
5845B95m16K49q3l05L82k56K81k42QJ26l39L22J40j34p4R1m6L2o4K49j74k10L47
5868A79k44J94N6l68J63J47j60N2j7j73O9J34j92j22K14K6K44j11k39L4K05k15
5890a24j8j22J21L09j74p2j72L88m36N70n00M53n54N27j16Kk32j23K75J28p8k04
5912a52j0K98nm6J12k88k71N28J33k94J44R3r8k78K64l21K18K04j52l2k79P4O8
$$ plain form
5935 -90 248 -154 123 -153 45 -223 -138 235 -339 -160 -211 356 170 -2 30 36 88 234 -182 1 35 121 297
5958 297 -45 299 -71 235 -182 207 -315 -78 165 69 -108 -22 273 194 -107 -122 -103 -89 172 -177 -59 -122
5980 -122 -20 29 -70 -14 -152 41 -12 -154 200 -137 195 -53 26 375 -3 -34 -104 147 295 219 118 -145 -113
6003 -113 85 -154 90 459 152 4 159 181 69 -33 -93 2 68 -37 72 185 153 142 -189 -56 -215 1
6025 1 118 44 -117 -57 220 -78 5 -207 -138 82 -125 -75 -157 -99 -152 124 44 -251 45 -246 186 174 -78 137
6049 137 -281 -98 -144 154 -151 30 -116 -233 -59 -86 62 0 93 -77 235 293 -24 132 -244 -121 45 -147
6071 -147 103 -110 87 64 -197 55 141 25 -384 65 73 41 192 87 -24 -97 -155 206 -157 -311 -48 45 107
6094 107 -346 -287 -69 61 -165 248 237 -164 -56 -22 -305 -502 154 -115 102 176 -85 26 -22 39 188 -166
$$ packed form
5935i0L38m02K77k76J98k68Q5L73n74J79n1N67j86j72L2ON2J46m16J83L4Q6J76
5958B97l42L44l70L06m17L89n22K37K43r6j77Q6K95p9l01j5J9J4K61l49J18o3
5980a22J02M9r9N6j38J93n3j42L54l37L32k48P9L49l78l1p0K51J48p6j01k63L2
6003a13J98k39K44L69l07j48J55K2j12j02o0R5O6j05J09J13l2j1l31J33j59K16
6025AJ17p4j61O0K77k98Q3k12O9K20k07N0q2N8n3K76q0k95K96k91M32j2k52K15
6049A37m18J83m6K98l05J81j46j17J74k7J48o2R3j70L12N8l17J56l76J23J66j92
6071a47K50k13J97k3k61K52Q6j16m09M49Ql2J51j05j11p3n8L61l63j54K63R3O2
6094A07m53N9K18J30k26M13j1m01J08L4k83j97O56k69K17P4k61J11m8O1J49l54
$$ plain form
6116 -166 175 -310 -53 -143 -225 -56 -363 -52 8 3 -49 -21 177 -9 19 117 -72 -462 140 117 71 -208 -93 58
6140 58 -28 -13 -102 -42 162 -229 -66 280 -192 79 -105 -291 82 291 -351 248 -195 72 -31 -106 155 115
6162 115 9 77 -77 161 -14 -406 96 -115 -84 -118 18 -24 114 -151 -48 -85 62 -97 20 15 0 126 72
6185 72 127 293 -78 -105 -235 -89 96 115 -247 -139 68 302 87 76 130 123 -42 56 66 102 227 -76 262 -69
6209 -69 112 -150 232 -122 -152 -33 -314 -88 -84 -108 78 36 -11 266 -2 -198 97 35 32 -105 -151 -115 -80 -88 289
6234 289 -89 -264 388 -188 26 28 -82 -161 -160 -40 75 -240 149 68 -184 -182 69 84 16 -43 -273 -147 -78 90
6258 90 88 -119 67 23 -75 -17 94 -113 90 416 -19 -296 176 -69 92 -64 -161 6 -28 -87 -212 22 -157
6281 -157 193 201 50 -59 -54 -42 45 48 136 -29 -37 54 133 200 -213 -100 -14 118 206 -45 -68 87 10 154 116 218
$$ packed form
6116a66L41m85K57r0q2J69l07L11O0nn2K8J98j86K8R8j89l90O02k3m6k79J15J51
6140E8q6J5q9O0K04l91J63L46m72K71j84j86L73K09o42N99m43K67j03p5K61m0
6162A15j06O8j54K38j75l92N02k11L1l4J36m2J38k65J03l7J47j59J17nj5J26n4
6185G2N5J66l71k7j30J46J85J9l62J08K07K34k15j1N4pj65R8J0L6J25l03L38l31
6209f9J81k62L82l54l0J19k81K26Mk4J86m2m7K77k68j96K95o2lj37m6L6L5qL77
6234B89l78j75O52n76K14Kj10p9JJ20J15l15L89q1k52KK51J5o8n9k30J26O9J68
6258I0kk07J86m4r8N8J11k07K03L26m35k77M72k45J61j56r7J67l4n9j25K34j79
6281a57L50Qj51j09NJ2Q7LQ8j65qR1P9O7m13J13Q6J32Q8k51k3J55p7J44l8J02
$$ plain form
6307 218 235 283 -129 53 -83 -167 67 -20 -280 -287 176 52 46 109 -241 -57 10 -13 -43 234 74 -318 24 -139
6331 -139 52 139 -61 197 15 -120 225 87 -122 -85 252 58 427 -32 -295 70 75 80 -67 -56 -295 142
6353 142 -23 -1 -306 -320 -216 -5 -21 108 -80 -26 -153 88 109 160 464 192 -116 91 71 90 70 -215 -38
6376 -38 88 -146 -136 -217 -94 166 154 -66 -23 -352 -246 -124 31 13 196 34 -46 -279 169 68 79 50 46 -70
6400 -70 -3 -191 -9 -77 67 28 25 -186 -53 -28 140 -34 -230 104 -31 -32 135 147 -173 39 304 94 86 92 85
6425 85 -144 211 -119 -164 -210 67 39 -177 208 85 -86 2 -174 73 -92 291 -290 11 163 -384 151 -133
6447 -133 -16 -23 -75 101 206 -119 -240 51 -290 -100 -128 -68 67 121 -18 40 177 85 186 -132 289 85 -150
6470 -150 194 -263 -112 -185 74 64 28 -83 55 98 45 -8 39 2 9 42 82 42 59 -118 -165 475 100 -145 -61
$$ packed form
6307B18J7M8m12J82j36q4K34q7k60pM63j24oO3l50J84O7k3l0K77j60l92L42j63
6331a39J91Q7k00K58j82j35L45j38k09L7L37j94L69m59k63L65NNj47J1k39M37
6353A42j65K2l05j4J04K11j6J29j88N4j27K41K1N1L04k72l08K07k0J9k0k85J77
6376c8J26k34J0q1J23K60j2k20M3l29J06J22J55j8J83j62q0k33M48j01J1k9mj16
6400g0O7j88J82o8J44l9lk11J33K5J68j74j96L34j35jJ67J2l20K12K65k10qOp
6425H5k29L55l30m5m6K77k8k16L85j23j71Q8j76K47j65L83n81L01J52n47N35k84
6447a33J17pn2J76J05l25j21K91l41J90k8O0J35N4j39N8J37r2J01l18M21k04k35
6470a50L44m57J51p3K59j0l6j11J38M3n3n3M7l7PL3M0m0J7j77m7O40l75k45Q4
$$ plain form
6495 -61 133 -174 360 -2 92 -57 42 62 -24 -7 -44 185 -233 -292 218 -65 -55 -126 -119 -444 -48 41 -89 244
6519 244 177 -196 -100 89 -105 -36 58 2 -30 -42 58 -64 226 -212 228 -176 70 183 -14 258 12 83 -39
6542 -39 -4 80 57 237 6 -82 -46 207 109 114 -421 -144 169 -48 -190 -63 52 -129 102 -224 22 -167 -75
6565 -75 -189 27 -151 94 -7 41 299 -77 103 177 -6 171 -139 168 -150 44 -98 52 -364 152 -281
6586 -281 111 62 -8 55 -163 -29 -125 -116 187 -13 99 -165 -8 -336 89 -47 -174 31 -426 -106 87 53
6608 53 93 17 -113 -113 -65 -174 92 305 -49 -100 178 43 -51 223 -174 46 272 25 -117 -407 -164 -275 55
6631 55 10 -4 -35 -35 -54 31 27 90 -5 23 -193 39 -42 225 38 259 -73 74 -293 -121 34 -375 425 164 22
6656 22 -26 68 412 70 205 143 107 185 -71 132 -21 -3 -105 -141 -53 87 -112 -34 193 -86 -65 185 80 15
$$ packed form
6495f1J94l07N34l62R4j49R9K0q6J7l7K29m18n9N10k83J0p1Pl25L96Q9j30L33
6519B44o7l73R6J89j94O9R4n6l2j2J00j22K90m38M40m04K46J13j97K72k46P1j22
6542c9L5Q4k3J80k31q8L6K53r8Nn35K77L13k17j42J27J15j81K31l26K46j89R2
6565g5j14K16j78K45j01M8K58l76J80P4j83J77l10L07l18J94j42J50m16N16m33
6586b81L92m9p0O3k18J34r6RL03k00J12k64J57l28M25j36j27K05m57L20J93l4
6608E3M0p6j30%M8j09K66K13l54n1K78j35r4K74l97K20K26k47j42k90K43j11L30
6631E5m5j4l1%j9Q5mO3r5K8k16K32q1K67j87K21l32J47l67J72J55m09Q00k61j42
6656B2m8R4L44l42J35o2l6P8k56K03j53J8j02l6Q8J40j99P8K27k79K1K50j05o5
$$ plain form
6680 15 -318 102 36 -150 -45 -205 85 231 205 -150 201 -53 39 35 -10 -126 237 -261 68 15 -167 -234 74
6703 74 -215 -174 143 -108 267 -25 47 349 -253 213 -64 32 -164 200 60 -89 51 -53 61 178 178 141
6725 141 -23 -70 70 241 182 -178 -88 40 290 -214 -120 146 -26 28 221 -228 253 27 -79 -144 -223 -99
6747 -99 -77 31 2 107 -323 -93 121 284 -206 14 -143 93 239 94 -328 14 -28 13 139 -173 108 271
6769 271 -180 6 36 -161 183 365 271 6 29 11 48 -49 -46 32 2 4 92 -71 23 -183 -196 -15 -62 -137 -480 -203
6795 -203 -116 -40 -218 42 271 211 37 -31 233 80 -31 -192 -32 -9 44 198 -43 -16 -130 240 -82 -137 96
6818 96 7 39 -338 52 -237 -184 -238 -26 37 -3 430 -67 303 -66 178 156 -285 -111 185 -123 226 209 -232
6841 -232 33 -173 85 -152 115 -103 -23 80 175 -14 147 -49 405 -46 -54 63 -61 -363 -74 17 -414 6
$$ packed form
6680A5l33M20o6j86J05j60K90J46k6l55L51k54R2mm5j16L63m98L29n3j82o7L08
6703G4k89M1L17k51L75k92P2L02o02M66k77R6j96L64j40j49J40j04J14J17%l7
6725A41j64m7J40J71n9l60R0J28K50n04R4K66j72N4J93m49M81k26j06o5p9J24
6747i9K2J08k9J05m30K30K14J63m90K20j57K36J46j45m22L42m2M1J26l12K81J63
6769B71m51J86L0j97L44J82r4k65K3j8L7r7LP8l0KQ8j63R4k06j3J81m7p5l43K77
6795b03Q7P6j78K60K29o0j74o8K64j53j11j61J60K3N3J54k41K7j14L70l22n5K33
6818I6q9L2l77L90k89N3n4K12O3m0M33m97L70l69K44k2m41J74K96l08L49j7m41
6841b32K65k06K58k37K67k18Q0J03R5j89J61j96M54m51qJ17j24l02K89R1m31M20
$$ plain form
6863 6 -140 -123 -201 19 -16 -239 133 -36 148 -105 -145 -100 -3 -165 194 -298 72 255 147 -52 155 122 112
6886 112 -36 22 -20 -274 218 -33 -93 -90 -76 83 -106 471 -186 193 214 105 180 -10 112 267 437 55 -116
6909 -116 -45 260 99 240 124 -29 -153 -119 -49 -95 156 -124 -73 -149 31 65 183 189 115 50 -75 48 236 146
6933 146 122 342 21 -215 81 -4 88 46 -63 -31 -123 -171 243 305 271 133 15 -51 49 164 -34 279 -302
6956 -302 -204 -208 -57 170 233 99 -93 -529 -12 113 242 254 -76 -34 -170 122 165 -39 -154 -83 10 180 129
6979 129 -119 44 255 -332 -289 128 -8 -73 282 25 162 -124 34 -151 149 -70 55 -105 290 126 231
7000 231 8 -119 185 -70 -24 212 -103 -52 -67 -249 63 51 151 -48 30 155 22 -306 -185 197 -33 35
7022 35 92 -122 82 88 -187 -181 73 99 -122 251 -152 -223 -136 -137 -138 99 -112 -110 20 -20 -83 -321 -310 4 156 -152
$$ packed form
6863Fj46J7p8K20l5k23L72j69J84k53m0M5R7j62L59m92L70J83j08j99K07l3j0
6886A12j48N8m2k54M92k51o0LJ4J59j89N77o57L79K1j09P5j90J22J55J70l82j71
6909a16P1L05j61J41j16j53j24L4P0m6K51k80N1p6J80L4J18Op4o5j25J23J88r0
6933A46k4K20l21k36K96q5R2m2j09L2r2m8M14O2l4j38j18o6J00J15j98L13n81
6956c02R8mJ51K27O3j34j92m36N17J25J29J2l30M2j36K92M3k04j15P1R3J70n1
6979A29k48J63K11n87M3M17j36o5L55k57J37k86J58j85L00k19J25j60L95j64J05
7000B31k23j27L04k55M6K36l15N1j5j82L12j2J00j99P8J25j33l28J21L82k30O8
7022C5N7k14K04Ok75OK54K6k21L73m03p1Q7jjK37k11KJ30m0o3k38J1L14J52l08
$$ plain form
7048 -152 58 3 -76 -165 174 -64 -253 -226 -291 105 26 -174 141 217 140 67 -162 42 -9 188 91 30 -309 145
7072 145 105 89 -130 10 -137 98 68 167 -304 365 -131 -79 -31 -180 -4 165 -5 337 -148 341 -230 79
7094 79 -57 388 77 -186 312 -15 -101 -162 -21 106 110 -31 -152 -55 -165 -142 137 271 144 -178 355 25
7116 25 79 191 -66 230 -100 -157 189 71 -24 175 116 45 85 233 -39 -127 25 -179 62 406 82 30 -157
7139 -157 39 -184 -141 -133 -72 29 144 178 68 -54 -136 150 -19 -307 -402 17 211 -28 43 154 -303 -19 -190
7162 -190 207 -348 -42 15 -86 199 63 108 164 269 396 -49 -147 -35 29 -147 -167 93 -40 202 299 277 282
7185 282 -35 254 -249 -200 38 247 -40 88 -177 109 186 -102 -19 86 -58 9 -2 40 150 -75 26 -108
7207 -108 72 151 -48 -13 -146 187 115 10 87 -43 250 118 -53 -9 -39 -84 160 -104 374 39 -6 325 -51
$$ packed form
7048a52K10n5p9q9L39k38j89K7o5L96p9k00L15P6p7p3k29K04n1J97r7o1l39M54
7072A45m0j6k19J40j47K35l0R9m71O69m96N2M8j49J76J69j70L42m85M89n71L09
7094G9j36M45l11k63M98l27q6o1J41J27Mj41j21R7j10K3K79J34j27l22N33l30
7116B5N4J12k57K96l30n7L46j18r5J99n9p1M0J48k72q8J52k04K41L44l24n2j87
7139a57J96k23M3QO1J01J15L4j10j22q2K86j69k88r5M19J94k39P1J11m57K84j71
7162a90L97n55L06N7j01K85j36M5N6J05J27m45r8J12O4j76k0K60j33K42R7k2N
7185B82l17K89n03M9K38K09k87J28k65K86P7k88Q3J05j44O7j1M2J10k25J01j34
7207a08J80P9j99L5j33L33p2j05P7j30K93j32j71M4l0m5K44k64M78l35m5L31l76
$$ plain form
7230 -51 159 -158 -21 -53 -14 -91 -47 -190 165 -98 59 -15 224 81 91 -186 5 114 -56 -64 -109 -53 2 198
7254 198 -111 130 -178 -165 -87 -186 -95 -146 116 -148 -43 154 -174 -2 -143 -167 -4 99 42 66 -168 159 212
7277 212 71 -45 -104 -65 20 -277 207 -93 -9 182 285 96 244 25 -55 -25 -240 278 42 -81 69 16
7299 16 -59 134 183 51 -52 125 77 -251 -135 -24 -7 129 -159 -163 42 45 -184 -47 200 -72 -108 -148 -284 -326
7323 -326 -260 -243 280 162 -84 172 21 -8 6 347 -38 91 -157 22 -79 257 -51 -126 -75 214 198 59
7345 59 -275 -23 303 -263 24 102 -97 31 -290 46 -134 86 25 -10 197 -72 -341 141 133 42 -89 6 88
7368 88 -47 149 246 -50 -133 119 42 250 36 162 -346 82 -164 198 118 83 -163 -246 -13 -284 -26 233
7390 233 93 -179 551 -219 52 -119 -36 64 -186 399 -129 -36 328 -187 77 -292 164 -227 58 -50 -6
$$ packed form
7230e1K10l17J37l2L9p7M4j43L55k63J57p4K39j43J0k77J91J09j70qm5N6N5J96
7254A98l09K41l08J3P8r9R1n1K62k64J05J97l28J72j41k4J63J03n7K4k34L27N3
7277B12j41j16n9L9Q5k97M84l00Q4J91J03j89J48k19q0L0k15N18k36j23J50n3
7299A6p5J93M9j32j03J77m8l28J16J11J7J36k88mK05Lk29J37K47k72l6m0j36m2
7323c26O6J7N23j18k46K56j51k9J4L41l85J29k48J79j01L36l08p5N1K89j6j39
7345E9l34K52L26n66K87P8j99J28l21L36j80K20o1l5K07k69k69M82qr1j31R5Q2
7368H8j35J96R7k96q3K52p7K08k14J26n08M28k46L62q0l5k46q3K33k71K58K59
7390B33j40k72P30p70K71j71Q3J00k50N85n28R3L64n15K64l69M56l91K85j08M4
$$ plain form
7411 -6 -59 -237 134 -376 -159 42 52 17 -350 32 183 -85 164 -7 174 201 -180 84 150 -1 -155 -24
7433 -24 -196 62 95 90 54 93 256 -156 105 -122 -4 118 146 146 66 41 98 58 -33 299 279 -87 -16 13 -181 39
7459 39 -137 -126 -93 250 250 -56 40 43 17 -161 24 23 -265 -71 38 -79 216 58 40 -5 -79 -49 -185 -43 -54
7484 -54 -47 287 236 82 -264 58 325 -66 -258 -13 258 60 312 -150 -35 55 -237 -33 -146 241 -46 154
7506 154 -94 -71 279 -170 89 -107 114 -124 54 119 14 310 -25 119 126 -195 161 -341 -60 287 23
7527 23 -105 -120 12 64 -51 -31 -99 -222 108 60 138 -118 96 59 68 178 85 -97 68 203 79 83 -39 48 68
7552 68 20 -132 167 -27 -213 -293 106 -287 -287 146 -19 -154 -557 -67 -67 55 128 32 234 -106 -16 -272 -136
7575 -136 0 -167 38 198 -151 -58 -307 0 -142 24 21 -38 140 -76 222 108 -54 265 60 37 -462 -177
$$ packed form
7411fn3j78L71n10K17K01J0l5l67L82J51k68K49j71J81K7l81K64O6j51j54J31
7433b4j72K58L3nl6L9J63m12K61k27J18J22K8%q0k5N7m0r1L32k0l66P1K9j94K20
7459C9j76J1L3L43%l06R6Lk6j78J85jk88J94J09j17K95j58j8m5p4L0j36J42j1
7484e4PL34n1j54l46L22K67l91j92K45K71j98K52m62J15R0k92K04j13L87k87K00
7506A54k48K3L50m49K59j96K21k38J78O5j05K96l35J44Pl21L56n02K81L47k64
7527B3j28j5J32N2j15K0o8j23L30m8P8k56K14l7RJ10r3j82J65J35j24Mj22Q7K0
7552F8m8j52K99j94j86q0L99l93%M33j65j35m03M90%J22P3r6K02l40R0k56J36
7575a36J36j67K05J60l49R3k49L07j42J66ln9J78k16K98j14j62L19k05k3m99K85
$$ plain form
7597 -177 1 111 56 -67 -158 268 26 -115 43 -284 -114 124 74 172 14 -109 -88 -107 -159 -41 -158 -345
7619 -345 196 -238 -35 77 -257 -17 8 -116 41 -157 -243 177 -52 -252 -144 148 115 -89 278 -307 -225
7640 -225 272 -200 215 227 146 88 57 -160 -220 8 150 69 -119 -148 -39 350 62 -99 -204 -85 -4 77 123
7663 123 -121 98 111 -130 -157 67 32 -85 -40 -102 221 -86 178 39 192 -72 230 -27 -242 -49 -159 111
7685 111 -43 141 204 11 118 -36 52 -244 186 219 3 62 -63 110 -35 -1 -118 -329 15 -141 -3 -94
7707 -94 -42 0 -33 -128 -1 116 -153 9 -93 41 37 56 -70 -171 -294 -150 -308 192 188 129 187 -193 179 -9
7731 -9 -88 332 -193 -261 16 117 92 78 53 -183 49 46 -3 -102 198 -45 95 -174 -63 47 83 -274 151 365
7755 365 -37 -222 241 228 -59 105 19 -210 73 96 -124 70 -281 93 -299 195 -134 -298 136 -90 -44
$$ packed form
7597a77J78J10n5j23r1M26k42j41J58l27J70K38n0R8j58j23K1j9n2J18j17j87
7619c45N41m34K03J12l34K40K5j24J57j98q6M20k29k00J08K92l3k04L67n85Q2
7640b25M97m72M15J2q1n8l1k17o0K28J42q1j88k9J09L89k88j61j05J19Q1Q1M6
7663A23k44K19J3k41k7K24l5j17M5o2L23l07K64j39J53k64L02k57k15J93j10K70
7685A11j54J84O3j93J07j54Q8k96M30L3k16N9j25J73j45L4j17k11L44j56J38r1
7707i4N2M2l3r5J27J17k69J62j02J34mJ9j26j01j23J44j58N00mn9N8l80L72j88
7731ip9M20n25o8K77J01k5j4k5k36K32lm9r9L00k43J40k69J11J10L6l57M25K14
7755C65m02j85M63j3k87J64q6k29K83K3k20J94l51L74l92M94l29j64M34k26M6
$$ plain form
7776 -44 -191 46 4 149 9 194 -115 -20 -110 -83 119 94 -60 410 -37 52 189 147 -70 35 34 -249 452
7799 452 45 318 28 354 -79 31 271 227 -48 -166 313 -46 -208 150 -30 137 -43 14 -77 -223 -124
7820 -124 109 58 15 150 -83 -92 222 164 -250 104 -369 -324 -169 250 65 113 32 54 63 -229 125 70 -224 -41
7844 -41 94 63 -67 266 -39 -165 183 -104 -93 -90 39 -13 -137 65 -180 185 306 -1 -13 -238 -49 -206
7866 -206 -25 -317 156 -93 -114 17 -239 161 -91 286 -206 -18 -71 -242 325 133 132 -152 22 -123 132
7887 132 169 -37 -119 24 -336 79 142 87 132 121 -10 -57 -87 64 47 -32 -139 138 108 109 49 293 -346 293 104
7912 104 196 92 7 132 338 131 30 -94 -32 293 176 18 32 -345 104 -29 -55 136 -350 129 -223 -13
7934 -13 -7 -132 -248 -167 192 -135 -406 307 -162 24 5 -293 17 -197 29 -309 169 -262 -126 181 -136 75
$$ packed form
7776d4j47K37m2J45j40J85l09R5r0K7K02k5j54M70m47Q9J37m2k17J05jk83P01
7799D52m07K73k90L26m33J10K40m4k75j18M79l59j62L58j80J67j80N7r1j46R9
7820a24K33n1m3J35k33rL14n8m14L54m73M5J55M19j85M8q1K2Rk92L54n5k94J83
7844d1J35l1j30L33l05j26L48k87J1LJ29n2j24K02k45L65J21l07j2k25J89j57
7866b06J81k92M73k49k1J31k56M00k52L77m92J88n3j71N67j92jk84J74j45K55
7887A32L7k06q2J43l60M15O3n5M5j1j31m7l0J51j7p9j07K77l0Jo0K44o39O39j89
7912A04R2j04q5J25K06k07j01j24O2L25j17j58J4l77M49j33k6J91m86M79l52K10
7934a3Oj25j16Q1L59l27k71P13m69J86j9k98L10k14K26l38M78m31J36L07l17K11
$$ plain form
7956 75 -204 240 -224 -190 87 169 23 106 -129 95 -201 -63 2 -66 -55 71 89 -37 263 -50 -250 343 -115
7979 -115 -66 29 64 161 268 0 36 -141 -329 125 27 -12 -139 -41 -90 -37 300 111 164 -76 -148 270 -242 423
8003 423 133 -246 85 -194 -83 12 -383 -27 -47 -93 382 -108 373 0 -52 31 28 256 -4 -22 -197 -136 -124
8026 -124 11 -85 -7 6 -1 295 153 -50 18 -148 -19 260 -109 27 -52 -40 -167 276 -139 -85 -9 223 19
8049 19 49 -62 -114 147 -129 76 -20 -143 -297 252 84 -337 -42 -116 212 204 126 -22 -210 166 289 13 91
8072 91 90 -37 -34 -186 -477 -115 -183 240 -83 108 127 -35 246 83 187 30 145 -8 5 207 120 -281 176
8095 176 -19 -119 -135 138 -215 48 -325 -110 -104 -47 -138 94 82 23 -8 53 -214 -79 246 190 -117 -89 -187 -59
8119 -59 -51 30 9 23 144 -44 301 77 68 -77 -303 -39 23 118 -163 -192 49 -174 5 16 45 -87 233 44
$$ packed form
7956G5k79M44m64L4K77Q2j46Q3k35K24k96J38O5o8J1J26J8j26L00l13k00N93m58
7979a15M9R5L5R7J07k68L6j77j88M54r8l9j27R8m9N3L37j89N3k40p2M18n12O65
8003D23k90l79L31k79J11R5l95L56k0m6M75m90M81l73n2Q3lK28k60j8j75O1J2
8026a24J35r6P8J3pK96j42k03O8j66J29K79l69J36p9J2j27M43m15N4P6K32k04
8049A9L0j11n2K61k76K05r6j23j54N49j68m21K95p4L28qp8j48j88L76J23k76P8
8072I1jj27Lj52k91L62o8M23l23J91J9j62K81j63J04j57J15j53J3K02q7m01M57
8095A76j95j00j6K73l53K63l73K15ON7r1K32j2n9l1O1k67J35L25n6l07K8r8J28
8119e9QQ1k1J4J21j88L45k24rj45k26K64O2R5k81k9K41k23J79J1K9j32L20j89
$$ plain form
8143 44 -259 419 176 148 -28 -104 -50 168 -97 -167 149 69 -104 -191 94 132 -78 -255 -198 18 252 -353 32
8166 32 -79 70 146 12 192 173 291 -43 -112 110 67 53 -29 -102 -179 21 -203 -66 -311 86 41 88 -2 225
8190 225 13
$$ packed form
8143D4l03O78k43k8j76p6N4K18k65p0L16q0j73q7K85L8k10j77N7K16K34o05L85
8166C2j11J49P6j34J80j9J18l34o9K22m3j4q2p3p7K00k24J37k45L97m5M7r0K27
8190B25k12
8191A3
$$ Imaginary data points
##PAGE= N=2
##DATA TABLE= (X++(I..I)), XYDATA
$$ plain form
0 0 0 0 0 0 0 0 0 0 0 -1 8 -8 8 -8 9 -16 16 -19 24 -28 32 -39 43 -50 57 -66 75 -88 97 -110 123 -139 155
33 155 -174 196 -219 243 -268 297 -329 365 -404 448 -497 549 -610 679 -757 844 -949 1071
51 1071 -1219 1403 -1632 1937 -2356 2972 -3979 5893 -10872 51989 97592 -21150 -59207 -9372
65 -9372 48058 29126 5950 1007 -10824 -34606 -6623 43470 32716 -39975 -59961 145 46030
78 46030 14621 -22771 -11749 4768 -11341 -10051 31192 45185 -10064 -53479 -14186 51723
90 51723 44915 -15744 -41447 -13021 14115 16898 12476 -1210 -32730 -42861 3359 52000 24695
103 24695 -47485 -58302 7594 52076 18756 -29113 -26118 2053 9436 7157 15587 9111 -22606
116 -22606 -32194 6661 39396 14789 -28986 -28595 2678 11088 925 3640 6327 -17582 -34192
$$ packed form
0@%%%%%%%%%jRj6J6j6J7k5L2l5M3n2O0p1Q2r3J07j23J41j63J85k07K33k62K94
33A55l29L70m15M62n11N65o26O94p69Q52r45J046j159J289j436J601j793K020
51A071k290K622l035L569m293N328o951R872j6765O2861M5603j18742l8057M9835
65i372N7430j8932k3176m943j1831k3782K7983N0093j0754p2691j9986O0106M5885
78D6030l1409l7392J1022J6517j6109J290M1243J3993n5249m3415L9293O5909
90E1723o808o0659k5703K8426K7136K783m422j3686l1520j0131M6220M8641k7305
103B4695p2180j0817O5896M4482l3320m7869K995K8171P383k279Q430o476l1717
116b2606r588L8855L2735k4607m3775L91L1273Q410j0163K715K687k3909j6610
$$ plain form
129 -34192 332 44868 24913 -37883 -49189 6270 47453 23724 -18227 -26826 -11114 4894
141 4894 20727 26779 1386 -35845 -27757 23678 45565 3969 -38808 -23862 16645 22967 745
154 745 -9569 -6436 -11929 -15885 3290 23245 6326 -30609 -33512 903 23096 8038 -14827
167 -14827 -18429 -10924 -3016 10570 19480 1733 -30788 -28064 17689 43750 8780 -39310 -32368
180 -32368 12411 29755 5981 -17134 -17768 -12274 -5742 9977 17134 -7300 -34657 -20884 19992
193 19992 27670 -5265 -24418 -6623 10796 5386 2568 14241 8160 -18632 -20337 16771 36627
206 36627 4819 -33114 -22938 12274 21412 4101 -9439 -13982 -17272 -6233 20786 27379 -7980
219 -7980 -38540 -13721 34203 36015 -5188 -25610 -3847 18958 15828 6528 5707 -1838 -14518
$$ packed form
129c4192L4524M4536j9955o2796j1306N5459M1183k3729m1951q599J5712J6008
141D894J5833O052k5393l7231Q088N1435K1887m1596m2777J4946M0507O322k2222
154G45j0314L133n493l956J9175J9955j6919l6935k903L4415K2193j5058k2865
167a4827l602P505P908J3586Q910j7747l2521K724M5753K6061l4970m8090O942
180c2368M4779J7344k3774k3115o34N494O532J5719P157k4434k7357J3773M0876
193A9992P678l2935j9153J7795J7419n410k818J1673o081k6792j705L7108J9856
206C6627l1808l7933J0176L5212R138j7311j3540m543l290J1039K7019O593l5359
219g980l0560K4819M7924J812m1203k0422K1763K2805l130r300q21p545j2680
$$ plain form
232 -14518 -5792 20771 23327 -8779 -29760 -10815 14826 11949 -4641 -6908 -4841 -11584 -8164
245 -8164 15226 25022 -3839 -32409 -12530 29681 32275 -4888 -25557 -7650 13294 14413 8495
258 8495 2814 -11363 -20905 -1530 27615 19294 -19636 -31879 -90 25899 11224 -11655 -9152
271 -9152 3003 -249 -1175 13472 17895 -5800 -22677 -1661 27686 20313 -8444 -16444 -803
284 -803 8381 6963 9249 7662 -11136 -22900 508 30965 20121 -20427 -30641 2434 28376
297 28376 14213 -9543 -11903 -2294 2236 8020 15400 6833 -15355 -17959 9020 27923 9418
310 9418 -16589 -13507 6183 10349 1898 2522 5310 -7234 -17129 139 23206 13456 -17902 -24892
324 -24892 1124 19866 8866 -8120 -10892 -7382 -3649 7661 17104 3497 -22680 -20996 12007
$$ packed form
232a4518Q726K6563K556l2106k0981J8945K5641k877j6590k267K067o743L420
245h164K3390R796k8861k8570J9879M2211K594l7163k0669J7907K0944J119n918
258H495n681j4177r542J9375K9145q321l8930j2243L1789K5989j4675k2879K503
271i152J2155l252r26J4647M423k3695j6877K1016K9347p373k8757q000J5641
284h03R184j418K286j587j8798j1764K3408L0457j0844m0548j0214L3075K5942
297B8376j4163k3756k360R609M530N784P380q567k2188k604K6979J8903j8505
310I418k6007L082J9690M166q451O24K788j2544r895J7268K3067r750l1358o990
324b4892K6016J8742j1000j6986k772L510L733J1310R443j3607k6177J684L3003
$$ plain form
337 12007 28998 5015 -23045 -16180 8121 13717 1580 -3589 -2966 -8373 -9707 5283 16240
350 16240 1080 -20669 -15708 7628 14255 -175 -9025 -4849 -3056 -4685 4547 15778 4440
363 4440 -19283 -17497 11463 26118 4619 -19689 -14959 5355 12289 5154 -1740 -7496 -13186 -6901
377 -6901 12068 16924 -5752 -24832 -11820 14829 16012 -4666 -13449 -3981 2752 686 3355 9100
391 9100 855 -14360 -10687 10935 17776 -1317 -16737 -9562 4064 5672 1448 -195 -6044 -14654
405 -14654 -8764 11669 16635 -6094 -25173 -10945 15770 17138 -3561 -14263 -5965 3182 4973
418 4973 6280 5325 -5914 -14734 -3599 15075 12365 -9067 -17837 -3215 8912 4023 -3424 -1595
432 -1595 -2323 -8909 -5717 10122 13852 -4232 -18574 -5932 14849 14425 -1918 -9284 -4060 1236
$$ packed form
337A2007J6991k3983k8060O865K4301N596j2137n169O23n407j334J4990J0957
350A6240j5160k1749M961K3336O627j4430q850M176J793j629R232J1231j1338
363D440k3723J786K8960J4655k1499k4308M730K0314O934p135o894n756n690O285
377f901J8969M856k2676j9080J3012K6649J183k0678q783R468O733k066K669N745
391I100q245j5215L673K1622O841j9093j5420P175J3626J608m224j643n849q610
405a4654N890K0433M966k2729j9079J4228K6715J368k0699j0702Q298R147J791
418D973J307r55j1239q820J1135J8674k710k1432q770J4622J2127m889p447J829
432a595p28o586L192J5839L730j8084j4342J2642K0781m24j6343p366N224N296
$$ plain form
446 1236 4780 9655 6874 -8002 -15977 -313 19202 12763 -11430 -18030 -565 12954 6762 -3324
460 -3324 -3608 -2463 -3911 1070 11179 9047 -7071 -12866 1478 15174 8948 -4577 -6079 370
474 370 1811 2137 7234 6754 -6637 -14584 -508 17234 11180 -10173 -16051 -651 11999 7548
488 7548 -1371 -4220 -4788 -3415 5407 13362 5707 -11171 -12255 5956 16964 5597 -8991 -7266
502 -7266 2978 4797 1914 3866 3074 -5595 -9538 1808 14047 6815 -9671 -11218 1902 9788
516 9788 4700 -870 -1779 -3913 -4440 4464 13441 5692 -11872 -12921 6316 17989 5360 -10423
530 -10423 -8278 2951 6491 3858 2827 166 -6836 -6743 5813 13639 2005 -12041 -8470 6825
544 6825 10007 563 -4580 -567 -1019 -3542 2393 11050 4446 -11261 -11340 6575 14942 2571 -10267
$$ packed form
446A236L544M875k781j4876p975J5664J9515o439k4193o600J7465J3519o192j0086
460c324k84J145j448M981J0109k132j6118n795J4344J3696o226j3525j502O449
474C70J441L26N097m80j3391p947J4076J7742o054k1353n878J5400J2650m451
488G548q919k849n68J373Q822P955p655j6878j084J8211J1008j1367j4588J725
502g266J0244J819k883J952p92q669l943J1346J2239p232j6486j547J3120P886
516I788n088n570r09k134n27Q904Q977p749j7564j049J9237J1673j2629j5783
530a0423K145J1229L540k633j031k661p002R3J2556P826j1634j4046L571J5295
544F825L182r444n143M013m52k523N935Q657o604j5707p9J7915Q367j2371j2838
$$ plain form
559 -10267 -6898 2167 3425 2165 3134 -1417 -10382 -8069 7655 13159 -2230 -16796 -8061 8903
573 8903 9240 -2288 -6130 -1636 -1033 -1751 3728 8105 -387 -11304 -6096 8970 10520 -2665 -9366
588 -9366 -3121 2854 951 529 3113 -1027 -10618 -7932 6982 11649 -2790 -14751 -6591 8050
602 8050 8058 -1530 -5323 -2603 -1759 14 6209 7456 -3594 -12499 -3171 10925 8864 -6443 -10835
617 -10835 -966 5127 578 -2256 1013 -1326 -7981 -4367 7353 8683 -5279 -12189 -2011 8187
631 8187 5139 -2250 -2078 -906 -3276 -1205 6703 6964 -5647 -12998 -1918 11406 6380 -7796 -10645
646 -10645 -1810 3609 1615 732 -453 -4931 -7074 513 9299 4838 -7085 -8911 1855 8114 3059
661 3059 -2903 -2419 -417 -1159 547 5322 3963 -4737 -8723 -581 8818 5590 -5049 -7610 -1259
$$ packed form
559a0267L369R065J258j260R69m551q965K313J5724N504j5389j4566Q735J6964
573H903L37j1528l842M494O03p18N479M377q492j0917N208J5066J550j3185o701
588i366O245N975j903m22K584m140r591K686J4914M667j4439j1961Q160J4641
602H050Qr588l793K720Q44J773O195J247j1050q905R328J4096k061j5307m392
617a0835R869O093m549k834L269k339o655L614J1720J330j3962o910J0178J0198
631H187l048p389J72J172k370K071P908K61j2611p351J1080J3324n026j4176k849
646a0645Q835N419j994q83j185m478k143P587Q786m461j1923j826J0766O259n055
661C059n962M84K002p42J706M775j359q700l986Q142R399l228j0639k561O351
$$ plain form
676 -1259 3857 2704 827 -340 -3182 -4607 1547 9163 5466 -6809 -9115 2288 10426 4496 -4737
691 -4737 -4091 394 1423 1179 3772 2593 -4381 -7104 2354 9957 3143 -7537 -6141 2925 4900
706 4900 855 265 1178 -2306 -4838 1841 9745 4771 -6990 -7622 3552 9196 2606 -4057 -3133 237
722 237 785 2829 5333 1146 -6568 -6350 4115 9363 1892 -7478 -5346 2719 4763 951 -878 -520
738 -520 -1737 -2817 2617 7278 2642 -6519 -5678 4338 9021 2044 -4244 -1773 1663 1202 1236 4218
754 4218 2624 -5018 -5660 3709 9451 1062 -8635 -4754 4993 5658 -633 -1184 415 -1721 -3362 3321
770 3321 8536 1346 -8265 -4138 7437 7767 -1954 -5392 -55 2438 -513 496 3627 39 -7239
785 -7239 -4999 5605 7574 -2400 -7858 -2366 4478 2527 -890 73 -223 -2897 -1856 4789 6557
$$ packed form
676a259N116j153j877j167k842j425O154P616l697j2275k306J1403Q138n930r233
691d737O46M485J029k44K593j179o974k723R458P603o814j0680J396R066J975
706D900m045n90R13l484k532O679P904m974j1761o32J1174N644o590o663R24L370
722B37N48K044K504m187p714K18J0465N248p471r370K132Q065K044l812j829L58
738e20j217j080N434M661m636r161Q41J0016M683o977o288K471L436m61L4K982
754D218j594p642o42R369N742q389r697L881R747O65o291n51J599k136j641O683
770C321N215p190r611M127J1575L30r721l438N337K493k951J009L131l588p278
785g239K240J0604J969r974n458N492O844j951l417R63k96k674J041O645J768
$$ plain form
800 6557 -2003 -8075 -2590 6264 5708 -2174 -5224 -1793 89 -369 941 2109 -1551 -6404 -3207 4698
816 4698 5408 -2935 -7107 -1723 4496 2897 -958 -1087 -352 -2473 -2058 3701 5326 -1781 -7831 -2261
832 -2261 5834 3619 -3551 -4592 -59 937 -1048 237 2436 -1574 -6273 -1858 6132 4462 -4124
847 -4124 -6642 545 4691 588 -1853 -729 -279 -2678 -863 4155 3128 -4532 -6881 359 5955
862 5955 1792 -4608 -3822 184 932 73 1030 748 -3087 -4925 320 5371 2488 -4484 -5235 734 3727
879 3727 871 -1565 -1592 -1317 -1403 491 3646 2286 -3760 -5881 322 5407 2258 -3547 -4081 402 1554
896 1554 134 388 1014 -1738 -4083 167 5552 2707 -4611 -5011 1736 4797 991 -1886 -229 478
912 478 -1345 31 4065 2779 -3689 -4680 1838 6247 1064 -4241 -2030 1824 1325 -328 947 1500
$$ packed form
800F557q560o072N485Q854n56p882l050L431J882m58J310J168l660m853L197P905
816D698P10q343m172N384O219j599l855j29P35k121M15N759J625p107o050N570
832b261Q095k215p170j041M533R96j985J285K199m010m699M415P990j670q586
847d124k518P187M146m103k441J124M50k399J815N018j027p660k349P240N596
862E955m163o400P86M006P48q59R57k82l835j838N245N051k883o972p51N969K993
879C727k856k436k7K75q6J894L155j360o046k121O203N085l149n805n34M483J152
896A554j420K54O26k752k345M250N385k845p318m00O747L061l806k877J657P07
912D78j823J376M034j286o468r91O518M409n183n305K211L854m99j653J275N53
$$ plain form
928 1500 -2126 -3320 1838 5450 1411 -4525 -2969 3299 4024 -244 -1656 142 211 -870 891 3596
944 3596 1437 -4175 -3479 2935 5354 41 -4189 -1601 2419 1750 224 737 845 -1885 -2313 2385
960 2385 5231 1224 -4657 -2753 3270 4318 -167 -1902 547 618 -749 1031 3448 700 -4036 -2809
976 -2809 3674 5044 -481 -3937 -829 2654 1397 -315 1376 970 -2273 -2263 3065 5188 -420 -4725
992 -4725 -1041 3666 2683 -1221 -1475 771 -322 -1146 1268 3034 -462 -4038 -1742 4127 3545 -1606
1008 -1606 -3512 -98 1858 427 -349 1152 179 -2759 -1387 3191 3312 -1451 -4605 -699 3297 1961
1024 1961 -1401 -1444 404 -588 -578 1798 2278 -1383 -3941 -1176 3846 2802 -2376 -3771 -117 1533
1040 1533 -30 -465 249 -579 -2692 -1435 2775 2409 -2530 -4280 -299 3548 1319 -1932 -1388 -330
$$ packed form
928A500l626j194N158L612m039n936J556O268P25m268j412J798O9j081J761K705
944C596k159n612O96O414K419n313m230K588M020o69j526N13J08k730m28M698
960B385K846m007n881J904O023J048m485j735K449P1j367J780K417k748m736J227
976b809O483J370n525l456L108L483j257j712J691m06l243J0N328K123n608m305
992d725L684M707r83l904k54K246j093q24K414J766l496l576K296N869n82n151
1008a606j906L414J956j431p76J501r73k938J372M578J21m763l154L906L996j336
1024A961l362m3J848r92J0K376M80l661k558K765N022j044n178j395L654J650
1040A533j563m35P14q28k113J257M210l66m939j750L981L847k229l251N44J058
$$ plain form
1056 -330 -107 -726 1242 1642 -1724 -4013 -548 3310 1931 -2625 -3183 195 1596 58 -330 331 -897
1073 -897 -2267 -551 2985 2049 -2481 -4111 295 2929 620 -2013 -1501 160 -346 -649 1567 1359
1089 1359 -2199 -3695 -193 3330 1085 -2839 -2886 655 1752 -226 -851 391 -978 -2549 -155 2469
1105 2469 1459 -3099 -3173 958 3179 449 -2106 -1115 230 -319 -518 1286 1178 -1944 -3102 1055
1121 1055 3062 873 -3333 -2149 1281 1241 -606 -498 494 -650 -1899 230 2748 1381 -2983 -2454
1137 -2454 1712 3076 81 -1864 -402 467 -139 270 1710 884 -2250 -2114 1728 3296 235 -3176
1153 -3176 -1170 1734 1453 -284 -440 466 -793 -1307 1145 2993 545 -2579 -1664 2349 2682 -326
1169 -326 -1064 565 925 -43 417 1980 669 -1972 -1566 2214 3138 -300 -2570 -864 2047 1484 -208
$$ packed form
1056c30K23o19J968M00l366k289L465L858j379m556n58L378J401j538l88O61j228
1073h97j370J716L536r36m530j630M406K634k309k633N12J661n06l03K216k08
1089A359l558j496L502L523k245l924m7L541J097j978o25J242j369j571K394K624
1105B469j010m558p4M131K221k730k555R91J345n49j99J804j08l122j158M157
1121A055K007k189m206J184L430m0j847J08R92j144j249K129K518j367m364N29
1137b454M166J364k995j945J462Q69o06M09J440q26l134J36L842J568l061l411
1153c176K006K904k81j737j56R06j259n14K452J848k448l124R15M013L33l008
1169c26p38J629L60r68M60J563j311k641M06L780R24l438k270J706K911n63j692
$$ plain form
1186 -208 46 316 -681 -803 1654 2868 64 -2623 -806 2688 2486 -548 -1344 473 1038 88 315
1203 315 1494 172 -1923 -835 2304 2583 -772 -2547 -425 1798 1086 -580 69 166 -923 -858 1683
1220 1683 2514 -545 -2465 -329 2800 2221 -1146 -1335 321 798 153 474 1053 -184 -1885 -602 2276
1237 2276 2150 -1500 -2528 165 1769 468 -755 93 355 -770 -670 1646 2269 -975 -2944 -434
1253 -434 2570 1598 -1590 -1609 328 525 -179 71 953 -708 -2654 -425 2455 1392 -2158 -2769 490
1270 490 2240 330 -1174 -504 251 -805 -766 1860 1428 -1318 -2542 409 2413 518 -1665 -826 581
1287 581 -136 -815 8 767 -1200 -2318 -150 2317 637 -2159 -2253 269 1460 -221 -775 -269 -235 -881
1305 -881 104 1327 593 -1806 -2017 924 2232 74 -1826 -1286 558 305 -210 356 30 -1096 -2122
$$ packed form
1186b08K54K70r97j22K457J214k804k687J817L494k02l034p96J817N65r50K27
1203C15J179j322k095J088L139K79l355j775K122K223p12j666O49R7j089O5K541
1220A683Q31l059j920K136L129n79l367j89J656M77o45L21N79j237j701J283K878
1237B276j26l650j028K693J604j301j223Q48K62j125J00K316O23l244j969K510
1253d34L004r72l188j9J937J97p04K50Q82j661j946K229K880j063l550o11L259
1270D90J750j910j504O70P55j056L9K626m32k746j224K951K004j895k183Q39J407
1287E81p17o79Q23P59j967j118K168K467j680k796r4K522J191j681n54N06L4o46
1305h81R85J223p34k399k11K941J308k158j900N40J844k53n15N66l26j126j026
$$ plain form
1322 -2122 -57 2333 341 -2284 -1587 1074 1524 -100 -963 -185 127 -1061 128 1856 616 -2088
1338 -2088 -2039 1354 2443 -169 -2160 -899 973 112 -817 272 269 -1415 -1999 1100 1905 -101 -2719
1355 -2719 -1069 1465 1246 -639 -458 658 -48 -259 495 1635 94 -1584 -1024 1367 1505 -263 -1254
1372 -1254 49 326 438 134 414 -205 -1200 -799 1061 1702 -154 -1853 -607 1472 1352 -333 -807
1389 -807 108 616 477 484 839 152 -1675 -831 1471 1746 -484 -1867 -119 1101 477 -624 262 340 -802
1408 -802 -515 1367 1919 -530 -2086 -281 2022 1492 -691 -840 784 310 -315 572 1506 -342 -1893
1425 -1893 40 1988 1350 -1226 -1255 431 872 -91 -348 284 158 -631 84 1172 1435 -809 -1431 206
1443 206 1625 1056 -658 -446 242 429 62 602 766 -435 -1361 -57 1709 1080 -1048 -1453 158 1357
$$ packed form
1322b122K065K390j992k625O97K661M50j624q63P78L12j188J189J728j240k704
1338b088M9L393J089k612j991J261J872q61r29J089lj684n84L099Q05k006k618
1355b719J650K534k19j885J81J116p06k11P54J140j541j678N60K391J38j768r91
1372a254J303K77J12l04K80o19r95M01J860O41j856j699J246K079j20j685m74
1389h07R15N08j39PL55o87j827Q44K302K75k230j383J748J220o24j101Q86P8j142
1408h02K87J882N52k449j556J805K303n30k183j49J624m74o25Q87R34j848j551
1425a893J933J948o38k576k9J686M41r63k57O32j26p89P15J088K63k244o22J637
1443B06J419n69j714K12O88J87l67N40J64j201r26J304J766o29k128m05J611J199
$$ plain form
1461 1357 131 -823 333 582 -301 -445 1040 1589 -1274 -1813 374 2346 433 -1545 -478 916
1477 916 503 -502 293 1189 -507 -2022 113 1996 658 -1960 -1228 1150 1052 -612 -482 467 -6
1494 -6 -1078 54 1720 410 -1686 -1306 1642 1638 -424 -1072 -191 640 -190 -224 438 377 -1106 -1552 747
1513 747 1474 -340 -1658 -1035 797 575 -696 -320 181 -279 -456 463 1100 -90 -1605 -961 1069 1138
1531 1138 -80 -1419 -343 665 -68 -673 93 343 -847 -1156 380 1376 -294 -1822 -758 1163
1547 1163 810 -723 -522 266 -134 -973 241 1387 -64 -1865 -568 1510 996 -1193 -1519 148 668
1564 668 -444 -631 335 52 -1420 -700 803 1227 -1029 -1266 -80 941 194 -519 66 -20 -499 -353
1582 -353 451 825 -528 -1007 -35 801 410 -801 -1038 291 256 -134 16 -58 -93 -500 -238 517 757 -307
$$ packed form
1461A357j226r54J156K49q83j44J485N49k863n39K187J972j913j978J067J394
1477I16m13j005P95Q96j696j515K135J883j338k618P32K378r8j664J30R49m73
1494fj072J132J666j310k096L80K948mk062o48Q81Q31q30l4O62o1j483m46K299
1513G47P27j814j318O23J832k22j271L76N01m60j77R19O37j190j515O44K030O9
1531A138j218j339J076J008p33o05P66K50j190l09J536R96j670j528J064J921
1547A163l53j533K01P88m00q39J214J146j451j801J297K078n14k189l26J667N20
1564F68j112j87R66k83j472P20J503M24k256k37J186J021p47p13N85q6m79J46
1582c53Q04L74j353m79R72Q36l91j211k37J329l5l90J50p4l5m07K62P55K40j064
$$ plain form
1602 -307 -1089 113 1058 823 -251 -338 135 531 -427 140 805 -235 -1083 -187 1436 811 -1126 -1057 321
1621 321 917 26 -532 532 606 -715 99 1492 985 -992 -1049 379 1420 218 -662 -325 669 344
1639 344 -186 595 756 -335 -574 215 1457 474 -1135 -365 1017 655 96 -261 410 -103 -658 340 925
1658 925 414 -806 -742 562 1294 229 -685 -181 543 429 141 319 642 -333 -882 8 1606 613 -1056
1677 -1056 -681 812 963 -159 -993 472 558 -591 -22 1232 483 -1015 -575 658 1144 -280 -800
1694 -800 320 658 58 -381 408 181 -595 -632 420 1364 -469 -1097 -117 913 290 -471 -345 418 -159
1713 -159 -679 357 760 -45 -1036 -603 1174 702 -279 -854 -9 751 -349 21 427 271 -932 -683 477
1732 477 771 -580 -1208 -96 590 227 -712 -203 187 153 -653 313 702 -315 -942 -353 1121 498 -976
$$ packed form
1602c07p82J202R45k35j074q7M73L96r58N67O65j040q48Q96J623o25j937O9J378
1621C21N96q91n58J064P4j321Q14J393n07j977n7J428J041j202q80L37R94l25
1639C44n30P81J61j091k39P89J242r83j609P70J382l62n59l57O71n13n55R98N85
1658I25n11j220O4J304P32j065r14N04P24j14k88J78L23r75n49Q90J598r93j669
1677a056L75J493J51j122q34J465Q6j149N69J254p49j498M40J233M86j424n20
1694h00J120L38o00m39P89k27p76l7J052R44j833o28R80J030o23p61J26P63n77
1713a59n20J036M03q05r91M33J777m72r81n75Q45P60j100L70M06j56j203K49J160
1732D77K94j351o28J112O86l63r39N09L90l4q06R66L89j017o27N89J474o23j474
$$ plain form
1751 -976 -821 409 344 -454 -341 295 18 -864 -758 840 772 -865 -1175 25 724 -146 -614 -245 327
1770 327 -116 -260 571 800 -185 -986 -67 941 279 -1267 -566 140 467 -251 -492 498 48 -930 -69
1789 -69 902 466 -707 -951 496 934 -75 -565 -26 166 -392 -440 339 306 -274 -910 148 1008 252 -744
1809 -744 -671 783 699 -458 -167 87 -215 -574 21 966 198 -934 -469 554 1139 -248 -522 22 374
1828 374 -37 -206 431 -119 -599 -907 567 799 -80 -1024 -203 425 365 -241 -305 460 -256 -579 285 704
1848 704 -6 -905 -70 690 693 -146 -514 -42 485 12 127 431 153 -436 -338 583 843 -171 -793 37 737
1869 737 391 -157 29 249 -36 0 411 735 29 -488 -437 692 740 -131 -321 176 359 369 238 215 309 -916
1891 -916 -127 640 502 -307 -804 180 648 474 -396 -255 37 75 36 520 524 -110 -822 -174 1000 343 -344
$$ packed form
1751i76J55J230o5p98J13O36k77q82J06J598o8j637l10J200O99q70m68L69N72
1770C27m43j44Q31K29r85q01R19J008o62j546P01P06L27p18k41R90m50r78Q61
1789f9R71m36j173k44J447M38j009m90N39J92n58m8P79l3n80o36J058Q60p56r96
1809g44P3J454q4j157K91K54l02l59N95R45p68j132M65J023N85j387k74N44L52
1828C74m11j69O37n50m80l08J474K32q79r44Q21O28o0o06o4P65p16l23Q64M19
1848G04p10q99Q35P60Lq39l68M72N27m73J15L04k78n89R8R21K60j014o22Q30P00
1869G37l46n48J86K20k85L6M11L24p06n17N1J129M8q71j90M97J83J0j31k3R4j225
1891i16P89P67j38q09m97R84M68j74q70J41K92L8l9M84Mo34p12O48J174o57o87
$$ plain form
1912 -344 -478 385 430 -331 10 162 -42 -556 -121 704 230 -391 -711 351 609 -141 -374 26 485 113
1932 113 96 309 657 -230 -681 147 1017 527 -453 -641 572 -36 -48 -112 -26 -108 -554 28 572 156 -670
1953 -670 -685 131 730 47 -493 -310 153 11 -34 440 297 -521 -558 -55 837 -51 -724 -666 206 335 -212
1974 -212 -13 215 -194 -609 29 595 174 -799 -477 558 709 -86 -220 239 188 122 -188 259 223 -524 -585
1995 -585 264 726 -245 -711 -300 281 -91 -169 -239 113 -307 -400 99 837 29 -631 -382 506 411 -232 -515
2016 -515 -20 -86 -153 -86 142 229 -517 -66 504 337 -392 -933 -115 440 209 -278 -246 153 -148 -250 270 550
2038 550 -59 -965 -335 930 415 -318 -407 59 363 -131 -313 251 70 -413 -595 904 611 -560 -743
2057 -743 -55 877 458 -128 -524 145 -257 -269 739 731 -366 -774 112 813 183 -325 -266 89 252 30 311
$$ packed form
1912c44j34Q63M5p61L41J52k04n14M35Q25m74o21l20J062K58p50k33M00M59l72
1932A13j7K13L48q87m51Q28Q70m90r80j88J213o08j2o4Q6q2m46N82N44m16q26
1953f70j5Q16N99o83n40J83M63j42m5M74j43q18l7N03Q92q88o73N8Q72J29n47
1974b12J99K28m09m15O38N66m21r73L22J035J51p95j34M59n1o6l10M47l6p47o1
1995e85Q49M62r71m66M11N81l72p8p0L52m20r3M99P38q08o60K49Q88r5o43k83
2016e15M95o6o7O7K28Q7p46M51N70j67p29n41Q18N55k31m87L2L99l01j02N20K80
2038E50o09r06O30J265n15p33q9M66L04m94j82N64j81m83j82J499k93j171j83
2057g43O88R32m19n86l96O69m02j2J008qj097m08Q86P01o30n08N9L55J63k22K81
$$ plain form
2078 311 314 -174 -600 80 660 606 -493 -474 35 541 159 -117 -20 -435 -162 32 487 232 -38 -316 172
2099 172 637 520 -32 -634 24 383 -22 -91 159 -497 -643 -18 318 460 -492 -499 334 710 180 -349 90
2120 90 -273 -255 2 603 437 -594 -874 96 693 27 -812 -534 490 303 27 24 -35 -270 -306 327 683
2141 683 -54 -518 -406 443 521 127 -203 337 -182 175 126 654 128 -609 -519 476 568 65 -158 -473 -43
2162 -43 504 -51 -26 -182 -306 34 201 426 46 -663 -283 290 651 105 -520 322 123 -345 58 302 441
2183 441 -668 -519 200 409 3 -518 -145 292 387 -70 -24 167 -420 -239 112 702 -304 -1167 -188 763
2203 763 729 -283 -639 50 118 -91 194 296 -199 -670 -118 455 418 -484 -356 -115 214 -13 -54 310 58
2224 58 -384 60 223 302 -189 -765 -349 150 247 41 -349 -448 150 63 106 157 -133 -571 -205 426 369 -377 -874
$$ packed form
2078C11Lm88m26O80N80n4j099J9N09N06l82k76R7m15K73J94M55k55k70k78M88
2099A72M65j17n52o02O58L59m05o9K50o56j46O25L36J42r52pQ33L76n30n29M39
2120I0l63J8K57O01j66j031k80R70N97o66q39K78J024j87k76ln9k35l6O33L56
2141F83p37m64J12Q49P8l94l30N40n19L57m9N28n26p37R0R95R2n03k23l15M30
2162d3N47n55K5j56j24L40J67K25l80p09L80N73L61n46o25Q42j99m68M03K44J39
2183D41j109J49P19K09m06n21L73M37R5m57M6J91n87J81L51N90j006q63R79R51
2203G63l4j012l56O89O8k09K85J02m95m71N52N73l7r02J28K41L29k27m1L64k52
2224E8m42M44J63P9m91n76M16M99R7k06l90r9N98q7M3N1k90m38L66O31n7p46m97
$$ plain form
2247 -874 -389 579 222 -261 -435 -194 -88 -317 336 272 -205 -639 122 245 335 -495 -390 -6 139 -350 181
2268 181 560 -79 -563 -185 481 616 -324 -535 153 527 49 -189 -130 -310 -127 -87 766 -192 -432 -714 286
2289 286 517 -324 -446 -169 177 268 422 -166 101 -259 -247 -38 511 140 -323 -554 177 322 208 -14 -219
2310 -219 -108 -539 262 602 -149 -341 -451 280 856 633 -457 -462 106 231 276 133 178 -59 -314 355 221
2331 221 67 -213 -95 374 359 222 81 -142 -153 -29 1 577 252 -503 -259 209 171 136 -437 -355 206 113
2353 113 171 157 -140 -474 -323 518 720 -113 -577 -301 541 723 129 -492 -36 10 166 234 -211 -381 -224
2374 -224 -151 125 574 -179 -495 153 45 21 -97 34 123 -369 -103 412 607 306 -528 -272 348 945 -109
2395 -109 -346 -304 -182 -200 458 141 -260 -491 -308 844 455 -416 -494 215 705 271 -123 50 -26 -459 -364
$$ packed form
2247h74M85R68l57m83j74K41J06k29O53o4m77m34P61J23R0q30J05L84J45m89N31
2268A81L79o39m84L78O66J35r40k11O88L74m78k38N9j80J83M0Q53r58k40k82J000
2289B86K31q41j22K77L46R1J54n88K67l60J2K09N49l71m63k31P31J45j14k22k05
2310b19J11m31Q01L40p51j92j10P31N76k23j090nN68J25M5j43M5k37k55O69j34
2331B21j54k80J18M69j5j37j41k23j1J24L0N76l25p55K44M68l8l5n73Q2N61r3
2353A13N8j4k97l34J51Q41K02q33m64K76Q42J82n94o21M56M6J56O8m45j70J57
2374b24P3K76M49p53l16O48j08k4j18J31Q9m92K66N15J95l01q34K56O20N97j054
2395a09k37M2J22j8O58l17m01k31J83J152l89q71p8P09M90m34l94J73p6m33R5
$$ plain form
2416 -364 592 548 -93 -433 -65 289 91 -257 155 -109 -461 83 167 385 -254 -477 -114 582 408 -505 -477
2437 -477 -430 309 331 82 -133 -202 42 287 649 153 -455 -360 91 392 -452 -508 -509 193 -115 -175 24 228 -89
2460 -89 -451 -145 471 352 -198 -396 -412 366 302 -94 9 -330 -137 176 794 -41 -592 -549 210 613 77
2481 77 -419 -308 -159 149 311 153 -5 -426 -305 230 462 -174 -361 -146 11 61 -52 -131 279 -161 -652
2502 -652 82 182 -148 10 -469 -42 840 409 -304 -507 -20 371 282 207 -383 -503 -334 393 747 -374
2522 -374 -607 -155 537 236 29 131 -161 73 313 -18 347 251 -351 -250 112 231 -54 -2 -209 74 -53
2543 -53 538 286 71 -670 -172 431 456 -76 -599 -286 149 575 212 121 -29 -122 238 396 222 -294 -535
2564 -535 237 364 484 -300 -269 -68 173 -182 230 478 -29 -151 -236 38 590 -69 -127 -15 -45 334 98
$$ packed form
2416c64R56m4o41l40L68L54j98l48M12k64l52N44Q4K18o39k23L63O96j74r13K8
2437d77M7P39K2k49k15o9K44K45L62m96o08R5M51L01q44n6jP02l08o0J99K04l17
2460h9l62L06O16j19n50j98j6P78o4l96J03l39J93L13O18q35n51M3P59M03n36
2481G7m96J11J49L08J62j58j58m21J21N35K32o36j87K15J57N0j13p9M10m40m91
2502f52P34J00l30J58m79M27Q82m31p13k03M87L91q9p5n90j20J69P27L54j121
2522c74k33M52O92l01k07J02k92K34K40l31L65r6o02J01L62J19k85N2k07K83j27
2543e3N91k52k15p41M98O03K5n32n23L13M35M26l63r1j50r3L60J58j74n16k41
2564e35P72J27J20p84L1K01K41l55M12K48n07j22q5K74N52o59n8J12l0L79k36
$$ plain form
2585 98 -230 -254 -246 241 504 489 -377 -448 236 660 331 -622 -443 -61 332 221 101 -20 -78 -370 -35 250
2607 250 217 5 -410 35 97 161 -286 116 209 -205 -287 306 238 -270 -636 -233 481 376 148 -330 -89 129
2629 129 230 311 -188 -203 -181 186 492 230 -282 -110 385 315 185 -150 -87 -61 283 -146 89 82 -77 -190 140
2652 140 112 -19 -193 -346 -205 -116 35 456 -17 -448 -226 388 722 353 -454 -506 167 696 148 -275 -438
2673 -438 34 268 406 33 -183 -244 -334 -11 209 -295 -243 -68 129 404 -179 -47 211 -38 -534 108 318
2694 318 287 -450 -428 -70 223 249 16 -264 -311 -43 582 480 -99 -487 -387 139 491 -471 -516 -328 65 613
2716 613 120 -78 14 99 113 299 -32 -110 37 -110 98 4 4 139 -56 77 13 221 194 180 -443 143 -31
2739 -31 331 204 -370 -401 95 230 -19 7 -547 -154 139 365 43 -157 -683 -663 560 87 -205 -177 -437
$$ packed form
2585I8l28k4QM87K63j5q66p1O84M24l29r53J79L82L93j11j20j21n8k92L35K85
2607B50l3k12m15M45O2O4m47M02R3m14q2N93o8n08l66M03P14j05k28m78K41K18
2629A29J01Q1m99j5K2L67L06k62n12J72M95p0j30l35O3K6L44m29K35pj59j13L30
2652A40k8j31j74j53J41Q9J51M21m73m31K22O14L34l69q07n2O73N29n48m23j63
2673d38M72K34J38l73k16o1r0L23K20n04N2J75J97K75n83J32K58k49m96O42K10
2694C18l1p37K2L58K93K6k33k80m7K68O25j02n79l88J00N26L52r62m5J88L93N48
2716F13m93j98R2Q5J4J86l31p8J47j47K08r4%J35j95J33o4K08k7j4o23N86j74
2739c1L62j27n74l1M96J35k49K6n54L93K93K26l22k00n26K0J223m73k92K8k60
$$ plain form
2760 -437 120 -140 -56 246 182 91 -191 -64 302 46 -336 -21 306 272 31 -314 -28 -382 77 421 333 -224
2782 -224 -373 -190 302 385 -200 -269 -298 -141 474 157 40 -227 251 306 290 139 -12 -83 118 250 212 -70
2804 -70 41 -124 -60 -35 104 344 -87 -162 -262 -61 57 423 -392 -376 180 430 599 38 -211 -383 219 315
2826 315 297 -323 -652 -26 714 178 -395 -154 59 -100 25 -6 127 147 -153 183 -221 119 -225 89 18
2847 18 357 10 241 10 -428 -302 82 435 -49 -280 86 -117 -16 252 36 -184 -365 88 365 339 154
2868 154 -607 20 106 349 -12 -557 -265 191 354 328 -95 8 -173 -117 -170 264 106 -342 -41 -17 347 324
2890 324 -94 -222 -298 -109 298 389 -44 -505 -469 387 496 189 -650 -261 73 326 102 -9 -21 -319 -24
2911 -24 166 401 -240 -279 -358 321 149 -295 84 -191 127 -71 -74 264 67 -383 -157 -26 -85 -21 -38 -148 76
$$ packed form
2760d37N57k60Q4L02o4r1k82J27L66k56l82L15L27l4k41l45K86l54M59L44q8n57
2782b24j49J83M92Q3n85o9k9J57O15l17j17k67M78N5j6j51j51p1K01J32l8k82
2804g0J11j65O4K5J39K40m31p5j00K01J18L66q15J6N56K50J69n61k49j72O02R6
2826C15j8o20l29O26P40n36n73K41K13j59J25l1J33K0l00L36m04L40l44L14p1
2847A8L39l47K31k31m38J26L84L53m84k31L66k03J01K68k16k20j81M53K77k6j85
2868A54p61O27Q6K43l61n45K92M56J63k6m23J03j81N6n3M34j58m48L01K4L64k3
2890C24m18j28p6J89M07R1m33m61L6Q56J09l07q39L89L34K53k24j11j2k98K95
2911b4J90K35o41l9p9O79j72m44L79k75L18j98lL38j97m50K26J31n9O4j7j10K24
$$ plain form
2934 76 54 157 461 -189 -456 43 260 -132 72 -386 -177 284 217 -269 -429 -40 -60 147 22 -52 -200 -191
2956 -191 -184 33 -145 -125 -360 -4 336 -157 -21 64 -123 -360 -407 355 261 -95 -490 -306 180 422 40 -217
2978 -217 146 65 312 421 46 -306 -284 108 294 186 -269 -368 152 247 169 55 13 31 40 151 114 17 -18 -23 -200
3003 -200 250 148 132 -99 -291 -113 181 211 246 23 -230 329 98 35 -310 87 -5 251 339 -53 -264 -350
3025 -350 81 327 166 -269 -3 53 326 327 95 -136 -419 -192 -82 139 -156 154 -181 -192 -58 372 391 -198
3047 -198 -433 -148 -63 31 136 -238 -113 -387 177 381 123 -35 -427 369 597 -4 -126 -81 -93 -87 183 89
3069 89 -102 -222 44 159 -171 -132 -36 -31 37 61 394 -46 9 -343 100 33 308 553 -312 -155 38 136 80 -134
3093 -134 -482 85 221 461 -137 -223 -269 -41 488 -74 -18 -147 35 163 211 -78 -105 -240 29 130 115 350
$$ packed form
2934G6k2J03L04o50k67M99K17l92K04m58K09M61o7m86j60L89k0K07j25p4j48R
2956a91PK17j78K0k35L56L40m93J36Q5j87k37m7P62r4l56l95J84M86K42l82k57
2978b17L63q1K47J09l75l52K2L92J86j08m55r9N20R5p8j14m2J8RJ11l7r7l5nj77
3003b00M50j02j6k31j92J78K94L0L5k23k53N59k31o3l45L97r2K56Q8l92k11q6
3025c50M31K46j61m35K66N6K73Jk32k31k83K27J10K21k95L10l35j1J34M30J9n89
3047a98k35K85Q5R4J05l74J25k74N64K04k58j58l92P96K28o01j22M5j2OK70r4
3069H9j91j20K66J15l30L9R6NO8K4L33m40N5l52M43o7K75K45q65J57J93R8n6k14
3093a34l48N67J36K40n98q6m6K28N29n62N6j29J82J28M8k89k7j35K69J01j5K35
$$ plain form
3115 350 17 -484 -71 324 -152 -112 -339 -143 163 -317 144 201 147 -343 -160 462 156 -156 -182 -85 495 310
3137 310 -56 31 -49 -77 -12 407 248 -29 -349 281 414 104 53 -368 151 -43 93 -266 205 17 -505 -4
3159 -4 0 251 27 206 -196 374 154 -6 107 299 -118 -126 276 158 26 -261 -12 519 232 -225 -296 -271 269
3182 269 -20 30 -197 -273 -236 -78 256 243 173 33 73 214 37 259 -316 -184 108 74 89 145 2 97 -232
3205 -232 -28 264 -38 -19 115 311 100 149 -36 -247 -154 -64 271 449 -84 -304 48 358 37 43 43 -184 200
3228 200 371 -124 -107 51 -130 128 22 37 -137 45 26 111 126 6 -140 -272 84 -154 300 260 -279 -81
3250 -81 52 313 -4 -19 -215 -243 224 42 344 -412 -93 -67 185 358 -132 78 -118 69 111 -46 -39 -115 172
3273 172 130 238 570 109 156 -132 -53 98 239 -371 -165 -248 -228 -58 142 -282 -179 27 355 486 252 111
$$ packed form
3115C50l33n01M13L95m76M0k27J96L06m80M61N7n4m90J83O22l06l12k6R7N80j85
3137C10l66Q7q0k8O5M19j59k77l20O30J33l10n1m21N19j94J36l59M71j88n22N01
3159dMK51k24J79m02N70k20j60J13J92m17qM02j18j32k87K49N31k87m57p1K5N40
3182B69k89N0k27p6L7J58L34j3p0j40M0J41j77K22n75J32K92l4J5N6j43R5l29
3205b32K04K92l02J9J34J96k11M9j85k11R3R0L35J78n33k20L52L10l21O%k27L84
3228B00J71m95J7J58j81K58j06J5j74J82j9Q5J5j20j46j32L56k38M54m0n39J98
3250h1J33K61l17j5j96k8M67j82L02p56L19K6K52J73m90K10j96J87M2j57Pp6K87
3273A72m2J08L32m61M7k88P9J51J41o10K06q3K0J70K00m24J03K06L28J31k34j41
$$ plain form
3295 111 125 -98 36 78 -95 37 -377 227 164 162 153 -407 -4 49 42 -208 -34 97 -232 112 119 223 -363 -236
3319 -236 -166 83 250 -165 -25 -150 -54 -47 79 -65 -51 -335 126 198 118 142 -354 -61 307 2 -84 -182 28
3342 28 142 161 40 143 34 -230 7 50 -53 -109 -213 1 518 -66 440 -119 -105 29 -69 -368 172 -329
3364 -329 140 195 157 34 39 -169 -94 -115 130 155 -107 -46 -287 448 -36 229 16 9 153 218 93 134 60 369
3388 369 -38 189 133 -129 51 -122 193 224 203 -40 -172 102 196 -79 -62 42 -175 -314 120 260 96 -185
3410 -185 -112 299 200 10 -6 -74 -206 -37 334 155 -26 -297 16 24 64 62 -192 20 37 55 287 213 -86 -80 -18
3435 -18 -183 299 91 -121 -360 -346 197 110 -151 51 -159 -269 206 78 -158 239 245 128 248 107 180 -81
3457 -81 3 165 50 -149 -6 44 -134 107 127 82 90 -208 327 38 -50 41 74 -59 6 -18 -106 179 -269 35
$$ packed form
3295A11J4k23J34M2j73J32m14O04o3krn60M03N3pk50J74J31l29L44PJ04n86J27
3319b36P0K49J67m15J40j25R6PJ26j44J4k84M61P2q0K4m96K93L68l05q6r8K10
3342B8J14J9j21J03j09k64K37M3j03n6j04K14N17n84N06n59J4J34r8k99N40n01
3364c29M69N5l8j23Nk08P5k1K45K5k62O1k41P35m84K65k13pJ44O5j25M1p4L09
3388C69m07K27n6k62J80j73L15L1k1k43j32K74R4k75J7J04k17j39M34J40j64k81
3410a85P3M11r9j90j6o8j32J69L71j79j81k71L13QM0kk54K12J7J8K32p4k99OO2
3435a8j65M82k08k12k39J4N43q7k61K02k10j10M75j28k36L97Oj17J20j41P3k61
3457h1Q4J62j15j99J43N0j78K41K0m5Qk98N35k89q8R1L3j33O5k4q8K85m48L04
$$ plain form
3481 35 73 82 -515 61 194 271 34 -179 -108 -9 -400 0 31 -10 -223 -181 5 -208 62 -59 10 110 -59 322
3505 322 -136 276 -203 -202 -106 103 -374 -75 -7 236 215 62 256 -58 -4 270 291 39 -57 66 -178 -52 195
3528 195 212 1 -260 -198 -32 -109 -266 47 -92 -69 14 -198 36 -254 -53 -1 -139 -151 3 265 85 241
3550 241 210 214 -169 -254 -197 -299 127 -133 -51 -184 249 51 -266 334 -73 128 -48 -37 151 -98 0 -111 163
3573 163 233 120 -45 149 -6 43 32 120 44 55 -330 -115 281 -68 55 93 -84 -62 86 131 -169 -113 -70 -118
3597 -118 172 239 47 -128 -312 45 96 -128 66 206 -244 5 223 -59 -130 103 150 206 27 -120 -190 -231
3619 -231 176 -26 -138 130 46 -179 -12 -75 22 -274 -85 59 -118 150 -24 -13 205 78 184 -146 -69 -130
3641 -130 -21 147 33 -80 9 76 -106 200 -257 -64 137 182 -24 43 -34 33 -42 74 45 176 30 -10 117
$$ packed form
3481C5L8Rn97N76J33P7k37k13P1R9l91M00L1m1k13M2J86k13K70j21O9J00j69L81
3505C22m58M12m79JR6K09m77K99O8K43k1j53J94l14N4K74K1k52r6J23k44J26K47
3528A95J7k11k61O2J66p7j57L13j39K3Q3k12K34k90K01N2j38j2J54K62j80J56
3550B41l1Ml83q5N7j02M26k60Q2j33M33j98l17O00m07K01j76J1J88k49R8j11K74
3573A63P0j13j65J94j55M9j1Q8p6J1l85K15L96l49J23L8j77K2J48M5l00N6M3m8
3597a18K90O7j92j75j84L57N1k24J94J40m50K49K18k82p1K33M7N6j79j47p0m1
3619b31M07k02j12K68q4k25J67o3R7k96J89J44j77K68j74J1K18j27J06l30P7o1
3641a30J09J68j14j13Q9O7j82L06m57J93K01M5k06O7p7O7p5J16k9J31j46m0J27
$$ plain form
3664 117 28 -86 -100 -37 -145 -63 -94 -52 10 115 -206 -144 279 203 -5 -39 154 194 -28 -68 145 181 -400 325
3688 325 241 -184 -142 117 -278 114 -282 58 164 95 -74 -31 41 124 -147 -9 -83 52 -1 -136 45 -157 -84
3711 -84 41 213 275 140 41 152 116 35 -169 -110 -55 186 57 -260 71 -16 -14 148 -207 214 -75 -142 -53 31
3735 31 55 48 185 -105 -17 375 -103 94 -311 -46 -232 -87 48 -212 34 -115 108 -60 -218 129 104 -135
3757 -135 -191 13 107 -184 283 -46 324 27 -139 47 -104 -121 328 -69 -41 88 64 -35 -36 43 -106 -100 20 -23
3781 -23 -37 -5 94 -280 -218 -23 -14 -131 -386 -252 20 157 120 124 -16 -156 71 164 217 -130 197 -136 -23 -77
3805 -77 278 66 -332 238 140 -34 68 -85 138 -134 -212 -139 -117 -231 261 102 -234 26 31 140 -129 332
3827 332 -133 164 -30 -240 -14 42 27 -104 38 -52 -182 41 -97 -88 356 -106 107 65 -79 40 -100 60
$$ packed form
3664A17q9j14j4O3j08Q2l1M2O2J05l21O2M23p6k08l4J93M0k22m0K13L6n81P25
3688C25q4m25M2K59l95L92l96L40J06o9j69M3P2Q3k71J38p4J35n3j35J81k02P3
3711h4J25J72O2j35r9J11l6q1k04N9N5K41j29l17L31q7KJ62l55M21k89o7Q9Q4
3735C1K4pJ37k90Q8L92m78J97m05K65j86J45J35k60K46j49K23j68j58L47k5k39
3757a35n6K04R4k91M67l29L70k97j66J86j51j7M49l97K8J29k4r9jP9j49OJ20m3
3781b3j4L2R9l74O2J95Rj17k55J34K72J37l7Mj40j40K27R3N3l47L27l33J13n4
3805g7L55k12l98N70r8j74J02j53K23k72p8P3K2j14M92j59l36K60NJ09k69M61
3827C32m65K97j94k10K26N6j5j31J42r0j30K23j38RM44m62K13m2j44J19j40J60
$$ plain form
3849 60 25 -182 28 -242 38 147 216 -218 160 234 -46 -33 5 180 151 -30 -85 -109 -184 83 -150 -271 -159
3872 -159 182 28 -136 160 1 -18 216 52 -41 4 106 -37 -100 60 -55 242 214 -304 43 -220 -16 66
3894 66 -100 151 24 130 52 195 76 151 -128 -102 84 -11 170 21 -289 -169 172 25 233 122 237 16
3916 16 -271 -162 -213 -64 361 -58 287 100 -78 39 -166 -56 4 -86 -25 144 259 -156 -45 -201 -188 298
3938 298 46 -38 -215 186 -97 -60 -98 -121 93 -22 -17 -64 63 -10 -95 -224 119 -196 7 -177 334 70 -9
3961 -9 -24 216 412 -184 67 -130 -105 30 288 -385 50 117 -81 -231 12 -188 6 -88 185 -67 118 106
3983 106 -257 75 -82 31 -172 138 -254 -7 373 -101 -314 -78 -108 88 -125 -132 178 126 -28 9 -179 -242
4005 -242 70 -154 -90 -280 76 158 -126 -66 94 -2 196 -130 29 118 77 85 165 -64 47 -184 126 268 3
$$ packed form
3849F0l5k07K10k70K80J09O9m34L78P4k80J3L8J75k9j81n5k4p5K67k33j21J12
3872a59L41j54j64K96j59j9K34j64r3M5J02j43o3J60j15K97k8n18L47k63K04Q2
3894F6j66K51j27J06p8J43j19P5k79K6J86r5J81j49l10J20L41j47K08j11J15k21
3916A6k87J09n1J49M25m19L45j87j78J17k05J10O0r0O1J69J15m15J11j56J3M86
3938B98k52q4j77M01k83L7l8k3K14j15Nm7J27p3q5j29L43l15K03j84N11k64p9
3961ij5K40J96n96K51j97K5J35K58o73M35O7j98j50K43k00J94r4K73k52J85j2
3983A06l63L32j57J13k03L10l92K47L80m74k13K36l0J96k13pL10n2j54L7j88o3
4005b42L12k24O4j90L56Q2k84O0J60r6J98l26J59Q9m1QQ0k29J11k31L10J42k65
$$ plain form
4028 3 160 -108 12 359 -100 172 195 51 -140 263 -139 73 53 -137 -17 -92 172 -95 -154 -112 11 157
4050 157 277 11 -38 5 -32 -59 81 56 -146 230 312 -65 -164 19 287 -81 135 179 -1 62 -259 -43 77
4073 77 2 96 -4 37 -36 -18 207 -118 -152 -267 146 97 77 125 -5 130 -5 -70 95 129 28 -43 -97 -125 90
4098 90 -37 -38 4 47 275 425 -273 146 72 -64 -98 -164 425 35 115 -28 139 -149 4 -74 35 -108 3
4121 3 19 -154 -391 -8 150 164 352 -48 -215 149 80 -337 25 -18 142 -15 113 31 -109 -256 152 326
4143 326 -154 181 37 92 144 289 -141 -145 108 250 20 -171 178 334 -49 70 93 -31 -203 -115 282 193
4165 193 56 174 14 93 121 2 224 25 -47 152 -63 35 138 -118 265 -99 25 24 -89 -95 -38 113 182
4188 182 8 47 -43 119 -154 270 -292 -128 -18 142 80 -162 -139 -14 98 -156 -21 -40 29 -53 70 34 -69
$$ packed form
4028CJ57k68J20L47m59K72K3j44j91M03m02K12k0j90J20p5K64k67n9M2J23J46
4050A57J20k66m9M3l7k7J40k5k02L76Q2l77r9J83K68l68K16M4j80O3l21K16J20
4073G7p5R4j00M1p3J8K25l25l4j15M13m9k0M8j30J35j35o5J65L4j01p1n4k8K15
4098I0j27jM2M3K28J50o98M19p4j36l4o6N89l90Q0j43J67k88J53p8J09j43J11
4121CJ6j73k37L83J58J4J88m00j67L64o9m17L62m3J60j57J28q2j40j47M08J74
4143C26m80L35j44N5N2J45m30mK53J42k30j91L49J56l83J19K3j24j72Q8L97q9
4165A93j37J18j60P9K8j19K22j99p2J99k15R8J03k56L83l64J24jj13oN7J51O9
4188A82j74L9r0J62k73M24n62J64J10J60o2k42K3J25J12k54J35j9O9q2J23l6j03
$$ plain form
4211 -69 177 196 208 -83 199 -166 -16 -133 -250 -135 34 283 -49 91 169 31 -43 -71 -128 207 -132 38
4233 38 -67 -181 -27 57 138 57 32 159 -83 -119 -230 121 157 -50 66 1 -50 65 -8 137 -63 63 -307
4256 -307 116 128 185 -71 -220 170 -118 -171 -23 -85 13 -293 84 -20 54 -106 -398 65 8 274 -216 -237 -49
4279 -49 100 109 -58 -124 -54 -90 30 41 25 18 -165 -64 100 178 -186 111 -103 -78 117 34 36 -6 13 -35 -10 267
4305 267 -87 27 -55 340 228 -38 43 -128 273 -47 -210 -106 -133 -1 -43 -143 46 -264 -318 -153 23 -404
4327 -404 220 -247 15 67 255 15 32 -349 -120 43 -82 143 201 82 -151 -131 -110 250 294 -99 -206 109
4349 109 207 35 66 -27 167 178 277 92 12 252 182 22 -281 37 -32 -170 10 -27 66 -61 71 26 155 59
4373 59 17 -466 138 -74 -22 5 -81 -57 -129 166 120 122 -359 116 163 -240 126 32 -67 36 20 30 -113 -76 189
$$ packed form
4211f9K46J9J2k91K82l65J50j17j17J15J69K49l32J40P8j38p4k8n7L35l39J70
4233C8j05j14J54Q4Q1q1k5J27k42l6j11L51L6k07J16o5n1J15p3J45k00J26l70
4256c07M23J2N7k56j49L90k88n3J48o2R8l06L77j04P4j60k92M63n7K66m90k1J88
4279d9J49Rj67o6P0l6J20J1j6pj83J01J64P8l64K97k14K5J95q3Km2J9m8K5K77
4305B67l54J14q2L95j12k66Q1j71M01l20j63J04k7J32m2j00J89l10n4J65J76m27
4327d04O24m67K62N2J88k40J7l81K29J63j25K25N8j19k33K0K1L60M4l93j07L15
4349A09R8j72L1r3J94J1R9j85q0K40p0j60l03L18o9j38J80l7R3j27J32m5J29r6
4373E9m2m83O04k12N2K7q6K4p2K95m6Km81M75M7m03L66r4r9J03j6J0j43L7K65
$$ plain form
4398 189 19 -104 -223 -55 -171 394 -88 21 113 -45 -48 -21 25 -187 216 -77 66 -40 -118 -102 149 191 -253
4421 -253 17 -90 205 391 215 27 171 -78 -115 192 -119 -38 50 -72 17 -165 9 43 81 -70 179 125
4443 125 -73 35 22 -213 146 222 127 120 -121 60 44 19 -49 127 -9 36 156 -6 83 156 20 122 298 29
4467 29 -84 -174 100 198 78 113 21 -28 124 96 197 51 -105 160 -91 -130 -310 22 -104 140 -258 37 355
4490 355 -158 -91 -301 22 -167 -208 -200 471 105 27 110 -113 5 7 -141 -105 -96 17 -264 -57 -37 58 -13 -148 -199
4515 -199 21 -24 178 27 -109 108 -197 170 74 -74 -98 11 117 12 -287 -176 62 15 324 163 -3
4536 -3 -100 -128 28 59 -55 381 313 115 28 109 34 -29 272 152 -287 -93 68 101 -60 103 249 -124 41 -104
4560 -104 -188 -197 256 104 299 -135 79 -102 20 -143 -98 -6 -6 191 -138 -100 131 -119 63 -160 26 7 -22
$$ packed form
4398A89j70j23j19J68j16N65m82J09R2j58lK7M6k12M03k93J43j06p8J6K51M2m44
4421b53K70j07K95J86j76j88J44k49l7L07l11Q1Q8j22Q9j82J74L4L8j51K49n4
4443A25j98J08j3k35L59P6r5pk41J81j6k5o8J76j36M5J20j62Q9P3j36J02J76k69
4467B9j13r0K74R8j20L5r2m9J52k8J01j46j56K65k51l9j80L32j26K44l98K95L18
4490C55n13O7k10L23j89m1QO71l66p8Q3k23J18Kj48L6RJ13k81K07K0R5p1j35n1
4515a99K20m5K02j51j36K17l05L67r6j48k4J09J06j05k99J11K38m7L09j61j66
4536cr7k8J56L1j14M36o8j98q7Q1p5o3L01j20m39J94J61L3j61J63J46l73J65j45
4560a04q4rM53j52J95m34K14j81J22j63M5R2%J97l29L8K31k50J82k23J86j9k9
$$ plain form
4583 -22 -142 -283 -16 -53 21 124 57 -144 -132 -14 18 -6 -19 49 34 76 -11 140 -58 -61 228 50 -180 -53 91
4608 91 178 41 -146 -172 53 83 -184 106 106 8 218 -54 67 170 1 -123 -85 165 -194 170 83 -135 -249
4631 -249 -20 -96 17 27 5 -176 -15 147 -147 -184 81 -18 56 47 -152 136 81 251 150 -201 21 -233 -28
4654 -28 175 103 -128 193 -71 96 -112 -341 17 -46 -43 -148 -157 -264 179 62 129 76 200 -106 74 -2 -10 -260
4678 -260 65 184 70 -100 -63 -5 -85 -82 67 43 -214 -46 -41 -196 -175 125 -6 162 90 -56 -187 -32 129
4701 129 -151 -62 -16 34 -122 160 -23 110 35 153 -1 166 -149 -156 189 -149 -21 179 -219 -65 107 -65
4723 -65 -65 184 -53 -112 -278 60 47 62 14 -82 10 167 216 232 12 102 15 -186 69 -28 -112 -16 -306 -125 -98 95
4749 95 -19 -86 -62 196 185 -137 -66 -294 313 524 49 -7 -15 8 87 119 9 56 -6 -168 20 311 -35 -82 186
$$ packed form
4583b2j20j41K67l7P4J03o7k01J2J18L2k4j3O8j5M2q7J51j98lK89j78k30J27J44
4608I1Q7j37j87k6K25L0k67K90%r8K10k72J21J03j69j24L8K50l59L64q7k18j14
4631b49K29p6J13J0k2j81J61J62k94l7K65r9P4rj99K88n5J70j01l51K22k54K05
4654b8K03p2k31L21k64J67k08k29L58o3Lj05rj07M43j17O7n3J24l06J80p6qk50
4678b60L25J19j14j70L7N8q0LJ49k4k57J68Nj55K1L00j31J68p2j46j31J55J61
4701A29k80Q9M6N0j56K82j83J33p5J18j54J67l15pL45l38J28K00l98J54J72j72
4723f5%K49k37n9j66L38j3J5m8r6R2J57M9J6k20R0q7k01K55r7q4R6k90J81K7J93
4749I5j14o7K4K58j1l22P1k28O07K11m75n6qK3P9L2j10M7o2j62J88K91l46m7K68
$$ plain form
4774 186 166 103 122 -93 -48 -7 123 153 111 57 -4 34 -178 100 181 -194 53 -119 -97 115 310 161 -59 -62 4
4799 4 -135 -41 -80 51 27 -91 240 121 -94 53 -155 -68 167 84 240 149 349 168 -284 -33 120 -55 11
4822 11 116 22 -38 57 134 -6 -84 -86 -71 63 -305 -166 -10 209 51 83 56 -58 -120 86 -210 -66 191 359
4846 359 -78 -109 -144 143 290 -188 1 -188 80 52 136 115 -97 299 236 59 128 77 5 -206 259 -83 -135
4869 -135 5 41 49 34 -288 -85 -289 317 -127 9 -36 -99 33 -112 -40 289 298 -104 18 -42 62 22 -50 41
4893 41 -70 81 59 143 -264 -228 105 -231 -2 -52 -100 -76 87 -110 233 112 -14 -10 174 -200 -139 130 -7
4916 -7 -29 27 -103 98 52 241 -143 36 120 60 -94 -65 -254 -13 174 119 -110 302 -292 -27 -30 -19 155 -139
4940 -139 -1 257 -63 -306 24 -375 333 -91 0 56 50 29 184 169 -24 -1 -85 8 161 85 414 -314 62
$$ packed form
4774A86k0o3J9k15M5M1J30L0m2n4o1L8k12K78Q1l75K47j72K2K12J95j49k20lO6
4799Dj39R4l9J31k4j18L31j19k15J47k08Q7K35q3J56r1K00j81m52K51J53j75O6
4822A1J05r4o0R5P7j40p8kJ5J34l68J39J56K19j58L2k7j14o2K06k96J44K57J68
4846C59m37l1l5K87J47m78J89j89K68k8Q4k1k12L96o3j77O9n1p2k11M65l42n2
4869a35J40L6Qj5l22K03k04O06m44J36m5o3J32j45P2L29Rm02J22o0J04m0p2R1
4893D1j11J51k2Q4m07L6L33l36K29n0m8K4J63j97L43j21j26MJ84l74O1K69j37
4916gk2N6j30K01m6J89l84J79Q4o0j54K9j89K41J87n5k29M12n94K65lJ1J74k94
4940a39J38K58l20k43L30l99P08m24R1N6ok1J55j5j93K3q4R3J53p6L29p28L76
$$ plain form
4963 62 -27 -51 -32 78 127 16 148 -225 -81 -106 130 -110 110 -81 -8 201 80 100 20 10 160 91 -87 224
4987 224 -168 -135 56 97 186 -135 -216 -125 160 111 -86 81 58 -50 174 -158 123 192 62 1 -205 -25 88
5010 88 -206 -84 -7 34 138 176 -65 -194 239 -115 156 -257 164 -24 -101 -38 -541 -42 -81 -163 114 -44 -338
5033 -338 -19 111 37 60 -5 86 -398 -184 -49 133 27 52 -47 -197 -176 69 335 -254 -48 -189 -17 5 -36
5056 -36 -55 -160 -131 102 19 -116 186 176 -215 200 234 -44 -63 -191 190 -40 37 396 -165 12 -66 -63 112 -79
5080 -79 -141 -101 -86 -218 -333 211 -296 40 33 -44 0 -231 -49 -204 -53 -63 -148 -138 48 -62 -94 -40 -170 -175 -73
5105 -73 -75 171 9 45 210 163 46 34 -79 163 53 -13 159 -3 -20 96 119 -112 221 -22 8 45 114 76
5129 76 109 211 208 -52 314 -122 274 148 -273 -115 -35 -79 116 118 32 -113 37 6 -145 -328 134 129 -32 -56
$$ packed form
4963F2q9k4J9J10M9j11J32l73J44k5K36k40K20j91P3K09j21K0q0j0J50o9j78L11
4987B24l92L3J91M1Q9l21q1R1K85m9j97J67k3j08K24l32K81O9j30o1k06J80J13
5010H8k94J22P7M1J04L8k41j29M33l54K71m13M21j88p7O3n03M99l9q2K77j58k94
5033c38L19J30p4K3o5R1m84K14J35J82j06K5r9j50K1K45K66n89K06j41J72K2m1
5056c6j9j05K9K33q3j35L02j0l91M15L4k78j9j28L81k30P7L59n61J77p8LJ75j91
5080g9o2M0J5j32j15N44n07L36pp7M4k31J82j55J51j0q5J0J86j10l2N4j30nJ02
5105g3kK46j62L6J65m7j17j2j13K42j10o6J72j62j7J16K3k31L33k43L0L7O9l8
5129G6L3J02lk60L66m36L96j26m21J58Q0m4J95Kq6j45J50l1j51j83M62nj61k4
$$ plain form
5153 -56 129 26 -11 27 -39 230 129 -29 146 -28 -53 364 -83 -49 70 -148 2 -88 -7 298 246 -453 -72
5176 -72 146 -307 253 20 254 -208 -175 166 -181 15 -18 184 109 233 -29 7 167 -335 243 306 32 -38
5198 -38 -34 -153 166 -163 42 143 -198 50 321 153 -69 -61 130 92 -269 134 20 25 84 224 70 -158 -131
5221 -131 -33 164 -255 -174 -160 -220 92 -252 -189 75 -46 -102 13 -24 -12 244 -71 34 -51 -56 -131 -117 61 192
5245 192 -201 168 -129 -130 145 110 -55 320 -92 -158 358 -173 31 -337 -140 -1 -81 94 41 260 50 94
5267 94 -140 -117 187 -60 -231 -53 152 -228 182 78 235 86 -89 37 40 -5 144 220 -46 107 -117 -21
5289 -21 180 314 104 30 76 -161 105 219 7 53 190 -54 -113 -97 133 -153 206 182 49 15 -88 -149 98
5312 98 15 58 98 -177 39 -344 39 -196 219 -163 196 -91 20 234 25 217 -79 -10 27 -234 -11 233
$$ packed form
5153e6J85j03l7L8o6K69j01j58J75j74k5M17m47L4J19k18J50r0Q1L05n2o99L81
5176g2K18m53N60k33K34m62L3L41l47J96l3K02p5J24k62L6J60n02N78O3k74p0
5198c8Mj19L19l29K05J01l41K48K71j68k22QJ91l8l61M03j14NN9J40j54k28K7
5221a31R8J97m19Q1J4o0L12l44O3K64j21n6J15l7J2K56l15J05q5np5J4J78J31
5245A92l93L69k97jK75l5j65L75m12o6N16n31K04l68J97J39q0J75n3K19k10M4
5267I4k34K3L04k47j71J78K05l80M10j04J57j49j75J26Lm5J49P6k66J53k24R6
5289b1K01J34k10p4M6k37K66J14k12M6J37k44n9J6K30k86L59k4j33l4j03o1K47
5312I8q3M3M0k75K16l83L83k35M15l82L59k87J11K14k09J92k96O9L7k61K23K44
$$ plain form
5334 233 121 -169 -169 488 -25 -17 187 -125 63 -379 6 272 137 157 -160 -236 175 129 4 185 77 205
5356 205 41 30 154 -129 62 244 203 -214 -81 -125 -190 -82 208 28 -158 -89 307 -9 52 -5 -35 -406 -95
5379 -95 110 -12 -222 -313 -26 190 182 213 162 -255 -107 57 -72 -20 -59 -384 84 -26 -116 259 214 -51 106
5402 106 -107 -378 307 129 -221 -168 176 129 -123 75 128 -166 34 37 -197 108 214 28 46 -282 66 12
5424 12 140 176 -74 -294 -62 -6 -34 93 2 102 -222 -28 -138 -174 179 197 -237 62 -142 -51 -23 -131 -189
5447 -189 172 -163 79 129 -114 153 43 -193 94 -68 -105 -150 -46 27 -3 122 -217 74 37 41 291 -9 -94
5470 -94 -234 92 28 -24 125 -14 -287 -80 89 -11 -109 46 -165 34 289 -347 146 -334 33 36 -290 128
5492 128 -84 -170 -121 178 -82 -87 107 -131 -216 -144 153 61 -41 186 -66 80 265 210 322 75 -92 -154 42
$$ packed form
5334B33j12k90%O57n13QK04l12J88m42L85K66j35K0l17p6M11m6j25J81j08J28
5356B05j64j1J24k83J91J82m1m17J33m4o5J08K90j80j86O9L96l16O1n7l0l71L11
5379i5K05j22k10r1K87K16qL1n1m17J48J64j29N2l9l25M68j10r0L75m5k65J57
5402A06k13k71O85j78l50N3L44m7k52J98N3k94K00Lk34L05J06j86J8l28L48n4
5424A2J28L6k50k20K32N6k8J27r1J00l24J94j10l6L53J8m34K99k04R1K8j08n8
5447a89L61l35K42N0k43K67j10k36K87j62l7m5J04P3l0J25l39K91l7MK50l00q5
5470i4j40L26o4n2J49j39k73K07J69j00r8J55k11J99K55o36M93m80L67Ll26M18
5492A28k12q6M9K99k60nJ94k38q5P2K97r2j02K27k52J46J85n5J12k47j67o2J96
$$ plain form
5515 42 -61 55 -184 -149 65 -59 -108 -203 126 -113 -6 -273 -122 92 39 -109 219 -60 27 143 118 -114
5537 -114 -98 201 144 -118 -86 -303 -15 173 145 127 -156 100 281 -79 149 185 496 128 142 -216 41 123 82
5560 82 60 -90 93 283 -13 -24 87 -33 146 113 133 -142 -262 -32 34 146 -91 -31 94 -64 74 -75
5582 -75 66 -80 141 354 -59 -60 -203 0 -85 -159 202 18 185 236 180 46 -85 -86 42 0 50 -167 -160 175
5606 175 110 -185 -69 104 -32 38 -107 -61 -49 -59 125 -281 54 -193 -18 -122 291 -251 -160 93 -8 62
5628 62 -305 -354 120 189 56 315 -54 38 -215 -320 94 -150 109 53 87 54 -80 288 159 145 -319 -62 -9
5651 -9 36 -188 221 -2 -6 251 287 97 25 34 4 -138 171 27 -1 -164 14 -373 74 208 24 145 131 84
5675 84 323 -64 -158 -195 -34 -42 -117 179 78 -131 349 44 69 108 -33 204 138 6 84 73 -162 209 -292 54
$$ packed form
5515D2j03J16k39L5K14j24m9r5L29k39J07k67J51K14n3j48L28k79Q7J16k5k32
5537a14J6K99n7k62L2k17K88J88k8j8k83K56J81l60K28L6L11l68J4l58K57Q2m1
5560H2k2j50J83J90k96j1J11j20J79l3K0k75j20K30O6J12k37O0J25j58J38j49
5582g5J41j46K21K13m13jj43K03q5p4L61j84J67N1n6j34j31jJ28m2N0k17PL35
5606A75o5k95J16J73j36P0j45M6J2j0J84m06L35k47J75j04M13n42R1K53j01P0
5628F2l67m9M74O9j33K59l69R2k53j05M14k44K59n6L4l3j34L68j29j4m64K57N3
5651iM5k24M09k23mK57L6j90p2Rl0j42L09j44k8j63J78l87M47J34j84J21j4m7
5675H4K39l87r4l7J61qp5K96j01k09M80l05K5L9j41K37o6j32P8j1k35L71n01L46
$$ plain form
5699 54 -200 -97 133 -61 287 49 91 -5 5 217 -3 114 73 159 108 -87 -101 -298 86 -62 -34 -147 -60
5722 -60 109 8 240 130 137 -109 54 -39 11 -40 107 -111 -185 51 213 177 8 59 -148 -74 -59 206 116 19
$$ packed form
5699E4k54J03K30j94L48k38M2r6J0K12k20J17m1Q6n1j95j4j97L84j48K8j13Q7
5722f0J69j01K32j10Pk46J63r3N0n1J47k18p4K36J62l6j69N1k07P4J5K65r0r7
$$ [...]
8191b27
##END NTUPLES=NMR FID
##END=
