##TITLE=1H_Ser Glu-Am
 CDCl3, 108 sc, 
 8.4.2019
##JCAMPDX= 6.0         $$ Bruker NMR JCAMP-DX V2.0
##DATA TYPE= NMR FID
##DATA CLASS= NTUPLES
##ORIGIN= UXNMR, Bruker Analytische Messtechnik GmbH
##OWNER= root
$$ XWIN-NMR		Version 3.5
$$ Mon Apr  8 16:09:16 2019 Russian Standard Time (UT+4h)  she@DPX200
##.OBSERVE FREQUENCY= 200.1315
##.OBSERVE NUCLEUS= ^1H
##.DELAY= (6, 6)
##.ACQUISITION MODE= SIMULTANEOUS
##.ACQUISITION SCHEME= undefined
##.AVERAGES= 8
##.DIGITISER RES= 18
##SPECTROMETER/DATA SYSTEM= spect
##.PULSE SEQUENCE= zg30
##.SOLVENT NAME= DMSO
##.SHIFT REFERENCE= (INTERNAL, DMSO, 0, 15.7039)
##AUDIT TRAIL= $$ (NUMBER, WHEN, WHO, WHERE, WHAT)
$$ ##TITLE= Audit trail, XWIN-NMR		Version 3.5
$$ ##JCAMPDX= 5.01
$$ ##ORIGIN= Bruker BioSpin GmbH
$$ ##OWNER= she
$$ F:/spectra/data/she/nmr/H-F/1/audita.txt
$$ ##AUDIT TRAIL=  $$ (NUMBER, WHEN, WHO, WHERE, WHAT)
(   1,<2019-04-08 16:07:45.50 +0400>,<she>,<DPX200>,
      <created by zg, POWCHK disabled, PULCHK disabled
       configuration hash MD5:
       00 E9 B6 7A A2 85 ED C7 34 08 36 98 17 FE 4E 26
       data hash MD5: 16K
       33 BA 23 F0 A2 0A C9 70 39 1E EC 75 E5 6B 5E 0E>)
$$ ##END=
$$ 
$$ hash MD5
$$ 20 74 E8 74 A2 5A 19 41 93 A9 5E 2B FC 60 66 E2
##$RELAX= 
##$RELAX= 
##$RELAX= 
##$RELAX= 
##$RELAX= 
##$RELAX= 
$$ Bruker specific parameters
$$ --------------------------
##$DU= <F:/spectra>
##$EXPNO= 1
##$NAME= <H-F>
##$PROCNO= 1
##$TYPE= <nmr>
##$USER= <she>
##$AMP= (0..31)
100 100 100 100 100 100 100 100 100 100 100 100 100 100 100 100 100 100 
100 100 100 100 100 100 100 100 100 100 100 100 100 100 
##$AQSEQ= 0
##$AQ_mod= 1
##$AUNM= <au_zg>
##$AUTOPOS= <>
##$BF1= 200.13
##$BF2= 200.13
##$BF3= 200.13
##$BF4= 200.13
##$BF5= 200.13
##$BF6= 200.13
##$BF7= 200.13
##$BF8= 200.13
##$BYTORDA= 1
##$CFDGTYP= 0
##$CFRGTYP= 5
##$CHEMSTR= <none>
##$CNST= (0..31)
1 1 145 1 1 1 1 1 1 1 1 1 1 1 1 1 1 1 1 1 1 1 1 1 1 1 1 1 1 1 1 1 
##$CPDPRG= <>
##$CPDPRG1= <>
##$CPDPRG2= <>
##$CPDPRG3= <>
##$CPDPRG4= <mlev>
##$CPDPRG5= <mlev>
##$CPDPRG6= <mlev>
##$CPDPRG7= <mlev>
##$CPDPRG8= <mlev>
##$CPDPRGB= <>
##$CPDPRGT= <>
##$D= (0..31)
0 1.2 0 0 0 0 0 0 0 0 0 0.03 0 0 0 0 0 0 0 0 0 0 0 0 0 0 0 0 0 0 0 0 
##$DATE= 1554725264
##$DBL= (0..7)
120 120 120 120 120 120 120 120 
##$DBP= (0..7)
150 150 150 150 150 150 150 150 
##$DBP07= 0
##$DBPNAM0= <>
##$DBPNAM1= <>
##$DBPNAM2= <>
##$DBPNAM3= <>
##$DBPNAM4= <>
##$DBPNAM5= <>
##$DBPNAM6= <>
##$DBPNAM7= <>
##$DBPOAL= (0..7)
0.5 0.5 0.5 0.5 0.5 0.5 0.5 0.5 
##$DBPOFFS= (0..7)
0 0 0 0 0 0 0 0 
##$DE= 6
##$DECBNUC= <off>
##$DECIM= 24
##$DECNUC= <off>
##$DECSTAT= 4
##$DIGMOD= 1
##$DIGTYP= 9
##$DL= (0..7)
0 120 120 120 120 120 120 120 
##$DP= (0..7)
150 150 150 150 150 150 150 150 
##$DP07= 0
##$DPNAME0= <>
##$DPNAME1= <>
##$DPNAME2= <>
##$DPNAME3= <>
##$DPNAME4= <>
##$DPNAME5= <>
##$DPNAME6= <>
##$DPNAME7= <>
##$DPOAL= (0..7)
0.5 0.5 0.5 0.5 0.5 0.5 0.5 0.5 
##$DPOFFS= (0..7)
0 0 0 0 0 0 0 0 
##$DQDMODE= 0
##$DR= 18
##$DS= 0
##$DSLIST= <SSSSSSSSSSSSSSS>
##$DSPFIRM= 0
$$ [...]
##$SUBNAM2= <"">
##$SUBNAM3= <"">
##$SUBNAM4= <"">
##$SUBNAM5= <"">
##$SUBNAM6= <"">
##$SUBNAM7= <"">
##$SUBNAM8= <"">
##$SUBNAM9= <"">
##$SW= 24.9337058887773
##$SWIBOX= (0..15)
0 0 2 0 0 0 0 0 0 0 0 0 0 0 0 0 
##$SW_h= 4990.01996007984
##$TD= 16384
##$TD0= 1
##$TE= 0
##$TE2= 300
##$TE3= 300
##$TEG= 300
##$TL= (0..7)
0 120 120 120 120 120 120 120 
##$TP= (0..7)
150 150 150 150 150 150 150 150 
##$TP07= 0
##$TPNAME0= <>
##$TPNAME1= <>
##$TPNAME2= <>
##$TPNAME3= <>
##$TPNAME4= <>
##$TPNAME5= <>
##$TPNAME6= <>
##$TPNAME7= <>
##$TPOAL= (0..7)
0.5 0.5 0.5 0.5 0.5 0.5 0.5 0.5 
##$TPOFFS= (0..7)
0 0 0 0 0 0 0 0 
##$TUNHIN= 0
##$TUNHOUT= 0
##$TUNXOUT= 0
##$USERA1= <user>
##$USERA2= <user>
##$USERA3= <user>
##$USERA4= <user>
##$USERA5= <user>
##$V9= 5
##$VALIST= <valist>
##$VCLIST= <CCCCCCCCCCCCCCC>
##$VD= 0
##$VDLIST= <DDDDDDDDDDDDDDD>
##$VPLIST= <PPPPPPPPPPPPPPP>
##$VTLIST= <TTTTTTTTTTTTTTT>
##$WBST= 1024
##$WBSW= 4
##$XGAIN= (0..3)
0 0 0 0 
##$XL= 0
##$YL= 0
##$YMAX_a= 86959
##$YMIN_a= -150736
##$ZGOPTNS= <>
##$ZL1= 120
##$ZL2= 120
##$ZL3= 120
##$ZL4= 120
##$ABSF1= 10
##$ABSF2= 0
##$ABSG= 5
##$ABSL= 3
##$ALPHA= 0
##$AQORDER= 0
##$ASSFAC= 0
##$ASSFACI= 0
##$ASSFACX= 0
##$ASSWID= 0
##$AUNMP= <proc_1d>
##$AZFE= 0.1
##$AZFW= 0.1
##$BCFW= 1
##$BC_mod= 2
##$BYTORDP= 1
##$COROFFS= 0
##$CY= 11.3945322036743
##$DATMOD= 1
##$DC= 2
##$DFILT= <>
##$DTYPP= 0
##$F1P= 18.9103706918063
##$F2P= -1.10871071338519
##$FCOR= 0.5
##$FTSIZE= 0
##$FT_mod= 4
##$GAMMA= 1
##$GB= 0.15
##$INTBC= 1
##$INTSCL= 1
##$ISEN= 128
##$LB= 0.24
##$LEV0= 0
##$LPBIN= 0
##$MAXI= 10000
##$MC2= 0
##$MEAN= 0
##$ME_mod= 0
##$MI= 1.114404
##$NCOEF= 0
##$NC_proc= 0
##$NLEV= 6
##$NOISF1= 3.799351
##$NOISF2= 2.8
##$NSP= 1
##$NTH_PI= 0
##$NZP= 0
##$OFFSET= 15.70392
##$PC= 1
##$PHC0= -8851.783
##$PHC1= 15.00026
##$PH_mod= 1
##$PKNL= yes
##$PPARMOD= 0
##$PSCAL= 0
##$PSIGN= 0
##$REVERSE= no
##$SF= 200.130013532006
##$SI= 16384
##$SIGF1= 3
##$SIGF2= 2
##$SINO= 400
##$SIOLD= 16384
##$SREGLST= <1H.CDCl3>
##$SSB= 0
##$STSI= 0
##$STSR= 0
##$SW_p= 3612.71676300578
##$SYMM= 0
##$S_DEV= 0
##$TDeff= 0
##$TDoff= 0
##$TI= <>
##$TILT= no
##$TM1= 0
##$TM2= 0
##$TOPLEV= 0
##$USERP1= <user>
##$USERP2= <user>
##$USERP3= <user>
##$USERP4= <user>
##$USERP5= <user>
##$WDW= 1
##$XDIM= 8192
##$YMAX_p= 0
##$YMIN_p= 0
$$ End of Bruker specific parameters
$$ ---------------------------------
##NTUPLES= NMR FID
##VAR_NAME=  TIME,          FID/REAL,        FID/IMAG
##SYMBOL=    X,             R,               I
##VAR_TYPE=  INDEPENDENT,   DEPENDENT,       DEPENDENT
##VAR_FORM=  AFFN,          ASDF,            ASDF
##VAR_DIM=   8192,          8192,            8192
##UNITS=     SECONDS,       ARBITRARY UNITS, ARBITRARY UNITS
##FACTOR=    0.0002004,     1,               1
##FIRST=     0,             0,               0
##LAST=      1.6414764,     0,               0
##MIN=       0,             -150736,         0
##MAX=       1.6414764,     86959,           0
$$ Real data points
##PAGE= N=1
##DATA TABLE= (X++(R..R)), XYDATA
0@%%%%%%%jRj6J6j6K4l2L3m1M9n7P2q7J02j19J37j56J80k09K38k69L06l45L88
31B06m39M95n55O20o88P65q53R47j049J164j292J429j580J749j938K152k395K672
49A410k992L364l807M345n012N865p003Q611j1063J5314k4759Q4397n0535j49403
63a31268R7569R0623j9223o8908J8559M0422O871m7169k4909J7485L3307Q414
75B1773J3795j1113n6681k5730O8140L6741n9281k4991O9995K0474p2488m0445
87e9811M5743M3729m651k0666j875j52k5408j6828M4341M2606m2962m4212N3614
100A3468L9243p6703n7933P4896P9421l5702p0790m636L8078J2316k3664o972
112a8978L4867J9410l2106k7773M725k756Q081N2306J1970p3690l6060O2328L4539
$$ y = [0, 0, 0, 0, 0, 0, 0, 0, -1, 8, -8, 8, -8, 16, -16, 17, -24, 25, -32, 40, -47, 55, -64, 73, -83, 97, -112, 126, -143, 163, -182, 206, -233, 262, -293, 327, -361, 404, -449, 498, -551, 613, -679, 750, -830, 919, -1019, 1133, -1262, 1410, -1582, 1782, -2025, 2320, -2692, 3173, -3830, 4781, -6282, 9032, -15727, 68670, 18135, -131268, -33699, 56924, 37701, -31207, -12648, 27774, 34645, -12524, -37433, -19948, 13359, 21773, 35568, 24455, -32226, -57956, 10184, 46925, -12356, -37347, 32648, 53122, -19366, -59811, -14068, 29661, 25010, 4344, 2469, 2317, -23091, -39919, 4422, 47028, 4066, -40146, 13468, 52711, -23992, -81925, -7029, 72392, 36690, -34100, -38736, -658, 11658, -12006, -18978, 15889, 35299, 3193, -24580, -19855, -22611, -14530, 37776, 49746, -23944, -60004, 2324, 36863]
125C6863n1266k4269N3140L8465m0035o2463L577N9993K0684m0785r427L6977
137B1454j0884m8013J5714M6288j3425k5248K6452J3457m1537k4281L0099L3013
149B3089l743k3430m131J9652l991l5327N033N0030M440m0837N39K0622k6824
162a4878j8368M5523L0723l5641k9870K0073J9800j8456k6305J5790M9731N357
174D3479o1736k9163M7577K8137k8113m895K5667j0474k5504J0653R752j4625
186i245M211K7697K381l0693k3874J6031L7783K088m1773n383M7974K482n6206
199b6527q576M8348J1602k5993L10R262j4302q756J3461J2679k274j0988m588
212f342J3788J672k9541n165M4400J4497m0891j3948K7595j70k1589J1159K0361
$$ y = [36863, -14403, -38672, 14468, 52933, 12898, -49565, -45988, 14005, 34689, -6096, -15523, 21454, 10570, -37443, -21729, 24559, 11134, -14114, 12338, 25795, -15742, -40023, -9924, 23089, 19346, -4084, -8215, 11437, 7446, -27881, -22848, 27182, 31622, -9215, -8676, 11946, -14878, -33246, 12277, 43000, 7359, -22511, -2438, 17362, -1094, -27399, -11609, 38122, 43479, -18257, -47420, 157, 28294, 181, -4714, 20953, 10479, -15025, -4372, 5380, -9245, -5034, 22663, 25044, -5649, -29523, -13492, 24291, 26379, -15394, -20777, 27197, 29679, -26527, -35103, 13245, 24847, -1146, -836, 8426, -5876, -14632, -1171, 11508, 9234, -1754, -6342, 7446, 9118, -20423, -25588, 18812, 33309, -7582, -21530, 6065, 5895, -15694, -4535, 15826]
225A5826q948j2565N58M12k241QO727J6603P99l4514j2904L7947J6590l5476j0202
240b1380L3663L562k8971l577J6755L568j523n7m006L61j107p010N658J3104j0625
255a585j1251J9031O564k7168m330K9545J542k1525L452J3425p304r921K308O469
269g48P478n51j2621Q54J3132r095j3281J9017J4905k1728j1805J7416J659j3851
283i219P306J3111o571p148k29r31N774N206q950k003J2225m650j5766J1126J3900
298A3181j3378n990J5596k719j5161P122J1284p860m812L371k91L441L454j0470
312c232k911J5336q38j5543O886J2448j2576q310J3215J374r964O639N818r742
326a400k219O651k450J609N208q327o629J1863J195j2679N562J2605j0237q137
$$ y = [15826, 6878, -5687, -5129, -4717, -6958, -6950, -223, 16380, 17179, -17335, -30239, 7708, 24298, -11178, -21380, 12283, 15845, -13126, -16703, 52, 3620, 2097, 2040, -1966, -1605, -2712, -9722, -4064, 9040, -1585, -12836, 6195, 12759, -14409, -18739, 10806, 12348, -9177, -5725, 7700, 396, -9525, -7217, -748, 6730, 6179, -6442, -5588, 7544, -1551, -14832, 4185, 19090, -2638, -14443, 2973, 4632, -9219, -1913, 11198, 4627, -2521, -2750, -3681, 2093, 7299, -1651, -3654, 8571, 3921, -11845, -719, 13181, -197, -6187, 9409, 6690, -8471, -1349, 9935, 2075, -2737, 634, 343, 3784, 7238, -3232, -6143, 9193, 8355, -7188, -302, 12146, -430, -8740, 4475, 5849, -4115, 2524, 8342, -1400, -3619, 3032, 582, 2191, 7399, -928, -7557, 4306, 5501, -7178, -1616, 10989, 752, -7385]
340g385R985M75q360P339N268j0736k161P063k832m23O843n074p403R602K349
355D550j1523M185J0828r489q168J0010J829p725N379M242r157N65P674m952k829
370d581Q575m016q750P528M718r243K494R332q197o193R942P49q317O150M097
385D288r790m24Q469l715l483Q525k829r489P518O088q974J171Q595p854o488
400h392J0278J628q324N071M162q779J16R485m447m364P752j902r011O393O363
415F029q241rQ713o429n872R356J537p802M324M135r145k18R361l587m537O920
431D535j238q384O286O105q318j5Q393o725o952R359L663q395K159M600o709k69
447a905Q384l839n424P168j177q686O058O488q666r46R199n290q157R531M797
$$ y = [-7385, 2600, 3075, -5285, 2054, 7322, -3414, -5575, 1488, -1344, -1767, 5076, 2, -7401, 2201, 4550, -6973, -2788, 8040, -1449, -9617, 393, 2222, -5503, -124, 4118, -5039, -4474, 3200, -1752, -4581, 3994, -22, -8772, -1244, 3474, -5769, -3275, 6057, -2140, -8333, 1609, 2358, -5959, 191, 4288, -5502, -5926, 2543, -1172, -4655, 3870, 1041, -8448, -930, 5158, -3816, -2645, 5950, -1904, -8392, 1886, 3514, -4810, 261, 4423, -4356, -4240, 5245, 798, -3566, 4186, 2284, -6727, -334, 6029, -2212, -2221, 6492, 63, -5809, 3547, 5084, -2718, 1606, 5741, -3404, -3622, 5739, 2152, -2385, 4535, 3297, -5087, 1199, 7304, -1014, -1029, 7364, 639, -6313, 3046, 6709, -1686, 473, 5073, -1636, -1905, 6479, 2640, -2784, 4384, 3207, -5479, 579, 7067, -1599, -2545, 6654, 1364, -6793, 2738, 7535]
462G535q697p0M640n638k77P396l915m699P298j297r278O664P701q809k312R021
478E263n406r042R875O584r242k306N463l104m92N024m358k795Q543j969j0733
493h695O392Q333r050l743J0937k765r672P348O939q819l447N842%m81K381n816
509d316j302R316k416j1006Q362J0708j1201p302J0742L25r581O927Q464q264
523e44o571M326K296J377J902m759n56Q455o150j2942J1299J5191j2397j0428
537i501J2143K824j2041K723J0597l048n104R91L7O45J431m975J333J1368m623
552D800j4450Q823J2895j3893r600J7049Q433j5406n215Q888O11l766Q34J953
566A956L576N37r406k437J1453k048j1192J1925J3914j9305j7551J7558J5906
$$ y = [7535, -1162, -1232, 3408, -2230, -2507, 4889, 974, -3725, 3573, 2276, -7002, -338, 7363, -1446, -3758, 5263, -143, -9185, 690, 7274, -1968, -4274, 1189, -1915, -2407, 2617, -1741, -4536, 4007, 2038, -8695, -2303, 6030, -3020, -6763, 4174, 1409, -8263, -915, 6024, -2795, -6242, -400, -400, -881, 1500, -4316, -5618, 3698, 1282, -9724, -1362, 9346, -1855, -9157, 1585, 1910, -7671, -744, 7720, -544, -7115, -2789, -493, 884, 2786, -1973, -2529, 5926, -224, -13166, -1867, 13324, 927, -9501, 2642, 5466, -6575, -3852, 6745, 3697, -1407, -416, -379, 266, 1697, -3278, -1945, 9423, 4800, -9650, -827, 12068, -1825, -11425, 5624, 14057, -1349, -6564, 2324, 2935, -831, 3, 1956, 5532, 6069, -3337, -5774, 5679, 3631, -7561, 4364, 18278, -1027, -18578, -1020, 14886]
579A4886j2909p348R362M003p072p616q40J0572Q966p770p951N073k719r639J2786
594A784J5788j6893j4928J8023J0864k1102j1082J8698J4363p486j4444m077J1009
607E17O570j1441l969J6597K052j8403Q36J3179j0338j1074K1145J4679k0486
620a36j6965J0510J2398l745p815J631J2057K720j9103j0306J7418R114j0823
633c045M838J1681j7779j9865J9281K0644j4043j3186J3683J0799j4122j9086
645b0200M364K6175J1845k2910j6551J6767Q724j9101m80K2917m69j8012M134
658b797Q948j3962p542J8108J4175r556j6045o46J3019R61j6569K060K9183K430
672B1767l5030p949K8046K490k0104Q727K2264r802k3479n9J5173M078p236J349
$$ y = [14886, 1977, -5371, 3991, 7994, 922, -6694, -7534, 3038, 12004, 4234, -3717, 1356, -1363, -11002, 1784, 17572, 679, -14249, 3774, 14638, -6464, -17546, 1152, 15515, 8029, -6415, -10492, 517, 7087, -4354, -8323, 8274, 10326, -8077, -7241, 5938, -4400, -15474, 5671, 20350, -136, -17101, -6591, 5807, 2062, -5753, -4122, 7935, 10655, -8448, -18754, -1336, 7778, -3045, 1793, 13474, -4305, -24170, -4889, 15755, 1712, -11474, 2209, 13008, -1114, -20200, -15836, 10339, 22184, -726, -17277, -510, 8214, -10887, -11367, 11550, 11081, -6931, -2797, 6151, -7811, -15353, 2755, 16930, 7374, -8671, -9317, 3702, 4663, -11906, -9846, 19337, 21767, -13263, -21212, 6834, 9324, -10780, -2053, 20211, 10409, -13070, -13129, 2044, 6122, -1114, 235]
686B35J3953j02k7759j1691L0476J8046k2349r566K0922j515k6641R09K3062M612
700A2592q633Q02M47j0994r371R380K2570K211k5869q688K7734N013l7208o138
714b6152M5177J6249l7513k1215J9929J3006r684o206Q791J0049m732j3929k728
727h958O366k549K732K2170O54l6094j0921L2619J0768k6217k991K7353M165k6416
741g319j4574J2173J7425J502p224K279J255j8854r721K7575J7972k5575j4149
754a7235K8046Q559l6082j5150L2218K5667j2135k3936n157J1850N822o600N26
767c607J1370l085r666O830J74k1863K047L7702P861l8309j5280K6730J2951j9391
781e536j1487J8954K0460j1067k8980k450K3931N064j3646Q008J3369j9180j8864
$$ y = [235, 14188, 14086, -13673, -25364, 5112, 23158, 809, -8757, 12165, 10650, -15991, -15082, 7980, 12592, 3959, 4761, 5208, -5786, -15157, -5777, 16793, 19004, -6865, -15553, 12181, 17194, -20014, -26152, 19025, 35274, -2239, -23454, -3525, 9481, -203, -6409, 2382, 12431, 7699, -6230, -8958, -2592, -5141, -2409, 19761, 20415, -15679, -26600, 6019, 16787, -9430, -12421, 14932, 19097, -7319, -21893, -9720, 7705, 9207, 1983, 4262, 5517, -13337, -23058, 4517, 22489, -3086, -17235, 10811, 19370, -16712, -31862, 356, 26023, 13888, -10048, -15205, -3355, 2467, -4133, -3607, 7763, 4678, -4988, 1842, 2016, -19847, -17800, 19902, 27763, -10546, -25826, 904, 13855, -5536, -17023, 1931, 22391, 11324, -17656, -20106, 3825, 8889, -4757, 3251, 16620, -2560, -21424]
794b1424J7493J5280j3302l950J7774K209k0875j2541J1341J8515K226j2944j808
807b006R200r211j6185J4641K2627j1518j6781J3990P179k3706q050K6369J6303
820B2852j6242j7985N097J4478k873j7962L914K6672J306k8235m768J9006j809
833C451j2154J2300J2798j3731j1366Q190L360q532N87J3559Q375j2902k0270
846a6335M204K3775r79k1537O683K4367j1353k9425O786K3591n82j0479L627K960
860E303q416o860M667J2001L204j2196l731J2854k607k0781M708K7450j443k2439
874h286J97J2158n306p234Q156O984m223n477Q5L551j651q344L349J9506n37k6016
890a3088k960K3878J179k0475K362J9248j215j4024l731L655M839L072j259M02
$$ y = [-21424, -3931, 11349, -1953, -5903, 11871, 14080, -6795, -19336, -7995, 10520, 12746, -198, -2006, 7194, -2017, -18202, -3561, 19066, 7548, -9233, 4757, 11936, -11770, -19820, 6549, 22852, 6610, -11375, -6278, 8200, 5327, -12635, -8721, 17951, 19257, -8978, -13746, 5260, 3451, -8703, 3597, 16395, 2664, -8702, -512, 2848, -5684, -5097, 8462, 16837, 3935, -16335, -12131, 11644, 10665, -10872, -4189, 20178, 8825, -20600, -13814, 9777, 9195, -1284, 2343, 5303, -3113, -9973, -5306, 6695, 9899, -2297, -6028, 6826, 4219, -16562, -11854, 15596, 14153, -8286, -8089, 4069, -1237, -8471, -315, 6669, 2446, -3031, -2946, 605, -1046, -9390, -6041, 13465, 12928, -13088, -16048, 7830, 9009, -11466, -9104, 10144, 8929, -5095, -8826, -5171, -332, 2740, 1481, 1883]
904A883K14q095m116J2058N294j2906K43J6663n121k0946L864J8579j0r874Q2
919b188L517j427l252j524N686O938o120q146P325N798j2657k816J7418K234j6259
934e473j041J1113j785p105K953M441L44j037m298j37N223k569n226Q087O592
949A0082j1905o206J2078K448j1517K878J0891l245r176P15L756J294P28k464
963C57J02M764l561r006O186J0292p061o878Q366J571j0300J337R356j900m892
978a267J942N72k023J055j078J82N042j235q733L654Q567o279p389Q991L571q378
994b806k62O595l093l807L679M84j300J652j161l465M591P44o943K724Q411n589
1010D54p807O651M078o588L18N696k868l641L248p34j443L850Rm599K627J990
$$ y = [1883, 2097, -5998, -10114, 1944, 7238, -5668, -5425, 11238, 6117, -14829, -10965, 7614, 7604, -2270, -2188, 1329, -98, -3350, -4874, 812, 7750, 1630, -6516, 809, 6607, -6050, -8866, 8552, 10786, -5473, -6514, 4599, 2814, -4291, -1338, 3103, 3447, 2410, -1888, -2025, 3198, 629, -4597, 3490, 10082, -1823, -8029, 4049, 6497, -5020, -2142, 8749, 5504, -3672, -2957, 799, 2093, 2821, 357, 459, 5223, 1662, -7344, -1158, 9134, 2073, -4805, 3561, 5132, -5168, -3831, 5525, 3625, -1267, 675, 1247, -776, 279, -799, -617, 4425, 3190, -5543, -1889, 6678, 399, -6990, 2001, 5572, -2806, -3068, 3527, 434, -3373, 306, 790, -510, 1142, -19, -3484, 1107, 1851, -5092, -2368, 6043, 454, -7353, -702, 3376, -3212, -2894, 2802, -66, -3707, -459, -1193, -2636, 1214, 1223, -3376, -749, 1241]
1026A241n592J094P842l568o668M906L590o362O46N596l069k723L335p16k425
1041b873M104J92m674K193L763n382k63O788k534n971M718L217n624Q14M854l425
1057a03k457L921j32l370M153R07n702J724M659m309j264O154k166n681M077L192
1073C603n165J191M516m189k707N265m29l490L253J996n789J314M575l877j898
1088a831O190j664n735L615L327m565O55M274l737l139N169l4m718L625K111n018
1104a475K22M751l327k026N292j255n738L359L479m180r7M438l328l515N312J40
1120B052m610L557J924n548j31N446k397k482M348j021n553L670M024n154j029
1135b904N447k713l374L962M99l960L270K160o198N46O137k651l565M124j32n029
$$ y = [1241, -4351, -3257, 4585, 1017, -5651, -745, 2845, -3517, -2871, 2725, -344, -3067, 268, -448, -2873, 1231, 1423, -3251, -1058, 2705, -2677, -2940, 3848, 1314, -4657, 61, 3278, -2346, -1532, 3322, -103, -2560, 1361, 1229, -2141, 2012, 2919, -2783, -1059, 3600, -709, -1973, 4181, 2015, -3666, 411, 3603, -1562, -371, 4145, -44, -2751, 2514, 2085, -1405, 1848, 3844, -1945, -631, 3944, 67, -1831, 4359, 2695, -3040, 575, 3902, -663, -8, 4266, 529, -2610, 2559, 2525, -2193, 1432, 3543, -1475, -1253, 3498, 171, -1855, 3437, 2182, -3556, -197, 3282, -898, -995, 3443, 115, -3400, 1912, 2052, -2558, 999, 2923, -2625, -2756, 2690, 293, -2189, 2159, 1138, -4415, -745, 3279, -1875, -2904, 2543, -170, -3544, 418, 917, -3043, 227, 2387, -3811, -3265, 2872, 221, -3344, 780, 648, -4381]
1151d381L087M233n326j103N563k234l752L519J016k841K832Q88n893J451O453
1166C512l231m428M958R44n571K662M507n014j662N552j014m525K407J715k039
1181a227K875O1n974K072P617l938o360N407K428m735J476L998m276j772M939
1196B591q98m150K662K110k269J788o50n466L690P904n055p386N751M191o212
1211a399m42N256j449k609L098j139l747L323J808j738J383l92n722K695P924
1226F850n152p257P637M578q000k501O031l6k440J680m08k271K398K20l098K428
1242F59P94m059K535O638p095q087R108P305r219l949P437J497n621q68J204J655
1258f6L724j916n572K077K703m103K023O488n265o891P400N079j0907k592J1218
$$ y = [-4381, -1294, 2939, -2387, -3490, 2073, -161, -3913, -394, 622, -2219, 613, 1501, -4392, -2941, 3512, 281, -4147, 811, 1755, -3816, -1154, 3353, -1661, -3323, 2229, 1215, -3310, -903, 812, -1227, 1648, 1709, -4265, -2193, 5424, 1486, -4874, 533, 2961, -1774, -298, 3700, -576, -2348, 2591, 1693, -2457, 205, 2315, 46, 1834, 1184, -4282, -592, 7312, 2257, -5129, 622, 4813, -1399, -1841, 3415, 1966, -643, 2455, 1316, -2431, 892, 2700, 962, 2345, 1953, -3769, -1074, 6850, 1698, -5559, 2078, 6656, -1344, -3845, 2186, 2150, -290, 1390, 982, -1289, 1109, 1329, -1769, 659, 1453, -2606, -71, 6567, -528, -8615, 493, 7798, -1421, -5370, 2067, 3564, -2057, -2925, -1721, -66, 3658, 1742, -3830, -1753, 950, -3153, -1130, 5358, 93, -6798, 602, 5681, -5226, -7818, 3400]
1273C400M130q375m761J283M240L798l598m896N147L742p624k188P733k085n239
1288e293P921M598j1845n400J1625M545p753l599M258M693o7p858m906R830P282
1303H031q321m080O868k435p479P307P605q962m918J0523K699j0889n173P711
1317a513R029Q34j1024o396R444O600r491l372J1827Q55j0784J574O351o584l203
1332e853J1433N047j0865p385M083Q396J136q355l619J1862N041j5017p476J4325
1346B753N629r843N41P888o630p648P208N899m871l317M201M231k353r929l198
1361i439J4248Q002j3694p543J2774J995j4123K93J4917M30r437R9K861l431k629
1376d677L550O954J605q921p267Q794O414j1145l043J6152L391j8563m391J3284
$$ y = [3400, 7530, -845, -5606, -4323, -83, 3715, 117, -4779, 368, 4110, -3514, -5702, 2031, -54, -5293, 2628, 7226, -4619, -10019, 1606, 6151, -1602, -5201, -943, 3750, 3683, -4175, -9081, 749, 8031, -290, -4370, 2498, 63, -7416, -109, 7496, -1466, -6384, 4139, 6838, -4051, -9224, -1513, 7516, 8350, -2674, -9070, 374, 6974, -2517, -5889, 5938, 6793, -3991, -2417, 3934, -2650, -5853, 5580, 10627, -238, -7623, -3540, 4856, 5992, -2363, -5982, 5880, 10921, -4096, -11572, 2753, 8382, -1461, -920, 6968, 338, -7310, -102, 5797, 926, -2391, 1810, 6041, 3688, -6241, -9439, 4809, 12811, -883, -8426, 4348, 6343, -7780, -7487, 7430, 7860, -1577, -1478, 1383, -2048, -4677, -1127, 5827, 7432, -1489, -8756, 38, 6452, -4693, -7736, 8416, 11807, -6756, -11147, 2137]
1390B137K319p911J992O403j691o613k445L369M900k360l208P397K187j4844n117
1405a3485J8069O183j6179k771J4746Q81j4786l749J0572O937j547o513k335L634
1419c43j552m702P116P058q513n037R982J61j6155J612K0526K536j6545n957Q443
1434a370M801l789m551M352Q358l275j1610J302R019m392l509J2588K434j7510
1448g152n209J6174M737j1320l048R736M650p412r602J768J2066K338q460J03
1462f31N725p353o868J2200O456j2565k386J4124P7j6805l658J3850R609n585
1476F190j1200j43R687p64j0971L763J4248l680j2841L702O314q639j958J3677
1490G385L402j2567n330O219M733k942m658L777Q625l507j3707J098J3480j711
$$ y = [2137, 4456, -3455, -1463, 4940, 3249, -3364, -5809, -2440, 2460, 100, -3108, 4289, 6476, -8368, -13485, 4584, 10767, -5412, -8183, 6563, 7444, -7342, -11091, -519, 6418, 4871, -1642, -3977, -343, -1895, -6597, 519, 7577, -936, -5973, 4009, 4170, -11985, -10373, 10153, 12689, -3856, -9813, -1370, 3431, -358, -4909, -557, 7801, 4526, -7084, -5782, 3237, -1155, -4664, 7924, 10358, -7152, -12361, 3813, 8550, -2770, -5818, 3918, 8568, 1156, -8446, -6678, 5388, 7726, -734, -631, 5094, -2259, -9127, 3073, 9529, -3036, -5422, 8702, 8779, -8026, -11684, 2166, 11775, 6190, -5010, -5153, 4534, 3770, -7201, -3438, 10810, 7130, -5711, -2009, 4305, -4334, -6292, 7385, 10787, -1780, -7110, -891, 3842, 900, -3758, 19, 8644, 5137, -8570, -7472, 6008, 4297]
1504D297j0000P158Q466j1176q948R695O579o222l636N594L383m554p996J023
1518f337J1107K546j1018j495J0632l138j2688N617J2641m715p547M796K663p433
1532d369j773N894M983j595n706j605N519j05r017L700J4163l217j6319J958J2828
1547E339l459q677N704P254m230n941k05K806K653q62j527L996L59r228l52J1352
1563D982n51j1044M501J0543o449j0068M335P568j487l208J048P25L02l209k479
1578d491N866M198p005k411R264j853j1809L128J3506k865r264J361M958j926
1592F57k379P89K264K794k184n156K032M199m642p14Q652o84j1138J061J0101
1607E652k372p340L963N132k992l794p83K223L811q17m517K493L799m900m710
$$ y = [4297, -5703, 1455, 9921, -1255, -10203, -508, 6071, -151, -3787, 1807, 5190, 636, -7360, -6337, 4770, 7316, -3702, -5197, 5435, 2297, -10391, -4774, 7867, 3152, -4395, 401, 3064, -4369, -6142, -248, 4735, 3140, -2566, -4171, 1348, 1243, -7774, -4074, 10089, 6872, -9447, -7489, 5339, 1880, -6797, -1093, 6161, 1931, -4010, -4215, -1409, 1244, 382, -1145, 2851, 3210, -6018, -6370, 4982, 4431, -6613, -2112, 8431, 1982, -8086, -3751, 3817, 2330, -878, 170, 895, 1197, -2012, -4491, 1375, 5573, -1432, -3843, 5421, 3568, -8241, -5113, 8393, 5528, -3736, -2375, 2583, 657, -1722, -933, 1331, 4125, 1941, -3215, -1183, 3016, -1626, -2340, 6312, 5628, -5510, -4449, 5652, 3280, -4060, -97, 5035, 2043, -1751, -2534, -311, 3500, 2683, -1834, 659, 4458, -442, -5152]
1622e152P708K790q076k4P871k382p289K474M576j146j129K23p28J455r94l665
1638c488K409O071m248n143N695K246p646k17Q633j052n961J075K406j740l18
1653a278J371n11J952m21m969J287N486k447n241N843L101p159j889O401k5m065
1669b564J826J910k482J27J099j398J227J114k968m0N463l047n401N153L916n495
1685a560k070N427l48m102J491J665j680J260J356k870N23K034k735m04N371j748
1701A610n435L338L757m676j611N408j22l626J381O98j904J641J875k929p7K957
1717B285k555j340L938r7m441K557L278m628q14M642r01l083J778Q70k589J875
1733G75J774l078l13L183j880j881M025l79m804K393L516l669j291M392q94l668
$$ y = [-5152, 2556, 5346, -2730, -2754, 5117, 2735, -4554, -2080, 2496, 1350, 221, 444, -284, 1171, 177, -3488, -1079, 4992, 744, -4399, 1296, 3542, -4104, -4321, 4312, 3260, -2701, -1626, 780, -960, -1278, 93, -418, 1534, 1113, -3856, -2569, 2917, 470, -4771, 1072, 4173, -2986, -4875, 1526, 1501, -2564, -738, 1172, -1310, -1183, -84, -1482, -255, 859, -2109, -2149, 3314, 267, -5134, 19, 3935, -1560, -3630, 1797, 1449, -2653, -1162, 503, -1177, 83, 1439, -1431, -908, 1126, -1609, -2013, 3358, 1610, -3825, -487, 3270, -1406, -3017, 2391, 2269, -1357, 24, 722, -1182, 459, 2334, -595, -672, 2285, -270, -1610, 2328, 2231, -2210, 347, 3625, -1003, -1817, 2825, 1924, -1159, 619, 1489, -1100, 775, 2549, -529, -842, 2341, 461, -1420, 2605, 2226, -2578, -185, 3331, -338, -1629, 2763, 1869, -1799]
1749a799K171J307k936J857K016l571n11L462j307k502L424M21l908Q67L339k874
1765e44j369L853j159k720J864J546k899J305K132l292q64L677q59k664K277J262
1781A546l959J104L147k965r28L856j035l583K271J531k633R37K217l036r88L615
1797A097n92k937K466J149l367Q61K869k415j269L069n92l105K247J956k767N68
1813g62K327k958o77L392l27l525K485J791l706O45K684j635j361L223r06l509
1829b819K712K473l339K43K305k274r17L561n98l461K574K063l745k80L522j585
1845D35j317K818r56l241K219K626k611l23J686j662o02L206j390k935K725K484
1861C162m112q17M210r88j989J964k87k685J927K065k363q70K491j655n21K473
$$ y = [-1799, 372, 1679, -1257, 600, 2616, -955, -1466, 1996, 689, -1813, 1611, 2032, -1876, -1009, 2330, -544, -1913, 1940, 781, -1939, -75, 1471, -1428, -123, 2009, -1283, -2147, 1530, 671, -1993, 284, 1546, -2413, -1309, 1838, -1127, -2055, 1801, 766, -2817, -546, 985, -1648, -711, 1506, -1530, -2518, 1097, 505, -2432, 34, 1183, -2184, -1323, 1546, -869, -2138, 931, 339, -2766, -519, 1437, -1330, -762, 1565, -1393, -2070, 1322, 995, -2530, -45, 1746, -1960, -1315, 1369, -266, -1627, 1596, 690, -2819, -107, 2366, -973, -730, 1575, -699, -1616, 1945, 1347, -2114, 460, 2523, -1222, -1502, 2020, 435, -882, 1936, 980, -2261, -42, 2584, -27, -350, 1336, -326, -928, 2278, 888, -2047, 678, 3162, -950, -1767, 2443, 1455, -534, 1430, 1143, -1542, 385, 2450, 87, -783, 1708, 53, -468, 2005]
1877B005o96l596K810K444l854j102L894k29k723J830j19k774K172K771l165p93
1893a125J936j262n61K820j468l101L335K433m661j746M943K74l038M66N29j860
1909b086K221J240k885j54K707j184j643K473p76k636L254K139n198j161N520
1924A831j02m491J258K033m30k16O10k077J90K443j978j156L340n13l625K056
1940h27K827l934j399N713j6n278O4L489k06l43L5j415J263J726k972j784M563
1957A506Q11m188J324K810m124j577O494N28o001J41M132J34k368j254K68L361
1973A997J660n134j988N497J191n036J009L861k767k404M484l34n026J451M691
1988C152n4k993k026N38L489J296m774j735O833K68o918L5N764r96k869L715l1
$$ y = [2005, 1309, -2287, 523, 2967, -887, -1989, 1905, 1676, -1047, 783, 664, -2110, 62, 2833, -332, -1125, 811, -451, -1012, 1808, 340, -2761, 574, 3007, -1654, -3400, 1543, 1817, -1221, -755, -226, -2086, 135, 1375, -1510, -1664, 1043, -141, -1784, 689, -87, -2723, 531, 2670, -2528, -3689, 1831, 1729, -2762, -1504, 529, 99, -117, 493, -1584, -1394, 1049, -929, -2085, 1255, 742, -2883, -827, 2000, -1934, -3333, 2380, 2364, -2914, -2850, 639, 433, 90, 125, -1290, -27, 1699, -1273, -3057, 1506, 2317, -1871, -547, 2263, -1861, -3438, 3056, 3584, -2417, -2276, 1856, 1990, -378, -1632, -1364, 1997, 3657, -1477, -3465, 2032, 3223, -1813, -804, 3057, 290, -2114, 2370, 2036, -2990, -1539, 3152, 3098, 105, -1921, -1383, 2106, 3402, -1372, -3107, 3726, 3994, -2924, -2889, 2875, 1879, -990, 2725, 2694]
2005B694n205j57M454R73k095j659J58L049O66n860j304P667K181p455j344N331
2021B094j422l481L523K091l775p05L028l75k345j151J556M289K82o559k271P448
2037B227J786q010M63P387j247n749J630K011j594l06K976J26k086j747r37L206
2053A36K245m152j445O347Q6q324l46Q433K63n965J701K932k631k896K207K370
2069I61N54j365k164J679J596l726j478P216J435p643j159O853j149n869K289
2084a970N837j659m030k45J920J030j043j449K727K868m234l972N067K118n699
2099b734L59P784j276q958J318O338l27l707O39K376J340l420l979K668N869j929
2115B361m018K888J599o514r9Q116K80p318J305N485k339n419N55N277L138l070
$$ y = [2694, -2511, -2668, 1786, 2759, 664, -995, -837, 2212, 2878, -2982, -4286, 3381, 5562, -1893, -3237, 2094, 672, -2809, 714, 2805, -970, -1675, 1353, 978, -1367, -2518, -962, 3327, 3609, -2950, -5221, 2227, 4013, -3997, -3534, 3853, 2606, -3143, -1513, 498, -1096, -1402, 1574, 1700, -386, -2133, -3070, 136, 2381, -1771, -3216, 3131, 3217, -5107, -5453, 2980, 3243, -2722, -1021, 1911, -720, -3616, -1409, 961, 1515, 150, -2014, -335, 1261, -2465, -3943, 3273, 4708, -2935, -4094, 2759, 1610, -4259, -1970, 3867, 2208, -1822, -2067, -147, 883, -160, -1609, 1118, 3986, -248, -4220, 847, 2965, -2734, -2375, 5409, 4133, -4825, -3507, 2831, 2504, -1203, -564, 1812, 3152, -268, -4247, -1579, 4290, 2361, -1657, 1231, 2830, -3684, -3783, 4333, 4613, -2705, -1400, 4085, 1746, -3673, -3118, 2159, 5297, 2227]
2131B227n730J578N607k790m541M423M557n423l511N770j38n506J685O436q39
2146C805n583j376K840K683j460l918K454N989l706p308L214N785l823k068N782
2161C310J90p422m86N859J109l390p89K532J887l023n432K647P738j079p463J625
2177b187M616l889l238N925K665n203r92L187o72k684K1L217K196k052m586Q74
2193b802N410k193n110L784O203m599o136M530L374l714j654M165J486l141j890
2208b287j3K686J123k552M7M351k041o397K804O173l215l676M457K696o093k361
2224d298M024K687j041j021o98R76pl083N58N710m49o161J427N169l737m782M809
2241H3N152l687l909J292K275j40j055o57J995J576l231j839L352L11l798K450
$$ y = [2227, -3503, -1925, 3682, 892, -3649, 774, 5331, -92, -3603, 2167, 2029, -3477, -1792, 4644, 3805, -1778, -3154, -314, 2369, 909, -3009, -555, 5434, 1728, -5580, -2366, 3419, -404, -2472, 3310, 3500, -3922, -4408, 1451, 2560, -830, -1619, 913, 2800, -223, -5655, -3008, 4730, 3651, -3812, -2187, 2429, -1460, -4698, 1227, 3892, -1311, -2303, 884, 212, -2472, -2451, 766, 2962, 910, -3676, -2802, 2608, 415, -4695, -911, 5292, 693, -5443, -913, 2461, -1253, -2907, 1258, 2744, -397, -2287, -2300, 386, 1509, -1043, -996, 3355, 1314, -5083, -2279, 3894, 679, -2997, 1460, 4156, -1937, -4298, -274, 2413, 1372, 351, -347, 629, 622, -2461, -1903, 3807, 3358, -2803, -1376, 3793, 56, -4726, 83, 5235, 1548, -2361, -1069, 1206, 1066, 11, -646, 1349, 2925, -306, -2145, 1207, 1518, -2280, 170]
2257A70M941m341m916M055L856l736k823L699K016j124l004j430K623L152k597
2272E41k097L363K74n497P81O015j580m206K609K888l734k441K404K801n62j001
2288E58k060K53K421j771j591L481J504m661l18M158j597l983L449L584l516k846
2304b935K054J280j97p33j709J935K656k495l209K512K975l566p56L614k95l808
2320b677J368K467j985q08K213o7o52m44j262J074K499j242k437K000K367m616
2336b202j107N333P0m059J378K259k132j215J760N13l38K29j180l85K232o85k417
2353a946K678K122l195k174M087J86l255J194J902j637n76J247k11o19R70l36
2369D37p48J530p6k771J931K000k611j408L639M13l519M90J788m09n70J285j201
$$ y = [170, 5111, 770, -4146, -91, 3765, 29, -2794, 905, 2921, 1797, -1207, -2637, -14, 3138, 541, -1556, 1807, 2081, -3416, -2635, 3380, 1800, -2406, 203, 3091, -643, -3084, -680, 2121, 1559, 558, -1502, -1249, 1172, -599, -2190, 1291, 2795, -1866, -2184, 1974, 377, -3606, -157, 3427, -89, -2935, -881, 399, 202, -531, -2240, -305, 2351, -144, -3353, -841, 2134, -1432, -2188, 1426, 1131, -2677, -1309, 1158, -827, -1635, 578, 511, -141, -585, -1847, -773, 1726, 484, -1953, 47, 2414, -2202, -3309, 2024, 2094, -1965, -587, 1672, -460, -1675, 85, 598, 260, 489, -691, -1076, 1156, 471, -1946, 732, 2854, -341, -2515, 1572, 1758, -1497, -303, 1599, -38, -614, 633, 422, -197, 773, 437, -311, 1219, 1143, -1628, 303, 2303, -308, -1716, 1923, 2336, -1183, -693, 1095, 686, 116, 1401, 200]
2386B00p80J640m34j492J858N50k188N94K140k841q91L157M05l102K31J951j110
2403a12k49J283q53o35J390o01j183J312R05k251N80K130k485j069K993J11k805
2420a539M62K110j154m19J313r26j288K006m08j878J742J164k269r2K133j787
2436h30p59K539j90k738N79J757j007k72J483q90j275J925l89j670J724J095j982
2453i00n61K122j006j214K322J73k569O63K018j515m17J680q20j368J576N16k058
2470a358J306J259k037n77K451r73j271J913K92k308O51K117j607o46K022q28
2486D06j585J779K37j667J418J237k072r81K277j46j509J747m0j908J113J258
2502A564j408q21K013l95j893J529O18j995J231J275k047q46K385m7j673J250
$$ y = [200, -580, 1060, 626, -866, 992, 1542, -646, -52, 2088, -753, -1644, 1513, 1918, -1184, -953, 998, -112, -361, 922, 69, -566, 824, 223, -960, 352, 1257, -994, -414, 1716, -769, -1838, 1155, 1266, -1539, -1077, 1033, -121, -540, 773, -153, -1441, 565, 157, -1721, 21, 1185, -1084, -1176, 957, -830, -1589, 950, 760, -1978, -1399, 358, -649, -921, 562, -328, -1603, 322, -67, -1737, -13, 1082, -900, -1461, 661, -345, -1559, 763, 936, -1633, -970, 1048, -467, -884, 796, -24, -1392, 184, 700, -1358, -52, 1207, -830, -1407, 1044, 71, -1200, 713, 1005, -1303, -652, 1465, -142, -788, 1234, 406, -1179, 600, 837, -830, 588, 1825, -247, -1228, 1049, 903, -606, 1141, 1101, -807, 306, 1564, 156, -665, 1348, 953, -940, 589, 1207, -788, 443, 1718, -329, -1175, 1210, 1163, -510, 740]
2518G40N62k332J154J228j519o29K457j136j557J246O74j441R98R99k175k23K067
2535A113j69k112J546N11j728L21J908j744r09K234o14j341J257K11j149N04J249
2552A088j936j213L050q4k235Q87J202j763L21J436j370n49K049p78j839J356
2568c78J022j583M14J570k302o87L138l06k579R05J404j248m80J759r14r58J685
2585D62m89j748J698Q93j769M70J751j996j335L120M11l131Q85J804j764l14J484
2602D32m12p96J578n22j274J259P81j803M18J838k027p73K834p4l040R02K183
2619A504j239j180J516r2k29N18r27j060K350Q93l073j42K995j737j001J929P74
2636A799k766K80J944j506n35J495P9r35M63m20q07K137N74k509J41K516j858
$$ y = [740, 1302, -1030, 124, 1352, -167, -796, 1661, 525, -1032, 214, 888, -553, 445, 1444, -731, -954, 1113, 944, -1168, 378, 889, -839, -518, 1390, -354, -1263, 971, 357, -984, 273, 484, -665, -161, 1088, -848, -2061, 989, 905, -1330, -443, 759, -1004, -683, 753, -617, -1166, 883, 105, -1734, -378, 644, -939, -525, 1045, -1257, -1944, 1194, 888, -1691, -786, 618, -630, -1110, 649, -265, -1223, 462, -27, -1775, -77, 816, -953, -483, 1268, -728, -2063, 1057, 1468, -1663, -778, 1026, -738, -1052, 432, 20, -776, 802, 280, -994, 265, 1046, -757, -339, 1499, -528, -1301, 1533, 1459, -1581, -679, 1504, 265, -915, 601, 509, 280, 798, -129, -1189, 1161, 2054, -1019, -1161, 1834, 97, -904, 1025, 1799, -967, -687, 1257, -249, -784, 711, 790, -145, 318, -102, -909, 1228, 1802, -707, -566, 1950, 92]
2653I2j861K646J079k868L61K376j558j684J675L36j53K52j096p53K389J93k927
2670a501J01L147p50k579J865P94k761P65K374j020j956J420P50j243l27j26M19
2687f28K679m12m521L33M099j082k587K219J684k736q04J958n3j342J540P89j308
2704a72k64j141p2K553R15l496j3L208j427k864K173K468k532l29K504j421k162
2721b072J076J702j35k14j177m61K749m23l814O95M983q64l888N28K709k242o04
2738a452K430P14j825l5J64p38O51l8L00K130j27m255n65M668m11l339K589K156
2756C017k921k701K496J344q26q4M28J3lj860p89K944K263l642j255L666q03l718
2774b431J458L637j716j890J870N53k374j98R31J364R74j695k076J811J220l079
$$ y = [92, -1769, 877, 1956, -912, -551, 1825, 267, -1417, 258, 594, 441, 693, -403, -1156, 1233, 1426, -1501, -1400, 1747, 997, -1582, 283, 1077, -1684, -919, 1455, 435, -1521, -101, 649, -594, -921, -1047, -628, 2051, 1639, -2882, -2549, 1550, 468, -2119, 100, 1784, -952, -1756, 202, 149, -1193, 347, 1136, -172, -436, -1577, -1649, 904, 1819, -1677, -1690, 1518, 91, -2773, -600, 1868, -664, -993, 1511, 90, -2072, -996, 706, 571, 357, -820, -1281, 1468, 1045, -2769, -2074, 2909, 2045, -1843, -1315, 1394, -848, -1452, 978, 1692, -133, -168, -4, -742, -91, -129, 171, 2301, 2174, -2081, -2646, 2022, 1611, -1728, 861, 3017, 96, -2605, -109, 1235, 409, 325, 753, 766, 763, -1097, -1886, 1058, 3321, -321, -1576, 2090, 1287, -2431, -973, 2664, 948, -942, 928, 1481, -893, -1091, -160, 1204, 2178, 483, -1593, 218, 1438, -1641]
2790a641j23M526n3m598P69K383j981j788L361K058j865k165m21N62J935o07j513
2807a161K733R19m104j962M037J440l036J036K486k776k838K602J943j106o63
2822d50J1M43K19j557j876L057L483l050k790L254M06l837O93L944o23k712J550
2839A65L51j773k88N59J476J877j794l212J303K485k240j399M409J011m393n04
2855a967K474r59j156K527J285j477j986m89Q17K184k64k009J709J929m070k346
2871c798M425J967l060j54K715j288l306J072K535K77m26m98o06P06o64j725J468
2888c60L983k351l003K707J021m480J40M630L15k495l53N01m34k6R8O55J610l34
2906A824l670N15K665j369j400L485J892n123j649L318O01j580K99J644m96r60
$$ y = [-1641, -1764, 2762, 2709, -1889, -1120, 1263, -718, -2506, 855, 2913, 1048, -1117, -1538, -976, 959, 352, -1161, 1572, 2491, -1613, -3575, 462, 1902, -1134, -98, 2388, -388, -3226, -624, 1319, 213, -450, -439, 4, 223, -1334, -3210, -153, 3330, 280, -2510, 744, 1150, -2687, -1994, 1950, 1327, -1385, 165, 516, -1257, -1545, -986, 490, 2367, 573, -2639, -1336, 1149, -1091, -2490, 1919, 2930, -1463, -1967, 507, -452, -1608, 919, 2204, 727, -1259, -1748, -931, 1253, 989, -1020, 689, 2618, -1452, -3798, 627, 2594, -466, -620, 2095, 807, -2499, -1427, 1108, 1385, 959, 461, -145, 561, -103, -1828, -360, 3623, 1272, -1731, 976, 1997, -2483, -2343, 2287, 2602, 107, -246, 255, -179, -205, -107, 548, 2158, 1824, -1846, -1331, 1334, -35, -1435, 2050, 3942, -1181, -2830, 488, 1089, -491, -192, 1452, 956, -4]
2922dj685o2K599J261k652J81J887j882k442L243K121l080o76K706j094k301K75
2939a605J884O49r6j095j420J861N39k512P09K886r12k815J722J576l284q01M056
2956A342O26k269p66L10K61L73n40m65K355P83l429r63K548M50k033J964J536
2973B083l260j111K440O61j708Q87R89r57l99q37p03K496J411k582o29K040m07
2990D14k740K052K473k282q61J896j19k038N69R21J55M06n67j941J637J407k268
3007h86o45L112K21k651M00J497j676m62K290M55j909N1N26o05Q07J61q24J046
3025I08P90k353j455L266Q10k753O84J871j637j508J415Q37o30O43k87r20J60
3042a59N55j141O03J455j752p60K268n1k733Q78K426j208j389J324R4r63L70N36
$$ y = [-4, -1689, -1751, 848, 2109, -543, -362, 1525, -357, -2799, 444, 2565, -515, -1191, 1515, 421, -1880, -1605, 279, 928, 832, -263, -1683, 178, 717, -1795, -1086, 1800, 888, -1927, -205, 1371, -1913, -2714, 1342, 1968, -301, -1067, -757, -496, -123, -663, -1128, 1227, 2010, -1419, -2382, 166, 616, -1417, 547, 2083, -1177, -2288, 152, 813, -895, -8, 981, 24, -375, -1212, -1915, 581, 1992, -590, -1219, 821, 414, -2326, -274, 2199, -83, -944, 952, 833, -1205, -636, 285, 440, 846, 279, -1662, -25, 1382, -886, -1531, 1581, 1802, -849, -449, 1048, -628, -1090, 1200, 1655, -254, -203, 323, -282, 525, 686, -138, 908, 1698, -655, -2110, 1156, 1966, -787, -103, 1768, 131, -1377, 38, 875, 245, 888, 601, -319, -159, 396, -745, -142, 1313, -439, -1199, 1069, 1018, -1715, -837, 1589, 381, -1008, 316, 410, -553, -183, 353]
3060C53q27Q17M40j518J40J233j066j407K901Q15l375M09K076j127q22J423j34
3077C31q21M19O4j406J137J547j664k36J214o55j693K197M09k166N92J545j182
3094c68j095J302L16q29M83J64p74N83J227j785l48J607m91j237J378O55j743
3111i55L33J812j218j277J994j72j467J111K21q69L11J607j675n91J516n31j144
3128i94J421O20j652j9J496r88r30J916P9j521P07K69p88P43J130j580q65J678
3146G22j61j441J158R87j577m0J507q67r39J564k68j014N34O66j351J54J784j346
3164G2q55J517R6j917J502R29j527j20J226n82j042J399k2j627J031R23j425j74
3182e96J655j162r43J741k00j402Q09J193j498l80J112k70j017J493j86j443M69
$$ y = [353, -474, 343, 783, -735, -595, 638, -428, -1835, 1066, 1881, -1494, -1085, 991, -136, -958, 465, 331, -490, -71, -7, -1413, -276, 1271, -393, -629, 585, -70, -1763, 434, 843, -1323, -731, 814, -368, -1463, -161, 155, -674, -191, -27, -801, -218, 1009, -776, -1124, 483, -8, -1245, 133, 788, -955, -622, 1190, -28, -1305, 689, 517, -950, 161, 382, -487, -176, 1431, -244, -835, 681, 150, -994, 427, 1047, -605, -624, 872, -116, -1046, 870, 949, -572, 135, 404, -384, 359, 1489, -91, -956, 722, 561, -880, 278, 1265, -312, -352, 1155, 288, -651, 913, 645, -369, 165, 831, -520, -366, 1418, 72, -783, 734, 830, -1087, 415, 1344, -183, -303, 923, 341, -701, 698, 676, -951, 80, 1003, -422, -596, 1059, -103, -1046, 695, 495, -907, -98, 1095, -403, -783, 329, 59, -958, 535, 349, -1094, -625]
3199f25J093r30k72J513j070q82R99Q12j902J027J242j685n27J660n62q88Q21
3216a76N67j638P30J397j133o15J199l66j082J313J52j269R14R13j436q10J840
3233E00k80j243J283J75j260L98J193j239j22J257p38j208J636J78j296P08J183
3250A125j162q72J634j69j160P60L44j403O04J239q89m28J212n88j231J579M79
3267A074j779P00J081j335n18J389J34r63P65J73j423N88J025r97l42J554q13
3284C13j238J461P63j471M0J499j284p82J545J8j321N21P98r53J04R93o80j086
3302g60J454o78q64J286Q00j910mJ679o39j249J322N18j624K93P37j243P57J198
3320A073j176n74J096j52j731J376J164j499l78J691j378o72J743K23j472K25
$$ y = [-625, 468, -462, -734, 779, -291, -1173, -174, 638, -1264, -237, 1005, -680, -1207, 453, -109, -997, -176, 391, -1247, -517, 880, -253, -868, 331, -35, -1117, 196, 348, -921, -7, 906, -530, -1340, 500, 220, -1023, 260, 435, -825, -427, 766, -473, -595, 662, -76, -1284, 352, 530, -766, -58, 1125, -37, -909, 725, 556, -604, 156, 500, -903, -299, 940, 51, -377, 835, 247, -984, 595, 1074, -705, -5, 1076, -259, -777, 612, 746, -217, 548, 721, -702, -114, 911, -86, -428, 1126, 313, -925, 536, 1299, -172, -132, 1367, 83, -699, 846, 864, -457, 64, 862, -91, 13, 1006, 326, -760, 694, 16, -848, 438, 1238, -672, -676, 1003, 364, -885, 437, 955, -669, -376, 361, -882, -125, 1073, -103, -677, 419, 267, -1464, -88, 1076, -423, -801, 890, -488, -1160, 583, 806, -666, -441]
3336d41P66p13p3P26p16q5J465j070j430J754Q70j531o21J965m57j671Q06R36
3354D80j513M99J038l71l81L70r09n0J661q27j213J810N11k136m80J716N3j549
3372a291J912P31j650o22N56J34M35N85j208k77J477q97j468J755J611j607j370
3389a194J609k13j341J186J286j309k95O55q18M06J69p66O36J782j223k159J376
3406b13J956k013q06K400k0k199L35J260q15l6O88l0J26L7j533k32K213J46j841
3425e77Q90J623k562j198K276P26j318P00N63j137o95J01Q30P06J72j403m28J462
3443G31q41j696J636K583j924j989J524M90j577O52J655l02j240M7q82J101L81
3460C49j007K08K056q40k707P16J990j109r70K410j42k014p9J100k82R0J81L42
$$ y = [-441, 325, -388, -461, 265, -451, -536, 929, -141, -1571, 183, 1053, -478, -1099, 866, 409, -1262, -456, 480, -1033, -534, 504, 133, -248, 122, -787, -837, 824, -3, -1216, 594, 1105, -1031, -1511, 205, 258, -1291, 621, 1352, -298, -920, -364, -230, 205, 790, -418, -695, 782, -115, -1583, 172, 1783, 176, -1194, 415, 202, -1139, 47, 1333, 24, -271, 384, -434, -28, 141, -625, 11, 1793, 570, -1589, -213, 1743, -270, -1076, 1324, 1304, -895, -560, 700, -115, -151, 537, 507, 633, 670, -863, -1095, 1118, 1264, -577, 313, 1936, -626, -1824, 452, 1178, -140, 560, 1123, -14, -709, -608, 222, 928, 1100, -303, -731, 731, -110, -1806, -170, 2413, 489, -1500, 24, 514, -1063, -411, 1244, 942, -298, -251, -1133, -32, 349, -658, -450, 1606, 766, -1941, -1225, 765, -344, -1314, 1096, 954, -1060, -1139, -39, -321, -231, -50, 292]
3478B92l6k00j894%K828P5j830K24J783j715k158K453J482j356l60J063q83j105
3496a337K80P51J205O57j844r16J763k16j675Q58K818j360k806J471M39j157J04
3513i65K044K68q96j350j96J263O93j026n91K580l60l305J57K674o66j123J928
3530A129J068k432j109Q75Q77K22J56j08J31j34k225l97L254Q32k513j32J708
3547A202j291k137J932K503q62j481N10k43m55m49L33J378R21j618k144K223Q02
3564A124k629P35K882o42l232J007J481j087m33J391M79l91j096j080M36J775
3580G20p59o48J712O93l131r33L400j54j773J148J361j435k060O98P10J449l36
3597F62j043j6P08j215j340K313J738k219q76J902q27j850J073K657q19j336m1
$$ y = [292, 256, 56, -1838, -1838, 990, 1065, -765, -541, 1242, -473, -2631, -178, 1304, -52, -412, 651, -232, -1337, -1057, -306, 899, 1556, -288, -1204, 559, 343, -1332, -474, 2344, 984, -1822, -351, 88, -1069, -965, 1079, 1347, 451, -899, -1095, 168, 861, -165, -756, 1824, 1464, -1841, -1684, 990, 324, -799, 1129, 2197, -235, -1344, -469, 408, 630, 786, 678, 809, 675, -1550, -1947, 1307, 2139, -374, -506, 1202, -89, -2226, -294, 2209, 1347, -134, 376, 133, -322, -771, -438, 940, 1861, 243, -1901, 322, 1124, -1505, -770, 2112, 1470, -1762, -755, 726, -361, -794, 597, 1076, 685, -411, -1491, -1055, 720, -39, -687, 1025, 1718, -1413, -2346, 1054, 900, -873, 275, 1636, 201, -1859, -1161, -451, 998, 662, -381, -397, 311, -904, -2244, 69, 1807, -412, -1288, 614, -213, -2063, -990, 1667, 848, -488, -529]
3614e29j81L07K71l45R19J199j642j750J236J257j655l30K706k47k848N61J184
3631A13l58l21N34O43p7n90j428M84J861J47j882J581N84k418o24K072J077k030
3649f32J026J121j419j425O51R50N69N5j174l47J319o79j357J589J969j799j523
3666a106J561L43j752N89J783o38j249K57J07K61L67n66J88J229n74j980Q02J741
3684A363j318j064K383J67k562K80J366o31o6O48k17J90l35r63k3J552K20j667
3702f77Q27J181j667j364J773J383j738O3Q07o68p79N60L40LO88r07p68J199N9
3721C15j462P43J816q98j771Q67J075j528J62R67j74k53K1m00M2N84J2r43J226
3740D01O24k057J82J661p88j049J362M98j625k38J357n14j72N02k11m44R93r42
$$ y = [-529, -710, -403, -132, -477, 442, 1641, -1, -1751, -515, 742, -913, -1243, 1463, 1216, -1632, -1071, 113, -245, -566, -32, 611, 534, -56, -1484, -1000, 861, 1008, -874, 707, 1291, -1127, -1751, 321, 1398, -632, 394, 1515, 96, -1329, -678, 272, 841, 896, -278, -625, 694, 15, -1342, 247, 2216, 417, -1106, 455, 798, -954, -365, 1418, 780, -469, -212, -105, 156, 523, -43, 145, 1374, 800, -1180, -378, 1363, 45, -1019, 1364, 1531, -1031, -751, 615, -16, -82, 566, 349, 539, 204, -759, -782, 770, 990, -677, 150, 1331, -336, -1700, 73, 1456, -282, -219, 588, -80, -859, -299, 41, 44, 732, -175, -943, 256, 315, -1147, -404, 1412, 514, -1257, -390, 685, -843, -681, 286, 112, -141, -120, -520, -478, 106, 118, -825, 401, 1025, -1032, -850, 811, 23, -1026, 336, 834, -791, -1029, 328, -186, -358, 144, -67, -511, 482, -460]
3758d60o11J042R92j574K39J468j013j555J385J492j753J67R53n44o89J019m58
3775A00l87R72l87j139Q04R36j244NJ225k47j362J009P14j102M7Q29o05k71P85
3794F82o71m16J064m11q86O91R71r32o64J022j39q28R11N98j156R2K57J20l93
3813h8J046p29p11R06m04l17L71R88j181l86J359m19j128R35N11j089J90N96p47
3832b97q4N76K1r69J085J72j137O28Q25r11n86R61j66j018Q65N41r36m5Q14p43
3852d04K83J75J41q80P03K98j188N73Q69p99p47J094q8p24O68K41q48R7R66j129
3872f99K48O66j93p15M59L91o91L54P71n52o75R01O9j166R23L76j080K70P97m88
3892c4n40J068K24j413N64P18r30K3J219q25j030J335m9m78J66N56q80J66M16
$$ y = [-460, -1071, -29, 963, -611, -372, 1096, 83, -1472, -87, 1405, -348, -181, 772, 228, -461, 558, 100, -287, 685, 298, -841, -37, 899, -345, -340, 885, 638, -724, 285, 999, -103, -56, 773, 168, -103, 682, 11, -405, 659, 248, -638, 53, 1024, 92, -572, 450, 311, -517, 394, 992, -164, -72, 185, 305, -88, 958, 229, -482, 424, 20, -297, 74, 1062, -119, -505, 854, 435, -693, 242, 753, -336, -146, 450, -297, -381, 195, 216, -753, 332, 504, -633, -5, 820, -91, -677, 284, 118, -900, -35, 506, -430, -475, 339, -404, -121, 54, 195, -685, 18, 316, -872, -299, 570, -229, -976, 118, 30, -694, -26, 215, -633, -536, 430, -699, -451, 215, 22, -693, -234, 157, -534, -180, 591, 39, -636, 265, 334, -832, 91, 467, -613, -343, 454, -34, -574, 494, 718, -695, -131, 587, -343, -320, 899, 74, -956, 379, 330, -148, 18, 574, -306, -140, 276]
3911B76n87k46J157j52q66M55M92r45J58Q87o27n47P19L84p55L90O83p50j41P41
3931G26q69m16J220O2j336P92N78o92k9N07n45p12J335R7j399P23O41o53j22P31
3951F39n38k50O05K55r84L80M70j194J76J388r49r27J026L66r72K92R00q27m91
3970f35J417q51m66Q53j95q41M49O75q77O7R90q33m98R76K09j099J18R58n53m11
3990e47M30K89p20O07j68n02O00M57j090j88J342l74p50N05O27q89q3R46r02k03
4010f13O86M32o78L09k83p26Q69P05r93l92J416n67j028Q31P20o66n02R92l23
4029A89m70K82J54l30P00l93p40N00J006j689J85J748n50j343O95J100j184k03
4047c43J153n03n86L93K45q99N54L73j177J499P57j620n12J408k86j247O76J511
$$ y = [276, -311, -557, 600, 448, -418, 37, 529, -416, -258, 629, 2, -545, 174, 558, -197, 193, 876, 126, -15, 726, -143, -559, 661, 723, -613, 179, 757, 65, 36, 543, -2, -714, 621, 718, -681, 42, 683, 30, -92, 639, 101, -149, 456, 711, -273, 107, 577, -617, -441, 947, -2, -929, 97, 463, -509, -217, 683, -144, -635, 782, -69, -535, 318, 123, -718, -269, 406, -471, -404, 586, -247, -745, 231, 440, -659, -541, 417, -136, -547, -117, 172, -548, 59, -109, -611, -11, 446, -644, -832, 510, 136, -614, -109, 518, -371, -454, 492, -410, -613, 73, 505, -173, 136, -147, -873, -4, 701, -292, -684, 732, 165, -863, -32, 688, 22, -480, 512, 189, -281, 1, 155, -175, 525, 132, -608, -108, 898, -791, -606, 1142, 592, -751, -56, 1044, -140, -343, 810, 307, -279, 114, 359, -540, 14, 387, -790, 709, 1466, -154, -666, 742, 456, -791, -115, 1396]
4065A396j230n77O55n4l87P51P7n97M44m01r13J048P93j185m87J637l92j655N83
4084d94J461p47n00O82P8n49j23j37L42O74k49j285R79P77j619m78J867K38j341
4103d24J67J080j021j032J121N99n97q8l0k64M58j3r38J176J316j715j074J815
4121E36o6j803O27J757p08j300O66N9K8J23J41j9O77j022j188J249J515j220j092
4140a040J507L12k056J46J913l41r00Q16r6m32n18j79M79J222k22j272Q05J257
4158A401j844j247K528P11j737k22O83n03p41O46J276k48m85m50p7Q82l81j254
4176a062J107J889j639j984J857R17j269n4J328l38j652K26Q69J91J50o30K91
4193A97Q57r24j634O84K670j496j374J645P25k156n99J728P25j112K53M30o25
$$ y = [1396, 166, -411, 244, 190, -197, 554, 631, 34, 478, 77, -836, 212, 1005, -180, -667, 970, 578, -1077, -494, 967, 220, -280, 402, 480, -69, -192, -329, 13, 687, 438, -847, 132, 909, -710, -1188, 679, 917, -424, -257, 823, -198, -1230, -109, 490, -107, -195, -225, -489, -31, -44, -982, 194, 1510, -205, -1279, 536, 470, -1333, -706, 1051, 343, -957, -291, -232, -204, -81, 60, 41, 718, -304, -1492, -243, 1272, 52, -1040, 467, 779, -1277, -1131, 782, 441, -459, 357, 261, -171, -689, -868, -389, 833, 611, -661, 144, 1401, -443, -1690, 838, 1549, -188, -410, 273, -230, -971, -325, 951, 703, 218, -232, -309, 573, 192, -1062, 45, 1934, 295, -1689, 168, 1085, -184, -238, 1090, 752, -900, -674, 195, 386, 536, -94, 197, 1054, 130, -1504, -820, 1850, 354, -1020, 625, 1350, -806, -1405, 323, 1048, -64, 189, 619, -6]
4210fJ50j122O61J411K71k066N4J745j333j222J726K040k412q05J132K69j410
4227i17M79J175J19m71j076m9R98n4j078J035J566j377k127J303J350j131o14
4244h69J697P5j063p61K63Q64N27p92m00J003j36k091K78K622k63k193J070J441
4262A272j761j249J720O98l73p63M42l7j91n91k67K275P60k559o09J702n31j689
4280a751J742J873j616j168M23M52k27q5P25M9K24j295o83J483R07j325j73J762
4298A317o14k166P36J968j078o52R38N71j370l64P00M83J86m50p24P24P62j826
4316h59l98K310N99k420N29J199j124p46Q18J117n19n18j49J84K67l26o50J265
4334E79J139j966j042J759J35j841J033J672q65j694R24L71k31J60m42O31N09
$$ y = [-6, 144, -978, -317, 1094, 1365, -701, -647, 1098, -235, -1457, 269, 2309, -103, -908, 224, 493, -917, -438, 737, 856, 385, -691, -740, 258, 204, -874, 161, 1727, 350, -1777, -474, 876, -255, -869, 828, 903, -160, -921, -658, 206, 733, -59, -459, 544, 408, -1683, -1405, 1217, 954, -1239, -169, 1272, -489, -1738, -18, 680, 307, -456, -14, -51, -242, -833, -1100, 1175, 1935, -624, -1233, 469, -62, -1751, -9, 1864, 248, -920, -497, -45, -272, -357, 368, 417, 641, -654, -1337, 146, 1053, -272, -445, 1317, 703, -1463, -727, 1241, 163, -489, 449, 1020, -350, -714, -14, 469, 655, 205, -519, 205, 967, -859, -1257, 1053, 1652, -768, -239, 960, -164, -910, -92, 1025, 506, -12, -161, 23, 290, -36, -686, 579, 1718, -248, -1290, 469, 604, -1237, -204, 1468, 603, -1091, -167, 204, -27, 133, -309, 322, 831]
4351H31q90j265J057J672j526r58J771L29k157K17J389j39r36N75K03m92k10k99
4369h28P00L40R0j153Q27R93j611j032K121P57j739j40J331o70j127O15J033l85
4387A22J59m57p02Q28K0m89K32J355r84j250J221L40j079J5J633m27r97LP83m52
4407a26J19K15q3J80r3j132N79J483r29j211J370Q05j748J53P48J24q40M39L7
4426I0J12r2k08j70O90J68p35m8J035r35n45J231O55j618r8J268j49j284O77L94
4446D38j57K97l95o00P01O21j289NJ622o66j381J018O01j002k56R98j2j000L64
4465i3K07n9j78L34p88Q78J48o55l11J085Q2j417Q20O28q62k65P06m4m24M41Q0
4486C13o30O46l92n11K97J027j057n67J487l08q45Q7J120j136o6P81k97p92R78
$$ y = [831, -59, -1324, -267, 1405, -121, -1079, 692, 1021, -1136, -919, 470, 331, -605, -30, 173, -319, -529, -828, -128, 212, 302, -851, -24, 969, -642, -1674, 447, 1204, -535, -675, 656, -14, -1141, -526, 507, 122, 281, -176, -878, -50, -30, -519, -287, 1068, 84, -1166, 55, 395, -684, -669, 964, 537, -460, -457, 326, -126, -7, 208, 125, 305, 212, -920, -341, 1142, 213, -998, 372, 1177, -571, -418, 330, 454, -386, 53, 90, 202, 110, -98, -268, 422, 590, -145, -193, 842, -93, -638, 593, 1248, -370, -468, 800, 651, -633, 44, 438, 281, 578, 183, -417, 284, 905, -384, -379, 1243, 577, -804, 214, 815, -187, -443, 555, 543, -457, -93, 114, 55, -123, 211, -577, 301, 449, -206, -517, 568, 650, -767, 53, 681, -181, -446, 260, 216, -208, 233, 313, -317, 329, -63, -574, -277, 750, -307, -874, 613, 305, -540, -453, 667, -469, -535, 246, -51, -843, 135]
4505A35k7m00J2K66q42P97P69o38r13J315p7j148L07J148r16p41J118Q3r24O25
4525e1k2n51N90M73r06q2J246q13p42J040K65j235N67N35n91m9N92j92n66Q88
4545C96j92o69K67N28n59J37N42m46o43J023K54j354M20O22m91j57J027o27m73
4564c95N22L27r88M77N61p37K2O30R5r45Q27M94j200M62O89o00o27R56m22p41
4584e93Q63M94j206P67L04o69j77L65o4n70Q15O8m40J01O04l30o76P76M3r77O61
4605A59J89q79M52M14o37k7P74l06m46M37j4p76J74J195r31l8N21M8r50R58K34
4626E51j269K46R92p29l90J203n07q27M20O06q17J58P36o33l49P89K09j136P18
4645b9J86p68N83K17n31k56J020k07r59N30N79q89M66M41j28o40P33j37n62M30
$$ y = [135, 108, -292, -280, -14, -856, -59, 710, 72, -841, 474, 397, -751, -444, 704, -212, -953, 165, 248, -676, -51, -73, -624, -34, 439, -467, -549, 697, -116, -858, 182, 447, -788, -221, 314, -277, -326, 266, 74, -492, 396, 204, -465, -198, 330, -229, -92, 450, 4, -639, 384, 638, -716, -296, 326, -165, -322, 705, 78, -395, 127, 454, -534, -57, 504, -233, -211, 419, 514, -431, 396, 890, -310, 152, 841, 241, -386, 570, 148, -593, 270, 764, -442, 325, 629, -40, -217, 148, 84, -486, 329, 397, -43, 58, 662, 332, -344, 432, 475, -502, 159, 348, -531, -79, 335, -302, -329, 445, 139, -307, 130, 116, -660, -486, 709, -222, -260, 261, 309, -641, 317, 551, -718, -472, 520, -209, -599, 604, 97, -730, -310, 296, -521, -363, 373, -260, -609, 180, 389, -747, -29, 157, -611, -28, 189, -342, -598, 422, 215, -744, -214, 365, -524, -58, 383, 255, -385, 348, 211, -351, 79]
4665G9K48o73K81N65l58o75Q62k35n54J84Q68j069Q5P76n33J50K98l5n72K54L20
4686B66k87k3L81m78j04R25k57j269P46O03m69l7M60p6p94O05J51m44K19J7k93
4707a58n1J054p69j80L86L44j443O91J009j176l42J103j04n95P12R0o49N8O27
4726F07q68M04L86o06n35J264q4j506Q04J032j090o23Q11M39n75L43J4l46k5R0
4746f4m20N65L55n82m08J127m12j066P34J006p19j182J124K19o28J73L00j54j39
4765a71L99m80j96Q83j196J3J133M04j420J74Q47j62r63Q03N02o00q4n4M03j42
4785I3r0l56M78N74j129n97J106L58j134L20J305p31j214R67M94m80RK18n5j61
4805b5j20l91N20R13r87j011J351M23j684J97J805m05j119M34N18q04q5N88K98
$$ y = [79, 327, -346, -65, 500, 142, -533, 329, 94, -460, -276, 592, -477, -392, 384, -149, 1, 299, 264, -308, -54, 266, -21, -44, 337, -141, -245, 680, 423, -846, -100, 503, 34, -3, 457, 381, -413, 192, 343, -101, 118, 135, -158, -209, 845, 76, -104, 282, 626, -817, -126, 883, -293, -635, 468, 364, -231, 481, 571, -78, -20, 607, -261, 143, 529, -77, -612, 652, 568, -938, -134, 898, -192, -815, -4, 435, -140, 203, 217, -129, -154, -64, -484, 81, 436, -146, -554, 573, 161, -905, -171, 835, 116, -1066, 58, 277, -351, -178, 122, -32, -171, 228, -252, -448, 435, -761, -748, 385, 789, -631, -457, 390, 228, -735, 68, 570, -30, -114, -168, 235, 93, 3, -353, 125, 699, -430, -1027, 79, 437, -697, -377, 928, 197, -1017, -50, 444, -36, -27, 191, 136, -25, -145, -536, -16, 897, -90, -1101, 250, 673, -1011, -814, 991, 586, -533, -99, 419, -385, -470, 118, 416]
4824D16M1k77l67J06R51r10q77J473O84j923k71J605m42r87P49Q00m67l63k43
4843c02O59k83K12o01O95P03j066r79J156P66j228J04J020k09j500P23N38k85
4861A23k66L37J06K62n27n30L16J198p85j220J044J114j702n96J730L67j022o99
4879g50R61m29k37RN21K14k39n40L6R86o27j180J379R19j436p38J490p0j097K41
4899e87J195k60o44n01M24P34L3j151M26J197j105j168J035J627j537m50J259
4916E27J74j130j91Q55J16l40j88J12L69p6j046N13J004n32j168J016R08j295
4934c72o60J427Q63j499j9L66K05j45m60M2Q82J06j369nJ406o69j051J215J233
4953A496j738r10J409L58r26j8Q39J82n38o55K48J007m3q24k29J399l95j828P85
$$ y = [416, 457, 180, -187, -81, 870, -40, -917, 556, 1240, -683, -954, 651, 209, -778, -29, 771, 304, -59, -302, 357, 74, 286, -315, 380, 1083, 17, -962, 194, 960, -268, -164, 856, 647, -853, -130, 408, 123, -143, 194, 300, 562, 35, -495, -179, 1019, 234, -986, 58, 1172, -530, -1126, 604, 971, -51, -750, 211, -218, -455, -446, 75, 289, 50, -490, -454, 532, -95, -1275, 104, 1023, -413, -1151, 339, 269, -828, -587, 608, 348, -296, -797, -373, 361, 394, -757, -331, 866, -239, -1407, -372, 1255, -282, -732, 527, 701, -429, -620, 235, 351, 11, -177, -65, 304, 228, -818, -305, 699, 167, -1001, 15, 923, -372, -1032, 395, 1258, -241, -260, 106, 311, 166, -294, -252, 630, 736, -633, -638, 768, 99, -952, 263, 1496, -242, -1152, 257, 615, -311, -329, 510, 692, 154, -501, -253, 754, 711, -113, -342, 1057, 662, -1166, -381]
4972c81J867r66j120R23M56j379k72Q95P30m74k34m95N70L03q61k66J556J6j853
4991i85L85J276m56j315J645K70j126k83M58K45k44l48O6Q26P04j656o36J645
5009D71K94j354N31J331q19j707R76O54n41o7M24K85l95q71P2O36J142j015r11
5028h64J547j80j716K22J801n1j496P52P61j016m01N77N13k03k34l65O6O23p98
5047d62m56J340O62j764l4J162J60j569Q56P36n42j88k04K61P4l5j90M46N61j116
5067c02p78J233Q78j586j6J360k44j248K86J266m03m54J45j24J02k5p67O51Q84
5086H58n27p28Q81K52j187l90J835n01q33R6P97l69m79J84J77mL19p12p8J091
5106F82l77p35P32O23j005n50J056k26p13J51O29J2l38J63m20K38L45l80j19P21
$$ y = [-381, 1486, 520, -600, 323, 779, -600, -872, 23, 753, 279, 45, -450, 120, 423, -438, -704, 852, 868, -985, -600, 676, 220, -1095, 550, 820, -306, -589, -131, 114, -130, -478, -412, 414, 1118, -538, -1174, 471, 765, -589, -58, 1273, 454, -1253, -277, 377, -164, -231, 193, 478, 83, -788, -716, -80, 1062, 47, -864, 683, 503, -1213, -991, 810, 759, -737, 15, 776, -240, -641, -64, 449, 246, 12, -353, -287, 336, -462, -918, 422, 1084, -680, -714, 448, 608, -961, -105, 631, 89, -99, -303, -42, 32, -3, -193, 253, 814, -302, -1080, 153, 1031, -555, -571, 789, 545, -703, -417, 849, 446, -8, 137, 13, 115, 90, -677, -26, 858, 331, -397, 484, 736, -451, -841, 994, 493, -340, -244, 553, 184, -295, -111, 66, 62, 381, -331, -409, 682, 305, -430, 302, 925, -80, -630, 426, 200, -513, -362, 267, 279, -59, 104, -316, -78, 267, -113, -232, 489]
5126D89l84p13M71Q50p16q47J117J05j005N69L40J36k71j61n87O78L69o68j03
5145c31N62R0q07J12R08n67r50J331mq61L56M06l32k28L26J12k90O16o03k39L02
5166i1J91n04j37J317j011l77R65M3o74L2M86j58k39k68J28K74M27l95n13N11
5186GO01r47Q6P47m70o62R67j48p71M48P16n77p5K25m82N19K34r8p58Q53J95q90
5208b80M1P91m29l10J40K11l31o7P41n91O9K17q7j50L36l01J3L25J93p01j06Q55
5230E79l70n89O00R5m31J83J23k40K17L6l72L95nRo54M90M72p28k98Q89l92o88
5252f79P97R4m79J35L97k30j02J60m14J1O28n14l77K55O09l98j65K73O8n78Q05
5273B96l20j97j08Q15q82K73K18k14l77P43j3p47L99L20l99j30L98J9k83J24K67
$$ y = [489, 105, -608, -137, 713, -3, -850, 267, 372, -633, -64, 276, 412, 141, -20, -607, 71, 440, -228, -331, 231, 321, -486, -374, 534, -33, -983, 348, 344, -517, -161, 245, -87, -315, 11, 123, -167, 449, -154, -393, -91, 100, -404, -541, 776, -235, -612, 353, 396, -278, -246, 240, 82, -157, -425, -297, -23, 404, 9, -504, 7, 608, -339, -253, 494, 24, -638, 329, 181, -590, -142, 574, -3, -78, 147, -335, 184, 418, 320, -438, 415, 610, -280, -239, 552, 123, -187, -47, 164, -167, -234, 507, -84, -15, 202, 115, -35, 301, 0, 13, 338, 531, -170, -276, 579, 209, -380, 220, 315, -116, 67, 190, -50, 167, 203, -169, 226, 221, 230, -424, 66, 538, -190, -488, 401, 9, -679, 118, 212, -267, -132, 265, 35, -67, 93, -321, -310, 318, -196, -573, -318, 291, -107, -272, 1, 69, -509, 296, -24, -221, -329, 486, -396, -123, 95, -119, -496, 247, 234, -513, -114, 206, -193, -323, 75, 94, -189, -65, 202]
5294B02n69K7N79m40k57R19o68j92N41Q7l65K07k21k05J70N55j91n68N79o5k75
5315a50o0K64k22j88P15k11l13K80L08n34O9L12p0l75K42p2l71N69P3l50ML21
5337B41j31l67N32j6o41N74N21j210K32O57l68m6M08l24j83J67M31j26m00N49
5357E00m63k52Q04m53l41L74K62r59N74M58o71k38P50k45k25n6N69j04l32j4l1
5378i3M6K36j56l50N07J82j211O79O87o23j7K72J02o09L09J92j66k1J00K9l53
5399b58N31k06l62N05L48j273L70P67k70p82N96M46p53k15O17m28K39K77m56J61
5419a46oK69m81L29l6l94K92N96l71p15O42J82l77k19M20j19Jj74J1K68K47k32
5441a3k93O27K79j035j69R28nn10K06M41m88m60P87l47RL02m66K82j08J42p64
$$ y = [202, -367, -340, 239, -201, -458, 461, -207, -399, 142, 229, -136, 71, -150, -355, -185, 370, 179, -389, 190, 125, -150, -210, 54, -168, -356, 359, 148, -165, 115, 423, -111, -42, 270, 200, -175, 67, -5, -376, 193, 266, -84, -80, 241, 110, -257, 275, 259, -382, 192, 713, -497, -265, 392, 24, -22, 386, 62, -121, 46, 477, 351, -49, 500, 37, -215, 589, 136, -205, 169, 431, -528, 46, 504, -167, -405, 345, 100, -125, -181, 388, 284, -48, -62, -93, -47, 189, 33, -317, 190, 372, -839, -160, 527, -96, -113, 159, 261, -348, -39, 153, -13, -34, 66, 95, -258, 273, 67, -295, 210, 558, -715, -345, 422, 152, -630, -34, 412, -341, -556, 61, -367, -128, 149, -307, -146, -152, 117, -364, -35, -71, -465, -173, 423, 52, -663, -21, 161, -216, -435, -15, -134, -133, -307, -296, -28, 219, -13, -306, 321, 600, -435, -604, 324, 319, -191, 15, 456, -32, -492, 295, -52, -43, 259, -207, 75, -33, 109, -655]
5462f55R21N34r48LQ14j41j261R18L02m74k54M79J01l57k56K01O1O27l42m88N83
5483C68K07o61o40J406o8j100L39N40m34k33K80O15n94N7M2j25L01l59n93Q63
5503B11L25o64j64N69N19j034j4Q77p58j92L4N41k3k16J90K7K63n50q51O40Q30
5524E60p26o27J343k34p24j73J007k2m80J22J82p0j18j85K03L49l81p91N50N75
5544C60q33O1J058l18p64PQ88k25j97P2j59L08l83K5n7O12m65m03L02N15p59o69
5566a024J268K40q57l06J237j90q76L44J00N43l97k91NQ59m89r91O52J083o28
5585B82r90P50N60j110k01J339P1j014j83M08L42k78k07P6O42N6j085L97O40k62
5605B33q83Q84N30j113m29Q37O73o84m68N92K09L0o93J33N50J02r61L48R05l79
$$ y = [-655, 266, 800, -148, -145, 669, 528, -733, 185, 487, 13, -241, 238, 339, -18, -274, -73, -12, 615, 273, -215, 368, 575, -86, -726, 680, 612, -488, -149, 391, -43, -276, 4, 619, 25, 82, 124, -1, 300, -59, -652, 211, 536, -128, -292, 277, 796, -238, -252, 625, -133, -325, -291, 250, 227, 11, 201, 228, 491, -59, -910, -270, 560, -166, -793, 550, 316, -408, -581, 426, 404, -76, 46, 228, 158, 40, -145, 58, 407, 26, -765, -215, 360, -473, -412, 646, 328, -436, -429, 459, 234, 37, 109, -50, 258, -125, -100, -157, 455, -10, -413, -111, 404, -355, -1024, 244, 484, -373, -679, 558, 368, -508, -164, -64, 479, 82, -209, -204, 655, 166, -825, -173, 910, 282, -708, 42, 602, -508, -709, 630, 701, -313, -496, -88, 254, -24, -231, -155, 487, 543, -542, -145, 495, 233, -650, 234, 764, -349, -778, 59, 732, 48, -420, 172, 381, 411, -282, -149, 401, 503, -458, -110, 795, 416]
5625D16j196R91N76o25n44P24P1m86j%M13j27l24j30Q32l50q44O10Q06m49j229
5646h66P12J067j167j45N13M11n90n16N38J5J53l90k33J032R5j087l64J565j64
5665E79j294M58R60q60j95J55M24q5l20R3Q1K85m07n79Q89N36j237J2J298n22
5685B71j027L98J149q88m65L75L38k29m69J38N07M45q13o88J333J63q40l41J332
5704F89P3j298p5J207n25o02N94J99l79k00l14P23J21j86r3J59O55j274j82J437
5724G29k14j298M18P59j93m71J82K56K09k37j18J3L61m44n82Q97O02j038k75P04
5744B60J57r19K18P41J66r55K76K83K41k94j41J61M27n31n86K82P83n57r61J093
5764A44L45q17l04J072k02m94K49K46j10Q9o41N85J2n2j76j83Q53o40o04P42N45
$$ y = [416, -780, 211, 787, 162, -382, 342, 413, -73, -74, -74, 339, 212, -112, -242, 590, 240, -604, 6, 812, 363, -866, -154, 913, -254, -399, 114, 525, -65, -581, -43, -28, 125, -265, -498, 534, 629, -458, -822, 743, 579, -715, -257, 703, -157, -352, -197, 227, 142, -178, -85, -4, 281, -126, -705, 184, 720, -517, -505, 793, 271, -756, -358, 791, -97, -562, -187, 151, -78, -547, -409, 98, 543, -270, -958, 375, 538, -302, -643, 689, 762, -536, -611, 596, 71, -531, 63, 262, -117, -317, -631, 92, 213, 27, -66, 93, 748, -526, -708, 729, 515, -783, -365, 394, 201, -270, -88, 168, 377, 140, 22, 35, 396, -48, -630, 267, 869, -169, -444, 260, 417, -502, -284, 457, 623, -332, -56, 227, 468, 174, 33, 194, 621, 90, -496, -214, 569, 12, -949, 144, 489, -328, -632, 440, 238, -256, -7, 239, 129, 218, -423, 162, 174, 122, -54, -237, 616, -24, -628, 114, 659]
5785F59j082M2P77p1o93Q6K48M8J15j69l32M00K4m73J46P61m34n86M27M19n54
5806b42k45Q49j8p57N08J0m31J52kj81O04j19q56N74N07j91l30J56N45j084K30
5827c21O18j23k96J93m7j03k42J59M5L73j27m29P0O27k92o55K62Q97r06R8M00
5848B01j36m52Q3O29l61QJ28l17J0R06r90q6Q57q2j126O05M05k54m38P24p1M2
5870B85j71j06j6L06N2o88O03J19n68NN06Q1n84M20P7k28q7L40k60J2L41k03k22
5893A4P3J95n51Q5M19l33j32K28L90o11L09J52m27l33P55k26J54q1j54j67L52
5914A11M13r46K07M08j05l34L11J73m72N7L72k55k06M45m07J22J40J23k67J39
5934B9J29n77L34M47p38l12Q00J96m94r7N19m75k11O88j83n0j78K41n33O45j16
$$ y = [659, -423, -381, 396, 325, -368, -282, -34, 14, 129, -40, -372, 28, 52, -421, -275, 486, 52, -534, -107, 312, -242, -487, 362, 344, -413, 95, 105, -326, -174, -176, -357, 247, 128, -728, -154, 353, 162, -168, -12, 533, -551, -321, 297, 174, -122, 71, 24, -79, -321, -162, -117, 256, 129, -300, -230, 397, 105, -550, -288, 609, -297, -199, 201, 65, -387, -304, 325, -36, -28, 100, -217, -207, 699, -291, -377, 480, 398, -728, -123, 282, 28, -410, 314, 243, 285, 114, 8, -8, 298, 350, -338, 265, 384, -184, -179, 327, 408, -176, 244, 321, 93, 6, 346, 86, 98, 439, 236, 14, 87, 282, -269, -184, 235, -98, -230, -2, 388, -223, 86, 238, -189, -522, 233, 7, 161, 80, -74, -241, 111, 524, -422, -215, 193, 88, -246, 65, 238, -234, -177, 195, -60, -266, 179, -228, -106, 34, 157, -110, 29, 158, -419, -85, 362, -376, -688, 112, 308, -186, -283, 236, -239, -450, 238, 55, 5, -173, 68, -465, 180, 64]
5955F4n54M87K95j48m77K50M48n35R8J21R0k41J09o2j04L24L2m51K75K55k98j40
5977a62N41m32l22N35n8%J1L40j82l59L13J52o32L95l7O3l78N09o79J84N33k4
5999C11m71K27M18o87J41M01k53j04J29J11m64K76K3l25L44M97o13k70O59j23
6019B27l18L60K46o23j47M31k83Pm7N9J13K88j29j00m06P87n57k63M37Q1n86L67
6041e6J52j91O6K88k33k41J82M8m73O53q5j47l43N93m54J76J19o4j78l3O64p24
6063b81k08N16J82k41R4k93k24N34n1k44K60M91q76J9K77j20k29J85K36n68L14
6084b27L28J22o95O35j69k70r3M17j21K13R2j92j99N74J43r74L62P13n48m58M65
6105A18j8l20J9J53m11M93O5j19R3K53k48k95L93n1k21J06K25k96p4L94R0m43
$$ y = [64, -490, -3, 292, 144, -333, -83, 365, -170, -72, 49, 139, -102, 7, -55, -159, 165, 197, -254, 21, 276, -22, -162, 379, -53, -375, 160, 102, 102, 113, 453, 271, -88, 225, 377, -255, 140, 103, 166, -212, 297, -382, -198, 335, 311, -160, 67, 485, -202, -61, 340, 87, -17, 112, 223, -241, 35, 58, -267, 77, 574, -39, -309, 350, 227, -91, 269, 515, -108, -255, 176, -107, -100, -147, -88, 25, 313, 184, 84, -322, 465, -92, -355, 82, 163, -423, -56, 96, -95, -29, 259, 26, -215, -33, 15, -458, 195, 110, -37, -380, 213, -241, -65, 54, -10, -188, -221, 443, -281, -489, 27, 209, -32, 62, -231, -455, 79, 28, -216, 44, 535, -341, -322, -45, -165, -394, -209, 27, -541, -227, 101, 223, -472, 163, -6, -276, -369, 48, -73, 140, 232, 40, -159, 415, 558, -416, -54, 659, 111, -347, 118, 100, -220, -201, -48, -459, 34, 99, -20, 73, 326, 78, -217, 176, 125, -96, 10, 235, -61, -135, 259, 349, -94]
6127i4K39n8k22L20J56n73M69K4m96j01O95J48p28O3K32Pm70L34J47r7j75L87
6149B07k97Qj82k23L59M30m93%L70J24l27j71L67k82L14k85K76o50N17N2k40N65
6171D39j77m44J05K61k56l47O37R7n49P0M45po96J32J22M27n37M30j94j74L89
6192A73k32k17N73o16l60Q69K05q23K0N26n3l90K45J15N1k68O3l8K26J43n47K60
6214g5L93m44n10O20J53m76n31J349j46o25K25N65l27k78j67l3M57k52j11KO68
6235D57n05l24P9Q70l61r21O61O5l19j07Q53k17k14j17q0J95L25p53L71O24n38
6256D4l69O15J81j130L20O59q5k67l5JL81k54N5J40K90p0q47k50Q28J06r09M54
6278a42M59k41l15J71M88m94j42K06J68l55o8L87J66J36n08k41Q17l39n68L36
$$ y = [-94, 145, 87, -135, 185, 341, -232, 237, 261, -235, -336, 359, 507, -221, -158, 74, 81, -389, -55, 92, -5, -180, 207, -90, -82, -264, -487, -128, 302, -191, -191, 179, 303, -24, -195, 172, -110, 204, -81, 195, -455, 62, 114, -126, 439, 262, -182, -77, 184, -72, -419, 218, 315, -234, -164, 281, 274, -422, -290, -168, 259, -278, 152, -42, -216, 173, -59, -276, 297, -319, -679, 190, 395, -428, -408, 118, 65, -325, -80, 35, 86, -182, -119, -157, 69, 212, -335, -75, 318, -126, -636, -16, 137, -339, -870, 479, 333, -292, -67, 498, 171, -107, -274, -307, 150, -102, -213, -211, 457, -48, -372, -293, 577, 216, -705, -44, 21, -298, -405, 448, 231, 17, -100, -180, 15, 340, -413, -42, 582, 44, -325, 290, 471, -659, -339, 320, 235, -32, -67, -66, 315, 61, 116, 256, 546, 476, -371, -621, 207, 313, -596, -142, 317, 76, -239, -68, 420, -74, -216, -10, 158, -197, -265, 122, 288, 424, -84, -325, 492, 153, -415, -79]
6298g9P10o53p44Q06L8j25j37L61K01m25m97J86N91O5m02k10R71j4j174l1R86
6319D24m74l56M13J38m45qN14K49n64k07J42J87J70p87J89O54L89j193J89Q70
6339D94o65o41O51P29m19j00n02K10r3L6k6P45j68n82lP13j62p22K33J168p25
6360A71p56N17M79n25k11N84N4m58P8k56J99N97p30k21P91Qn68J32P50n01n32
6381c98L06P58l88n85K83J71J18j67j78K87M0l80j33O27K30o45l43R05j52n53
6401a97j52Q93k5p75J68o2L23k99p8J96P86q19n65P80L85p59R7N53M7r65m4R48
6423D36o09L72l48K7J19p8j37KO55m26m87P67K50j163M7Q81j0l40k34M64l03K18
6445A03j84RK52L6m89nO09m66l22N12L57o76j86Q77L2r43K73K62mK31m00k20O62
$$ y = [-79, 631, -22, -766, 40, 78, -47, -184, 177, 378, -47, -544, -358, 233, 298, -104, -314, 657, 643, -531, -562, 424, -50, -406, 7, 145, -300, -308, 206, 455, -109, -316, -174, 13, 183, -604, -415, 239, 628, -565, -376, 494, -171, -812, -161, 568, 149, 49, -453, -243, -336, -300, -326, 419, 251, -331, -334, 379, 217, -505, -272, 896, 171, -585, -68, 411, -114, -325, 259, 313, -145, -67, -323, -124, 473, -257, -478, 313, 321, -247, -115, 635, 134, -398, -92, 666, 278, -307, -24, 147, 265, 98, -80, 207, 247, -133, -266, 361, 591, -54, -397, 508, 356, -197, -349, 544, 519, -256, -88, -150, 173, -126, -204, -8, 778, -41, -606, 174, 559, -200, -103, 450, 497, -468, -512, 436, -173, 199, -149, -122, -3, -81, -218, -216, 439, 13, -474, 293, 543, -620, -573, 308, 298, -42, -276, 188, -115, 103, -81, -72, 180, 216, -273, -278, 331, -135, -457, 55, 412, -264, -450, 427, 459, -484, -211, 51, 47, 278, -122, -342, 320]
6468C20l7p00k8N73L0n09N43P3n68m5M88K50o85m1K38L54n1j38l73J32L42l94
6490b26l25N96J64o57L11L24k48j19M68Q4r30L59O3M79n51L8QK47L17o20j98L79
6512c7L43q05O07L68l66n05N44q1l73J79L04m65J90L35n53M63M1l91j8K81j24
6533f3k08O0M76j00l80J43J86m02J40M12j61J50j87J6k1J05k42j94N34j38m60
6554c34K28K84l60J06k35K92K79l19J66K6j89L11j66J06j27k21j11J86J85l37
6574b30K06M45k55o75O86r8j56p9K43oj31q0L06k69J64k13l53M05M30n78j57L95
6596@j13o4L12M19m65k97K15m17M76M58p69M36k99m8j71N54P5m76j18M35J99m68
6618a26J07K63l57K36j26k0j56L25k74K24k8nm57K12K30j04M0R6j20n7J6P86p88
$$ y = [320, 283, -417, -445, 128, 158, -351, 192, 265, -303, -348, 140, 390, -295, -336, -98, 256, 205, 67, -306, -174, 168, -226, -551, 45, 209, -448, -137, 187, -61, -180, 288, 372, -558, -199, -136, 343, -208, -170, -162, 85, 402, -218, -416, -37, 306, -499, 108, 476, 110, -395, 149, 68, -305, -126, 178, -287, -97, 238, -315, 148, 189, -202, -220, 61, -63, -271, -211, 265, 165, -215, -72, 114, -288, -148, 264, 103, 253, 66, 82, 61, 166, -76, -270, 264, 126, -334, -106, 178, -182, -76, -311, -19, 260, -59, 107, 133, -56, 255, 89, 195, 68, -153, -264, -78, 107, -230, -24, 421, 166, -509, 177, 79, -77, -156, 87, 81, -50, -130, 176, -93, 71, -142, -495, -90, 340, -238, -395, 0, -113, -177, 135, 554, 89, -208, 7, -410, 66, 524, -245, 191, -108, -156, -327, 227, 302, -174, -292, 143, 342, -126, -19, 244, -113, 123, -3, -23, -179, 146, -128, 96, 68, 63, -394, -182, 48, -56, -16, 80, -40, -97, -81, 705, -83]
6641h3K06j38j04K29j33j82K82J96l08J25n5M27o08l18O84m12J12OL03k15k24
6662b10L63l76RK43P8k58J86M86q00Q3M08l14j74J75N7j37K15K67n58J34M96j15
6684B58j52n3N9k96J64Q3l77J75L21k53J57j07J84k80J76Rk18J98L5l22P6N88
6706D25l89m17N49k34qk9J56M9k62M82p5q86N61K66l58j25N53p10O12q4l13J53
6728h4j13L08m03L00J18k95QK53Ql36k84Q70q45M82p9k54L85L73l66n24N80l1
6750G1j45l9J15J49m06K45p1j0O1Q4K04m31L26k60L4K29L36n57K03J25m93J56
6772g4K28m53K55r6M39m11J07k50J04K32p6k92R5M48m04o8L96J39m55j39O30M1
6794C96m62L91J39n55n5R2k07q6L69j04J54j28n3QR7O34q08J0M93l96j71n8M82
$$ y = [-83, 123, -15, -119, 110, -23, -205, 77, 273, -35, 90, 35, 462, -146, -464, 220, -192, -80, -74, 229, 14, -210, 153, -223, -214, 29, 107, -151, 35, 521, -279, -196, 212, -102, -276, -101, -44, -181, 34, 301, -257, -123, 373, 258, 106, 53, 112, -184, -20, 63, -314, -139, 182, -71, 86, -21, 163, -117, 59, 68, -150, 48, 83, -239, -163, 425, 36, -381, 168, -66, -74, -103, 53, 102, -160, 322, 247, -639, -78, 188, -170, -295, 258, -452, 160, 76, -237, -84, -197, 111, -292, 8, 126, -169, -161, 92, 100, -236, -520, 350, -495, -13, -92, -346, 39, 412, 46, -478, 102, 71, -74, -113, 2, 151, -255, -10, -81, -91, -30, 54, 258, -173, 153, -107, -73, 156, 492, -65, 138, 263, -230, -74, 154, -299, -44, -140, 299, -112, -5, -255, -151, 81, 5, -287, -192, 256, -148, -216, 180, 319, -136, -275, 355, 396, -66, 325, 464, -91, -146, -54, -261, -347, 22, -82, 72, -56, -109, -101, -4, 630, -178, -168, 325, -71, -242, -300, 182]
6817A82j10l84R1K19qm4j32J02K69j61M5Q7k95J03j60N41l21k44K40J9m2m7K22
6840A72j39p2K04m06K07J86m84k26L95N31l08n57O64k0m00k3M72n6r2j42K55l81
6862b20N03r9k55K54k43j49N04k78j38L8M23j0n37O7K21M7k53J61J61l66K35M3
6884A09l94O02j52o10N84k6j5l48M35K59r20L13M26j43j43j5K37k3k41K85n05
6905b85L82R4l94K32L29n16n6O34m5o48L55K45k74j86M03l32K51j08q9J53jj32
6927A2k09M16k91p5n9K98K74o67l89Q44K61l61m47N55l28L25m95p6N77k6m97K46
6949a12J69J86k93L57Q4j58n29J83K32j61k16n9L52L08m94k11L95K53n07q7L83
6970G5O0l76L29J53n85q7K53J79J23l82o2N02k9R0l85J57J01m39J00L47Q4l08
$$ y = [182, 72, -312, -221, -2, -10, -54, -186, -84, 185, 24, 69, 156, -139, -36, -196, 345, 24, -220, 20, 39, -3, -50, 172, 33, -39, 165, -241, -34, 152, -332, -558, -163, 368, 60, -497, 167, 147, -253, -276, 196, 140, 48, -94, 161, -220, 283, 184, -71, 183, -60, -209, 295, 17, -121, -83, 340, 330, -207, -140, 81, 128, -125, 36, 197, -169, 66, 109, -285, 317, 165, -445, 139, 113, 98, -250, 185, 444, -476, -163, 263, 120, -23, -38, 199, 176, -65, 220, -285, 97, 191, -203, 29, 358, -158, -214, 420, 375, -273, 82, 327, 53, -133, 270, -62, 189, 81, -8, 145, 144, 12, -197, 219, -72, -147, -206, 92, 366, -301, -690, 154, 415, 54, -393, 162, -166, 159, -336, -412, 165, 139, -358, -112, 57, 243, -50, 307, 391, 233, -296, -113, 119, -42, -258, -317, 35, 343, -151, -362, 33, 286, -221, -308, 75, 135, -241, 88, 241, -344, -431, -178, 1, 124, -258, -320, 182, 153, 243, -142, 15, 116, -323, -223, 124, 208, -100]
6992a00J59J57k97k61M69o8J72l73K87n8k47o9j6N36k83k67J34L35J57n07K55
7013A15N33m47m14M46n0j73L31n98M30ok43j45K61K16j75n16P95k01m84K97L40
7034C12R6o62N9N87l1l43J2r1J43M0m30P03L14r00K0L4J61j66J76J75J8l42J47
7057C2J75L2o1j29n5L70m49k05O60r9k49n11L37L63l37J3L68l42q8j11O47k2k81
7080E8j72Q6J44l48j03M16M69p33j00K82K89o82RO01k40m8r5J62j49L52k56j01
7102a59J32Rj36Q9K66j90n24L39J97L67n10J63J82k77p2kM30l42j36K89M8M7j51
7125E9J27K34m34j27J45n0J0o8J61K2l50J86l23J36L95j97J69J14k87p3O9J58
7147G6K6j45J46M20p70M4M44k06L2j97J19k50Q4L7m3L92K33p09L11J20L7k18k18
$$ y = [-100, 59, 216, -81, -342, 127, 59, 231, -142, 145, 87, -160, -229, -245, 291, 8, -259, -125, 210, 367, -140, 115, 648, 201, -213, 233, 183, 10, 341, -257, 173, 167, -76, -221, 40, 256, 81, -435, 360, 159, -325, -28, 312, 408, -254, -195, 392, 361, 18, 30, -61, 82, 122, -308, 395, 709, -191, -171, -137, 24, -142, 34, 209, 227, -115, 32, 207, 239, 178, 49, -6, 364, -85, -290, 370, 271, 22, -489, -152, 211, -126, -113, 255, -87, -175, -286, 361, 339, 58, -114, -28, 116, -232, -335, 81, 550, -183, -283, -1, 288, -394, -385, 216, -24, -72, -167, -5, -154, 198, -58, -159, -27, -18, -154, -65, 201, 11, -513, -174, 23, 390, -120, 43, 225, -52, -124, -126, 304, -38, -174, 115, 163, 210, 59, 186, 420, -14, -141, 4, -46, -36, -104, 57, 79, -271, -85, -408, -272, 123, -74, 95, 209, -78, -151, -82, 76, 102, -43, 103, 523, -247, -203, 241, 35, 67, -130, -11, -261, -177, -140, -183, 209, 442, -267, 44, 164, 201, -17, -235]
7170b35K56O6j62J6Q4k82N9L19n5r2k0k92M92j22O7k94O76o74K55j33J21k59K68
7193E9K69M2k47j3m23J97j3J09j91M2M03m76J23J58J33l99J95J47P7m56K56j20
7215a28j71M34Q9k82L23l85k44M91Mm62J15J84K02l17j4L79l09k83N10k33L3P
7237e7k23KN43m33Q0J94n0k49J55k9O5p7O8K79k13R1k23J82j38K4l6Q8P9J7m73
7262c34L22k30J48M1k8k06K49Q4K82k67N3k8K99l95K30k60m0N9J65k66Q2J22j16
7285c4J08m07N13j73J88j42j10J5J91j51N6P0j40p6K40l90J80j7P9L15o73K14
7307a44L79m35J74M40n39J20K74L2n10M22n1k54K29J86j86l77J29J62q0K85J60
7328D16l69j83J59K35j08J45j42P5j68o7r4p0M6O0O6J6o1J34p0q6k15L14m8J71
$$ y = [-235, 21, 87, -75, -59, 25, -257, -198, 121, 66, -26, -46, -338, 154, 32, 99, -195, 481, -193, 62, -71, 50, -209, 59, 328, 370, 123, 110, -313, -116, -129, -20, -211, -169, 234, -242, -119, 39, 172, -227, -32, 115, 192, -264, -8, -128, -299, 135, 224, -58, 265, -120, -364, 127, 131, -331, -216, -32, 170, -147, -161, 218, -91, -374, 136, -97, -64, -57, -280, -278, 265, -168, -88, 106, 56, -193, -38, -67, -2, -79, -11, 268, 55, 146, -77, 105, -33, -9, -45, 43, 122, 139, -334, -12, -242, -94, -53, -81, -287, -38, 46, 328, 61, 114, 86, 385, -10, 220, -40, -80, -21, 144, -122, -40, 82, -34, 74, -333, 180, 7, 195, 53, -57, -42, 149, -2, 54, 124, -16, -92, 148, -242, -62, -79, 0, 315, -358, -144, 235, -200, -26, 414, -125, -5, 269, 301, -209, 213, 162, -92, 137, 323, 137, -240, -111, 51, -29, 256, 416, 47, -136, 23, 258, 150, 295, 153, 228, 60, -7, -101, -171, -125, -65, 1, 17, -44, 90, 20, -66, -281, 33, -15, 156]
7352A56n1j45j6L08k5n73K50K37J07m96K32N5k61J45N04l83k02j46L52K55l06
7373cJ50J7l06R7L79m76L5o3L24o04P25j51J60l66K52j20l40K23J22j74J56j28
7395i1r9K41L91n87J29L6J86m25L20J40q6j72L82m44J09J10k67J05J19j43q5K51
7417A20r8j48l3L74m07J77J04p1p7q3Q7R0PR9j75J64k55L93k72pJ06j99L12j26
7441H2j17k5K35O9m54M2L99j23l98M20J15o51N56L5k96k6L47k91L39l4L9m88L81
7464A56j5k96L91P9q1m42M52j06j23R7k37L07m63L53J40k65K88j79j95J99j44
7485h4L8j51N31k42k14M07l00k56K13K73k46j28K39j33J10K5R6l60J19L66l78
7506g5m01P35k89Q4J12k42o0j29K23J24k54K69q7q2R3R0l72K4K14p8MK08l17M12
$$ y = [156, 105, -40, -56, 252, 227, -346, -96, 141, 248, -248, -16, 39, -222, -77, 427, 44, -158, -304, 48, 303, -3, 147, 164, -142, -45, 334, -142, -107, -170, 154, -450, 275, 124, 284, -82, 170, 50, -290, -67, 55, -119, 37, -91, -190, 51, 442, -145, -16, 20, 206, -219, 101, 241, 155, -17, 365, -79, 30, 140, -127, -22, 97, -46, -131, 120, 22, -126, -159, 215, -192, -15, 89, 18, -59, -142, -55, 35, 42, 141, -34, 130, -125, 268, -4, -11, 95, -104, 208, 82, -35, -60, 175, 244, -210, -168, 231, 108, -290, 130, 245, -406, 150, 185, -111, -137, 210, -81, 258, 224, 263, -225, 156, 141, -155, 236, 315, 234, -208, 244, 138, 15, 112, -125, 182, -281, 72, 212, -53, 235, 56, -139, 60, -84, -46, -197, 334, 92, -122, 285, -15, -271, -58, 215, -31, -159, 80, -53, 57, 82, 178, -182, -63, 303, -75, -476, 259, -30, 54, 166, -76, -136, -265, -42, 82, -172, 97, 10, -72, 21, 111, -261, -237, -23, -101, -97, 111, -206, 206]
7530B06j81Q0j34k16L05m4j83M63j14j67J65p9R4P5k7j82j01L54j8o30J17J51
7552f6k33N31k62J41p5o0k38K49K09n0j34J33J22l17J3L81j54j72K38k65J3J98
7574B02r1J23j77Pj47J58K09k99j46J84L25l85q1Q1J08l69K08R1J51j77j06M1
7596i0K15l11P2J51J88j18k7j43N1P2k01J87q7j58J24J54K4k15l17M20o5L64m91
7619b01Q8L09j62j55J4L36l38R1r5J58Q6j69K39k00j41J35r1L18l74K43l40N90
7641C41m63m8J46K83m79J93J38J27o26M16lM4k5j76N1J56P4l29K45R4j84j01J93
7664F7L27l00k67K19j70p2L40k82N6J75k8L6m3J33l59j5M08K0m65K26J23N3k02
7687b0l4K51l77K65j04K27l13J33j28l5K47l54K46L30j31m84J78K42J87k14N04
$$ y = [206, 25, 105, -29, -245, 60, 16, -167, 296, 182, 15, 180, 101, 195, 270, 243, 61, -40, 314, 296, -334, -217, -66, -299, 232, -30, 111, 36, -24, -262, -13, 196, 146, 12, 145, 267, -50, -37, 344, 190, 18, 256, -9, 4, 202, 111, 234, 57, 64, -83, 75, 284, -15, -161, 23, 348, -37, -118, -37, 71, -298, -90, 1, 152, -25, -131, -90, 125, -186, -114, 37, 225, 107, 80, -63, -12, 60, -141, 46, -41, -199, -75, 79, 103, -112, -429, -9, -74, 290, -201, -113, 196, 34, -121, -107, 229, -109, -18, -113, 45, 131, -38, 201, 1, -140, -5, -96, 222, -152, 91, -249, 341, -122, -170, -24, 259, -220, -27, 111, 238, -388, 28, 25, 69, 44, -132, -81, 75, 149, -180, 65, 159, -25, -126, 67, 394, 94, -173, 46, -124, -196, 144, -138, -82, 93, 65, 101, 58, 191, -168, -183, 225, 245, -220, 6, 129, 182, -20, -54, 197, -180, 85, -19, 208, -105, 28, -100, -135, 112, -242, 4, 334, 203, -281, -103, 139, 326, 112, 616]
7708F16o84k57J76K69k03j08O35o30K4M38l16j31K66Kl43j34K75J05k83L43K12
7729B72n60M99j7j96j16K60k82J1K87n3j96j5M99l57k10R9K44n00K74K62l46K37
7751I6J23j97j89NK35k3M6R1m07N06j06l66K57kL38m06k6r5N0m1J8l4J54N7j98
7776a14J82O0l11Q6P5J55l13K57j37j35L11j1j01K67k58j83O7o4N8K20oj6J53
7799B42l94j93N96L7o04L03J27m3pJ17n36j27N26j3j05L87p46L54M77o35J48P4
7821a5J00o5j26J16N82m60m29L00J13K6k92M51m29J28j85j18M53j03j38L89l56
7842e8O3k38M19m7o7r2j42J65j10jR1J27J62j46j79m6L04l44O5L19k65J48n6j42
7866g0j60K99K55l48m7J52j81J67J18j22k20J14R3j55l79N38q4l8J79p3rn1K63
$$ y = [616, -68, -325, -149, 120, -83, -191, 444, -186, -162, 276, -40, -171, 95, 97, -246, -380, -105, 0, -283, 60, 272, -288, 211, 194, -2, -118, 142, -140, -129, 158, 105, -91, -106, 393, 36, -174, -75, 169, -331, -57, 205, -141, 96, 219, 22, -167, -162, 73, 50, 96, 187, -220, 286, 180, -186, 71, 69, 407, 1, -25, -120, -70, -111, -93, -127, 27, 84, -114, 68, 128, -183, -97, -22, 133, -180, 77, -60, -195, 116, 105, 4, 271, 13, -170, -103, -167, -109, 111, 105, 89, 242, -152, -345, 251, 288, -316, -13, 114, 71, 64, 181, -355, -482, 44, 31, -74, 313, -433, -79, 398, -237, -89, -15, 85, 20, -106, 10, 592, 132, -297, 3, 116, 142, -150, 301, -128, 0, -185, -303, 150, 47, -91, 298, -58, 5, -233, 186, 139, 72, -20, -162, 3, -107, -108, -17, 110, 272, 126, -53, -99, 205, -139, -74, 245, -20, 128, 72, -70, -230, 69, 324, -24, -71, 81, -100, 67, 185, 63, -157, -43, 50, -105, -484, 54, -30, -68, 111, 38, 29, -22, 241]
7889B41m14J32l07J53L40j62J37n90N54K90k98l41M16k13r5j88OL25j4j36M46
7910B82k96n8J93l11J1O50m17L3L86o86J8L21j19m04J30L52l5P8n9Rj99M0J5R5
7934B9k8J46J66l17K65n70L75K18l75p1L59k25l12k1M56R3k58M51n46J81R9n2
7956F3JK84k46J06j75j64N72m27P2r2P5k53L24J40l82K94k21m3Q1j92pK42Q7k9
7980A10n1%J04r6k18M41n67L31L8N0k36K6J32m04N48k55J50r4M73l55j20O2j67
8003i8k79J10N40l14k92L30P7R5l90K18J4J73K0m90J4L85j04k96J94L8m0k38L42
8026Ik07K67k1K17l15O5J23j4L7o7j04o7J99j46j68L43k86N9R6Q4k88j66J89K79
8050A18l63K87j37K53j93%r0J57J37q6l53J47L02j57j4K06k60l0J11j77K89K29
$$ y = [241, -173, -41, -348, -195, 145, -17, 120, -470, 84, 374, 76, -265, 151, -62, -157, -345, -339, -14, -28, -164, 282, -14, -72, 121, -190, -179, 471, 54, 87, 473, -213, -195, 126, 7, -397, -267, 85, 50, 128, 69, 78, -121, -81, -66, 29, 1, 147, 313, -4, 261, -309, 66, 284, -91, -162, 197, -28, -340, -361, 95, 188, -70, 381, -165, 16, 115, 63, 64, 348, 102, 208, 33, -131, 441, 14, 86, -6, 69, -184, 140, 280, -102, 192, -29, -72, 9, -183, -190, 52, 139, 110, 59, 59, 163, 67, -151, 290, -277, 54, 92, 142, -94, -68, 64, -340, 208, -47, 103, 9, 482, 127, 7, 69, -98, -377, -267, 273, -41, -333, -3, 74, 169, -221, -3, 11, 184, 204, -286, -272, 113, 9, -287, -93, -55, -95, -333, 9, -198, 69, 48, 265, -50, 15, 138, 124, 161, 94, -10, -77, 122, -24, -192, 151, -135, -76, 20, 104, -184, -350, -161, 118, -245, 42, -95, 158, -35, -35, -125, 32, 169, 83, -270, -123, 179, 22, 8, 214, -46, -76, 35, -142, 147, 376]
8072C76k51n63M76J85l52m9L83n63L91J2L40k96Q6ol72J97L27k69j49J20r3K08
8094A38j92P5j90J22l6R0P4n5K91l70J88l80K78j52L27k68J56j69L33m70J41N6
8116a3j26J92j73K8N7j99M9P4K12p4J08l30Q1Q6j95J48M2j41J48L2L21k61j72
8139a06j22k9L71j35Q3j67K36l80J74K57k70l7J36K61l91K76k76K21q9L4j1J1
8161D7K47m04J56m9m8Q9l73L27J8M5P6J74q3m27K16j98J62r4Q0J06%j5K29j35
8185A46j43J54j62L33j43k27
$$ y = [376, 125, -438, 38, 223, -129, -178, 205, -358, 33, 45, 385, 89, 175, 169, -203, -6, 321, 52, -97, 23, -70, 138, -54, 21, -169, -47, -83, 7, 81, 26, 317, -53, 135, -245, 33, -119, 208, -60, 96, -73, 260, -210, -69, -13, -139, 53, -120, -92, -35, -234, -185, -111, 101, 27, 135, -195, -114, -28, -223, -75, -33, -174, -26, 6, 327, 66, -106, -228, -257, 114, -21, 62, -105, 131, -249, -75, 182, -88, -125, 11, 272, -119, 157, -119, 102, 13, 47, 36, 47, 294, -110, 46, -3, -51, 38, -335, -8, 10, 55, 131, 305, 222, -205, 11, -187, -25, -119, -39, 67, 67, 52, 281, 146, 3, 157, -5, 328, 185, -42]
8191d2
$$ Imaginary data points
##PAGE= N=2
##DATA TABLE= (X++(I..I)), XYDATA
0@%%%%%%%%%%%Qj6J6j6J6j6K4l2L2l9M7n1N9o9P8r0J05j17J30j47J65j85K07k32
35a23K58k86L18l52L90m32M77n27N85o49P19q00Q93r99J122j267J444j662J936
54A045k297K797l535M729o986J2681n1256j07914J24475J13220m4701q3346J8036
67b3052M9481m844m8182j4803L5409L6008n569j2041j5736l9580p491O9950L4257
80E3807o3172l1076O3405J7941p3805k8812O2142M4666k1654l4975m938P077r178
93a8572n752L8864L2775m4899m7661M6139M0327o6654m5416Q2149P0465n9183
105B2582p8814J2388N4115J2900k5384r706K8783J1996l7752k8213K0635J7889
117A419N151K8790m86o8447k6698P1161L9093n5235k7410N2307K7386n1023n1528
$$ y = [0, 0, 0, 0, 0, 0, 0, 0, 0, 0, 0, 0, 8, -8, 8, -8, 8, -8, 16, -16, 16, -23, 24, -27, 32, -37, 41, -49, 56, -61, 69, -78, 87, -98, 109, -123, 135, -151, 167, -185, 205, -227, 250, -277, 308, -341, 378, -422, 471, -528, 594, -673, 771, -891, 1045, -1252, 1545, -1990, 2739, -4247, 8434, -42822, -150736, -26261, 86959, 42258, -41088, -23052, 26429, 21585, -26597, -41400, -5991, 30017, 24448, 12407, -3329, -42909, -50400, 19550, 53807, -9365, -40441, 22964, 40905, -32900, -61712, 430, 45096, 23442, -11533, -16471, -9394, -18572, -24324, 14540, 47315, 2416, -45245, 894, 41221, -25433, -70849, 11300, 81765, 22582, -56232, -43844, 10271, 23171, -2213, -11919, 16864, 28860, -8892, -37105, -16470, 1419, 6570, 35360, 34874, -33573, -60271, 10890, 49983, -5252, -32662, 19645, 47031, -3992, -55520]
130e5520K3903O4349J3407n0178j8614L5922j240m2509J4931N0431j2962l7419
142a5499J8236J6711l6696j7104M0560L0579j7009k8976l235J8776J50k5036O682
155a1861M4119j54m8283n627L0019j1944j6440L9450K4699m3908l2507K6327K4335
168A8225j8131j9798J8704L7167p499n9129j8026N6891L2433l6423j7129K3935
180A1220n043k7443J1236J9595j0985j253K1009l957l1831j2508K5141L2332n869
193B1644m0723n296M3814L254n2948m730N4715J1323l7511p385J5347p804p533
206a3833J5652J1311q126j2651k963J0983M135k1006k039L8898R802m4552j6557
219c0946L4665P318k3745P498K0920j1588j7348M112O478p56L086M997P361n165
$$ y = [-55520, -31617, 32732, 46139, -4039, -22653, 13269, 12029, -30480, -15549, 34882, 21920, -15499, 2737, 19448, -17248, -34352, 6208, 36787, 19778, -9198, -12433, 6343, 6493, -18543, -11861, 32258, 32104, -16179, -21806, 8213, -3731, -20171, 19279, 43978, 70, -32437, -6110, 18225, 94, -19704, -1000, 36167, 28668, -30461, -48487, 8404, 40837, 4414, -12715, 11220, 6177, -21266, -10030, 9565, -1420, -2673, 18336, 14379, -17452, -29960, -4819, 27513, 21644, -19079, -24375, 19439, 22693, -30255, -34985, 19730, 31053, -6458, -13843, 1504, -6300, -13833, 1819, 13130, 5004, -7647, -10610, 373, 4508, -16498, -18537, 20361, 30163, -14389, -30946, 3719, 11037, -12708, -5210, 15710, 4122, -13226, -9114, -2636, -3392, -306, 4691, 12052, 6887]
233F887k6556p461L7853J6964l7138j3755L4288O491l2096k962K4360M322q964
246B233k118k647m35K281m089M019J1421p944j2771J4482R165k3805m930K9537
260A4399K744k6159R05J7319o338j1606O694Q415K905l009j1267p11J3223m150
274C364j2895J4420J4776k1853j4511K0336O902j4627L874J3189q018j0933L407
287b569L267K959L690p514m465J0597j361j4426R155J5484j2876j0544J4383J253
301G033j6103N470J3545p585q511N821K463k24K186p499l673J3540J298j5894
315h133L680J3602j0257j0478J3479N359j1929K531P947q641m338Q602L39l279
329a516L715m961o879J0333M789j2109J931J3167q656j0902J0731M533r599L568
$$ y = [6887, -19669, -27130, 10723, 27687, -9451, -23206, 11082, 17573, -14523, -17485, 6875, 11197, 2233, 115, -2532, -2967, -686, -4775, -756, 10665, 2721, -10050, 4432, 13597, -10208, -15138, 14399, 17143, -9016, -8111, 9208, 2870, -8736, -2042, 6373, 9278, 6269, -4998, -5709, 7514, 3364, -9531, 4889, 19665, -2188, -16699, 3637, 10539, -4088, -214, 12975, 4957, -5976, -2569, 698, 3657, 7347, -167, -4632, 5965, 4604, -9822, -667, 14817, 1941, -8603, 5780, 7033, -9070, -3600, 9945, 2360, -6151, -330, 2133, 1909, 4095, -3404, -7077, 6463, 7761, -8133, -4453, 9149, -1108, -11586, 1893, 7252, -4677, -2146, 5801, -2840, -7178, 1424, 1763, -1516, 2199, -2762, -9641, 692, 5481, -6628, -4697, 8470, -186, -11088, -357, 4176, -5423, -1855]
343a855O708r589l768R322j94l595N360k691p639P540N226j0744Q78J1634p122
358e29j0205J0735N159r232K282O249p914k131R349k904n328P048o25r449O175
373a320P767q731j058R792n641q188R814L607r449K602O457q167k559J0109j802
388C233n920O634j5r408N639P862q263k530Q769m744p826R701M459r740K076O236
404F163p158k320R949k444p298O144J259r134M508Q763q027l119Q665l780p630
419e459Q470M153r007O91O379p417k377J0062j025p805N116K055q027L725P473
434G007p704l771Q693k938q379Q399N723r160j266O789n125k201Q436k428p604
449e529N508K298p966L069Q379p144m362R336k926q466P560O959r909k852O981
$$ y = [-1855, 4853, -4736, -8504, 818, 624, -2971, 2389, -302, -7941, -401, 4825, -5919, -5041, 6593, -529, -10734, 1, 5160, -4072, -1790, 4459, -3455, -5586, 3763, 859, -4469, 2579, 1954, -7495, -1320, 6447, -2284, -3342, 6450, 809, -7379, 2435, 6042, -3407, -805, 5652, -2515, -5074, 5035, 3233, -2687, 3947, 3932, -5476, 163, 8025, -238, -2768, 6001, 1257, -6569, 3132, 7591, -2149, -73, 6163, -995, -3315, 6634, 4190, -3108, 3036, 4295, -4839, -331, 8432, 405, -2714, 5951, 2171, -5459, 3011, 7164, -1843, -1152, 5227, -2190, -4567, 5495, 4470, -3335, 1781, 3836, -4191, -466, 7007, -697, -4468, 4225, 1287, -7092, 1307, 7030, -2130, -3396, 3393, -1732, -3933, 4503, 2075, -5529, -21, 2277, -5689, -2620, 5759, -1385, -5747, 3589, 663, -7803, -243, 6716, -3193, -6045, 936]
464I36k896k310O645j221o538N319J621q226L984Q952p715n737R041j625r108
479h878Q426P616r532m489P390m35l002M709k239m401O755N94j0280M544J0345
494G123p963o589J0610O33j0732N597Q787q672n442P656J813l348J275k691k035
509c978Q266j33j0300N422J1155j0379r319J0877M716j0162L781R182q608p757
523g237O945M791j220K78l594k158P079k655j0576Q827J4947j2208j3561J2017
537A675O616j1796K61J1732l261q113K058K057l58J548k594l21Q434l203j3712
552h977O657J4213j1900j1039J5952Q993j7088p007J2235K878n875R08K429M04
566B783q03o897j946J1324O81j1073O746J1843j6849j5995J9746J7125j4745j1466
$$ y = [936, -1960, -4270, 2375, 1154, -5384, -65, 1556, -6670, -2686, 6266, -1449, -7186, 1855, 230, -8878, -452, 7164, -2368, -6857, 533, 98, -2904, 1805, -434, -4835, 1920, 2514, -7766, -3222, 7123, -840, -7429, 3181, 3814, -6918, -1321, 7466, -1206, -6648, 1008, 2821, -527, 748, -1943, -3978, 4288, 4155, -6145, -723, 10432, 53, -9266, 1611, 6327, -3835, -54, 9128, 520, -7237, -292, 4499, 3279, 3557, -37, -2195, 4884, 2229, -8347, 480, 15427, 3219, -10342, 1675, 8291, -3505, -3244, 8488, 5227, -2886, -828, 1229, 871, 2419, -175, -496, 7938, 4735, -8977, -2320, 11893, -7, -11046, 4906, 13899, -3189, -10196, 2039, 4917, -958, -50, 2379, 2783, 1980, -4917, -6863, 4461, 5142, -5931, 815, 12658, -4191, -20186, -440, 16685, 1940, -9526]
580i526J0467M341q856n023L537R713N890r837j0238N868L213o917Q806J3336
594A4774j5493j6608J6805J2984j9431j0005K0596J2530j3397j5306Q87J2989
606A325O363j0413n556J4126K893j8331j567J6175m515j1539J6819J2337k2672
619d555j6784J6295J5730o368r545K689Q625K87j6243o495J9598J1140j3638l081
633b345R857j2181j5866K0123K1590j6450j7570J3462J1388j5154j4278J0717
645f707K4011M339k5879j6074J9091J3491j6696l439K1258j66k1737J825J2785
658F102q749o657J7471J0612j5012j6053L590J4368J940j3011Q59K2696p70l4060
672a6674n566L2329O442k2914L466K0437j1146k4264N453K0568K960r463j848
$$ y = [-9526, 941, 5282, -3574, -8597, -5060, 4653, 10543, 706, -9532, -3664, -451, -7368, 1438, 14774, -719, -17327, -522, 12462, -6969, -16974, 3622, 16152, 2755, -12551, -11664, 1325, 7688, -2725, -8281, 5845, 8738, -9593, -11160, 5015, 500, -11039, 5780, 18117, -4555, -21339, -5044, 10686, 4318, -5227, -2538, 6087, 6374, -9869, -16364, 3234, 14374, 736, -2345, 7512, -4669, -20535, -412, 21178, 4728, -12842, 620, 12008, -3146, -17424, -6707, 17304, 21643, -4236, -20310, -1219, 12272, -4424, -7863, 13395, 13229, -8508, -6683, 6102, -2647, -9304, 8167, 18779, 3767, -12286, -8696, 5672, 7612, -5399, -4540, 18156, 17386, -16674, -22240, 10089, 16531, -6383, -2917, 17520, 6374, -17890, -12437, 8131, 11091, 1628, -220]
685b20Q460k462k1121m715L0339J6516k6394j5898K0576L277k4060K408K7039
698A3745K552j6823l453K425o490l411J2706J6268l876k4965p398K5784P253l1569
712a7252l916M2460J0569m3620k0239K8325J7912j2438q512Q510O907p432j3081
725a1807K88J1562K183j078J1837k646l1545n798L6059J2612k8962o500K5968
738A2173J335k8351q700K0715J8029l759j3022k284K677j0573m294K5046J5164
751B4156k6741j7574K6134R725l2350r536L6212K0902k3024k6733J927J7527P745
764H370p621k407R310k523j1866L793N077j3035K643L1329K126m0264j3023L2593
778D502J5396k1703j1072J8972J4601j5861k6052M099K8579N912j8455O56J1945
$$ y = [-220, 8240, 5778, -15343, -20058, 10281, 26797, 403, -15495, 5081, 8358, -15702, -13294, 13745, 16297, -526, -3979, -1554, -8044, -11455, 1251, 17519, 13643, -11322, -18720, 7064, 14317, -17252, -21168, 21292, 31861, -11759, -31998, -3673, 14239, 1801, -6711, 1799, 8706, 1274, -11807, -11519, 43, 2226, 1148, 12985, 10339, -21206, -27004, 9055, 21667, -7295, -13795, 12173, 13508, -14843, -23543, -2828, 15201, 11442, -1580, -3864, -1187, -11760, -16054, 8992, 24156, -2585, -20159, 5975, 15700, -16650, -26186, 10026, 30928, 7904, -18829, -16902, 625, 8370, 749, -1658, 7652, 5129, -6737, -2944, 2133, -10902, -8259, 23070, 25196, -15068, -28091, 4502, 19898, -1805, -12877, 6095, 20696, 4835, -21217, -17118, 11461, 17373, -1082, -426, 11519]
791A1519j5532j5783J9450J8401j4220j0014J5160Q92k0296o785J7434J7021l531
804A3716j6451m374R850l559j1710J3117K0389j2996k1521J1908J0812j8297n507
817a4623K6279J1947k2265j8288R574J5629k599j4946L792K2574k233k8925l997
830a8081K3990K648j4636P654J1279j4085j2842J1292P163p197n4J1178K324j4601
844c968j4672Q168K3581j045k2312K612K2663j0534k7548R808K8320l086j7272
857e285J488M799o611m201Q231R892j37j2896m431J1385N46j5856M720K4751k983
872A3412k6416k69J7767k480q452P206P066o887o651J939L744O0m963L234J3931
887A2241k837k3716j564K5446L117k1686R23J9830k791j7338j202R237N122O60
$$ y = [11519, -4013, -19796, -346, 18055, 3835, -6179, 8981, 9873, -10423, -17208, 226, 17247, 13716, -2735, -7109, 2741, -818, -12528, 589, 20978, 7982, -13539, -1631, 9181, -9116, -14623, 11656, 23603, 1338, -16950, -7376, 8253, 5654, -9292, -5500, 17074, 14841, -14084, -18081, 5909, 8557, -6079, 1575, 12854, -1231, -14073, -2781, 4382, -2815, -2869, 8309, 10633, -3968, -18640, -10472, 13109, 12064, -10248, -7636, 15027, 4493, -23055, -13247, 15073, 11987, -5285, -3797, 1002, -5609, -9810, -1579, 8313, 8176, -4720, -9151, 2234, 2780, -13076, -8356, 16395, 13412, -13004, -13273, 4494, 2014, -6438, 768, 7834, 947, -5704, -3765, -21, 39, -4924, -1690, 12241, 9404, -14312, -15876, 9570, 12687, -8999, -8076, 11754, 8963, -8375, -9577, -340, 4782, 5442]
901E442k935k916J44l967k110J0798N202j1689l242J4217l329j8654M976K0842
915A2779j617j4828l09O326j127l199O85M883M521o380q595O879P136r633l686
930f165J5244K133j7289k100J3874n87q784K958N596j774l153k433J58N043l47
945B374n181M670O261j0679o957J2109N003j1447R5J1392l863j0452K280O621
959B226K74r60j850j210L098j520p136N001J0582o759r213P493M131r230j40J0157
975D944j643p399J839K750k684Q27J204j015K855m39p398K579R053n168q248P944
991AN627q509k488P393r88n537L787K055k802Q39J95k959K974K197n195J001P695
1008E286m600q404O436O203o515j786O475k145m810L154J890k267K378O21m208
$$ y = [5442, 2507, -409, -265, -4232, -6342, 4456, 9658, -2031, -5273, 8944, 5615, -13039, -8063, 12779, 11162, -3666, -3975, 2351, 1224, -1975, -1290, 3593, 8114, 1734, -6861, 18, 7154, -2479, -6165, 9079, 11212, -6077, -8177, 5697, 5110, -3674, -716, 4880, 3106, -47, -2480, -2322, 2721, 2374, -2807, 1863, 8124, -2555, -9512, 2597, 7600, -3847, -3752, 7640, 3777, -6675, -4395, 2226, 2500, 1540, -310, -1520, 1578, 58, -7078, -2077, 8505, 1746, -7467, 26, 4157, -5073, -5213, 4944, 3301, -4098, -2259, 491, -2193, -1366, -162, -1177, 1678, 1239, -6159, -3580, 5473, 305, -7943, 1, 5628, -2881, -5369, 2024, 1036, -4501, -714, 1341, -1461, -622, -427, -3386, -412, 1785, -3410, -2409, 5286, 686, -7718, -1282, 4921, -1594, -3380, 3095, 950, -3860, -706, 1184, -1083, 1295, 1916, -2292]
1023b292J335L270m473k37P382k557p584M488N125n787j108O329k259m560L862
1038I34J040l271K599J672m925J395M150l561k078O293j093p117L949N031n494
1053d76j271N857k346m403M310J340l905K435J947n150K00N656k926l088N223
1068C403j24o817K877N327m997j353N265k767m148M590J825m955K221K838n070
1083a885l97N528k659l464N255p1o203K549M835m351j373M982k910m026M999J310
1099B119m687J834L223n124q14N448j747l792M725rn607K645M751m245j766M761
1115A715j820m334M617J629m784J719L232m691j071O180j835l982L974M39n157
1130d169K517M992m912k131N285j435m019L659K432m558J734K866m941n40O327
$$ y = [-2292, -957, 2313, -2160, -2397, 4985, 2428, -5156, -668, 4457, -1330, -2438, 3891, 1632, -2928, 934, 1974, -1297, 1302, 2974, -1951, -556, 3594, 33, -2045, 4248, 3155, -3962, -13, 5018, -476, -1747, 4110, 1764, -2639, 1671, 3011, -894, 1541, 3488, -1662, -1462, 4194, 1268, -1820, 3403, 3279, -3538, -661, 4666, -331, -1684, 3581, 814, -3334, 1256, 3081, -1874, 347, 3185, -1885, -2282, 3246, 587, -2877, 2378, 2307, -3896, -1347, 3488, -863, -2236, 2746, -164, -4190, 809, 2119, -2568, -734, 2489, -2635, -3449, 1999, 252, -3540, 1185, 1176, -4431, -1786, 2965, -1280, -3046, 1715, -105, -4439, 178, 1807, -2977, -1258, 1974, -2717, -3788, 2392, 557, -3425, 549, 988, -4169, -1652, 3340, -1572, -3703, 1582, 147, -3872, -213, 2219, -2339, -605, 2261, -2680, -3220, 3107]
1145C107j311n384L831J457m920K382M899m740k556N572j75n437L300K640k779
1160a14M80J821m223q2O623j925n864L771K827n089J201M802l564l247N235M44
1176C096n163J478L359k216L11J292m520J069P187l010p073M200M496m938n81
1191a013N240l524l441N012Q99n256J905L429k595l31N32l394K103O933m543p850
1207e894N312O018o165k600O268n95m417K485O50l659K647K551k448l40P44m119
1223c562J916P080l996p941O485N987p968l752P257J164m939J429R50k227J400
1238g17J407k724Q36K447l578N81N834n085p663Q283P961q936n969Q105K334o237
1254c121r84L801J059J700k366n019J999M599k724p09N565l368p544O432O193
$$ y = [3107, 1796, -3588, 243, 1700, -3220, -838, 4061, -679, -3235, 2337, 2162, -3275, 25, 2665, -114, 366, 2187, -2036, -2118, 4505, 2580, -3284, 487, 3314, -1775, -574, 4228, 664, -2583, 2652, 3096, -2067, -589, 2770, 554, 865, 2157, -2363, -1294, 5893, 2883, -4190, 10, 4506, -432, -1013, 4227, 703, -2738, 2274, 3173, -2083, -178, 3251, 656, 325, 857, -2537, -434, 6499, 1956, -5894, -582, 5436, -729, -3329, 2939, 2344, -2073, 412, 1062, -2597, 50, 2601, 153, -187, 557, -3562, -1646, 5434, 1438, -6503, -18, 5969, -1999, -5751, 1506, 2670, -2269, -840, 110, -2117, -717, 690, -2034, -1198, 1249, -2329, -1748, 4086, -999, -8662, -379, 7582, -1354, -7323, 782, 3116, -3121, -4105, -304, 755, 2455, 89, -4930, -2931, 1668, -1056, -1765, 3800, 432, -7112, -680, 5513]
1269E513r069l323J1256L244j0579m142M366N441J224l350m579M037M337o475
1283b099k979Q056O13o688M525M867j0085m806J2186N154r716m562O131M328k040
1298B885o726k125Q903O559q830o272P031R81o877N202P932p979o945R546L523
1313F808j0394l792R901P356l773j0396m825J0367P602r332m932J0733J861j1969
1327d785n1Q927l733m394R887L217j2313o279Q047Q019q89q490k424R398M007
1342H144j3732n903J4919O881j1904k684Q325m357p416O853P446n790m465L775
1356I2L388l613p140K61J3018N696j4531q770J2876M848j3064l21J5386n29j2957
1371e360m91N739j283k055M106M775j631q276n121Q901P314r206m773J4187K514
$$ y = [5513, -3556, -6879, 4377, 7621, -2958, -7100, -2734, 2707, 3931, 581, -3998, 39, 4376, -2099, -5078, 2978, 3591, -3097, 1428, 6295, -3790, -8596, 3590, 8744, -972, -5534, 597, 4925, 2885, -3841, -5966, 2937, 9496, 666, -5606, 1425, 2406, -4471, 731, 8663, 684, -6261, 3285, 6808, -3586, -7378, 2523, 9879, 6106, -4290, -9115, 1252, 8854, -478, -5410, 5323, 7184, -4785, -4836, 4091, 358, -4036, 5851, 9068, -3245, -9524, -1477, 6542, 5653, -2837, -5261, 4137, 8144, -5588, -11491, 3428, 10309, -1595, -4279, 4046, -311, -7727, -874, 6572, 782, -3683, 92, 3480, -133, -7273, -7012, 6006, 11702, -2829, -11599, 1277, 6125, -6939, -7260, 8126, 7597, -5360, -5851, -112, -1395, -3450, 656, 5431, 3800, -4476, -9597, -696, 6618, -2588, -7361, 6826, 9340]
1386I340j8394m107J6582L808r912j15O631k889o157j84N019M181j766m581M133
1401A589K117j1177l367J7239O312j7321m961J5185J571j5348j295J3353N694
1414I591o029p174j291M689J173l574M643O145p732p258Q783K611j2733J761J9193
1429A2798Q3j9577m859J2182O081n110m130L569N932l814j0797K178J1079j925
1443C690n991P984K423j6019l770J8021N160j3857l693J0461K844q962p019N393
1457c335J1214P68j0334k125O561l835o045J0145P153j2494m854J3361M01j5766
1471i185j357J6554O947j0191j1020J542J0487L11r872K770J2584m059j4495L451
1485e533R605n819l448J1838K454j4520m763R385N208l984l739L093O041l874
$$ y = [9340, -9054, -13161, 3421, 7229, -2683, -2798, 3833, 944, -5213, -5397, -378, 3803, 2037, -2544, 1589, 3706, -7471, -10838, 6401, 12713, -4608, -9569, 5616, 7187, -8161, -9456, 3897, 9591, 3562, -3612, -4903, -214, 959, -2615, 2028, 8173, 441, -6817, 1966, 4577, -8156, -6395, 12798, 12881, -6696, -11555, 627, 6708, 1598, -2532, 1037, 6969, 3155, -7642, -5464, 5615, 3690, -2301, 5683, 8106, -7913, -11683, 6338, 11498, -2359, -6052, 4409, 7253, -1709, -8728, -3335, 7879, 8647, -1687, -3812, 2749, -1086, -7131, 3014, 10167, -2327, -7181, 6180, 6581, -9185, -10542, 6012, 12959, 2768, -8252, -6710, 3777, 4088, -5784, -3014, 9570, 5511, -8984, -5533, 4072, -1747, -5195, 6643, 9097, -5423, -10186, -801, 4407, 423, -3316, -223, 5818, 1944]
1499A944j2190K291J4708q92j2203M496Q940r947q450J0809Q315p893m821N692
1513G99K770n360n534L211R837J580j1734k318J0452j323j1646N163J3471n073
1527D295j0270L791M860o030j516P544L259l937o047m22N700J139o616K125J1881
1542I756m172j6026K888J4925k712j0283N343P015n384o134J649L993K728j490
1556B096k616J773J146o810k79J1001j08j1036K351J0405n710j0798O104R448
1570F967k903n415J169J064n1j782j240N185L277o922l748Q056k6j0302L293J2486
1586I108k929j1309J193O912j780k665J441K337O51k219m712J781N230k769k502
1601b232O526j92j0491Q12J1161k014q237L223O224l685m610O71K880K318p41
$$ y = [1944, -10246, -7955, 6753, 5861, -6342, -1846, 7094, -2853, -11303, -494, 7821, -72, -4893, 799, 3569, -1791, -7325, -4114, 5723, 7303, -4431, -6749, 3703, 2380, -9266, -4103, 9368, 4295, -5975, -2184, 2676, -3354, -4870, 2674, 5933, 1996, -4051, -4473, 1227, 2366, -4250, -2125, 9756, 5584, -10442, -7554, 7371, 4659, -5624, -281, 6734, 1350, -4784, -3135, 858, 3586, 2096, -520, 1253, 2399, -4411, -4690, 6311, 6203, -4833, -2482, 7923, 2213, -8585, -2481, 6967, 4064, -1351, -182, 882, 831, -951, -2191, 2994, 6271, -651, -4399, 3657, 3631, -6671, -3378, 9108, 6179, -5130, -3937, 2975, 1195, -1470, -29, 2308, 2959, 740, -3972, -2191, 3039, 270, -2232, 4294, 4102, -6389, -5577, 5584, 3570, -4667, -1444, 4780, 1095, -3515, -2844, 36, 2354, 1613]
1616A613m262J253M476l918m736O795L994q039j569P930j768p668K859O224k087
1631A097k739P15j70O05j13k281J715M835l164o280N135L809o591j199Q445j64
1647C655p986J381M301j342j420J975m64K7O0l453O89N899k132n435M316L796
1663C867n857k642O726J116n448J358K467k202k30J935j275o6J969k654n38M054
1679B580j510m992M042N330o202k767N908P26n001J129K651j517J60J212k121
1694c72n73K667j274j390L850n57n243K668M653m518k493N007R19m776J011K016
1710A595j857R63J569k150j127K866j305k090L447O24m867J700M090l605k378
1725b525M704K56m401J483K214k822M81K280k337j184L781j159k915L319N01m110
$$ y = [1613, -2649, -1396, 3080, -838, -5574, 1221, 5215, -2824, -4393, 3537, 1769, -5899, -3040, 3184, 1097, -1642, -927, -1097, -492, -605, -2886, -1171, 3664, 500, -5780, -645, 3164, -3427, -4626, 3819, 3655, -4331, -2950, 1351, 9, -1411, 564, 100, 127, 187, -3266, -2577, 3322, 1190, -4245, 71, 3867, -1990, -4632, 2094, 3210, -2238, -880, 1587, -615, -845, 1090, -185, -251, 1718, -936, -1474, 2580, 1070, -3922, 120, 5450, -752, -3519, 2389, 3115, -1886, -757, 1894, 377, 537, 1749, -372, -945, 1722, 448, -942, 2908, 2351, -2892, -224, 4429, -89, -2582, 2425, 3344, -1432, -421, 1595, -262, 701, 2270, 120, -1007, 1859, 554, -1536, 1911, 2535, -2332, -632, 3458, -147, -2525, 2179, 2435, -1966, -483, 1731, -1091, -610, 1670, -667, -1851, 1930, 771, -2144, 1175, 1676, -2434]
1741b434J296L711k829k378L828L31l832J155K584k654K88K718k891j630L965
1756A228n51l127K698R55l621M68L676k202k046L623m8l690J127K710k415p0K697
1773A412k564j907M149j56l379K062J624l366K37L553j836k474L450O53m171K160
1789e53K075k133l22K290j671k160L855K14l844K101K134l147k32L388j410k562
1805a977L297L86l514J151L250k568r85K716j850j863L738L0l261J643K268l419
1821i58k18L742j563k306K797M13l623J687K970k368j046K224j449j556L192J36
1837B074l356J539K932l371j371L574o32k530K428L2l177J642L441k545k127K556
1853A109k88j800K397j29l319J798L520m274j503M287Ml306J689N20k662J499
$$ y = [-2434, -1138, 2573, -256, -2634, 1194, 1525, -2307, -1152, 1432, -1222, -934, 1784, -1107, -2737, 1228, 677, -2450, 248, 1203, -2418, -1950, 1726, -476, -2522, 1101, 1053, -2637, -1510, 1200, -1215, -1285, 1412, -1152, -3059, 1090, 934, -2445, -383, 1241, -2125, -1888, 1665, -171, -2645, 805, 1458, -2713, -553, 1522, -611, -933, 1357, -314, -2474, 1381, 1595, -2249, -148, 1986, -1161, -1393, 1995, 585, -1977, 1320, 1706, -1808, -657, 2593, 25, -960, 1756, -94, -1957, 1781, 1811, -1450, 193, 2461, -958, -1176, 2566, 1003, -1303, 1494, 1907, -1716, -29, 2941, 573, -473, 1751, 302, -1254, 1938, 2074, -1282, 257, 3189, -182, -1553, 2021, 1389, -1141, 1287, 1319, -1858, -216, 3225, 680, -1447, 1109, 821, -979, 1418, 1289, -2030, -232, 3288, -986, -2489, 1798, 1802, -1504, 185, 705, -1957, -458]
1869d58K784l136j271K889n95j583K132l04l141K012L041l683j862M477L1l491
$$ y = [-458, 2326, -810, -2081, 808, 213, -1370, 762, 458, -2683, -671, 2370, -1313, -3175, 1302, 1333, -2158]
$$ [...]
8191I2
##END NTUPLES=NMR FID
##END=
