##TITLE=1H_Ser Gli-AcNO2
 200.13MHz, CDCl3,
 8 sc
 
 30.1.2025
##JCAMPDX= 6.0         $$ Bruker NMR JCAMP-DX V2.0
##DATA TYPE= NMR FID
##DATA CLASS= NTUPLES
##ORIGIN= UXNMR, Bruker Analytische Messtechnik GmbH
##OWNER= pz
$$ XWIN-NMR		Version 3.5
$$ Thu Jan 30 17:06:31 2025 Russian Standard Time (UT+4h)  she@DPX200
##.OBSERVE FREQUENCY= 200.1313
##.OBSERVE NUCLEUS= ^1H
##.DELAY= (6, 6)
##.ACQUISITION MODE= SIMULTANEOUS
##.ACQUISITION SCHEME= undefined
##.AVERAGES= 8
##.DIGITISER RES= 18
##SPECTROMETER/DATA SYSTEM= spect
##.PULSE SEQUENCE= zg30
##.SOLVENT NAME= D2O
##.SHIFT REFERENCE= (INTERNAL, D2O, 0, 14.3821)
##AUDIT TRAIL= $$ (NUMBER, WHEN, WHO, WHERE, WHAT)
$$ ##TITLE= Audit trail, XWIN-NMR		Version 3.5
$$ ##JCAMPDX= 5.01
$$ ##ORIGIN= Bruker BioSpin GmbH
$$ ##OWNER= she
$$ F:/spectra/data/she/nmr/H-C/1/audita.txt
$$ ##AUDIT TRAIL=  $$ (NUMBER, WHEN, WHO, WHERE, WHAT)
(   1,<2025-01-30 17:04:18.67 +0400>,<she>,<DPX200>,
      <created by zg, POWCHK disabled, PULCHK disabled
       configuration hash MD5:
       00 E9 B6 7A A2 85 ED C7 34 08 36 98 17 FE 4E 26
       data hash MD5: 16K
       1E 3A C7 80 65 7F 15 8A F7 FB 8F FB E9 C8 64 9F>)
$$ ##END=
$$ 
$$ hash MD5
$$ E7 D3 66 46 78 FC 86 C9 86 09 FA 5F 1E 30 90 A5
##$RELAX= 
##$RELAX= 
##$RELAX= 
##$RELAX= 
##$RELAX= 
##$RELAX= 
$$ Bruker specific parameters
$$ --------------------------
##$DU= <F:/spectra>
##$EXPNO= 1
##$NAME= <H-C>
##$PROCNO= 1
##$TYPE= <nmr>
##$USER= <she>
##$AMP= (0..31)
100 100 100 100 100 100 100 100 100 100 100 100 100 100 100 100 100 100 
100 100 100 100 100 100 100 100 100 100 100 100 100 100 
##$AQSEQ= 0
##$AQ_mod= 1
##$AUNM= <au_zg>
##$AUTOPOS= <>
##$BF1= 200.13
##$BF2= 200.13
##$BF3= 200.13
##$BF4= 200.13
##$BF5= 200.13
##$BF6= 200.13
##$BF7= 200.13
##$BF8= 200.13
##$BYTORDA= 1
##$CFDGTYP= 0
##$CFRGTYP= 5
##$CHEMSTR= <none>
##$CNST= (0..31)
1 1 145 1 1 1 1 1 1 1 1 1 1 1 1 1 1 1 1 1 1 1 1 1 1 1 1 1 1 1 1 1 
##$CPDPRG= <>
##$CPDPRG1= <>
##$CPDPRG2= <>
##$CPDPRG3= <>
##$CPDPRG4= <mlev>
##$CPDPRG5= <mlev>
##$CPDPRG6= <mlev>
##$CPDPRG7= <mlev>
##$CPDPRG8= <mlev>
##$CPDPRGB= <>
##$CPDPRGT= <>
##$D= (0..31)
0 0.7 0 0 0 0 0 0 0 0 0 0.03 0 0 0 0 0 0 0 0 0 0 0 0 0 0 0 0 0 0 0 0 
##$DATE= 1738242258
##$DBL= (0..7)
120 120 120 120 120 120 120 120 
##$DBP= (0..7)
150 150 150 150 150 150 150 150 
##$DBP07= 0
##$DBPNAM0= <>
##$DBPNAM1= <>
##$DBPNAM2= <>
##$DBPNAM3= <>
##$DBPNAM4= <>
##$DBPNAM5= <>
##$DBPNAM6= <>
##$DBPNAM7= <>
##$DBPOAL= (0..7)
0.5 0.5 0.5 0.5 0.5 0.5 0.5 0.5 
##$DBPOFFS= (0..7)
0 0 0 0 0 0 0 0 
##$DE= 6
##$DECBNUC= <off>
##$DECIM= 32
##$DECNUC= <off>
##$DECSTAT= 4
##$DIGMOD= 1
##$DIGTYP= 9
##$DL= (0..7)
0 120 120 120 120 120 120 120 
##$DP= (0..7)
150 150 150 150 150 150 150 150 
##$DP07= 0
##$DPNAME0= <>
##$DPNAME1= <>
##$DPNAME2= <>
##$DPNAME3= <>
##$DPNAME4= <>
##$DPNAME5= <>
##$DPNAME6= <>
##$DPNAME7= <>
##$DPOAL= (0..7)
0.5 0.5 0.5 0.5 0.5 0.5 0.5 0.5 
##$DPOFFS= (0..7)
0 0 0 0 0 0 0 0 
##$DQDMODE= 0
##$DR= 18
##$DS= 0
##$DSLIST= <SSSSSSSSSSSSSSS>
$$ [...]
##$SUBNAM0= <"">
##$SUBNAM1= <"">
##$SUBNAM2= <"">
##$SUBNAM3= <"">
##$SUBNAM4= <"">
##$SUBNAM5= <"">
##$SUBNAM6= <"">
##$SUBNAM7= <"">
##$SUBNAM8= <"">
##$SUBNAM9= <"">
##$SW= 18.0517328524113
##$SWIBOX= (0..15)
0 0 2 0 0 0 0 0 0 0 0 0 0 0 0 0 
##$SW_h= 3612.71676300578
##$TD= 16384
##$TD0= 1
##$TE= 0
##$TE2= 300
##$TE3= 300
##$TEG= 300
##$TL= (0..7)
0 120 120 120 120 120 120 120 
##$TP= (0..7)
150 150 150 150 150 150 150 150 
##$TP07= 0
##$TPNAME0= <>
##$TPNAME1= <>
##$TPNAME2= <>
##$TPNAME3= <>
##$TPNAME4= <>
##$TPNAME5= <>
##$TPNAME6= <>
##$TPNAME7= <>
##$TPOAL= (0..7)
0.5 0.5 0.5 0.5 0.5 0.5 0.5 0.5 
##$TPOFFS= (0..7)
0 0 0 0 0 0 0 0 
##$TUNHIN= 0
##$TUNHOUT= 0
##$TUNXOUT= 0
##$USERA1= <user>
##$USERA2= <user>
##$USERA3= <user>
##$USERA4= <user>
##$USERA5= <user>
##$V9= 5
##$VALIST= <valist>
##$VCLIST= <CCCCCCCCCCCCCCC>
##$VD= 0
##$VDLIST= <DDDDDDDDDDDDDDD>
##$VPLIST= <PPPPPPPPPPPPPPP>
##$VTLIST= <TTTTTTTTTTTTTTT>
##$WBST= 1024
##$WBSW= 4
##$XGAIN= (0..3)
0 0 0 0 
##$XL= 0
##$YL= 0
##$YMAX_a= 269431
##$YMIN_a= -318761
##$ZGOPTNS= <>
##$ZL1= 120
##$ZL2= 120
##$ZL3= 120
##$ZL4= 120
##$ABSF1= 10
##$ABSF2= 0
##$ABSG= 5
##$ABSL= 3
##$ALPHA= 0
##$AQORDER= 0
##$ASSFAC= 0
##$ASSFACI= 0
##$ASSFACX= 0
##$ASSWID= 0
##$AUNMP= <proc_1d>
##$AZFE= 0.1
##$AZFW= 0.1
##$BCFW= 1
##$BC_mod= 2
##$BYTORDP= 1
##$COROFFS= 0
##$CY= -3
##$DATMOD= 1
##$DC= 2
##$DFILT= <>
##$DTYPP= 0
##$F1P= 0
##$F2P= 0
##$FCOR= 0.5
##$FTSIZE= 0
##$FT_mod= 4
##$GAMMA= 1
##$GB= 0.15
##$INTBC= 1
##$INTSCL= 1
##$ISEN= 128
##$LB= 0.25
##$LEV0= 0
##$LPBIN= 0
##$MAXI= 10000
##$MC2= 0
##$MEAN= 0
##$ME_mod= 0
##$MI= 1.114404
##$NCOEF= 0
##$NC_proc= 0
##$NLEV= 6
##$NOISF1= 3.799351
##$NOISF2= 2.8
##$NSP= 1
##$NTH_PI= 0
##$NZP= 0
##$OFFSET= 14.38212
##$PC= 1
##$PHC0= 247.5443
##$PHC1= 16.99223
##$PH_mod= 1
##$PKNL= yes
##$PPARMOD= 0
##$PSCAL= 0
##$PSIGN= 0
##$REVERSE= no
##$SF= 200.129724274929
##$SI= 16384
##$SIGF1= 3
##$SIGF2= 2
##$SINO= 400
##$SIOLD= 16384
##$SREGLST= <1H.CDCl3>
##$SSB= 0
##$STSI= 0
##$STSR= 0
##$SW_p= 3205.1282051282
##$SYMM= 0
##$S_DEV= 0
##$TDeff= 0
##$TDoff= 0
##$TI= <>
##$TILT= no
##$TM1= 0
##$TM2= 0
##$TOPLEV= 0
##$USERP1= <user>
##$USERP2= <user>
##$USERP3= <user>
##$USERP4= <user>
##$USERP5= <user>
##$WDW= 1
##$XDIM= 8192
##$YMAX_p= 0
##$YMIN_p= 0
$$ End of Bruker specific parameters
$$ ---------------------------------
##NTUPLES= NMR FID
##VAR_NAME=  TIME,          FID/REAL,        FID/IMAG
##SYMBOL=    X,             R,               I
##VAR_TYPE=  INDEPENDENT,   DEPENDENT,       DEPENDENT
##VAR_FORM=  AFFN,          ASDF,            ASDF
##VAR_DIM=   8192,          8192,            8192
##UNITS=     SECONDS,       ARBITRARY UNITS, ARBITRARY UNITS
##FACTOR=    0.0002768,     1,               1
##FIRST=     0,             0,               0
##LAST=      2.2672688,     0,               0
##MIN=       0,             -318761,         0
##MAX=       2.2672688,     269431,          0
$$ Real data points
##PAGE= N=1
##DATA TABLE= (X++(R..R)), XYDATA
$$ [...]
$$ plain form
2155 1728 -2792 -2974 2173 3282 -948 -2474 1323 2732 -1265 -3574 117 3006 38 -2953 -174
2170 -174 3297 340 -3487 -1270 2871 1187 -2888 -1422 3025 2471 -2027 -2035 2293 2394 -1889 -2773 1174
2187 1174 2872 -1348 -3130 612 2841 -661 -3135 248 3339 329 -2629 -405 2975 1079 -2726
2202 -2726 -1326 2650 1534 -2571 -1781 2323 2150 -2000 -2489 1805 2362 -1720 -2892 1098 2826 -526
2218 -526 -2738 570 3091 -296 -2853 -487 2639 544 -2681 -328 2968 1215 -2637 -1559 1871
2233 1871 1058 -2346 -1997 1984 2170 -1425 -1946 1481 2410 -1118 -2845 641 2332 -729 -2348 294
2249 294 3123 522 -2502 -723 2738 441 -2994 -1350 1997 1416 -1564 -1177 2119 1809 -2130 -2371
2265 -2371 1254 1934 -1220 -1873 1561 2357 -493 -2259 300 1946 -260 -2540 -505 2493 459 -2006
$$ packed form
2155A728m520j82N147J109m230j526L797J409l997k309L691K889k968k991K779
2170a74L471k957l827K217M141j684m075J466M447n54m498qM328J01m283q84L947
2187A174J698m220j782L742K229l502k474L383L091l010k958K224L380j896l805
2202b726J400L976j116m105P90M104j73m150m89M294N57m082j172L990J728l352
2218e26k212L308K521l387k557K366L126k095l225K353L296j753l852J078L430
2233A871q13l404L49L981J86l595n21L427R29l528j727L486J691l061j619K642
2249B94K829k601l024J779L461k297l435J644L347n81k980L87L296l10l939k41
2265b371L625O80l154o53L434P96k850j766K559J646k206k280K035K998k034k465
$$ plain form
2281 -2006 -665 2034 809 -2132 -1342 1916 1201 -1620 -1268 1782 1634 -1111 -1444 1047 1994 -805
2297 -805 -2141 400 2012 91 -1728 93 1969 -172 -2207 -441 1904 633 -1395 -500 1947
2312 1947 1148 -1691 -1181 1416 1378 -1019 -1272 969 1658 -984 -1933 246 1211 -500 -1743 448 1651
2329 1651 40 -1858 -459 1447 358 -1476 -426 1723 1190 -1230 -719 1389 928 -1367 -1372 649
2345 649 793 -869 -1507 801 1437 -158 -1176 -119 1177 -358 -1726 -268 1719 810 -716 -155
2361 -155 1049 495 -1521 -980 866 952 -478 -566 896 1072 -1140 -1742 181 925 -331 -862 298 1468
2379 1468 244 -1446 -92 1094 225 -1174 -226 1329 858 -875 -656 891 911 -964 -908 711 966
2396 966 -341 -1143 561 1132 -315 -1366 -162 1354 237 -924 269 1142 445 -1446 -645 860
$$ packed form
2281b006J341K699j225k941P90L258p15k821L52L050j48k745l33K491R47k799
2297h05j336K541J612j921j819J821J876k141k035J766K345j271k028Q95K447
2312A947p99k839N10K597l8k397k53K241O89k642r49K179R65j711j243K191J203
2329A651j611j898J399J906j089j834J050K149n33k420N11K108m61k295nK021
2345F49J44j662o38K308O36j595j018J057J296j535j368J458J987r09j526N61
2361a55J204n54k016N41J846Q6j430q8J462J76k212o02J923P44j256n31J160J170
2379A468j224j690J354J186q69j399R48J555m71j733K19J547K0j875N6J619K55
2396I66j307q02J704N71j447j051J204J516j117j161J193Q73o97j891Q01J505
$$ plain form
2412 860 628 -770 -494 1263 1200 -736 -894 31 868 -763 -1264 130 1620 497 -754 135 996 196
2430 196 -1365 -957 966 893 -684 -341 1027 863 -1166 -1200 217 840 -755 -919 643 1347 -109 -915
2448 -915 2 1214 -220 -1135 -236 1203 539 -1127 -667 1206 665 -1133 -888 689 907 -810 -900 711
2466 711 1258 -449 -1363 642 1044 -375 -1225 -5 1793 101 -1419 -148 1181 309 -1204 -354 1105
2483 1105 508 -1273 -1155 639 897 -680 -771 1001 1139 -304 -1296 529 1640 -53 -1356 125 1631
2500 1631 -282 -1586 -91 1272 189 -1410 -740 1094 847 -1037 -664 1219 1223 -908 -886 610 1242
2517 1242 -833 -1403 856 1439 -51 -1226 237 1229 -79 -1833 -122 1571 598 -1410 -587 1069
2533 1069 373 -1595 -769 1310 1232 -1205 -745 1121 1055 -875 -1071 936 1544 -528 -1495 209 1532
$$ packed form
2412H60k32j398K76J757o3j936j58R25Q37j631n01J394J490j123j251Q89Q61q00
2430A96j561M08J923p3j577L43J368j64k029l4J417O23j595j64J562P04j456q06
2448i15R17J212j434r15Q99J439o64j666M60J873n41j798K45J577K18j717r0J611
2466G11N47j707r14K005M02j419q50J220J798j692j520J271J329q72j513Q50J459
2483A105n97j781J18J794K58j577r1J772J38j443r92J825J111j693j303J481J506
2500A631j913j304J495J363j083j599O70J834k47j884L73J883Mk131K2J496O32
2517A242k075n70K259N83j490j175J463R92j308j754J711J693r73k008Q23J656
2533A069o96j968Q26K079p8k437M60J866o6j930j96K007O08k072r67J704J323
$$ plain form
2550 1532 -367 -1835 141 1701 108 -1762 -335 1291 331 -1353 -271 1614 1224 -1105 -851 1155
2566 1155 871 -1645 -1418 1015 1531 -507 -1250 734 1127 -979 -1835 92 1964 528 -1289 277
2582 277 1545 23 -1841 -804 1142 729 -1066 -542 1543 1226 -1230 -1297 806 710 -1035 -1656 935
2599 935 1364 -631 -1373 378 1416 -210 -1739 -162 1482 445 -1389 136 1741 799 -1631 -1195
2615 -1195 850 528 -1742 -878 1282 1381 -926 -1046 606 1188 -1187 -1524 615 1401 -228 -1451 -60
2632 -60 1130 -197 -1756 101 1491 328 -1546 -666 1491 844 -955 -703 1138 750 -1266 -1411 576
2649 576 910 -620 -849 1105 1659 -569 -1394 284 1018 -312 -1423 178 1521 429 -1294 -627 1105
2666 1105 18 -1419 -581 1572 860 -582 -675 1154 1029 -956 -766 864 1278 -785 -1341 185 972
$$ packed form
2550A532j899j468J976J560j593j870J427J626r60j684J082J885l90k329K54K006
2566A155k84k516K27K433N16k038p43J984L93k106q56J927J872j436j817J566
2582B77J268j522j864J037J946m13j795N24K085l17k456o7K103r6j745o21K591
2599I35M29j995p42J751J038j626j529J577J644j037j834J525J605r42k430M36
2615a195K045l22k270Q64K160R9k307j20J652N82k375l37K139P86j629j223J391
2632f0J190j327j559J857J390j163j874Q80K157o47j799K52J841l88k016j45J987
2649E76L34j530k29J954N54k228q25J678P34j330j111J601J343j092j723O67J732
2666A105j087j437Q38K153p12j442r3J829j25j985J90J630M14k063n56J526P87
$$ plain form
2683 972 -417 -1305 612 1554 172 -1254 -58 1309 -181 -1181 -153 1494 784 -691 -626 578
2699 578 458 -1065 -1142 599 1187 -197 -718 778 1090 -647 -1302 -37 854 -486 -1065 285 1352
2716 1352 118 -909 -66 747 -181 -1112 -187 1172 995 -249 -180 780 422 -1199 -1344 297 895 -435
2734 -435 -464 733 907 -237 -1232 -123 952 168 -725 220 720 311 -805 -167 528 118 -883 -264
2752 -264 704 485 -649 -500 640 747 -326 -673 493 682 -436 -1013 -43 788 109 -610 -125 932
2770 932 216 -782 -297 781 308 -785 -494 401 454 -617 -435 302 557 -361 -484 541 802 -412 -470
2789 -470 312 703 -317 -687 109 900 158 -558 -78 586 385 -741 -192 589 273 -602 -332 541 373
2808 373 -299 -561 434 495 -203 -690 203 825 -144 -582 408 631 33 -818 -324 295 44 -802 -131 493
$$ packed form
2683I72j389q88J917R42j382j426J196J367j490j000J028J647p10j475O5J204
2699E78j20j523p7J741N88j384n21J496L12j737o55J265Q91j340n79J350J067
2716A352j234j027Q43Q13r28r31R25J359j77j244O9R60l58j621j45J641N98j330
2734d35k9J197J74j144r95J109J075p84q93R45N00m09j116O38O95m10j001O19
2752b64R68k19j134J49J140J07j073l47J166J89j118n77R70Q31o79p19M85J057
2770I32p16r98M85J078m73j093K91Q95N3j071J82P37K55r18j23J025K61j214n8
2789d70P82L91j020l70P96P91p42p16M80O64k01j126N49P81l16q75K70Q73j68
2808C73o72k62R95O1o98m87Q93O22r69m38R90K23n98q51M94O19k51q46O71O24
$$ plain form
2828 493 330 -460 -424 171 183 -551 -85 371 479 -111 -323 196 371 -216 -723 -175 700 166 -662 332 578
2849 578 537 -423 -44 657 228 -529 -416 408 257 -405 -492 210 253 -589 -391 153 458 -125 -516 460 861
2870 861 84 -382 -123 474 71 -499 -186 738 14 -629 -41 470 496 -248 -383 349 407 -298 -674 234 584
2891 584 267 58 237 657 -363 -724 -135 390 167 -318 339 559 434 -435 -90 8 234 -330 5 398
2911 398 434 -165 -288 167 174 -386 -134 24 418 219 -554 -152 664 246 -658 -361 474 -66 -525 -371 98
2932 98 384 -223 -97 476 127 -585 -766 251 486 -357 -542 131 374 79 -473 -63 288 -532 -647 -117
2952 -117 397 292 -316 127 428 141 -473 -589 -15 246 -125 -385 528 586 -194 -291 283 285 -95 -307 49
2973 49 286 264 -432 -339 165 -149 -516 -404 405 187 -442 -197 391 181 -261 -357 398 327 -358 -365 337 392 59
$$ packed form
2828D93j63p90L6N95J2p34M66M56J08n90k12N19J75n87n07N48Q75n34q28R94K46
2849E78m1r60L79P01m29p57J13Q24j51o62q7P02M3q42J98N44L05n83l91R76M01
2870H61p77m66K59N97m03n70L13R24p24o43N88N11K6p44j35P32N8p05l76R08L50
2891E84l17k09J79M20j020l61N89N25k23m85O57K20j25q69L45R8K26n64L35L93
2911C98L6n99j23M55Pn60K52J58L94j99p73M02Q16m18r04K97Q35n40m59J54M69
2932I8K86o07J26N73l49p12j81J017K35q43j85O73K43k95n52M10L51q20j15N30
2952a17N14j05o08M43L01k87o14j16N74K61l71k60R13N8p80r7N74Kl80k12L56
2973D9K37k2o96R3N04l14l67J12Q09k18o29K45N88k10m42r6P55p1o85pP02N5l33
$$ plain form
2996 59 -263 318 526 51 -410 -172 422 -197 -560 -167 405 383 -210 -76 361 -5 -611 -274 363 397 -493
3017 -493 -60 311 417 -417 -496 224 248 -22 -448 268 455 -18 -237 -211 386 29 -447 -334 567 265 -281
3038 -281 -36 212 271 -342 -456 -54 202 -162 -346 435 336 63 -42 405 266 -70 -241 -168 221 80 -427
3059 -427 -8 424 -37 -195 -301 288 126 -145 -246 212 219 -297 -253 -29 7 -324 -258 177 29 -207 -165 124
3081 124 321 -82 -206 -264 52 -297 -248 39 159 269 -234 -226 61 -78 -161 73 80 112 91 -390 -90 -182 -62
3104 -62 -54 -87 181 -103 -484 -51 195 112 -308 -49 187 12 63 -84 -76 -115 -174 6 101 407 -180 36 25 -173
3128 -173 -136 -164 199 -46 -294 -133 107 169 -222 -293 -55 144 97 70 -2 -274 -155 157 144 57 99 -28 226
3151 226 11 -94 -95 53 25 313 124 94 -30 37 -17 49 160 -41 -27 257 271 34 19 51 -18 212 52 -64
$$ packed form
2996E9l22N81K08m75m61K38N94o19l63L93N72k2n93J34M37l66o06L37O37L4q90
3017d93M33L71J06q34p9P20K4k70m26P16J87m73k19K6N97l57m76J13R01l02n46
3038b81K45K48N9o13j14M02K56l64j84P81r9k73j05M47j39l36j71P3L89j41n07
3059d27M19M32m61j58j06N89j62k71j01M58Pn16M4K24L6l31O6M35j48k36M2K89
3081A24J97m03j24n8L16l49M9K87J20J10n03QK87j39q3K34PL2k1m81L00r2J20
3104f2Ql3K68k84l81M33K46q3m20K59K36j75N1j47Ql9n9J80R5L06n87K16j1j98
3128a73L7k8L63k45k48J61K40O2l91p1K38J99m7k7p2k72J19L12j3q7M2j27K54
3151B26k15j05jJ48k8K88j89l0j24O7n4O6J11k01J4K84J4k37j5L2o9K30j60j16
$$ plain form
3175 -64 -262 -59 -154 323 104 -33 55 -192 -11 -149 265 95 -73 -58 -94 147 -190 101 46 -67 -61 294 116
3198 116 38 -102 -35 -103 47 248 234 289 29 327 -43 -163 91 225 102 -92 -63 -24 245 -268 -39 -8 -69
3221 -69 16 -140 44 352 60 63 172 132 -174 39 -298 138 -171 -341 -14 259 -76 -157 -104 137 103 -13 -453
3244 -453 -19 163 -204 3 -2 31 -95 -83 103 397 -39 -252 -62 34 -93 -102 -42 337 109 -231 288 -10 76
3267 76 -222 -114 -21 146 -52 -80 98 127 -124 -312 61 153 79 -250 203 202 49 -410 29 -223 -90 -268 -38
3290 -38 128 42 157 47 -72 135 -19 -184 237 21 -75 71 2 107 -54 -435 48 -204 -266 -25 62 290
3312 290 -12 -39 -186 -96 -264 -234 128 136 297 -14 -204 145 332 27 42 123 116 124 -144 42 115 -490 -52 -47 166
3337 166 -13 -130 -168 130 -121 -25 -23 139 -71 24 -278 -81 147 21 -75 31 82 32 63 -171 -149 44 333
$$ packed form
3175f4j98K03r5M77k19j37Q8k47J81j38M14j70j68J5l6K41l37K91n5j13OL55j78
3198A16p8j40O7o8J50K01j4N5k60K98l70j20K54J34j23j94K9L9K69n13K29L1o1
3221f9Q5j56J84L08k92LJ09m0l06K13l37M36l09j70L27K73l35q1N3K41l4j16m40
3244d53M34J82l67K07nL3j26J2J86K94m36k13J90R6j27rO0L79k28l40N19k98Q6
3267G6k98J08R3J67j98k8J78K9k51j88L73R2p4l29M53jj53m59M39k52J33j78K30
3290c8J66q6J15j10j19K07j54j65M21k16r6J46o9J05j61l81M83k52o2K41Q7K28
3312B90l02k7j47R0j68L0L62QJ61l11j90L49J87l05J5Q1pQk68J86P3o05M38NK13
3337A66j79j17l8K98k51R6KJ62k10R5l02J97K28j26r6J06N1n0L1k34K2J93K89
$$ plain form
3360 333 275 155 -124 -103 -19 223 276 -40 -187 124 -149 -169 143 95 31 178 -199 -42 -252 -130 -81 -153 -10
3383 -10 78 -242 -126 77 -114 -49 110 362 10 -252 21 224 3 -27 -222 106 -117 -199 -217 -152 353 22
3405 22 -33 68 166 156 136 -53 -214 -93 -343 -68 241 -245 15 -78 -167 235 207 134 -19 219 178 -183 -157 41
3429 41 133 50 -200 194 133 -51 31 205 98 -306 -150 -8 41 81 -78 -85 35 49 100 -259 64 -288 -104 12
3453 12 -207 129 -34 -252 -211 74 -160 -86 -269 -227 -211 -277 -32 223 94 -150 168 153 -104 -263 -225 -27 143
3476 143 41 -181 -206 -1 -133 -278 54 -51 -154 -117 88 386 -51 -46 158 156 -27 -351 -118 202 367 -100
3498 -100 -60 76 341 -491 -58 -9 -171 -394 -226 8 73 -267 -135 -163 29 -301 -282 41 434 109 -157 159
3520 159 353 142 -536 -219 280 403 -143 -31 205 159 79 -338 -26 -45 -114 -511 325 256 -98 -223 85 509
$$ packed form
3360C33n8j20k79K1Q4K42N3l16j47L11k73k0L12m8o4J47l77J57k10J22M9p2J43
3383a0Q8l20J16K03j91O5J59K52l52k62K73K03k21l0j95L28k23q2j8O5N05l31
3405B2n5J01R8j0k0j89j61J21k50K75L09m86K60r3q9M02k8p3j53K38m1l61K6J98
3429D1R2q3k50L94o1j84Q2J74j07m04J56J42M9M0j59pJ20J4N1l59L23l52J84J16
3453A2k19L36j63k18M1K85k34P4j83M2J6o6K45K55j29k44L18j5k57j59L8J98J70
3476A43j02k22k5K05j32j45L32j05j03L7K05K98m37NK04kj83l24K33L20J65m67
3498a00M0J36K65q32M33M9j62k23J68K34O5l40J32k8J92l30J9L23L93l25k66L16
3520A59J94k11o78L17M99J23n46J12K36m6q0m17L12j9o9l97Q36o9l54j25L08M24
$$ plain form
3542 509 -132 -13 -177 245 -114 -397 -121 263 227 -232 -126 306 131 -186 141 151 -28 -47 -203 61 110
3563 110 91 -31 291 110 162 -248 -46 139 19 12 -73 338 -23 -345 -283 470 350 -423 -79 33 30 -241 -223
3586 -223 -21 298 -243 -362 -70 157 137 -81 170 17 83 -242 -143 268 -100 -272 -89 564 194 -151 40
3607 40 55 185 -93 -187 221 430 116 -100 29 172 -183 -299 -106 -36 59 -334 -18 273 207 -433 -127 237
3629 237 -148 -181 -344 254 444 -101 -456 554 215 -181 -192 222 -128 191 -225 177 349 -106 -298 199
3649 199 296 -181 -496 -182 276 227 -125 -195 228 78 -20 39 360 266 -79 -278 143 122 -55 -357 201 561
3671 561 -60 -232 227 206 -8 -180 174 446 36 -224 -156 338 144 -291 -24 137 248 -173 -323 -58 153
3692 153 -194 -211 319 316 -295 -178 -91 96 -18 -229 -76 246 87 -20 51 -167 68 -289 -36 139 161 -97
$$ packed form
3542E09o41J19j64M22l59k83K76L84l6m59J06M32j75l17L27J0j79j9j56K64M9
3563A10j9j22L22j81N2m10K02J85j20pq5M11l61l22O2P53j20p73L44J12lk71J8
3586b23K02L19n41j19K92K27k0k18K51j53O6l25R9M11l68j72J83O53l70l45J91
3607D0J5J30k78r4M08K09l14k16J29J43l55j16J93P0R5l93L16K91o6o40L06L64
3629B37l85l3j63N98J90n45l55J010l39l96j1M14l50L19m16M02J72m55j92M97
3649A99R7m77l15L14M58m9l52p0M23j50r8N9L21r4l45j99M21k1j77l02N58L60
3671E61o21j72M59k1k14j72L54K72m10k60O8M94j94m35K67J61J11m21j50K65K11
3692A53l47j7N30lo11J17Q7J87j14k11J53L22j59j07P1k18K35l57K53J75K2k58
$$ plain form
3714 -97 -236 131 277 -170 -100 165 -50 66 -280 28 406 53 -186 -163 267 131 -340 -242 225 -86 -261
3735 -261 -75 302 241 112 -271 158 127 -319 -410 226 322 -174 -415 236 245 -90 -9 -82 60 254 -392 -71 12
3758 12 62 -142 -13 174 110 -301 -167 40 307 62 -178 197 54 -266 -132 215 134 93 -46 117 52 -143
3780 -143 92 -240 267 -51 -65 -212 -176 245 133 -11 121 266 25 -120 -40 336 -169 -399 -77 392 325
3801 325 -194 -190 150 -232 -424 -38 441 -26 -281 55 -99 172 -212 -258 -87 113 -422 -29 112 418 -94
3822 -94 -240 110 138 -163 -390 -53 255 169 -96 -236 47 133 -280 -267 219 405 -143 49 228 122 -199 -145
3844 -145 50 34 -53 -159 61 106 233 -529 -23 252 145 -84 -99 349 178 -379 -249 561 356 -227 5
3865 5 379 -138 -79 -46 -70 301 66 -277 -23 341 194 -9 -219 349 159 -344 -281 275 166 -168 -169 292 244
$$ packed form
3714i7j39L67J46m47P0K65k15J16l46L08L78l53k39K3M30j36m71R8M67l11j75
3735b61J86L77o1j29l83M29l1m46r1O36R6m96k41O51Rl35Q1p3J42J94o46L21Q3
3758A2N0k04J29J87o4m11J34K07K67k45k40L75j43l20J34L47q1m1j39J63o5j95
3780a43K35l32N07l18j4j47L6M21j12j44J32J45k41j45Q0L76n05k30L22M69o7
3801C25n19ML40l82j92L86M79m67k55L36j54K71l84m6J71K00n35L93J41L06n12
3822i4j46L50K8l01k27L37L08q6k65j40K83Q6m13J3M86J86n48J92J79j06l21N4
3844a45J95j6q7j06K20M5J27p62N06K75j07k29j5M48j71n57J30Q10k05n83K32
3865EL74n17N9L3k4L71k35l43K54L64j47k03k10N68j90n03O3N56j09l34jM61m8
$$ plain form
3888 244 -187 -354 472 146 -251 -161 157 351 40 -403 -110 114 -113 -326 -71 351 69 -309 -140 270
3908 270 99 -304 -257 201 252 -177 -120 336 282 -372 -362 129 272 -79 -342 -93 608 -135 -472 243 378 317
3930 317 -316 -312 456 461 -467 -106 419 242 -333 -334 250 -40 -319 -269 272 202 -236 -326 103 98 -130 -391 35 345
3954 345 -202 -577 20 504 59 -369 -219 492 212 -437 -192 494 607 -382 -185 282 217 -116 -369 262
3974 262 227 -112 -615 93 222 -83 -355 97 153 -177 -413 73 487 122 -428 -291 559 184 -508 -140 479
3995 479 247 -253 -255 537 464 27 -597 366 622 -196 -475 47 447 178 -270 -43 408 233 -493 11 361
4016 361 20 -556 -471 290 276 -226 17 517 386 -91 -390 91 199 -219 -226 245 152 -90 -343 -21 331 90
4038 90 -297 175 203 224 -269 -97 252 186 -437 -90 321 398 -544 -269 262 319 -43 -322 102 174 -146 -403
$$ packed form
3888B44m31j67Q26l26l97R0L18J94l11m43K93K24k27k13K55M22k82l78J69M10
3908B70j71m03M7M58N1m29N7M56n4o54J0M91J43l51k63K49P01p43l37P15J35o1
3930C17o33MP68Nr28L61N25j77n75jN84k90k79N0N41p0m38r0M29nk28k61M26L10
3954C45n47l75N97M84m45m28J50P11k80o49K45O86J13r89J97M67o5l33k53O31
3974B62l5l39n03P08J29l05k72M52N6l30k36M86M14l65n50J37Q50l75o92L68O19
3995D79k32n00kP92p3m37o24R63K56q18k79N22M00k69m48K27M51j75p26N04L50
4016C61l41n76Q5P61j4n02K43N00j31m77k99M81J08m18pM71r3k42k53L22L52k41
4038I0l87M72K8K1m93J72L49o6o23L47M11P7r42K75N31N7l62k79M24P2l20k57
$$ plain form
4060 -403 -8 347 61 -398 108 430 -56 -354 -198 145 31 -547 -213 313 488 -383 -376 9 17 -257 -407
4081 -407 327 359 -233 -392 140 249 -34 -413 330 491 80 -286 -170 287 82 -508 -253 264 12 -230
4101 -230 -39 146 333 -13 -478 270 426 -414 -223 70 402 -20 -520 -92 181 148 -374 67 301 45
4121 45 -294 32 269 239 -257 -31 366 212 -255 -456 491 91 -235 0 381 299 -289 -217 -9 121 -82
4142 -82 -325 -120 -178 264 -343 -159 514 159 -195 -177 361 100 -31 -214 429 30 -472 -213 -14 218 92
4163 92 -168 145 160 -128 -45 -214 567 201 -357 -174 395 64 -296 -140 273 155 -315 -123 225 161 -26
4184 -26 -117 67 195 -73 -453 228 97 -29 -312 -28 -113 88 -263 -118 57 201 -256 71 415 78 -63
4205 -63 -346 154 225 251 -172 -71 394 -296 -209 166 381 -141 -102 50 61 -15 -286 -306 99 86 -139 -372 100
$$ packed form
4060d03L95L55k86m59N06L22m86k98J56L43j14n78L34N26J75q71PL85Qk74j50
4081d07P34L2n92j59N32J09k83l79P43J61m11l66J16M57k05n90K55N17k52k42
4101b30J91J85J87l46m65P48J56q40J91K93L32m22n00M28K73l3n22M41K34k56
4121D5l39L26K37l0m96K26L97j54m67k01R47m00l26K35L81q2n88P2K08J30k03
4142h2k43K05n8M42o07J84O73l55l54J8N38k61j31j83O43l99n02K59J99K32j26
4163I2k60L13J5k88Q3j69P81l66n58J83N69l31l60J56M13j18m70J92L48o4j87
4184b6r1J84J28k68l80O81j31j26k83K84q5K01l51J45J75J44m57L27L44l37j41
4205f3k83N00P1K6m23J01M65o90Q7L75K15n22L9J52J1p6k71k0M05j3k25k33M72
$$ plain form
4228 100 286 -139 -322 380 166 -80 -312 422 207 -61 -179 124 214 113 -292 -134 419 53 158 -314
4248 -314 142 113 -85 -140 -305 444 -31 -263 227 92 -165 -122 -115 -63 -60 -393 153 -55 124 -11 97 232 214
4271 214 -85 -186 243 211 202 -62 293 91 -197 -242 161 39 -93 -3 -213 231 158 -34 72 228 -10 -137
4293 -137 -122 209 -23 -547 -228 -24 124 -171 -129 180 -217 -372 -244 177 375 -186 -193 67 65 199 -7 61
4315 61 -21 51 17 -143 -69 125 -308 -31 153 -101 82 -321 281 424 53 -371 52 272 21 27 137 113 13
4338 13 -165 -252 596 205 74 -50 100 264 -200 128 -11 14 -96 -46 114 109 52 -303 -44 259 -364 -279 176
4361 176 367 -81 -97 -30 -119 -93 -43 -122 -174 169 80 42 273 84 -154 -91 158 -159 -134 -15 358 -32 -206 -67
4385 -67 -25 443 244 -133 63 24 16 63 4 100 -74 25 140 407 -100 -106 173 278 125 -69 -106 162 233 -203
$$ packed form
4228A00J86m25j83P02k14k46k32P34k15k68j18L03R0j01m05J58N53l66J05m72
4248c14M56k9j98n5j65P49m75k32M90j35k57M3PN2Ll33N46k08J79j35J08J35j8
4271B14k99j01M29l2rk64L55k02k88m5M03j22j32R0k10M44p3j92J06J56k38j27
4293a37J5L31k32n24L19K04J48k95M2L09l97j55J28M21J98n61pK60kJ34k06O8
4315F1q2P2l4j60P4J94m33K77J84k54J83m03O02J43l71m24M23K20k51OJ10k4j00
4338A3j78q7Q48l91j31j24J50J64m64L28j39K5j10N0J60nn7l55K59L03o23Q5M55
4361A76J91m48j6O7q9K6N0p9n2L43q9l8K31j89k38O3K49l17K5J19L73l90j74J39
4385f7M2M68j99l77J96l9qM7n9R6j74R9J15K67n07oK79J05j53j94l7K68P1m36
$$ plain form
4409 -203 -207 185 341 13 -20 203 312 331 -35 -57 51 -91 -396 -402 -18 130 5 -299 54 -106 -205 -317 36
4432 36 319 -448 -188 102 238 -122 -215 74 211 -228 -161 -126 405 -21 -100 61 202 58 -43 -157 164 31
4454 31 38 258 113 66 156 -98 32 389 18 -277 119 -25 49 -45 -76 -51 -52 110 47 97 -13 -263 -9 99
4478 99 121 -158 -27 310 -165 -45 -142 131 166 -321 -293 -1 -56 75 -216 399 -8 -40 -113 -84 32 63 -285
4501 -285 -184 460 80 -55 -16 -147 13 88 57 215 98 -254 -165 -28 78 15 78 54 160 202 -135 19 91
4524 91 -14 -189 -29 67 -241 -90 -1 50 112 -59 -84 96 177 -269 42 -54 16 -47 -518 254 49 -20 -54 -135
4548 -135 -16 149 -111 82 257 -252 -73 -160 146 100 -116 -275 37 228 -232 -115 61 127 -255 -10 130
4569 130 16 -238 -304 -121 85 -46 -167 105 -18 15 77 -231 55 138 -123 114 139 -13 62 -30 61 231 -22
$$ packed form
4409b03mL92J56l28l3K23J09J9l66k2J08j42l05oL84J48j25l04L53j60r9j12L53
4432C6K83p67K60K90J36l60r3K89J37m39O7L5N31m26p9J61J41j44j01j14L21j33
4454C1PK20j45m7R0k54J30L57l71k95L96j44P4r4l1K5jJ62o3N0j10k50K54J08
4478I9K2k79J31L37m75J20r7K73L5m87K8K92n5J31k91O15m07l2p3K9J16L1l48
4501b85J01O44l80j35L9j31J60P5l1J58j17l52Q9J37J06o3O3k4J06M2l37J54P2
4524I1j05j75J60R6l08J51Q9N1O2j71k5J80Q1m46L11r6P0o3m71P72k05o9l4q1
4548a35J19J65k60J93J75n09J79q7L06m6k16j59L12J91m60J17J76O6l82K45J40
4569A30j14k54o6J83K06j31j21K72j23L3O2l08K86Q3k61K37K5j52P5r2R1J70k53
$$ plain form
4592 -22 -194 204 108 86 -237 23 198 -106 -113 51 -34 250 -68 63 -153 -98 -243 -211 -73 -148 -119 -171 184 17
4616 17 -191 84 256 240 -46 -323 158 237 1 17 -67 107 -76 -44 -39 100 112 -74 200 -7 98 -127 -372
4639 -372 -101 205 -96 -264 185 125 -175 -39 -110 157 131 -127 176 260 15 -292 29 -58 -188 49 -38 -116
4661 -116 -315 5 -69 438 -37 108 -92 53 219 2 -225 164 122 -97 -99 -123 301 138 -46 -89 40 -255
4683 -255 -12 -67 326 64 66 -85 25 89 133 -223 -104 -21 41 -26 -162 156 9 -308 -87 128 -31 108 376
4706 376 167 41 -59 -31 356 293 -135 -236 -70 113 -5 89 42 -31 113 36 80 477 159 -110 93 362
4728 362 195 129 130 421 -137 120 -96 -57 239 -130 20 -76 3 -133 205 94 406 7 -197 96 10 61 154
4751 154 50 226 26 -216 -124 13 -198 -163 -193 104 155 -86 -58 -264 86 9 -238 9 -19 87 214 271 -227
$$ packed form
4592b2j72L98r6k2l23K60J75l04pJ64q5K84l18J31k16N5j45L2J38p5K9n2L55j67
4616A7k08K75J72j6k86k77M81P9k36J6q4J74j83L2NJ39J2j86K74k07J05k25k45
4639c72K71L06l01j68M49o0l00J36p1K67k6k58L03Q4k45l07L21q7j30K37q7p8
4661a16j99L20p4N07m75J45k00J45J66k17k27L89m2k19kk4M24j63j84m3J29k95
4683b55K43n5L93k62Kj51J10O4M4l56J19Q3O2o7j36L18j47l17K21K15j59J39K68
4706C76k09j26j00K8L87o3m28j01J66J83j18R4m7p3J44p7M4L97l18k69K03K69
4728C62j67o6JK91n58K57k16L9K96l69J50r6P9j36L38j11L12l99k04K93q6N1R3
4751A54j04J76k00k42R2J37k11L5l0K97N1k41K8k06L50p7k47K47k8J06J27N7m98
$$ plain form
4774 -227 26 -132 -171 55 50 -12 107 5 125 9 23 14 -78 -351 6 -37 -64 -140 180 110 288 -226 -98 -330
4798 -330 207 -17 -348 276 56 71 -47 -156 -20 205 2 -77 462 -44 45 -68 -31 -250 -96 -73 -102 177
4820 177 92 -27 -170 -182 -158 -70 -42 -119 278 -55 124 101 -45 -93 311 -30 -43 -142 -147 168 169 -25 -102 45 -292
4845 -292 55 154 -264 -5 57 94 -78 251 -58 -117 -250 246 -305 -112 -180 102 193 -159 -121 -31 145 149 18
4868 18 160 52 57 81 282 20 192 -52 -22 -343 -241 -122 -96 -43 -161 -243 -77 335 259 298 -28 -173 64
4891 64 -257 -74 -121 104 -164 -314 95 248 114 -438 -47 -196 248 -96 291 -106 4 -48 35 -124 186
4912 186 -216 83 55 55 97 -294 -74 -62 15 -10 -10 264 -83 -133 207 125 -24 -207 -231 -223 -134 25 18 -53 -38 291
4938 291 68 123 -39 269 4 -120 -15 -277 -69 117 -146 -157 117 -28 -3 -4 -163 209 -21 -191 -194 -334
$$ packed form
4774b27K53j58l9K26no2J19j02J20j16J4rr2k73L57m3k7p6L20p0J78n14J28k32
4798c30N37k24l31O24k20J5j18j09J36K25k03p9N39n06Q9j13L7k19J54K3k9K79
4820A77q5j19j43j2K4Q8K8p7L97l33J79k3j46m8M04l41j3r9nL15Jj94p7J47l37
4845b92L47R9m18K59O2L7j72L29l09n9j33M96n51J93o8K82R1l52L8R0J76Mj31
4868A8J42j08NK4K01k62J72k44L0l21J02J19K6N3j18q2J66M12p6L9l26j45K37
4891F4l21J83m7K25k68j50M09J53j34n52L91j49M44l44L87l97J10n2Q3j59L10
4912A86m02K99k8%M2l91K20J2P7k5%K74l47n0L40q2j49j83k4QQ9J59pp1J5L29
4938B91k23N5j62L08k65j24J05k62K08J86k63j1K74j45K5jj59L72k30j70lj40
$$ plain form
4960 -334 133 87 -162 -306 67 -110 -10 79 146 -162 -72 158 234 -81 68 -92 178 -52 132 87 6 148
4982 148 -184 -68 13 -132 16 -162 250 231 61 341 59 -65 -335 56 -139 0 410 -9 -94 259 53
5003 53 -166 -51 -9 -74 205 230 62 50 364 60 -1 -19 155 56 -79 436 7 -49 -5 -43 -333 215 -232 20
5027 20 -8 -65 -110 -34 27 -91 -288 206 -211 189 190 -78 121 -88 172 -40 74 -44 -32 267 -71 -30 62 15
5051 15 73 119 60 -102 24 21 -88 154 -109 198 -78 -44 -65 -153 -48 43 -8 24 233 163 66 -28 -149 52 157
5076 157 -86 182 61 -279 -128 285 23 -103 -214 -200 42 58 -80 123 143 -140 -73 22 42 -93 -1 156
5098 156 -126 134 -114 -1 32 -33 -24 -13 138 251 226 192 47 -195 -146 -33 53 -49 -3 -50 -293 18 -85 -43
5122 -43 -214 -111 -17 108 107 141 -191 -84 -134 123 -112 -81 -180 -66 10 35 -212 -164 69 16 -67 128 -48 120
$$ packed form
4960c34M67m6k49j44L73j77J00Q9O7l08R0K30P6l15J49j60K70k30J84m5q1J42
4982A48l32J16Q1j45J48j78M12j9j70K80k82j24k70L91j95J39M10m19q5L53k06
5003E3k19J15M2o5K79K5j68j2L14l04o1j8J74r9j35N15m29n6M4l8k90N48m47K52
5027B0k8n7m5P6O1j18j97M94m17M00Jk68J99k09K60k12J14j18J2K99l38M1R2m7
5051A5N8M6n9j62J26lj09K42k63L07k76L4k1q8J05R1n1L2K09p0r7r4j21K01J05
5076A57k43K68j21l40J51M13k62j26j11J4K42J6j38K03K0k83O7R5K0j35R2J57
5098A56k82K60k48J13L3o5RJ1J51J13k5l4j45k42M9J13Q6j02M6m7k43L11j03M2
5122d3j71J03R4J25jL4l32J07n0K57k35L1r9J14P6K5k47M8K33n3q3J95j76J68
$$ plain form
5146 120 50 216 198 -9 252 -195 51 -275 -158 -235 240 19 162 67 239 -220 -1 -80 -246 597 -246 260
5168 260 46 68 219 -196 -260 -130 -4 -58 -227 -1 52 -25 -294 55 187 99 -131 302 216 69 -71 -68 33
5191 33 -52 215 -171 -329 68 -322 -41 -17 87 -15 -99 96 -186 26 -213 -103 89 76 -30 -65 -141 -84 -98
5214 -98 116 88 -121 -66 61 93 -37 16 62 235 -28 241 -86 -20 156 -250 -295 39 148 54 -154 23 227
5237 227 -167 139 11 69 -152 34 37 -124 86 -143 123 188 161 -257 59 272 88 -75 -213 224 256 86
5259 86 96 31 9 149 58 397 46 276 144 -112 -240 -225 -106 -17 11 -71 9 113 82 126 79 205 91 33 -3
5284 -3 30 -37 160 355 -50 -8 -235 -142 -174 105 154 110 60 27 235 65 -339 -375 174 27 128 -113 172 -145
5308 -145 -24 -65 -224 169 388 12 107 187 125 -130 -197 -51 135 -203 -179 376 1 -268 -237 -174 -40 189 83
$$ packed form
5146A20p0J66j8k07K61m47K46l26J17p7M75k21J43r5J72m59K19p9j66Q43q43N06
5168B60k14K2J51m15o4J30J26n4j69K26N3p7k69L49J32q8k30M33q6j47j40LJ01
5191C3q5K67l86j58L97l90K81K4J04j02q4J95k82K12k39J10J92j3j06l5p6N7j4
5214i8K14k8k09N5J27L2j30N3M6J73k63K69l27O6J76m06m5L34J09r4k08J77K04
5237B27l94L06j28N8k21J86Lj61K10k29K66O5k7m18L16K13j84j63j38M37L2j70
5259H6J0o5k2J40r1L39l51K30j32k56j28J5J19Q9K8q2Q0J04l1M4m7J26j14n8l6
5284cL3o7J97J95m05M2k27R3l2K79M9m4n0l3K08j70m04l6N49j47J01k41K85l17
5308a45J21m1j59L93K19l76R5Q0o2k55o7J46J86l38K4N55l75k69L1O3J34K29j06
$$ plain form
5331 83 251 17 -86 -24 -155 81 -241 -17 95 -128 274 38 -36 277 469 167 -100 176 -33 146 134
5352 134 -13 79 -37 -145 46 -65 284 306 -109 398 -54 -11 -226 51 47 108 88 257 229 51 25 169 -106
5375 -106 -33 -41 -113 174 -164 38 238 35 69 24 332 -179 -76 -155 115 162 22 2 -147 63 39 -84 100
5398 100 137 -4 -271 163 -300 117 36 9 -88 37 -258 -61 103 -59 -129 99 -47 -19 179 60 301 -7
5420 -7 -175 209 32 -78 -87 -59 -164 -163 182 185 -142 100 -2 221 22 111 71 92 59 -121 170 -27 -179 -238 103
5445 103 -75 -323 -116 149 -146 -29 -483 12 -10 -89 -61 -153 264 163 -171 202 221 -130 -166 -258 -30 -40 -111
5468 -111 135 -177 151 -146 -159 -163 -9 -142 -209 110 197 -75 131 323 -49 -37 -34 -122 53 219 -185 94 227
5491 227 19 -135 -133 157 -42 -144 -268 187 -5 -86 160 -74 -183 293 -194 86 80 -105 243 -44 20 44
$$ packed form
5331H3J68k34j03O2j31K36l22K24J12k23M02k36p4L13J92l02k67K76k09J79j2
5352A34j47R2j16j08J91j11L49K2m15N07m52M3k15K77mO1k0J69k8j78k6J44k75
5375a06P3qp2K87l38K02K00k03L4m5L08n11J03p9K70M7j40k0j49K10k4j23J84
5398A00L7j41k67M34m63M17q1k7r7J25k95J97J64j62p0K28j46K8J98j19K41l08
5420gj68L84j77j10rK8j05JL45Ll27K42j02K23j99Q9m0K1l3j80K91j97j52n9L41
5445A03j78k48K07K65k95J17m54M95k2p9K8r2M17j01l34L73J9l51l6r2K28j0p1
5468a11K46l12L28k97j3mJ54j33o7L19Q7k72K06J92l72J2Lq8J75J66m04K79J33
5491B27k08j54KK90j99j02j24M55j92q1K46k34j09M76m87K80oj85L48k87O4K4
$$ plain form
5513 44 107 26 110 -151 -279 -10 159 64 10 211 232 -48 -92 47 -189 -98 16 -143 44 170 -257 205 40
5536 40 -21 -11 -199 -78 171 -86 117 -185 -30 72 -72 -150 146 7 185 -102 32 -81 221 34 -31 34
5558 34 -171 166 194 166 -14 -226 -37 158 -202 114 18 -157 -95 156 38 -37 -243 -57 -167 249 -29 119
5580 119 198 -207 -182 -90 -24 93 -206 -30 50 -35 59 110 -62 44 41 221 -179 -78 220 26 -39 11 -137 -31
5604 -31 -132 4 -10 182 -450 2 -203 -94 14 83 -98 229 8 20 148 -178 48 144 -204 -128 -90 -37 36
5627 36 136 150 -123 -38 -9 34 -17 129 -15 95 -286 -91 -243 -88 135 -192 87 -131 82 22 163 86 -132
5650 -132 -46 -204 39 -203 90 84 25 22 21 89 -173 -28 -19 -31 45 19 64 17 -56 -32 205 84 -23 -91 -65 -252 -178
5677 -178 17 118 -41 16 135 -53 57 -70 271 37 -125 -80 -170 23 59 133 109 -107 37 -91 -121 -229
$$ packed form
5513D4O3q1Q4k61j28K69J69r5n4K01K1k80m4J39k36R1J14j59J87J26m27M62j65
5536D0o1J0j88J21K49k57K03l02J55J02j44p8K96j39J78k87J34j13L02j87o5O5
5558C4k05L37K8k8j80k12J89J95l60L16r6j75O2K51j18p5k06J86j10M16k78J48
5580A19P9m05K5R2O6J17k99J76Q0q5R4N1j72J06lJ80m00J01K98j94o5N0j48J06
5604c1j01J36j4J92o32M52k05J09J08O9j81L27k21J2J28l26K26R6l48P6L8N3P3
5627C6J00J4k73Q5K9M3n1J46j44J10l81J95j52J55K23l27K79k18K13o0J41p7k18
5650a32Q6j58K43k42K93on9ljO8k62J45Rj2P6k6M5m7p3K4K37j21j07o8K6j87P4
5677a78J95J01j59N7J19j88J10j27L41k34j62M5r0J93L6P4k4k16J44j28l0j08
$$ plain form
5699 -229 6 -175 -37 -54 -56 94 -96 -242 -116 161 -31 107 -41 128 -15 -107 384 -84 -146 -49 -179 55
5721 55 -140 -30 -266 147 -24 -54 -99 61 103 7 151 330 -166 -107 -40 -48 -110 -143 -96 -130 35 -53 118 258 10
5746 10 -275 -9 -10 -60 111 -269 -45 38 116 -154 204 12 -243 -49 70 143 291 105 -286 103 197 107 113 -38
5770 -38 162 -165 -107 101 -162 -300 79 -122 17 46 -90 192 44 262 -280 -241 -71 92 -161 -244 189 -48
5792 -48 -74 54 147 -119 -102 -125 -58 185 -113 82 176 589 -323 51 76 13 148 -441 -169 -19 243 -34 275
5815 275 183 87 -49 -331 266 71 -26 -79 204 318 -96 -414 -28 -63 -172 -112 369 -34 -71 348 -374 -57
5837 -57 37 -386 -177 246 -247 9 -146 79 165 -4 202 -166 156 -80 40 6 -113 -141 -158 230 -269 73
5859 73 118 -3 210 276 77 217 195 -54 143 -200 -80 5 -77 -95 146 29 78 -30 167 64 -82 112 68
$$ packed form
5699b29K35j81J38j7kJ50j90j46J26K77j92J38j48J69j43r2M91m68o2R7j30K34
5721E5j95J10k36M13j71l0m5J60M2r6J44J79m96N9O7qo2l3M7l4J65q8J71J40k48
5746A0k85K66jn0J71l80K24Q3P8k70L58j92k55J94J19P3J48j86l91L89R4r0Oj51
5770c8K00l27N8K08k63j38L79k01J39K9j36K82j48K18n42L9J70J63k53q3M33k37
5792d8k6J28R3k66J7k3O7K43k98J95R4M13r12L74K5o3J35n89K72J50K62k77L09
5815B75r2r6j36k82N97j95r7n3K83J14m14l18L86l5j09O0M81m03l7M19p22L17
5837e7R4m23K09M23m93K56j55K25Q6j69K06l68L22k36J20l4j19k8j7L88m99L42
5859G3M5j21K13O6j99J40k2k49J97l43J20Q5q2j8K41j17M9j08J97j03j46J94m4
$$ plain form
5882 68 -187 84 -108 -94 -57 -62 -76 -269 176 79 76 -29 -102 115 9 -210 31 145 189 -90 -49 19 -37 23 -84
5907 -84 75 -74 -17 -75 9 117 -17 -193 -29 -4 -157 34 108 28 -92 1 220 -157 246 -51 109 198 -167
5930 -167 -150 -26 34 -174 9 191 119 27 -76 186 74 -23 319 207 60 309 172 -194 -11 119 -216 105
5952 105 22 -279 -2 -69 -21 -99 30 -323 189 209 -88 -195 -69 18 -64 154 43 225 -89 157 5 -112
5974 -112 -436 96 74 2 169 -120 -278 -205 115 152 -132 146 181 127 -12 82 -79 -205 -36 -144 -2 62 -59
5997 -59 158 -32 -55 331 84 66 103 -91 -164 77 94 -5 4 95 83 -47 349 -204 271 -41 -46 120 210 -186 -400
6022 -400 -123 -218 203 163 167 89 35 -109 -236 152 212 -202 63 -48 269 42 257 -30 -157 299 195 -178
6044 -178 -21 203 288 -76 45 29 62 45 -226 -1 21 -71 -141 112 -3 -128 81 150 -98 23 12 74 177
$$ packed form
5882F8k55K71j92J4L7nj4j93M45r7lj05p3K17j06k19K41J14M4k79M1O8n6O0j07
5907h4J59j49N7n8Q4J08j34j76J64K5j53J91P4q0j20R3K19l77M03k97J60Q9l65
5930a67J7J24O0k08J83J82p2r2j03K62j12r7L42j12j47K49j37l66J83J30l35L21
5952A05q3l01K77o7M8p8J29l53N12K0k97j07J26Q7q2K18j11J82l14K46j52j17
5974a12l24N32k2p2J67k89j58P3L20L7k84K78L5n4j39R4j61j26J69j08J42O4j21
5997e9K17j90k3L86k47j8L7j94p3K41J7r9RR1j2j30L96n53M75l12nJ66R0l96k14
6022d00K77r5M21m0Mp8n4j44j27L88O0m14K65j11L17k27K15k87j27M56j04l73
6044a78J57K24Q5l64J21j6L3j7k71K25K2r2p0K53j15j25K09O9k48J21j1O2J03
$$ plain form
6067 177 -19 -186 -135 330 54 -10 -184 23 -371 -56 37 -93 -342 60 21 157 286 -106 -104 117 312 167
6089 167 160 230 95 150 -203 202 144 -75 -1 25 162 25 -110 271 282 198 -85 35 23 -9 -198 3 142 156
6113 156 -230 -108 71 -30 -69 -18 -107 39 103 -63 -70 255 -71 -143 275 133 -52 -357 92 30 66 -61 -278
6136 -278 179 54 -209 -211 -214 196 -139 -82 56 39 -285 22 129 -138 -10 10 -90 183 -113 -25 -19 21 -2 -83
6160 -83 -270 185 44 -349 198 167 205 58 69 65 -13 -20 -107 9 203 -44 -95 -22 219 14 179 338 95 -34
6184 -34 -159 -14 21 -132 -375 114 -100 130 141 20 187 -58 -214 -112 53 75 -39 10 -147 195 -260 -415
6206 -415 104 180 -206 77 171 68 51 -471 80 -42 147 -98 118 116 1 -95 -38 313 273 -134 -208 52 209
6229 209 -46 -168 32 290 223 -38 -217 199 7 -41 -12 -32 188 -57 -52 144 -39 -201 -119 -1 158 -31
$$ packed form
6067A77j96j67N1M65k76o4j74K07l94L15R3j30k49M02l9J36J29l92KK21J95j45
6089A67pP0j35N5l53M05n8k19P4K6J37j37j35L81J1q4k83J20j2l2j89K01J39J4
6113A56l86J22J79j01l9N1q9J46O4j66pL25l26p2M18j42j85l05M49o2L6j27k17
6136b78M57j25k63klM10l35N7J38j7l24L07J07k67J28K0j00K73k96Q8OM0k3q1
6160h3j87M55j41l93N47l1L8j47J1mp8pq7J16J94k47n1P3K41k05J65J59k43j29
6184c4j25J45L5j53k43M89k14K30J1j21J67k45j56J02J65K2j14M9j57L42m55j55
6206d15N19P6l86K83R4j03j7n22N51j22J89k45K16kj15r6N7L51m0m07p4K60J57
6229B09k55j22K00K58o7k61j79M16j92m8K9k0K20k45NJ96j83j62Q2J18J59j89
$$ plain form
6251 -31 -16 305 337 -25 -7 215 177 -64 -2 -183 141 -170 85 77 23 63 -399 -185 46 210 -70 -27 208 -131
6275 -131 52 -242 -6 236 -277 -368 -47 100 -11 -84 44 56 188 -16 -70 82 49 -71 27 78 41 -286 61
6298 61 112 80 -10 -79 288 280 -50 102 286 -91 -49 -203 339 274 -96 -236 1 140 -7 -96 -7 -33 -5 -250
6322 -250 -81 -64 150 -219 127 168 315 -108 342 164 43 -80 -143 -36 39 -318 106 196 74 -218 -187 -45
6344 -45 -241 -10 -28 -175 -43 -174 -209 -127 378 200 -73 102 138 26 193 32 13 74 265 -5 232 269 18
6367 18 139 -110 50 -56 94 262 124 -185 -96 128 159 261 -57 -64 44 11 155 -4 182 69 2 -239
6389 -239 -142 26 207 -43 -23 232 -272 -155 -60 126 -180 -163 -116 59 -223 -65 10 62 -14 -135 -48 -181 26
6412 26 -1 -70 78 94 64 -105 -133 157 96 -324 -54 127 198 -194 -176 -212 -86 -76 28 -35 161 197 -112 155
$$ packed form
6251c1J5L21L2l62J8K22l8k41O2j81L24l11K55qn4M0m62K14K31J64k80M3K35l39
6275a31J83k94K36K42n13r1L21J47j11p3J28J2J32k04n4J52l3j20R8N1l7l27L47
6298F1N1l2r0o9L67ql30J52J84l77M2j54N42o5l70j40K37J39j47q9Q9k6K8k45
6322b50J69J7K14l69L46M1J47m23M50j78j21j23o3J07P5l57M24R0j22k92L1J42
6344d5j96K31j8j47J32j31l5Q2N05j78k73J75L6j12J67j61j9O1J91k70K37L7k51
6367A8J21k49J60j06J50J68j38l09Q9K24L1J02l18pJ08l3J44j59J86j13o7k41
6389b39R7J68J81k50K0K55n04J17R5J86l06J7M7J75k82J58P5N2p6j21Q7j33K07
6412B6k7o9J48J6l0j69k8K90o1m20K70J81P1l92J8l6J26J0J04o3J96L6l09K67
$$ plain form
6436 155 317 -163 -275 -234 -92 153 -7 127 -13 52 -336 -93 -10 53 -68 171 -9 161 -250 -86 131
6457 131 222 -263 -174 -146 168 -256 -160 113 15 95 -46 151 93 210 -452 -67 79 37 41 -105 5 138 -270
6480 -270 -199 8 -119 92 -237 -1 157 -6 -195 46 -41 114 -294 12 -23 11 -199 166 189 -14 -321 -433
6502 -433 36 37 -303 -536 37 78 -26 28 181 -215 -95 -36 178 324 324 -230 -57 162 -30 -153 334 264 130
6525 130 26 -67 -14 -171 -218 -174 -33 38 -117 -165 44 18 19 -106 -49 190 37 -202 47 388 277 -327 146
6548 146 71 199 -20 52 170 -179 -129 -76 116 187 -285 -349 92 4 -261 72 421 95 -94 -211 323 109
6570 109 -264 51 -101 28 -75 -126 112 42 -304 -346 -184 108 -249 -95 -131 24 -191 -155 -134 202 54 -57
6592 -57 -183 246 237 104 -5 28 -37 150 105 47 176 153 -180 104 156 162 -252 3 302 105 128 -277 190 219
$$ packed form
6436A55J62m80j12M1J42K45j60J34j40O5l88K43Q3O3j21K39j80J70m11J64K17
6457A31R1m85Q9K8L14m24R6K73r8Q0j41J97n8J17o62L85J46m2Mj46J10J33m08
6480b70P1K07j27K11l29K36J58j63j89K41q7J55m08L06l5L4k10L65K3k03l07j12
6502d33M69Jl40k33N73M1j04N4J53l96J20N9K14J46%n54J73K19j92j23M87p0j34
6525A30j04r3N3j57m7M4J41P1j55m8K09k6Jj25N7K39j53k39K49L41j11o04M73
6548A46p5J28k19P2J18l49N0N3J92P1m72o4M41q8k65L33L49l26j89j17N34k14
6570A09l73L15j52J29j03n1K38p0l46m2J62K92l57J54l6J55k15L6K1L36j48j11
6592e7j26M29rj33j09L3o5J87m5n8J29k3l33K84N2Om14K55K99j97K3m05M67K9
$$ plain form
6616 219 -200 -19 153 288 -72 -108 42 -1 -65 -285 -113 -27 70 -156 406 121 204 -139 -171 358 -183 -252 -39
6639 -39 51 -181 -10 -94 52 -37 -104 -250 36 200 8 -202 108 23 187 -123 34 241 -23 -30 -128 373 36
6662 36 -137 156 382 372 -82 -104 77 -10 80 78 5 303 -275 -137 146 243 -73 156 -89 154 -173 -308 17
6685 17 -3 -62 -263 -31 133 28 61 -182 282 11 -56 -224 280 89 60 -196 -186 223 -29 48 -116 -12 59
6708 59 52 192 228 149 -41 -69 64 156 23 -143 72 132 -37 -149 195 210 -170 -358 -162 140 -85 -76 -94 10
6732 10 -195 -80 49 -21 36 -224 11 288 -208 -63 -77 106 349 -223 76 174 251 -39 42 336 263 -40 -175
6755 -175 223 389 129 -230 -4 118 38 -206 -34 424 -140 -94 115 35 28 -60 -169 -41 226 -205 -113 96
6777 96 165 88 -29 149 247 -258 -281 231 74 -36 -10 -132 224 185 44 -180 161 93 74 -338 60 -37 101
$$ packed form
6616B19m19J81J72J35l60l6J50m3o4k20J72Q6R7k26N62k85Q3l43l2N29n41o9K13
6639c9R0k32J71q4J46q9o7j46K86J64j92k10L10q5J64l10J57K07k64pr8N01l37
6662C6j73K93K26j0m54k2J81q7R0kp3K98n78J38K83R7l16K29k45K43l27j35L25
6685A7k0n9k01K32J64j05L3k43M64k71o7j68N04j91k9k56J0M09k52P7j64J04P1
6708E9pJ40L6p9j90k8J33R2j33j66K15O0j69j12L44J5l80j88J96L02k25Rj8J04
6732A0k05J15J29p0N7k60K35K77m96J45j4J83K43n72K99R8P7k90Q1K94p3l03j35
6755a75L98J66k60l59K26J22q0k44J72M58n64M6K09q0pq8j09J28K67m31R2K09
6777I6O9p7j17J78R8n05k3N12j57j10K6j22L56l9j41k24L41o8j9m12L98r7J38
$$ plain form
6800 101 -129 79 85 13 122 60 232 -61 -33 -266 192 117 -14 -305 -366 -63 89 -285 -79 -93 -9 -120 76
6823 76 178 179 -29 157 201 193 -139 -294 167 41 -39 85 55 -34 -283 -190 29 272 -181 -46 -79 339 9 -129
6847 -129 67 -16 -55 -124 -52 298 83 -62 182 -117 -6 -41 -225 83 -105 -51 124 141 -79 -289 -133 169
6869 169 116 -160 -71 120 -105 -236 -173 171 254 -122 -5 342 82 -269 -251 -39 35 -16 -14 55 -46 31 131 2
6893 2 40 68 -46 6 170 -61 262 53 352 134 -177 -367 -168 -70 -38 -127 -120 134 166 -318 246 260 -134 -58
6917 -58 280 115 318 -126 58 283 -73 89 -63 121 200 15 -107 -130 -169 -55 -91 -171 95 162 -277 -42
6939 -42 288 -50 -139 147 49 459 -477 -37 195 207 17 -141 -147 236 96 -245 5 -49 -5 -58 -169 295 -154
6962 -154 133 0 57 48 -89 -127 135 -186 -152 -19 -104 12 -124 -209 41 312 265 -293 97 -98 138 39 0
$$ packed form
6800A01k30K08Op2J09o2J72k93K8k33M58p5j31k91o1L03J52l74K06j4Q4j11J96
6823G6J02Jk08J86M4ql32j55M61j26q0J24l0q9k49R3K19K43m53J35l3M18l30j38
6847a29J96q3l9o9P2L50k15j45K44k99J11l5j84L08j88N4J75J7k20k10J56L02
6869A69n3k76Q9J91k25j31O3L44Q3l76J17L47k60l51J8K12P4n1KO9j01P7J00j29
6893BL8K8j14N2J64k31L23k09K99k18l11j90J99R8L2q9PK54L2m84N64J4l94P6
6917e8L38j65K03m44J84K25l56J62j52J84P9j85j22k3l9J14l6q0K66O7m39K35
6939d2L30l38q9K86r8M10r36M40K32J2j90j58oL83j40l41K50n4M4n3j11M64m49
6962a54K87j33N7rj37l8K62l21L4J33q5J16j36q5K50K71m7n58L90j95K36r9l9
$$ plain form
6985 0 300 -225 -202 425 -22 306 74 -34 122 -174 19 -145 194 8 13 -249 -15 170 -238 24 160 -151
7007 -151 -63 -160 95 28 -54 -46 -148 104 -110 147 -89 33 -187 37 86 -72 203 130 -42 -37 9 -116 182 127
7031 127 153 109 20 198 239 -98 -20 -25 92 -50 98 -92 31 90 -125 -81 401 191 -120 137 -125 89 208
7054 208 -37 -124 -1 -15 -214 -136 147 -103 56 -142 57 11 6 121 388 116 -93 -9 86 70 407 105 5
7077 5 210 -5 52 -56 -16 -309 127 225 -169 -36 -202 157 32 -14 -123 71 -4 -28 180 195 189 224 -152 66
7101 66 80 218 -37 97 66 56 -19 -174 44 177 -123 -129 -59 -277 38 -95 41 -22 296 3 -99 -6 323
7124 323 28 107 -64 -42 -94 -26 216 -114 126 -103 -9 58 -50 -225 -57 26 221 -163 -144 406 -39 -106 -116
7147 -116 253 229 -93 -210 299 381 201 -78 97 -26 -27 -442 95 161 -154 -9 -48 281 179 168 -35 13 94
$$ packed form
6985@L00n25K3O27m47L28k32j08J56k96J93j64L39j86Nk62K34J85m08K62J36l11
7007a51Q8r7K55o7q2Qj02K52k14K57k36J22k20K24M9j58K75p3j72NM6j25K98n5
7031A27K6m4q9J78M1l37P8nJ17j42J48j90J23N9k15M4M82k10l11K57k62K14J19
7054B08k45q7J23j4j99P8K83k50J59j98J99m6nJ15K67k72k09Q4R5j6L37l02j00
7077EK05k15N7j08M0k93M36R8l94J33j66L59j25m6j09J94p5k4K08J5oL5l76K18
7101F6J4J38k55J34l1j0p5j55K18J33l00oP0k18L15j33J36o3L18k93j02R3L29
7124C23k95P9j71K2n2O8K42l30K40k29R4O7j08j75J68Q3J95l84J9N50m45o7j0
7147a16L69k4l22j17N09Q2j80k79J75j23jm15N37O6l15J45l9L29j02j1k03M8Q1
$$ plain form
7170 94 66 -108 137 -138 236 -124 29 -240 42 44 145 -10 31 11 247 125 -135 -173 -80 -266 -82 152 -140
7193 -140 -91 -84 7 65 90 -48 -261 -93 103 157 -210 58 230 358 -42 -50 305 65 -58 -200 104 153 -124
7216 -124 41 118 -59 -181 -234 -105 120 -13 217 -206 111 99 -85 27 41 70 -211 -166 232 -146 -146 26 26
7239 26 -181 72 126 -159 255 93 -118 -112 163 -204 -122 -147 116 312 -54 -35 87 427 -261 -231 69 -193 -195
7262 -195 -19 -67 409 -213 -269 -86 -154 128 95 -153 153 232 -83 50 249 20 -77 -134 -130 -128 -100 10 -45 261
7286 261 -134 111 102 528 171 2 -136 -88 -28 -378 240 24 -91 -136 232 102 -28 -64 -82 -6 -32 -227 68
7309 68 222 94 42 -299 59 345 95 227 114 162 140 -18 -23 -2 -199 -445 -68 13 309 5 -96 34 223
7332 223 -16 93 202 92 41 -229 -38 285 -74 134 -159 112 40 17 -42 174 12 -161 136 71 190 113
$$ packed form
7170I4k8j74K45k75L74l60J53k69K82KJ01j55M1k0K36j22k60l8R3j86J84K34k92
7193a40M9PR1N8K5j38k13J68J96N4l67K68J72J28m00qL55k40j23j42L04M9k77
7216a24J65P7j77j22n3J29K25j33K30m23L17j2j84J12J4K9k81M5L98l78%J72%
7239B6k07K53N4k85M14j62k11OK75l67Q2k5K63J96l66J9J22L40o88L0L00k62k
7262a95J76m8M76o22n6J83o8K82l3k48L06P9l15J33J99k29r7n7MKK8J10n5L06
7286B61l95K45rM26l57j69j38M8O0l50O18k16j15m5L68j30j30l6j8P6k6j95K95
7309F8J54j28n2l41L58K86k50J32j13M8k2j58nK1j97k46L77Q1K96l04j01J30J89
7332B23k39J09J09j10n1k70J91L23l59K08k93K71p2k3n9K16j62j73K97o5J19p7
$$ plain form
7354 113 121 57 71 -39 -119 -316 -6 -23 -312 163 -199 -208 65 164 116 130 5 -20 150 -235 -186 17 -99 -276
7378 -276 -28 20 -26 3 -307 43 91 342 53 8 -123 29 97 -187 -10 61 124 139 15 131 -60 -134 -68 320
7402 320 -132 -144 -232 -265 196 -151 74 -61 131 -2 167 68 75 -180 -210 -270 -261 37 47 -148 266 150 -277 78
7426 78 -90 229 -129 -16 51 -61 -62 -53 -32 3 24 -51 47 2 81 -31 -329 -76 164 -148 111 -200 146 -141
7450 -141 -175 162 154 -149 -29 -201 -86 -63 -64 63 -15 -37 117 -93 -242 8 45 23 -112 -82 181 226 53 88
7474 88 -265 -259 -11 -8 20 -145 -117 -29 -114 -174 88 262 -162 -58 -18 12 -107 -34 21 -184 85 225 13 218 178
7499 178 159 49 -70 -40 -349 -355 204 -202 -206 22 -15 -231 79 -31 170 94 -137 -434 -260 55 -116 -78 230
7522 230 30 -193 8 -149 167 -176 249 73 30 -19 55 116 294 65 144 -5 84 69 -30 88 -58 -122 15
$$ packed form
7354A13Qo4J4j10q0j97L10j7k89M75l62rK73R9m8J4j25k5J70l85M9K03j16j77
7378b76K48M8m6K9l10L50M8K51k89m5j31J52O8k84J77P1O3J5j24J16j91p4O6L88
7402C20m52j2q8l3M61l47K25j35J92j33J69r9Pk55l0o0RK98J0j95M14j16m27L55
7426G8j68L19l58J13O7j12jRK1L5K1p5R8m5P9j12k98K53K40l12K59l11L46k87
7450a41l4L37ql03J20j72J15K3jJ27p8k2J54k10j49K50L7k2j35L0K63M5j73L5
7474H8l53OK48LK8j65K8Q8q5o0K62J74m24J04M0L0j19P3N5k05K69J40k12K05m0
7499A78j9j10j19L0l09oN59m06mK28l7k16L10j10K01p6k31k97J74L15j71L8L08
7522B30k00k23K01j57L16l43M25j76m3m9P4O1J78k29P9j49Q9j5r9J18j46o4J37
$$ plain form
7545 15 -182 -95 105 -211 -56 0 -68 67 73 -153 -32 168 -18 21 -118 112 421 -11 -188 87 187 196 -58
7568 -58 -47 204 -48 87 62 36 -233 -137 -42 -464 -76 91 -181 20 184 -5 165 303 -163 334 191 97
7590 97 -44 -230 190 31 118 173 221 -37 339 -160 289 -93 146 -305 -13 70 149 134 -75 74 68 -190 -382
7613 -382 161 75 40 -224 112 129 -233 -105 -200 254 280 66 -149 145 -110 181 -81 41 91 -38 3 -73 49
7636 49 -43 305 -267 1 198 -231 219 51 -56 -227 166 2 163 -162 148 -53 82 -388 -123 166 198
7657 198 -217 -29 132 -114 169 -272 355 91 210 -94 -170 68 -66 247 45 -2 -62 9 300 310 114 53
7679 53 156 7 0 -40 28 203 -85 -126 197 -166 -74 -380 -117 -264 66 133 -8 210 170 -49 -109 119 93 18
7703 18 41 -221 122 -15 -7 -216 43 174 -35 38 230 51 21 -111 -67 -80 2 39 -159 -157 -47 113 52 213
$$ packed form
7545A5j97Q7K00l16J55N6o8J35Ok26J21K00j86L9j39K30L09m32j77K75J00Rk54
7568e8J1K51k52J35k5k6k69R6R5m22L88J67k72K01J64j89J70J38m66M97j43r4
7590I7j41j86M20j59Q7N5M8k58L76m99M49l82K39m51K92Q3P9j5k09J49ok58j92
7613c82N43q6l5k64L36J7l62J28r5M54K6k14k15K94k55K91k62J22N0j29M1p6J22
7636D9r2L48n72K68J97m29M50j68j07j71L93j64J61l25L10k01J35m70K65K89L2
7657A98m15J88J61k46K83m41O27k64J19l04p6K38j34L13k02m7o0P1K91J0j96o1
7679E3J03j49pm0O8J75k88m1L23l63R2l06K63j47L30O7j41K18m0k19o0K28k6p5
7703A8K3k62L43j37Qk09K59J31k09P3J92j79l0j32M4j3Q2L7j98KJ10J60o1J61
$$ plain form
7727 213 219 181 -15 -95 289 -37 251 -27 -98 191 -234 -44 -77 -46 -163 236 118 123 -102 -153 5 -129 99
7750 99 -13 4 144 -309 33 74 72 0 -213 -276 107 -162 64 -275 177 68 -173 272 -98 -123 -110 -8 175
7773 175 -31 114 127 44 73 32 226 43 75 163 160 -79 -30 8 -130 -15 -47 116 -103 -159 -34 157 -339 -145
7797 -145 55 -175 -112 -39 78 295 104 12 -82 -182 116 25 278 84 -19 147 -52 12 -36 -103 -41 338 50
7820 50 70 323 204 113 -24 53 31 78 -201 145 -151 -117 -65 -194 52 -154 -68 59 22 -217 -2 -23 212 33
7844 33 87 -14 93 -48 -102 -306 -234 -193 -255 69 -268 38 -29 -120 37 31 1 -96 428 -138 -122 276 -73 324
7868 324 -68 -199 -200 103 44 -36 -29 198 -109 53 -93 -96 -32 110 201 -116 222 62 1 67 281 317 -1 26 64
7893 64 216 -137 60 -131 104 -1 -235 69 3 -61 -6 -91 -133 72 -26 47 156 92 40 31 9 175 -297 -297 -20
$$ packed form
7727B13Ol8j96q0L84l26K88k78p1K89m25J90l3L1j17L99j18Nk25n1J58j34K28
7750I9j12J7J40m53L42M1kp2k13o3L83k69K26l39M52j09k41M45l70k5J3J02J83
7773A75k06J45J3q3K9m1J94j83L2Q8lk39M9L8j38J15l2J63k19n6J25J91m96J94
7797a45K00k30O3P3J17K17j91r2r4j00K98r1K53j94j03J66j99O4m8o7O2L79k88
7820E0K0K53j19r1j37P7k2M7k79L46k96L4N2j29K46k06Q6J27l7k39K15k1K35j79
7844C3N4j01J07j41n4k04P2M1o2L24l37L06o7r1J57ol0r7N24n66J6L98l49L97
7868C24l92j31jL03n9q0PK27l07J62j46lO4J42R1l17L38j60o1O6K14L6l18K7L8
7893F4J52l53J97j91K35j05k34L04o6o4N5q5m2K05r8P3J09o4n2rk2J66m72%K77
$$ plain form
7918 -20 49 -21 137 -38 237 -70 -227 15 -222 -130 346 75 339 -104 -311 -148 -96 274 132 78 113 -59
7940 -59 69 55 66 162 -83 -135 164 -6 -32 -289 53 137 232 -72 41 174 -160 -71 -74 -376 138 -287 -7 71
7964 71 52 45 -9 -119 15 303 27 -258 156 -21 149 342 191 115 90 -159 185 158 -232 19 -176 183 66
7987 66 40 -165 24 -17 54 113 102 -72 -127 -119 169 35 29 0 -74 -208 -48 4 -119 -39 -212 -10 -49 -52 -15 -236
8013 -236 -275 -60 4 -306 62 -13 25 -170 -68 114 129 25 -10 101 -99 -10 270 -39 -162 108 252 -11
8035 -11 -36 -133 5 10 235 -89 7 305 -99 96 -28 101 2 -16 -278 -83 -90 306 104 -116 -83 338 -293 1
8059 1 -269 104 -54 39 131 -104 70 -88 -79 65 68 -81 33 194 103 14 168 22 -31 -63 -345 -122 -115 -235 -341
8084 -341 147 307 148 -39 -187 183 15 -7 17 171 -15 61 -126 151 -14 -28 172 -49 9 -54 -69 246
$$ packed form
7918b0O9p0J58j75K75l07j57K42k37R2M76k71K64m43k07J63N2L70j42n4L5j72
7940e9J28j4J1R6k45n2K99j70k6k57L42Q4R5l04J13J33l34Q9ll02N14m25K80P8
7964G1j9pn4j10J34K88k76k85M14j77J70J93j51p6k5k49L44k7l90K51j95L59j17
7987F6k6k05J89m1P1N9j1j74n5QK88j34ok9p4j34J60N2j23Q0j73K02l9lL7k21
8013b36l9K15O4l10L68p5L8j95J02J82J5j04l5J11k00Q9K80l09j23K70J44k63
8035a1k5r7J38NK25l24R6K98m04J95j24J29r9j8k62J95pL96k02k20L3M21o31K94
8059Ak70L73j58R3R2k35J74j58RJ44Lj49J14J61r1q9J54j46n3l2k82K23Pj20j06
8084c41M88J60j59j87j48L70j68k2K4J54j86P6j87K77j65j4K00k21N8o3j5L15
$$ plain form
8106 246 -105 98 -161 -57 356 227 108 71 41 157 256 -148 148 266 -198 -113 -150 2 -131 330 223 -46
8128 -46 -96 -127 -6 -203 119 -122 253 72 104 -53 17 28 -59 165 226 63 -122 -184 53 110 142 303 159 339
8152 339 -8 -258 -84 5 113 140 -220 16 -14 -132 16 3 -70 -102 -91 -318 96 32 207 -150 105 -131 -130
8175 -130 34 -3 -1 -114 112 -293 -3 -241 6 -127 38 155 -79 8 333 83
$$ packed form
8106B46l51K03k59J04M13j29j19l7l0J16R9m04K96J18m64Q5l7J52j33M61j07k69
8128d6n0l1J21j97L22k41L75j81L2j57P0J1q7K24O1j63j85o2K37N7L2J61j44J80
8152C39l47k50J74Q9J08K7l60K36l0j18J48j3p3l2J1k27M14o4J75l57K55k36J
8175a30J64l7Kj13K26m05K90k38K47j33J65J17k34Q7L25k50
8191H3
$$ Imaginary data points
##PAGE= N=2
##DATA TABLE= (X++(I..I)), XYDATA
$$ plain form
0 0 0 0 0 0 0 0 0 0 0 0 0 -8 8 -8 14 -16 16 -24 25 -32 40 -48 56 -65 80 -89 105 -122 140 -162 185 -211 240
33 240 -272 308 -346 388 -435 487 -543 603 -671 745 -825 912 -1009 1113 -1226 1354 -1491
50 -1491 1641 -1807 1993 -2200 2430 -2692 2987 -3329 3722 -4190 4750 -5438 6305 -7437 8987
65 8987 -11244 14853 -21568 38376 -178692 -183197 150761 61310 6972 140272 258872 41110
77 41110 -182830 -139117 49588 31822 -76758 -14198 176054 135627 -92624 -155704 7750
88 7750 33083 -123989 -142715 64573 157104 16500 -64595 81384 165509 4883 -141385
99 -141385 -42833 72048 -32823 -157483 -36001 143622 84220 -82822 -50915 89078 42390
110 42390 -124506 -88500 110205 125608 -48603 -74863 77780 92400 -81619 -129674 29396
$$ packed form
0@%%%%%%%%%%%qJ6j6K2l0L2m0M9n7P2q8J04j21J45j69J94k27K62l02L47l96M51
33B40n12N80o54P34q23R22j030J146j274J416j570J737j921K122k339K580k845
50a491L132l448L800m193M630n122N679o316P051p912Q940j0188J1743j3742J6424
65H987k0231K6097l6421N9944k17068m505L33958q9451n4338J33300J18600k17762
77D1110k23940M3713J88705j7766j08580O2560J90252m0427k28251o3080J63454
88G750K5333j57072j8726K07288R2531j40604q1095J45979Q4125j60626j46268
99a41385R8552J14881j04871j24660J21482J79623n9402j67042L1907J39993m6688
110D2390j66896L6006J98705J5403j74211k6260J52643J4620j74019m8055J59070
$$ plain form
121 29396 97799 -40747 -117446 11128 109354 5341 -94602 11610 135411 40679 -106564
132 -106564 -48149 83945 27326 -109833 -56636 101680 81248 -67924 -70173 57147 58208
143 58208 -77579 -97656 46772 102984 -17741 -78530 37529 106947 -12012 -105986 -4499
154 -4499 92244 -4028 -106314 -17496 97343 32073 -78100 -25135 85308 36897 -91853
165 -91853 -73865 50004 54998 -51786 -49307 78689 100154 -30686 -81826 20002 60503
176 60503 -44783 -92169 22343 100966 10432 -76100 -9365 62695 -11392 -99828 -31618 83500
188 83500 53489 -44557 -16634 77083 44789 -70768 -68172 40575 52873 -45569 -58964 41349
200 41349 64465 -34212 -73520 15542 66425 -9546 -60682 14203 75958 9676 -64087 -14580
$$ packed form
121B9396O8403j38546p6699J28574R8226j04013r9943J06212J23801r4732j47243
132a06564N8415J32094n6619j37159N3197J58316k0432j49172k249J27320J061
143E8208j35787k0077J44428N6212j20725o0789J16059O9418j18959r3974J01487
154d499R6743r6272j02286Q8818J14839o5270j10173N2965J10443m8411j28750
165i1853J7988J23869M994j06784K479J27996K1465j30840n1140J01828M0501
176F0503j05286m7386J14512P8623r0534q6532O6735P2060p4087q8436O8210J15118
188H3500l0011r8046K7923R3717l2294j15557K596J08747J2298r8442j3395J00313
200D1349K3116r8677l9308Q9062N0883p5971n1136P4885O1755o6282p3763M9507
$$ plain form
212 -14580 60257 14582 -68358 -34064 50847 27657 -54774 -34570 56066 53535 -33374 -41412
224 -41412 36885 45916 -35419 -58106 20389 58016 -11047 -56322 4536 49430 -11589 -66169
236 -66169 -9195 60127 22761 -39110 -3077 60119 24050 -51352 -36641 32126 26085 -38573
248 -38573 -35287 35017 42321 -26518 -47559 13327 40193 -17444 -45196 16382 56486 4446
260 4446 -39292 1661 42393 1108 -50265 -18416 37010 17936 -32613 -17008 36515 26042
272 26042 -35451 -36483 21513 30430 -20290 -28156 25934 41361 -13516 -41014 4241 32641 -6901
285 -6901 -35091 4805 42191 9291 -35137 -13684 28561 8435 -34608 -16943 33309 26351
297 26351 -24670 -26525 19352 20964 -25091 -28887 20304 37691 -4419 -26138 7827 26903 -9831
$$ packed form
212a4580P4837m5675q2940L4294Q4911k3190q2431K0204R0636k531q6909q038
224d1412P8297R031q1335k2687P8495L7627o9063m5275O0858M4894o1019n4580
236f6169N6974O9322l7366o1871L6033O3196l6069p5402J4711O8767o041o4658
248c8573L286P0304P304o8839k1041O0886K6866n7637k7752O1578M0104n2040
260D446m3738M0953M0732m1285n1373L1849N5426j9074n0549J5605N3523j0473
272B6042o1493j032N7996Q917n0720p866N4090J5427n4877k7498M5255K8400l9542
285f901k8190L9896L7386l2900m4428K1453M2245k0126m3043J7665N0252o958
297B6351n1021j855M5877J612m6055l796M9191J7387m2110k1719L3965J9076l6734
$$ plain form
310 -9831 -36671 -3067 32680 10970 -24719 -5608 28776 6952 -36356 -22897 22102 20266
322 20266 -16081 -12794 26433 24424 -20093 -29973 8107 24289 -7249 -23079 11245 32654 -1446
335 -1446 -31464 -6512 23741 2279 -29146 -7222 29354 12628 -25078 -14902 21883 16740
347 16740 -20023 -18252 19450 22819 -15076 -23977 11788 26250 -5755 -23943 6624 26309 -5814
360 -5814 -32845 -6375 24238 5230 -22507 -2529 29555 12203 -25881 -18908 15082 12867 -18285
373 -18285 -14286 24891 29920 -8957 -23664 5810 16159 -16079 -30220 5489 31409 4489
385 4489 -21314 802 23155 -1297 -31789 -12276 23580 13325 -18151 -7813 25840 18990
397 18990 -19610 -20881 14602 18191 -17000 -23398 11960 23818 -7945 -23418 6740 25957 -3182
$$ packed form
310i831k6840L3604L5747k1710l5689J9111L4384k1824m3308J3459M4999j836
322B0266l6347L287L9227k009m4517r880L8080J6182l1538j5830L4324K1409l4100
335a446l0018K4952L0253k1462l1425K1924L6576j6726l7706J0176L6785n143
347A6740l6763J771L7702L369l7895q901L5765J4462l2005j8188L0567J9685l2123
360e814k7031K6470L0613j9008k7737J9978L2084j7352l8084O973L3990k215l1152
373a8285L999L9177N029l8877j4707K9474J0349l2238j4141L5709K5920k6920
385D489k5803K2116K2353k4452l0492J9513L5856j0255l1476J0338L3653o850
397A8990l8600j271L5483L589l5191o398L5358J1858l1763j5473L0158J9217k9139
$$ plain form
410 -3182 -27313 -3462 22085 2150 -25166 -5039 29106 15614 -18555 -9770 20584 10718 -25053
423 -25053 -21623 15507 20310 -11559 -15816 16197 22590 -11803 -28628 61 20055 -4956 -22713
436 -22713 6074 31145 7029 -22814 -6108 20777 3096 -26487 -10941 23087 15709 -15999
448 -15999 -13043 17756 15383 -19427 -24155 9477 19835 -10093 -20188 11888 27517 -4019 -24077
461 -24077 1503 21433 -2201 -23852 -987 26008 8671 -20879 -8703 19016 7670 -22086
473 -22086 -14511 17805 15268 -16051 -16549 14344 17980 -12036 -19327 11086 22236 -6381 -21248
486 -21248 4776 21128 -3354 -21147 1275 23108 3843 -21318 -7624 17128 5535 -20847
498 -20847 -11384 20189 16106 -16140 -15136 15555 15311 -15218 -17468 13666 20481 -7702 -17778
$$ packed form
410c182k4131K3851K5547j9935k7316K0127L4145j3492l4169Q785L0354r866l5771
423b5053L430L7130M803l1869m257L2013O393l4393j6825K8689J9994k5011j7757
436b2713K8787K5071k4116k9843J6706K6885j7681k9583J5546L4028p378l1708
448a5999K956L0799k373l4810m728L3632J0358k9928j0095L2076J5629l1536k0058
461b4077K5580J9930k3634k1651K2865K6995j7337k9550J2176K7719j1346k9756
473b2086P575L2316k537l1319m98L0893L636l0016p291L0413J1150k8617j4867
486b1248K6024J6352k4482j7793K2422K1833j9265k5161J3694K4752j1593k6382
498b0847R463L1573m083l2246J004L0691k44l0529k250L1134O815k8183j0076
$$ plain form
511 -17778 7067 18963 -4387 -21230 -628 20260 1736 -22377 -5555 19328 5631 -19600
523 -19600 -6781 20555 11417 -17033 -13120 12944 11809 -12485 -12522 14531 20440 -6687 -19006
536 -19006 2793 13573 -8589 -19999 3801 22509 4114 -16817 -3000 15198 -89 -21554
548 -21554 -8177 18865 12983 -11282 -6816 16356 10953 -15225 -15549 8878 13543 -8812 -15886
561 -15886 7633 18022 -3931 -16966 2198 16455 -4001 -21536 -2820 17949 5589 -11224
573 -11224 808 18284 6566 -17665 -14888 7723 9153 -8738 -6681 16205 18251 -9185 -20340
586 -20340 -1746 7291 -8916 -12566 10817 24126 5369 -14156 -6419 5723 -5180 -17597 -1731
599 -1731 22304 17636 -4441 -6368 7020 -242 -22313 -18377 8579 17135 1140 -3981 11509
$$ packed form
511a7778K4845J1896k3350j6843K0602K0888j8524k4113J6822K4883j3697k5231
523a9600J2819K7336r138k8450L913K6064j135k4294l7K7053N909k7127j2319
536a9006K1799J0780k2162j1410K3800J8708j8395k0931J3817J8198j5287k1465
548b1554J3377K7042n882k4265M466K3172n403k6178l24K4427M665k2355p074
561a5886K3519J0389k1953j3035J9164J4257k0456j7535J8716K0769j2360j6813
573a1224J2032J7476j1718k4231K777K2611J430j7891K057K2886K046k7436j1155
586b0340J8594R037j6207l650K3383J3309j8757j9525P737J2142j0903j2417J5866
599a731K4035m668k2077j927J3388p262k2071L936K6956Q556j5995n121J5490
$$ plain form
612 11509 12152 -11597 -23309 -4624 10863 1562 -6825 8830 22463 6555 -14740 -9685 4226
625 4226 -3025 -18467 -8426 16568 18057 -549 -3230 10165 4505 -19439 -25127 -2398 12369
638 12369 4225 1512 16519 21587 -2077 -23912 -15819 880 -2387 -7901 9393 27850 15479
651 15479 -10625 -15322 -3232 -6155 -18015 -9293 16158 21006 2428 -6103 5337 7854 -10357
664 -10357 -17080 1491 13758 930 -10280 2983 16211 2797 -13828 -5943 7615 -1822 -17334
677 -17334 -8157 14392 14551 -1646 -2231 11031 6495 -15421 -19564 2069 12966 -286 -5542 10186
691 10186 14260 -6775 -20381 -5607 10756 3417 -6546 4782 17158 4081 -16940 -12315 6107
704 6107 4823 -10241 -4853 14485 11806 -9532 -13224 4703 9855 -4772 -7351 10840 17579 -1463
$$ packed form
612A1509O43k3749j1712J8685J5487r301q387J5655J3633j5908k1295N055J3911
625D226p251j5442J0041K4994J489j8606k681J3395n660k3944n688K2729J4767
638A2369q144k713J5007N068k3664k1835Q093J6699l267n514J7294J8457j2371
651A5479k6104m697J2090k923j1860Q722K5451M848j8578q531J1440K517j8211
664a0357o723J8571J2267j2828j1210J3263J3228j3414j6625P885J3558r437j5512
677a7334R177K2549J59j6197n85J3262m536k1916m143K1633J0897j3252n256J5728
691A0186M074k1035j3606J4774J6363p339r963J1328J2376j3077k1021M625J8422
704F107j284j5064N388J9338k679k1338l692J7927N152j4627k579J8191O739j9042
$$ plain form
718 -1463 -15531 -3747 6281 -6501 -17160 -1416 16277 7038 -8856 -2814 12483 4334 -13951
731 -13951 -7814 13195 12251 -5693 -6285 9889 8283 -13566 -18027 798 9550 -4392 -9745 7914
745 7914 18036 1306 -12751 -1017 11290 -1487 -15155 -2922 14505 6338 -10612 -4612 10744
758 10744 4194 -13578 -9951 9421 11533 -5321 -7034 10091 11842 -7981 -15382 1104 9720
771 9720 -4689 -12441 4531 15750 1333 -12095 -755 12139 1535 -12821 -2804 12872
783 12872 4974 -11686 -6846 9626 6400 -11499 -9514 8813 9279 -7378 -9209 8807 12890 -4535
797 -4535 -11162 3949 10438 -5043 -13039 1795 13221 1307 -11135 -654 11403 592 -13585
810 -13585 -4505 11332 6543 -8305 -4282 10827 5929 -12964 -12348 5808 8436 -5201 -5692 11056
$$ packed form
718a463j4068J1784J0028j2782j0659J5744J7693r239j5894O042J5297q149j8285
731a3951O137K1009r44j7944n92J6174j606k1849m461J8825Q752j3942n353J7659
745G914J0122j6730j4057J1734J2307j2777j3668J2233J7427q167j6950O000J5356
758A0744o550j7772L627J9372K112j6854j713J7125J751j9823p401J6486Q616
771I720j4409p752J6972J1219j4417j3428J1340J2894j0604j4356J0017J5676
783A2872p898j6660M840J6472l226j7899J985J8327M66j6657j831J8016M083j7425
797d535o627J5111O489j5481p996J4834J1426j1914j2442J0481J2057j0811j4177
810a3585R080J5837m789j4848M023J5109m898j8893O16J8156K628j3637m91J6748
$$ plain form
824 11056 14370 -3707 -12115 842 7886 -4927 -12111 2287 13974 1592 -11752 -2855 8214
837 8214 -1079 -13880 -4240 12945 8385 -6138 -2034 12023 7761 -9131 -9297 5653 5792 -9835
851 -9835 -11842 4050 9297 -3026 -7548 6308 12439 -2647 -12608 -1573 8473 -288 -8473 2128
865 2128 14237 4961 -10387 -6401 4587 -644 -11785 -5378 11403 11579 -2514 -3499 6944 5097
879 5097 -9582 -12146 2260 8066 -3100 -8027 4135 10213 -829 -8403 1663 10154 682 -9950
893 -9950 -2251 7953 1440 -7508 -1303 10058 4850 -8080 -6870 3286 1051 -9325 -6468 7617
907 7617 11050 602 -2335 6677 6273 -6788 -11861 -2343 4378 -1912 -5065 5328 12688 3683 -6273
922 -6273 -3072 1857 -4673 -12238 -4155 9461 9678 2187 3146 7553 974 -12631 -13586 -1685 3119
$$ packed form
824A1056L314j8077q408J2957P044j2813p184J4398J1687j2382j3344Q897J1069
837H214r293j2801R640J7185m560j4523M104J4057m262j6892j66J4950J39j5627
851i835k007J5892N247j2323m522J3856O131j5086r961J1035J0046q761q185J0601
865B128J2109r276j5348L986J0988n231j1141O407J6781J76j4093r85J0443j847
879E097j4679k564J4406N806j1166m927J2162O078j1042p574J0066Q491r472j0632
893i950P699J0204o513q948O205J1361n208j2930J210J0156k235j0376K857J4085
907G617L433j0448k937R012m04j3061n073R518O721o290l153J0393P360r005r956
922f273L201M929o530p565Q083J3616K17p491R59M407o579j3605r55J1901M804
$$ plain form
937 3119 -381 2890 12745 12235 -1313 -9301 -5175 -2716 -7431 -7471 3453 11077 5954 -1387 287
952 287 3537 -2859 -9819 -4640 4507 3600 -1545 1449 7946 4243 -4121 -4229 848 -324 -6260 -5472
968 -5472 1800 4522 -368 -1218 4829 6147 -832 -5392 -1581 910 -3408 -5034 1920 8067 4907
983 4907 24 841 2038 -4342 -9675 -6455 1238 3112 1773 4594 7556 3832 -4767 -7108 -3271
998 -3271 -1440 -2692 -212 6502 8114 2129 -2413 -459 -1107 -5427 -5530 -486 3418 1996 463 2308
1014 2308 3486 16 -3406 -2595 181 -671 -2814 -499 3783 3125 770 837 2374 209 -3593 -3915
1030 -3915 -1251 -226 -635 1079 3645 3275 32 -2610 -2400 -1894 -3553 -2361 1556 4212 3063 1603
1046 1603 1930 683 -2624 -3825 -2157 -160 301 597 2348 2916 467 -2071 -2393 -1494 -1863 -1697 484
$$ packed form
937C119l500L271R855n10j3548p988M126K459m715m0J0924P624n123p341J674
952B87L250o396o960N179R147r07n145K994O497l703q364j08N077j172n936P88
968e472P272K722m890q50O047J318o979m560L811K491m318j626O954O147l160
983D907m883Q17J197o380n333L220P693J874j339K821K962l724q599k341L837
998c271J831j252K480O714J612n985m542J954o48m320j03N044L904j422j533J845
1014B308J178l470l422Q11K776q52k143K315M282o58k355O7J537k165l802l22
1030c915K664J025m09J714K566l70l243k642K10N06j659J192L917K656j149j460
1046A603L27j247l307j201J668J997M61K96J751N68k449k538l22Q99l69J66K181
$$ plain form
1063 484 2771 2443 1045 1007 972 -867 -2429 -2009 228 624 -189 1182 2519 1120 -1198 -1107 -699 -1285
1081 -1285 -2437 -1548 1147 1724 562 872 2172 1541 -1508 -2778 -880 81 -996 -323 2863 3512 1448
1098 1448 -1206 -1280 -1282 -3631 -3866 -868 2469 2820 1777 1770 2124 -939 -3990 -3334 -626 989 564 2105
1116 2105 4317 2771 -1298 -2695 -1648 -1585 -3126 -2045 1000 2287 780 8 1097 1202 -1040 -2510
1132 -2510 -636 1400 138 -464 1884 3490 1666 -1065 -785 -535 -2649 -4145 -2750 933 2178 1760
1148 1760 1903 3363 1922 -2371 -3533 -1259 70 -262 606 3458 4141 542 -2338 -2289 -2017 -2946 -2530
1165 -2530 1370 4312 3793 1505 1491 614 -2643 -4875 -2907 204 2009 1562 1352 2303 184 -3007 -3714
1182 -3714 -956 850 1432 2903 4361 3298 -574 -3373 -3477 -2658 -2186 -868 1613 3294 1689 -798
$$ packed form
1063D84K287l28j398l8l5j839j562M20K237L96q13J371J337j399k318R1M08n86
1081a285j152Q89K695N77j162L10J300o31l049j270J898R61j077O73L186O49k064
1098A448k654p4kk349k35K998L337L51j043pL54l063l051O56K708J615m25J541
1116B105K212j546m069j397J047O3j541J081L045J287j507p72J089J05k242j470
1132b510J874K036j262o02K348J606j824k731K80K50k114j496J395L683J245m18
1148A760J43J460j441m293j162K274J329l32Q68K852O83l599k880M9K72r29M16
1165b530L900K942n19k288j4q77l257k232J968L111J805m47k10R51k119l191p07
1182c714K758J806N82J471J458j063l872k799j04Q19M72J318K481J681j605k487
$$ plain form
1198 -798 -1524 -898 -1421 -1207 871 3307 3049 1610 799 131 -1333 -3142 -3520 -1915 -446 84 403 1979
1216 1979 2593 1156 -1254 -1710 -963 -1153 -236 2151 3650 3089 688 -1134 -2431 -3106 -3468 -1632 1082
1233 1082 3011 2915 1359 -99 -1719 -2537 -2905 -370 1973 2904 1682 826 -536 -1541 -2500 -1665 154
1250 154 1833 1548 732 668 271 -896 -1423 -1062 19 274 -1008 -352 1081 907 336 100 305 -15 -1437
1269 -1437 -1895 -65 1612 1573 1481 1228 876 -780 -3217 -2510 -465 800 919 1743 2355 1304 -1783 -3372
1287 -3372 -1658 -261 -98 940 2961 3380 831 -1646 -1150 -244 -1227 -1972 -60 2481 1475 -993
1303 -993 -650 768 -431 -2254 -1834 1104 2011 -106 -101 2299 2005 -1174 -1958 -68 1600 -511 -1977
1320 -1977 827 2401 -25 -2083 -683 1159 -340 -2701 -633 2356 1438 -1032 -303 1939 987 -2492
$$ packed form
1198g98p26O26n23K14K078K436k58j439q11o68j464j809l78J605J469N30L19J576
1216A979O14j437k410m56P47j90R17K387J499n61k401j822j297o75l62J836K714
1233A082J929r6j556j458j620q18l68K535K343R31j222q56j362j005r59Q35J819
1250A54J679k85q16o4l97j167n27L61J081K55j282O56J433j74n71k36K05l20j422
1269a437m58J830J677l9r2k53l52j656k437P07K045J265J19Q24O12j051l087j589
1287c372J714J397J63J038K021M19k549k477M96R06r83p45J912K541j006k468
1303i93L43J418j199j823M20K938R07k117NK400k94l179p84J890J668k111j466
1320a977K804J574k426k058J400J842j499k361K068K989r18k470P29K242r52l479
$$ plain form
1336 -2492 -1766 1567 2256 -951 -1175 1897 1927 -1678 -3226 -288 1683 -542 -1659 1174 2989 234
1352 234 -3483 -1206 2008 107 -2165 114 3386 2084 -2348 -1911 1671 1189 -2101 -1803 2318 2273
1368 2273 -1463 -2850 638 2529 -1407 -2591 1235 3011 -488 -3458 -2 3186 330 -2348 284
1383 284 3391 562 -3493 -1876 2512 1097 -2406 -1371 3102 1609 -3054 -3295 1348 2391 -1799
1398 -1799 -1924 2775 4142 -1667 -3862 102 2919 -692 -2832 1510 4513 673 -3909 -1688 2160
1413 2160 273 -3816 -766 4182 2451 -2640 -2353 2113 1674 -3257 -2895 2737 3801 -889 -2529 1762
1429 1762 3623 -1659 -4341 -97 2898 -593 -3931 -142 3678 994 -3303 -498 3518 753 -4457
1444 -4457 -2489 3000 2888 -1757 -788 4185 2603 -3536 -4646 518 2534 -1435 -2418 2801 4528 -1200
$$ packed form
1336b492P26L333O89l207k24L072L0l605j548K938J971k225j117K833J815k755
1352B34l717K277L214j901k272K279L272j302m432M37L582m82l290K98M121m5
1368B273l736j387L488J891l936j184L826J776l499k970L456L188k856k678K632
1383B84L107k829m055J617M388j415l503J035M473j493m663k41M643J043m190
1398a799j25M699J367n809k195L964K817l611k140M342L003l840m582K221L848
1413B160j887m089L050M948j731n091K87M466m39m931L62N632J064m690j640M291
1429A762J861n282k682M244K995l491l338L789L820k684m297K805M016k765n210
1444d457J968N489j12m645R69M973j582o139j110N164K016l969r83N219J727n728
$$ plain form
1460 -1200 -4648 -1142 2121 -1007 -3834 1158 5498 1865 -3535 -1840 2379 618 -3390 -1421 3975
1475 3975 3466 -1696 -2602 1478 1639 -3112 -3471 2378 4173 -330 -3069 729 2787 -1152 -3736 369
1491 369 4220 902 -2684 -331 3716 1608 -3189 -1784 2608 770 -3710 -2600 2762 2958 -1597
1506 -1597 -1924 2169 2217 -3108 -4161 657 3101 15 -1310 2533 4157 -371 -4415 -2101 2023 -52
1522 -52 -2812 92 4549 2200 -2846 -2366 1551 587 -2709 -1864 2708 3108 -1396 -2266 1777 3015 -780
1539 -780 -2820 857 2829 -1113 -3243 242 3323 628 -2399 -391 2489 -145 -3918 -2039 2286
1554 2286 2134 -971 -528 2717 2289 -2049 -2815 1309 2432 -738 -2223 1221 2599 -765 -3037 167
1570 167 2704 403 -2465 -866 2244 157 -2885 -1181 2392 2141 -1175 -1145 2110 1492 -2343 -2971
$$ packed form
1460a200l448L506L263l128k827M992M340l633n400J695M219j761m008J969N396
1475C975n09n162r06M080J61m751l59N849J795m503k739L798K058l939k584M105
1491C69L851l318l586K353M047k108m797J405M392j838m480J110N362J96m555
1506a597l27M093M8n325j053M818K444l086j325L843J624m528m044K314M124k075
1522e2k760K904M457k349n046M80L917r64l296Q45M572M00m504q70M043J238l795
1539g80k040L677J972l942k130L485L081k695l027K008K880k634l773J879M325
1554B286j52l105M43L245m28m338p66M124J123l170j485L444J378l364k272L204
1570A67K537k301k868J599L110k087l042J704L573k51l316L0L255o18l835o28
$$ plain form
1586 -2971 758 2407 -430 -1522 1740 2579 -624 -3119 -1236 1359 85 -2168 146 3257 1764
1601 1764 -1730 -1230 971 607 -2666 -1760 1803 2710 -266 -1179 1269 1883 -1317 -3013 -536 2017
1617 2017 100 -1942 395 2833 715 -2191 -1011 1477 739 -2043 -1239 1783 2051 -892 -1417 1350
1633 1350 1983 -1448 -2600 58 1598 -580 -2160 371 2891 826 -2023 -611 1543 324 -2986
1648 -2986 -876 2398 2127 -1050 -860 1759 1368 -1875 -2956 589 2215 -761 -2017 1010 2621 -192
1664 -192 -2654 -893 2063 426 -2402 -3 2834 1341 -2150 -1409 1912 1382 -2259 -1981 1765 2364
1680 2364 -884 -2377 1438 2357 -1373 -3122 19 2339 89 -2418 128 2969 652 -2729 -965
1695 -965 2773 823 -2921 -1312 2376 1623 -1974 -1881 2271 2213 -1737 -3425 894 2259 -1489 -2942
$$ packed form
1586b971L729J649k837j092L262Q39l203k495J883K595j274k253K314L111j493
1601A764l494N00K201l64l273R06L563R07k976r13K448O14l200j696K477K553
1617B017j917k042K337K438k118k906J180K488p38k782Q04L022K68k943n25K767
1633A350O33l431j152K658J540k178j580K531K520k065k849J412K154j219l310
1648b986K110L274k71l177J90K619l91l243j081L545J626k976j256L027J611k813
1664a92k462J761K956j637k828K399K837j493l491P41L321n30l641K78L746N99
1680B364l248j493L815R19l730j749L141K320k250k507K546K841k317l381J764
1695i65L738j950l744J609L688p53l597R3M152n8l950j688M319J365l748j453
$$ plain form
1711 -2942 1453 4025 208 -2643 -349 2099 -762 -3743 -591 4067 2639 -1747 -707 2703 826
1726 826 -4335 -3667 1561 2600 -782 -1179 3153 3662 -2392 -4547 -121 2313 -826 -2689 1867 5111
1742 5111 1068 -3166 -1133 1935 -504 -4344 -1767 3882 2831 -2240 -1209 3064 2096 -3283 -3394
1757 -3394 1668 3123 -1429 -2343 2595 4233 -1065 -3779 -99 2763 -892 -4023 41 4264 1000
1772 1000 -3706 -761 3685 1302 -3635 -2571 2666 1584 -3556 -2346 3540 4015 -1730 -2275 2422
1787 2422 2725 -2766 -4401 1085 4307 -246 -3022 864 3819 -1356 -5660 -2014 3396 1039 -3028
1802 -3028 -460 4953 2558 -3437 -2565 3238 2654 -2707 -2610 2683 2680 -3077 -4310 1069 3772 -957 -3396
1819 -3396 1541 4347 -741 -4556 -221 3986 875 -3313 -66 4236 1077 -4612 -2772 2540 1177
$$ packed form
1711b942M395K572l817k851K294K448k861k981L152M658j428m386J040L410j877
1726H26n161O68N228J039l382l97M332N09o054k155M426K434l139j863M556L244
1742E111m043m234K033L068k439l840K577N649j051n071J031M273r68n379j11
1757c394N062J455m552r14M938J638n298k714L680K862l655l131M064M223l264
1772A000m706K945M446k383m937J064N237j082n140J210N886M75n745n45M697
1787B422L03n491j635N486L222m553k776L886K955n175m304L646N410k357m067
1802c028K568N413k395n995Q72N803n84n361R7N293ln757j233N379K703m729k439
1819c396M937K806n088l815M335M207l111m188L247M302l159n689J840N312j363
$$ plain form
1834 1177 -3622 -2228 4325 4277 -1590 -2228 2591 2850 -3406 -5520 690 3522 -476 -2739 2094 5118
1850 5118 -475 -5350 -1549 2974 460 -2905 690 6104 2806 -3441 -3148 1427 132 -4806 -3114
1865 -3114 3677 4428 -1303 -2415 2244 3420 -2465 -4416 901 4266 -321 -3556 784 4546 193
1880 193 -4690 -1497 3295 585 -4299 -1697 4418 2403 -2853 -1710 3669 2595 -3422 -3524 2399
1895 2399 3329 -2315 -3321 1904 3981 -1055 -4107 579 3813 -32 -3864 -383 3872 494 -3837
1910 -3837 -1006 3976 1382 -4051 -2527 3087 2261 -2762 -1962 3388 3598 -2155 -3349 1678 2771 -1960
1926 -1960 -3877 928 3714 -1069 -4139 243 3911 303 -3643 -675 3916 1243 -3675 -1490 3323
1941 3323 1889 -3043 -2215 2802 2383 -3093 -3575 2293 3505 -884 -2723 2480 4273 -1272 -4455 -184
$$ packed form
1834A177m799J394O553m8n867o38M819K59o256k114O210K832l998k263M833L024
1850E118n593m875L801M523k514l365L595N414l298o247K93M575j295m938J692
1865c114O791P51n731j112M659J176n885j951N317L365m587l235M340L762m353
1880A93m883L193M792k710m884K602O115k015n256J143N379j074o017j02N923
1895B399R30n644j006N225K077n036l052M686L234l845l832L481M255l378m331
1910c837K831M982k594n433J524N614q26n023Q00N350K10n753j194N027J093m731
1926a960j917M805K786m783l070M382L668l608l946K968M591k673m918K185M813
1941C323j434m932Q28N017m19n476m82N868J212m389j839N203J793n545l183M271
$$ plain form
1957 -184 2807 -473 -3759 -117 4449 1005 -3455 -1165 3410 1415 -2997 -1677 3092 2935 -2402
1972 -2402 -2601 2146 2506 -3096 -4423 617 2841 -1056 -2945 1859 4799 199 -2976 -86 3429
1987 3429 -16 -4098 -1127 3408 1580 -2547 -1790 2948 1638 -3499 -3141 2123 2710 -1733 -2170 2757
2003 2757 3900 -924 -3302 622 2712 -1223 -4375 222 3553 672 -2801 232 4271 1542 -3707
2018 -3707 -2067 2186 1025 -2780 -1422 3532 3509 -1334 -3053 1027 1512 -2638 -3652 1700 5198 943
2034 943 -2139 1016 2515 -1486 -5039 -1781 3002 1645 -2368 -217 3447 1290 -3885 -3081 2028
2049 2028 2602 -1495 -1382 3052 3275 -2057 -3942 558 2935 -1021 -3144 884 3509 -386 -3807 -905
2065 -905 3342 1151 -2778 -690 3596 1543 -3609 -2446 2381 1780 -2406 -1906 2591 2850 -1635 -2875
$$ packed form
1957a84K991l280l286L642M566l444m460K290M575j995m412J320M769j57n337
1972b402j99M747L60n602j327N040K224l897j889M804K940m600l175K890L515
1987C429l445m082K971M535j828m127P57M738j310n137L58N264N87m443m37M927
2003B757J143m824k378L924K090l935l152M597L331k881l473L033M039k729n249
2018c707J640M253j161l805J358M954k3m843j719M080M85m150j014N352L498m255
2034I43l082L155J499m001l553L258M783j357m013K151L664k157n175Q04N109
2049B028N74m097J13M434K23n332j885M500K377l956k123M028K625l895l421K902
2065i05M247k191l929K088M286k053n152J163M827o01m186N00M497K59m485j240
$$ plain form
2081 -2875 1057 3241 -1087 -3265 879 3498 -13 -3312 -181 3431 428 -3656 -1554 2917 1157
2096 1157 -2948 -1221 3589 2911 -2301 -2534 1773 1988 -2593 -2770 1965 3715 -719 -3082 441 2742
2112 2742 -1177 -3877 392 3873 1180 -2690 -559 3089 909 -3333 -1410 2909 1943 -2628 -2280
2127 -2280 2494 2400 -2096 -2431 1903 2813 -1910 -3252 786 3050 -335 -2645 987 3828 191 -3630
2143 -3630 -905 2836 640 -3020 -624 3760 2015 -3085 -2429 1778 1534 -2534 -2671 2315 3314 -1451
2159 -1451 -3085 1170 2805 -1606 -3195 626 3833 191 -3203 37 3000 421 -3579 -992 2764
2174 2764 1523 -2686 -1646 2860 1677 -2360 -2239 2329 2417 -2080 -2158 1740 2898 -1466 -2799 1023
2190 1023 2823 -636 -3075 421 3337 282 -3183 -691 2923 682 -3068 -1168 2632 1413 -2770
$$ packed form
2081b875L932K184m328k178M144K619l511l299L131L612l003m084K102M471j760
2096A157m105J727M810o78n212k33M307K15m581j77M735J750m434k363L523K301
2112B742l919k700M269L481k693l870K131L648k180m242J923M319r66m571L48
2127b280M774r4m496l35M334R10m723j342M038K264l385k310L632K841l637l821
2143c630K725L741k196l660K396M384j745n100O56M207k44m068j37M986R99m765
2159a451j634M255J635m411j589L821L207l642l394L240K963k579m000K587L756
2174B764j241m209J040M506j183m037J21M568Q8m497p8L898J158m364j333L822
2190A023J800l459k439L496K916l055l465K492L614k241l750J900L800j219m183
$$ plain form
2205 -2770 -1489 2650 2152 -1742 -2207 1766 2209 -1659 -2464 1425 2777 -735 -2918 432 2669 -531
2221 -531 -3177 -281 2985 407 -2652 -292 2992 907 -2721 -1334 2259 1398 -2228 -1577 2159 2198
2237 2198 -1928 -2215 1095 2196 -1567 -2676 725 2518 -299 -2519 674 2914 478 -2568 -558
2252 -558 2235 305 -2655 -797 2730 1666 -1912 -1359 2029 1097 -2339 -2335 1414 2017 -1201 -1890 1110
2269 1110 2281 -927 -2760 346 2232 -54 -2035 138 2609 296 -2180 -673 2209 816 -2079
2284 -2079 -1069 1865 1143 -1638 -1281 1729 1479 -1409 -1894 1059 1832 -756 -2116 734 2308 -212
2300 -212 -1771 271 1692 -286 -2443 -486 1745 817 -1389 -633 1832 552 -1765 -1308 1129 1282
2316 1282 -955 -989 1188 1573 -1011 -1757 570 1993 -356 -1286 686 1855 -142 -1565 -445 1738
$$ packed form
2205b770J281M139m98l894m65L973M43l868q05L889J352l512k183L350K237l200
2221e31k646K896L266k578l059K360L284k085l628J387L593q61l626O51L736L9
2237B198m126k87L310J101l763j109L401J793k817k220L193K240k436l046K010
2252e58K793j930k960J858L527j064l578N53L388r32l436ML749O03l218o89L000
2269A110J171l208j833L106J886k286j981K173K471k313k476J507K882j393k895
2284b079J010K934p22k781L57L010k50k888m85K953P73k588j360K850J574k520
2300b12j559K042J421j978k157J957K231r28k206P56K465j280k317M57K437J53
2316A282k237l4K177L85k584p46K327J423k349r30J972J169j997j423J120K183
$$ plain form
2332 1738 5 -1861 -402 1703 662 -1318 -640 1387 1027 -1285 -1417 864 1467 -649 -1043 797
2348 797 1249 -499 -1536 -152 1019 -374 -1572 -50 1572 495 -1229 -401 1257 292 -1637 -789
2364 -789 1405 1308 -469 -680 574 748 -900 -1516 258 1145 -103 -1286 464 1546 -375 -1541 -60
2381 -60 1106 315 -1198 -375 1677 899 -1113 -696 807 1013 -686 -856 587 1173 -566 -1389 467
2398 467 1004 -602 -1226 -6 1404 490 -812 -289 1030 214 -1076 -631 1311 829 -673 -712 1117
2415 1117 927 -949 -1264 124 955 -424 -841 685 1260 150 -1204 -315 991 356 -1191 -139 1735
2432 1735 499 -980 -593 1027 518 -1224 -883 530 1022 -553 -854 852 1131 -566 -1175 -9 1123
2449 1123 -109 -961 -9 1416 812 -936 -506 1119 529 -1260 -664 945 1065 -768 -998 758 974
$$ packed form
2332A738j733j866J459K105j041j980O78K027l60k312j32K281O03k116l94J840
2348G97M52j748j037J384J171j393j198J522J622j077j724Q28J658r65j929Q48
2364g89K194r7j777k11J254J74j648o16J774Q87j248j183J750J082j921j166J481
2381f0J166p91j513Q23K052p78k012M17J503K06j699j70J443N86j739q23J856
2398D67N37j606o24J220J410r14j302N23J319q16j290M45J942m82j502l9J829
2415A117j90j876l15J388Q31j379m17J526N75j110j354Q89J306o35j547J052J874
2432A735j236j479L87J620n09j742L41J413M92j575l01J706K79j697o09J166J132
2449A123j232q52R52J425o04j748M30J625n90j789N96J609J20j833k30J756K16
$$ plain form
2466 974 -900 -1452 223 909 -318 -1062 481 1394 100 -1426 -442 1403 261 -1201 -509 1220 498
2483 498 -1422 -1033 885 1108 -788 -842 789 893 -686 -1253 513 1148 -419 -1331 111 1235 -234
2500 -234 -1373 -76 1613 456 -1300 -397 1314 593 -1137 -561 990 803 -1161 -1431 847 983 -1028
2517 -1028 -1099 877 1666 -359 -1650 440 1118 106 -1350 254 1698 232 -1581 -570 1038 419
2533 419 -1325 -834 1503 1134 -1010 -993 1234 1100 -830 -1445 918 1497 -646 -1554 203 1341 -288
2550 -288 -1473 119 1567 -14 -1832 -491 1359 249 -1687 -675 1449 1073 -1372 -1171 955 988
2566 988 -1022 -955 1608 1800 -366 -1090 382 1103 -652 -1508 396 1788 433 -1370 -308 1355 -35
2583 -35 -1893 -394 1808 1161 -798 -258 1743 870 -1288 -1422 807 1248 -984 -1277 760 1329 -687
$$ packed form
2466I74j874n52J675O86j227p44J543R13j294j526R84J845j142j462O92J729p22
2483D98j920L89J918K23j896n4J631J04j579n67J766O35j567r12J442J124j469
2500b34j139J297J689j157j756R03J711p21j730N76J551j87j964k70K278J36k011
2517a028p1J976P89k025j291K090O78j012j456J604J444j466j813J011J608o19
2533D19j744M91K337l69k144J7K227j34j930o15K363N79k143r08J757J138j629
2550b88j185J592J448j581j818J341J850j110j936J012K124l76k445K01K126L3
2566I88k010O7K563J92k166p24J472P21j755q56J904J392j355j803J062J663j390
2583c5j858J499K202o47j959N40K001q73k158j34K229M41k232k93K037N69k016
$$ plain form
2600 -687 -1518 467 1509 -458 -1434 47 1729 388 -1383 -312 1477 344 -1804 -1079 744 485
2616 485 -1252 -259 1451 1237 -1400 -1369 621 961 -583 -1022 1036 1510 -503 -1471 75 1060 -361
2633 -361 -1353 256 1605 394 -1356 -291 1371 752 -1483 -823 1148 801 -1666 -1359 950 1077 -547
2650 -547 -712 1130 1157 -748 -1455 -59 1216 64 -1173 665 1212 72 -1724 -482 982 326 -1188
2667 -1188 -59 1381 787 -1181 -834 993 666 -712 -894 626 969 -746 -1264 744 1204 -294 -690
2684 -690 653 1547 -385 -1302 -347 973 178 -1204 -52 1349 460 -1086 -702 663 692 -1196 -471
2701 -471 1216 1463 -220 -760 606 481 -774 -1287 -82 796 -313 -755 475 1240 79 -1259 -432
2718 -432 861 -97 -1100 -118 1141 1016 -676 -429 317 -63 -1195 -1134 729 1203 -237 -279 643 836
$$ packed form
2600f87q31J985J042j967r76J481J682j341j771J071J789j133k148P25J823k59
2616D85j737R93J710k14k637L1J990L40j544m39K058M74k013r68J546R85j421
2633c61r92J609J349j211j750J065J662o19k235O60J971l47k467L07K309J27j624
2650e47j65J842K7j905p07J396J275j152j237J838N47j140j796J242J464o56j514
2667a188J129J440n94j968L47J827l27j378j82J520L43j715n18K008M60j498l96
2684f90J343Q94j932r17R55J320p95j382J152J401q89j546L84J365K9j888P25
2701d71J687K47j683n40J366j25j255n13J205Q78j109m42J230P65j161j338Q27
2718d32J293r58j003R82J259j25j692K47P46l80j132O1J863M74j440m2R22J93
$$ plain form
2736 836 -352 -1238 90 1029 -23 -885 -124 771 177 -1031 -281 902 546 -704 -258 890 572 -522
2754 -522 -609 652 592 -580 -761 254 708 -541 -787 192 895 -176 -556 296 672 31 -1034 -49 975
2773 975 658 -611 -262 744 196 -664 -609 613 483 -308 -558 887 838 -353 -927 -28 596 -53 -541
2792 -541 194 631 -17 -896 -343 369 225 -700 -326 531 157 -492 -298 524 239 -362 -619 290 740 -354
2812 -354 -451 449 690 88 -687 251 542 -32 -648 -385 589 360 -378 -183 372 473 -601 -692 501 132
2832 132 -469 -392 626 706 -85 -426 186 -13 -399 -629 116 573 24 -511 -69 383 -324 -571 -189 508
2852 508 -78 -571 -215 643 215 -337 -278 437 438 -404 -608 214 579 -232 -568 210 893 -186 -688 -140 324
2873 324 152 -858 -239 551 146 -450 -156 487 460 -260 -281 181 96 -317 -519 189 844 -51 -496 16 487
$$ packed form
2736H36j188q86J328R39j052q62P61Q95n94j208P50J183l56j250M46J148l18j094
2754e22q7J261o0j172j81J015M54j249k46R79P03j071l80Q52L76o41j065R85J024
2773I75l17j269L49J006n48q60N5J222j30p91k50J445m9j191n74Q99O24o49m88
2792e41P35M37o48q79N53P12j44r25L74Q57l74o49J94Q22k85o01k57R09M50j094
2812c54r7R00K41o02p75R38K91n74o16K63R74k29p38J95N55J01j074r1J193l69
2832A32o01P7J018Q0p91l41O12j99l86k30P45M57n49n35M42M52p07k47L82O97
2852E08n86m93L56Q58m28n52N9P15Jq42k04Q22L65q11l36P78O83j079n02N48M64
2873C24j72j010O19P90m05n96K94O43k7p20k1M62q5m13k02P08O55q95m45N12M71
$$ plain form
2894 487 -195 -487 98 750 371 -11 427 290 -121 -752 -681 207 333 -410 148 386 702 -404 -553 145
2914 145 281 -352 -567 348 357 151 -455 230 842 78 -494 -265 303 45 -441 -316 462 736 -473 -132
2934 -132 329 222 -538 -679 99 756 239 -87 165 615 -48 -474 -56 352 38 -466 256 663 122 -369
2954 -369 -46 345 -23 -528 -188 605 285 87 167 190 353 -114 -563 7 149 -168 -334 400 441 -64 -465
2975 -465 -159 140 73 -333 0 363 271 -313 -99 272 143 -333 -422 332 577 -632 -533 270 486 -420 -282
2996 -282 138 311 38 -254 155 224 9 -321 -167 302 38 -215 -294 127 193 -337 -182 551 336 -244 -321
3017 -321 125 190 -438 -499 -76 494 -426 -255 -1 385 -92 -331 93 315 -178 -263 -127 307 390 -259 145
3038 145 370 190 -238 -257 362 304 -2 -171 264 364 -330 -323 177 285 -291 -350 -70 413 4 -215 166 242
$$ packed form
2894D87o82k92N85O52l79l82M38j37m11o31P1Q88J26p43N58K38L16j106j49O98
2914A45J36o33k15R15Rk06o06O85O12p64n72K29N68k58m86J25P78K74j209L41
2934a32M61j07p60j41P78O57n17l26K52M50o63m26M18M08l14n04P22M07n41m91
2954c69L23L91l68n05L40P93l20j98Q0K3J63m67m49N70J42l17j66P34M1n05m01
2975d65L06K99o7m06L33L63r2n84K14L71j29m76q9P54K45j209R9Q03K16r06J38
2996b82M20J73k73k92M09O9k15l30J54M69k64k53p9M21O6n30J55P33k15n80p7
3017c21M46O5o28o1M23N70r20J71K54L86m77k39M24K22m93q5J36M34Q3o49M04
3038A45K25j80m28j9O19n8l06j69M35J00o94PN00J08n76n9K80M83m09k19L81P6
$$ plain form
3060 242 66 159 -146 123 422 -113 -81 -27 132 -248 -187 -82 302 -166 -230 258 358 -67 -242 15 554 245
3082 245 -246 5 235 192 38 -79 83 303 -22 -77 68 203 -123 -372 141 355 149 -24 254 492 82
3103 82 -232 5 496 -183 -142 -39 401 -104 7 65 168 118 -197 -215 156 50 -60 -12 271 175 -64 -207
3125 -207 -220 14 -219 -4 149 189 -196 -107 34 83 28 143 65 120 -218 -162 34 329 133 24 141 121 166
3148 166 232 -241 -168 432 139 193 -4 227 -46 -121 27 151 295 138 12 140 279 120 55 -32 101 102 186
3171 186 -77 8 219 24 77 157 31 -91 90 -218 -107 -43 22 118 61 -57 -2 72 95 -72 -35 18 -165 282
3195 282 -87 -171 -229 44 -165 -1 -49 -90 159 -306 52 -309 -34 -246 173 320 392 29 -102 278 -208 -126
3217 -126 -107 158 -200 -50 108 -182 186 -113 -202 -90 138 86 -192 -56 414 116 38 -356 -172 194 91
$$ packed form
3060B42j76R3l05K69K99n35L2N4J59l80O1J05L84m68o4M88J00m25j75K57N39l09
3082B45m91K51K30m3j54j17J62K20l25n5J45J35l26k49N13K14k06j73K78K38m10
3103H2l14K37M91o79M1J03M40n05J11N8J03n0l15j8L71j06j10M8K83r6k39j43
3125b07j3K34k33K15J53M0l85Q9J41M9n5J15p8N5l38N6J96K95j96j09J17k0M5
3148A66O6m73P3O00k93N4j97K31k73p5J48J24J44j57j26J28J39j59o5q7J33JQ4
3171A86k63Q5K11j95N3Q0j26j22J81l08J11O4O5R6n7j18N5P4K3j67L7N3j83M47
3195B82l69q4n8K73k09J64m8m1K49m65L58l61K75k12M19J47P2l63j31L80m86Q2
3217a26J9K65l58J50J58k90L68k99q9J12K28n2k78J36M70k98p8l94J84L66j03
$$ plain form
3238 91 82 224 -8 -36 -121 -31 -29 -379 -341 67 47 83 -1 -124 261 -10 -76 109 162 -8 -151 -227 335 38 -26
3263 -26 -60 -212 -32 -436 -13 38 235 51 -378 59 115 -162 -247 125 257 41 -18 190 -83 9 -328 -215
3285 -215 249 62 -249 -138 -11 10 -87 101 5 149 -39 -113 -15 23 143 128 97 201 30 -76 -184 -199 -114
3308 -114 -148 72 215 -73 -74 265 -187 -117 -167 -126 29 264 -70 -105 -6 -209 -155 49 114 240 -149 -161 135 140
3332 140 14 8 147 -131 20 -201 -63 299 209 123 147 177 94 302 -246 85 198 -34 58 -54 -243 -232 143
3355 143 25 -95 18 -92 -257 121 -167 55 -216 -8 -121 164 -389 37 233 -57 -34 62 176 -5 -163
3376 -163 75 42 -3 47 242 344 35 -60 106 -94 30 -251 -112 306 -56 -235 -123 36 42 -149 -349 287
3398 287 145 359 -47 72 391 81 -261 -205 -123 -170 64 83 255 -110 -17 -322 -49 -12 -347 -31 387 96
$$ packed form
3238I1rJ42k32k8q5R0Kl50L8M08k0L6q4j23L85k71o6J85N3j70j43p6N62k97o4
3263b6l4j52J80m04M23N1J97j84m29M37N6k77q5L72J32k16n9K08k73R2l37J13
3285b15M64j87l11J11J27K1r7J88r6J44j88p4R8L8J20j5l1J04j71j06j08j5Q5
3308a14l4K20J43k88jL39m52P0n0M1J55K35l34l5R9k03N4K04O5J26l89j2K96N
3332A40j26oJ39k78J51k21J38L62r0q6K4L0q3K08n48L31J13k32R2j12j89J1L75
3355A43j18j20J13j10j65L78k88K22k71K08j13K85n53M26J96k90K3R6J14j81j58
3376a63K38l3m5N0J95J02l09r5J66k00J24k81J39M18l62j79J12J59Oj91k00O36
3398B87j42K14m06J19L19l10l42N6Q2m7K34J9J72l65R3l05K73L7l35L16M18k91
$$ plain form
3420 96 207 260 53 -185 -286 -217 70 28 -207 -309 -37 -134 221 -102 -132 -7 131 -70 -229 266 -126 -12
3442 -12 -101 -100 26 50 -164 85 -83 -112 -21 219 110 310 8 -97 249 79 -126 -55 108 52 -90 -146 215
3465 215 -23 202 -206 -223 -129 -145 -12 -221 128 -208 -20 17 -88 -258 47 -87 -77 188 -98 -299 167 238
3487 238 -170 73 -135 225 -270 -269 -95 374 -39 -274 -60 213 159 -189 -44 200 147 -98 -42 78 238 -29
3509 -29 157 -102 -8 -140 -198 -236 134 -63 -259 -191 165 -74 -361 98 136 -3 -218 64 196 49 160 -284
3531 -284 -81 -38 -272 -294 229 284 93 -145 -174 98 33 -455 55 179 212 63 14 -66 42 -166 -180 179 4
3554 4 -176 -184 186 38 3 -243 -78 82 -173 -359 31 369 75 -278 319 111 50 -407 -404 77 122 -499 -215
3577 -215 482 54 -77 -111 117 3 -15 -177 7 19 -236 -140 348 258 23 -230 11 66 -174 -442 -214 179
$$ packed form
3420I6J11N3k07k38j01O9K87m2k35j02K72r7L55l23l0J25J38k01j59M95l92J14
3442a2q9JJ26K4k14K49j68k9R1K40j09K00l02j05L46j70k05P1J63n6j42n6L61
3465B15k38K25m08j7R4j6J33k09L49l36J88L7j05j70L05j34J0K65k86k01M66P1
3487B38m08K43k08L60m95JJ74M69m13k35K14K73n4l48J45K44n3k45N6J20J60k67
3509b9J86k59R4j32n8l8L70j97j96O8L56k39k87M59L8j39k15K82J32j47J11m44
3531b84K03M3k34k2N23N5j91k38k9K72o5m88N10J24L3j49m9q0J08k08j4L59j75
3554Dj80qL70j48l5k46J65J60k55j86L90L38k94l53N97k08o1m57LM81M5o21K84
3577b15O97m28j31l4K28j14j8j62J84J2k55R6M88r0k35k53K41N5k40k68K28L93
$$ plain form
3599 179 36 -120 92 304 -44 -129 -117 33 3 -171 -171 446 248 -209 -525 294 101 -152 -262 31 329 -45
3621 -45 -363 -19 299 -112 -176 -42 162 -24 -481 -162 160 89 -262 24 175 280 -224 -73 127 329 -104
3642 -104 0 -14 271 -172 -373 89 346 -35 -317 64 274 321 -132 -143 183 -78 -360 -284 161 165 -105 -133
3664 -133 332 -134 -314 -22 53 271 -190 -211 235 72 -284 -120 -47 316 -63 -242 275 208 120 5 -146 306
3686 306 263 -293 -203 464 267 -412 -271 64 13 -91 -131 -8 -54 -135 15 353 212 222 -337 -164 113 101 -293
3709 -293 88 337 242 -278 -158 194 118 -89 -126 286 109 172 -595 194 89 -93 0 104 437 -146 -417 -134
3731 -134 291 -92 -300 24 303 218 -449 -339 -76 -19 -474 47 -65 297 -38 -185 238 310 -83 -201 -26
3752 -26 501 35 -156 -168 313 -53 -208 -344 182 249 -352 34 343 293 73 -210 -110 39 -90 -114 -41 140
$$ packed form
3599A79j43j56K12K12l48q5J2J50l0j74%O17j98m57l16Q19j93k53j10K93K98l74
3621d5l18L44L18m11o4J34K04j86m57L19L22p1l51K86J51J05n04J51K00K02m33
3642a04J04j4K85m43k01M62K57l81k82L81K10M7m53j1L26k61k82P6M45Mk70k8
3664a33M65m66j80K92P5K18m61k1M46j63l56J64P3L63l79j79N17o7q8j15j51M52
3686C06m3n56R0O67j97o79J41L35n1j04m0J23m6q1J50L38j41J0n59J73K77j2l94
3709b93L81K49r5n20J20L52p6k07l7M12j77O3p67P89j05j82R3J04L33n83k71K83
3731a34M25l83k08L24K79q5o67J10K63N7m55N21j12L62l35j47M23P2l93j18J75
3752b6N27m66j91j2M81l66j55j36N26O7o01L86L09n0k20k83J00J49j29k4P3J81
$$ plain form
3774 140 -277 -208 39 172 -21 9 -95 175 195 -137 -226 60 181 -164 -197 -79 120 -245 -124 -187 72 47
3796 47 -50 109 354 92 -61 -108 343 -247 -71 29 10 86 -349 -71 -152 258 -81 -140 265 449 -231 -459
3818 -459 14 341 179 -206 24 80 -32 -265 -72 123 118 -276 -293 -13 124 -438 -335 207 146 -108 253 206
3840 206 396 -97 -225 209 -64 175 -95 193 504 192 -371 -14 177 -197 -385 -125 359 -211 -434 83
3860 83 96 411 -65 -95 83 76 -91 -321 189 -24 86 -193 32 421 -130 -341 32 199 129 -259 -42 368
3882 368 268 -76 -147 310 320 -238 -186 7 182 -185 -201 71 358 -206 -376 -132 25 -69 -345 206 244 23
3904 23 -428 -239 110 256 -210 -209 696 79 -291 -224 435 149 -214 -315 265 353 -166 -310 208 616 262 -146
3926 -146 -107 456 148 -305 174 19 30 -60 -58 595 83 -391 -287 410 -79 -278 -114 467 325 -135 -306 280
$$ packed form
3774A40m17O9K47J33j93L0j04K70K0l32q9K86J21l45l3J18J99l65J21o3K59k5
3796D7r7J59K45k62j53m7M51n90J76J00j9P6m35K78q1M10l39n9M05J84o80k28
3818d59M73L27j62l85K30N6j12k33J93J95nl94j7K80J37n62J03N42o1k54L61m7
3840B06J90m93j28M34k73K39k70K88L11l12n63L57J91l74j88K60M84n70k23N17
3860H3J3L15m76l0J78pj67k30N10k13J10k79K25L89n51k11L73J67p0l88K17M10
3882C68j00l44p1M57J0n58N2J93J75l67j6K72K87n64j70K44J57r4k76N51L8k21
3904B3m51J89L49J46m66JR05o17l70O7O59k86l63j01N80Q8n19j44N18M08l54m08
3926a46L9N63l08m53M79j55J1r0KO53n12m74J04O97m89j99J64N81j42m60j71N86
$$ plain form
3948 280 373 -457 -267 -72 324 -213 -291 115 509 145 -493 -329 244 116 -511 164 470 305 -340 -358 241
3969 241 309 -270 -489 207 434 -124 -204 312 352 -56 -182 198 307 -104 -428 -92 549 91 -280 -240 386
3990 386 195 -376 -387 332 79 -550 -415 338 362 -197 -169 -29 531 -287 -500 80 237 -180 -428 201 234
4011 234 37 -57 -421 473 185 -288 -307 314 234 -246 -211 318 151 -396 -318 541 189 -92 -484 -37 131 -103
4033 -103 -258 76 542 -115 -246 -203 233 212 -105 -284 386 -55 -368 -301 480 256 -114 -183 391 278 -269
4054 -269 -384 362 251 -103 -424 261 475 -164 -11 246 272 156 -498 -240 624 23 -485 139 229 210 -495
4075 -495 -155 293 335 -207 -185 239 401 -241 -141 359 319 161 -234 147 119 -71 -345 -111 243 251 -308 -251
4097 -251 365 315 -228 -224 200 397 -277 -254 282 323 -76 -437 -20 199 -143 -156 -204 473 42 -263 -43 309
$$ packed form
3948B80R3q30J90J95L96n37p8M06L94l64o38J64N73j28o27O75L06j65o45j8N99
3969B41O8n79k19O96K27n58q0N16M0m08j26L80J09m11l24L36O41m58l71M0O26
3990C86j91n71j1P19k53o29J35P53K4n59K8J40N60q18k13N80J57m17k48O29L3
4011B34j97r4l64Q94k88m73j9O21q0m80L5N29j67n47P8Q59l52k81l92M47J68k34
4033a03j55L34M66o57j31M3M36k1l17j79O70m41l13O7P81k24l70o9N74j13n47
4054b69j15P46j11l54l21O85K14o39J53K57K6j16o54K58Q64o01n08O24R0j9p05
4075d95L40M48M2n42K2M24J62o42J00N00m0j58l95L81k8j90k74K34L54Qn59N7
4097b51O16n0n43MM24J97o74K3N36M1l99l61M17K19l42j3m8O77m31l05K20L52
$$ plain form
4119 309 225 -252 149 460 179 -338 -141 317 191 40 -335 193 49 -74 -322 106 90 -85 -458 150 192
4140 192 -49 -214 127 241 -189 -344 -265 377 175 30 -5 498 279 -51 -92 321 321 -151 -466 167 89 -128
4162 -128 -405 240 155 -406 -462 -24 43 132 -250 -17 209 83 -149 88 292 251 -18 -103 -107 269 -124 -309 46
4185 46 233 -72 -459 143 398 235 -329 -10 405 -15 -267 -132 281 195 -308 -373 260 -11 -353 -113 248
4206 248 61 -208 -105 6 214 75 -120 171 466 -156 -347 -1 235 -25 -194 98 -38 200 -299 -95
4226 -95 322 63 -156 -148 347 -126 37 12 -86 391 5 -145 -24 -50 -121 -197 -136 93 -4 13 43 182 183 -202 -95
4251 -95 190 196 -346 -447 95 -221 -228 152 19 -70 33 -32 -21 131 -161 -281 5 219 -59 -78 -210 277 226
4274 226 -269 -119 196 43 -55 -297 275 65 -276 -327 10 45 -220 -117 184 64 -118 -176 33 252 176 -67
$$ packed form
4119C09q4m77M01L11k81n17J97M58j26j51l75N28j44j23k48M28j6j75l73O08M2
4140A92k41j65L41J14m30j55P9O42k02j45l5N03k19l30m1M13%m72l15O33p8k17
4162a28k77O45q5n61n6M38O7Q9l82K33K26j26k32K37K04m1k69q5mL76l93j85L55
4185D6J87l05l87O02K55j63n64L19M15m20k52J35M13q6n03o5O33k71l42K40L61
4206B48j87k69J03J11K08j39j95K91K95o22j91L46K36k60j69K92j36K38m99K04
4226i5M17k59k19QM95m73J63k5r8M77l86j50J21k6p1p6O1K29r7J7L0J39Jl85J07
4251i5K85On42j01N42l16pL80j33q9J03o5J1J52k92j20K86K14k78j9j32M87n1
4274B26m95J50L15j53r8k42N72k10l41n1L37L5k65J03L01j20j82n8K09K19p6k43
$$ plain form
4296 -67 -203 -2 35 -190 -211 167 25 -38 -78 178 -41 -266 94 312 233 243 -129 -147 376 37 -88 -23 162
4319 162 10 -344 -231 192 5 -233 -138 73 212 -134 -285 122 0 24 -131 70 269 99 -129 110 420
4340 420 11 -300 105 96 -127 -116 5 179 114 -240 -109 60 89 54 142 94 284 -321 -52 111 -99 -230 -173
4363 -173 34 86 -216 -289 -169 28 -285 -79 -154 274 134 -68 -73 154 46 -152 -242 37 29 -53 153 153 -7 192
4387 192 -310 -34 180 -24 213 111 183 -177 -410 129 149 -86 -52 -248 239 -113 -17 139 286 174 10
4408 10 -270 37 -87 -43 -141 -155 179 4 -419 -62 162 -41 -195 -320 206 138 35 -37 215 -113 -118 -170 -159
4431 -159 134 -47 -222 225 296 70 -327 168 347 45 17 -246 164 -54 -57 -148 -8 51 -188 189 426 109
4453 109 -108 -90 391 284 -172 -90 -57 210 -42 -163 76 192 83 -123 131 470 83 -263 -23 27 -37 -220
$$ packed form
4296f7j36K01L7k25k1L78j42o3m0K56k19k25L60K18p9J0l72j8N23l39j25O5J85
4319A62j52l54J13M23j87k38R5K11J39l46j51M07j22K4j55K01J99j70k28K39L10
4340D20m09l11M05rk23J1J21J74o5l54J31J69K9l5Q8m8J90o05K69J63k10j31N7
4363a73K07N2l02p3J20J97l13K06p5M28j40k02nK27j08j98r0K79qq2K06%j60J99
4387A92n02K76K14k04K37j02P2l60k33N39K0k35L4j96M87l52R6J56J47j12j64
4408A0k80L07j24M4r8j4L34j75m23L57K24k03j54j25N26o8j03p2K52l28nn2J1
4431a59K93j81j75M47P1k26l97M95J79l02k8k63M10k18lr1J40N9k39L77K37l17
4453A09k17J8M81j07m56Q2L3K67k52j21K39J16j09k06K54L39l87l46K40N0o4j83
$$ plain form
4475 -220 -90 196 -36 -362 105 272 207 -172 298 32 46 10 -308 -53 4 188 -340 47 187 -109 -137 218
4497 218 98 181 -300 -100 253 -61 -437 -103 -92 35 -223 -92 150 285 38 -364 182 256 161 -218 44
4518 44 165 31 3 -209 258 112 -252 -276 -5 223 -229 -332 151 21 -95 -178 -1 211 -29 -64 514 177
4540 177 -18 2 -112 168 -89 -210 -281 269 -75 -165 -185 82 52 -397 -63 463 -15 -190 -189 130 233 -128
4562 -128 186 -97 178 -24 -206 -90 352 81 -205 -362 111 1 -117 -102 -63 440 -368 -18 103 141 75
4583 75 -73 179 -7 63 -139 51 62 76 -327 265 117 -291 -175 -192 -190 42 -161 -104 428 70 99 25 -39 -52
4607 -52 -264 -130 311 272 -70 115 168 176 -50 -409 -28 60 -84 -31 -271 6 -68 -239 161 92 -6 -207 -283 382
4631 382 183 -151 3 269 424 -102 -93 37 216 -109 -15 309 229 106 -196 150 233 162 44 -167 12 -159
$$ packed form
4475b20J30K86k32l26M67J67o5l79M70k66J4l6l18K55N7J84n28L87J40k96k8L55
4497B18j20Q3m81K00L53l14l76L34J1J27k58J31K42J35k47m02N46P4r5l79K62
4518D4J21j34k8k12M67j46l64k4K71K28m52j03M83j30j16q3J77K12k40l5N78l37
4540A77j95K0j14K80k57j21p1N50l44r0k0K67l0m49L34N26m78j75JL19J03l61
4562a28L14k83K75k02j82J16M42k71k86j57M73j10j18J5L9N03q08L50J21L8o6
4583G5j48K52j86P0k02J90J1J4m03N92j48m08J16j7KK32k03N7N32l58K9p4o4j3
4607e2k12J34M41l9l42J85N3Qk26l59L81Q8j44N3k40K77p4j71M00o9r8k01p6O65
4631C82j99l34J54K66J55n26RJ30J79l25R4L24q0j23l02L46Q3p1j18k11J79j71
$$ plain form
4653 -159 -148 -208 -21 192 -32 -294 -104 -15 118 -231 28 -76 -127 97 -30 237 22 12 -64 179 201 -169
4675 -169 17 -283 -192 119 -17 260 9 -265 154 256 286 -90 57 226 92 -169 -153 145 19 7 379
4696 379 216 -64 108 39 129 -35 75 -27 12 224 -48 -1 -154 164 170 -16 -150 207 400 -281 -145 87
4718 87 -90 -19 -180 -87 98 -171 -107 205 49 -53 -116 145 15 72 -367 77 59 149 273 -176 -9 160 -250
4741 -250 -129 77 14 56 157 93 95 -11 -45 211 98 -300 -17 29 -81 55 -122 61 -101 -6 -276 -219 325
4764 325 71 69 -152 -2 -10 44 -351 137 345 109 -131 -15 270 329 -14 -345 189 54 -134 -320 310 -104
4786 -104 225 -257 280 90 -275 -42 311 -185 -60 100 155 -49 -47 -84 -67 293 163 -248 -19 191 17 -243
4808 -243 -98 -192 -25 -107 237 86 35 45 26 83 -4 25 -253 -218 26 20 -132 -88 -97 187 -57 -12 -81 -42 89 69
$$ packed form
4653a59J1o0J87K13k24k62J90Q9J33l49K59j04n1K24j27K67k15j0p6K43K2l70
4675a69J86l00R1L11j36K77k51k74M19J02L0l76J47J69j34k61J6K98j26j2L72
4696C79j63k80J72o9R0j64J10j02L9K12k72M7j53L18Oj86j34L57J93o81J36K32
4718H7j77P1j61R3J85k69O4L12j56j02o3K61j30N7m39M44j8R0J24m49J67J69m10
4741b50J21K06o3M2J01o4Kj06l4K56j13l98K83M6j10J36j77J83j62R5k70N7N44
4764C25k54kk21J50qN4l95M88K08k36k40J16K85N9l43l31N34j35j88j86O30m14
4786a04L29m82N37j90l65K33L53m96J25J60N5k04Kl7J7L60j30m11K29K10j74k60
4808b43J45r4J67q2L44j51n1J0j9N7q7K9k78L5K44oj52M4rK84k44M5o9L9J31k0
$$ plain form
4834 69 81 -236 -62 56 -307 92 98 -27 -48 41 49 24 18 112 -15 45 124 -89 -127 -69 281 96 119 -47 -1 367
4860 367 -98 -163 -37 -85 -47 21 -38 108 221 -232 -172 -64 153 -184 46 68 100 -126 118 110 -16 -218 1
4883 1 -173 96 93 -79 -48 48 -8 191 -152 -8 82 44 6 33 54 77 176 -46 223 -94 206 -44 41 138 70 -127
4909 -127 222 -129 128 12 8 75 -330 175 -62 -180 67 113 -23 6 48 126 -103 22 98 -189 -79 203 90
4932 90 -100 -261 -91 78 53 -37 72 224 157 128 185 168 20 -142 246 155 -133 12 -135 -13 184 -98 -85
4955 -85 79 48 -152 213 168 -75 -181 102 -7 -191 -72 171 85 124 -27 71 -99 -9 186 35 0 -77 198
4978 198 364 -52 25 -33 -160 -51 123 87 -230 12 -142 -161 58 -226 242 -31 -75 -57 -237 -98 66 50
5000 50 38 -59 47 22 2 -83 196 -82 -180 -28 5 179 -72 65 128 13 -94 -292 58 188 -10 40 -26 135
$$ packed form
4834F9J2l17J74J18l63L99Oj25k1Q9Qk5oR4j27O0P9k13l8N8L50j85K3j66M6L68
4860C67m65o5J26m8L8O8n9J46J13m53O0J08K17l37K30K2L2k26K44qj26k02K19
4883Aj74K69lj72L1R6n6J99l43J44R0l8l8K7K1K3R9k22K69l17L00k50Q5R7o8j97
4909a27L49l51K57j16mO7m05N05k37j18K47M6j36K9M2P8k29J25P6k87J10K82j13
4932I0j90j61J70J69k5r0J09J52o7k9N7j7j48j62L88r1k88J45j47J22J97k82J3
4955h5J64l1k00L65m5k43j06K83j09j84J19K43q6L9j51R8j70R0J95j51l5p7K75
4978A98J66m16P7n8j27J09J74l6l17K42j54j9K19k84M68k73m4J8j80J39J64j6
5000E0j2r7J06k5k0q5K79k78r8J52L3J74k51J37O3j15j07j98L50J30j98N0o6J61
$$ plain form
5024 135 62 -18 380 -24 115 29 171 187 -91 51 168 220 -61 214 28 -51 -234 56 59 11 -391 -96 -241
5047 -241 65 -56 163 -104 -169 -191 62 102 -165 58 67 -70 226 32 72 -90 266 -181 -80 157 41 309
5069 309 -26 -190 49 -297 61 -89 -270 -49 35 -52 -57 210 -153 -229 -118 41 -203 98 -170 -167 -29 -40 13
5092 13 114 83 164 174 -161 -180 144 152 -64 -188 105 -174 -124 -87 141 128 -119 103 8 130 1 -74 -97 -111 -17
5117 -17 -153 81 56 -47 120 -52 121 -52 10 -9 -65 252 -26 58 147 -150 10 88 -4 -90 -85 -48 51 -11 -178
5142 -178 -36 106 41 -200 277 -66 -114 140 72 82 -122 72 -217 43 -33 183 12 -33 74 -17 154 -190
$$ packed form
5024A35p3q0L98m04J39q6J42J6k78J42J17N2k81K75j86p9j83K90Lm8m02K95j45
5047b41L06j21K19k67o5k2K53M0k67K23Rj37K96j94M0j62L56m47J01K37j16K68
5069C09l35j64K39l46L58j50j81K21Q4q7nK67l63p6J11J59k44L01k68LJ38j1N3
5092A3J01l1Q1J0l35j9L24Qk16j24K93k79N0L7K28j3k47K22r5J22j29p5k3j4R4
5117a7j36K34k5j03J67j72J73j73O2j9n6L17k78Q4Q9k97J60P8r2q6NL7R9o2j67
5142a78J42J42o5k41M77l43m8K54o8J0k04J94k89K60p6K16j71m5J07r1J71l44
$$ [...]
8191h
##END NTUPLES=NMR FID
##END=
