##TITLE=1H_Ser Gli-Ac
 200.13MHz, CDCl3,
 8 sc
 
 29.1.2025
##JCAMPDX= 6.0         $$ Bruker NMR JCAMP-DX V2.0
##DATA TYPE= NMR FID
##DATA CLASS= NTUPLES
##ORIGIN= UXNMR, Bruker Analytische Messtechnik GmbH
##OWNER= pz
$$ XWIN-NMR		Version 3.5
$$ Wed Jan 29 16:17:41 2025 Russian Standard Time (UT+4h)  she@DPX200
##.OBSERVE FREQUENCY= 200.1311
##.OBSERVE NUCLEUS= ^1H
##.DELAY= (6, 6)
##.ACQUISITION MODE= SIMULTANEOUS
##.ACQUISITION SCHEME= undefined
##.AVERAGES= 8
##.DIGITISER RES= 18
##SPECTROMETER/DATA SYSTEM= spect
##.PULSE SEQUENCE= zg30
##.SOLVENT NAME= CDCl3
##.SHIFT REFERENCE= (INTERNAL, CDCl3, 0, 14.3821)
##AUDIT TRAIL= $$ (NUMBER, WHEN, WHO, WHERE, WHAT)
$$ ##TITLE= Audit trail, XWIN-NMR		Version 3.5
$$ ##JCAMPDX= 5.01
$$ ##ORIGIN= Bruker BioSpin GmbH
$$ ##OWNER= she
$$ F:/spectra/data/she/nmr/H-C/1/audita.txt
$$ ##AUDIT TRAIL=  $$ (NUMBER, WHEN, WHO, WHERE, WHAT)
(   1,<2025-01-29 16:16:38.90 +0400>,<she>,<DPX200>,
      <created by zg, POWCHK disabled, PULCHK disabled
       configuration hash MD5:
       00 E9 B6 7A A2 85 ED C7 34 08 36 98 17 FE 4E 26
       data hash MD5: 16K
       8B 26 90 DC 84 94 62 2C E0 C9 BF 8B 68 4E D2 35>)
$$ ##END=
$$ 
$$ hash MD5
$$ 91 BF FF 06 10 11 04 6C 4E F3 FB F3 BA 00 42 DB
##$RELAX= 
##$RELAX= 
##$RELAX= 
##$RELAX= 
##$RELAX= 
##$RELAX= 
$$ Bruker specific parameters
$$ --------------------------
##$DU= <F:/spectra>
##$EXPNO= 1
##$NAME= <H-C>
##$PROCNO= 1
##$TYPE= <nmr>
##$USER= <she>
##$AMP= (0..31)
100 100 100 100 100 100 100 100 100 100 100 100 100 100 100 100 100 100 
100 100 100 100 100 100 100 100 100 100 100 100 100 100 
##$AQSEQ= 0
##$AQ_mod= 1
##$AUNM= <au_zg>
##$AUTOPOS= <>
##$BF1= 200.13
##$BF2= 200.13
##$BF3= 200.13
##$BF4= 200.13
##$BF5= 200.13
##$BF6= 200.13
##$BF7= 200.13
##$BF8= 200.13
##$BYTORDA= 1
##$CFDGTYP= 0
##$CFRGTYP= 5
##$CHEMSTR= <none>
##$CNST= (0..31)
1 1 145 1 1 1 1 1 1 1 1 1 1 1 1 1 1 1 1 1 1 1 1 1 1 1 1 1 1 1 1 1 
##$CPDPRG= <>
##$CPDPRG1= <>
##$CPDPRG2= <>
##$CPDPRG3= <>
##$CPDPRG4= <mlev>
##$CPDPRG5= <mlev>
##$CPDPRG6= <mlev>
##$CPDPRG7= <mlev>
##$CPDPRG8= <mlev>
##$CPDPRGB= <>
##$CPDPRGT= <>
##$D= (0..31)
0 0.7 0 0 0 0 0 0 0 0 0 0.03 0 0 0 0 0 0 0 0 0 0 0 0 0 0 0 0 0 0 0 0 
##$DATE= 1738152998
##$DBL= (0..7)
120 120 120 120 120 120 120 120 
##$DBP= (0..7)
150 150 150 150 150 150 150 150 
##$DBP07= 0
##$DBPNAM0= <>
##$DBPNAM1= <>
##$DBPNAM2= <>
##$DBPNAM3= <>
##$DBPNAM4= <>
##$DBPNAM5= <>
##$DBPNAM6= <>
##$DBPNAM7= <>
##$DBPOAL= (0..7)
0.5 0.5 0.5 0.5 0.5 0.5 0.5 0.5 
##$DBPOFFS= (0..7)
0 0 0 0 0 0 0 0 
##$DE= 6
##$DECBNUC= <off>
##$DECIM= 32
##$DECNUC= <off>
##$DECSTAT= 4
##$DIGMOD= 1
##$DIGTYP= 9
##$DL= (0..7)
0 120 120 120 120 120 120 120 
##$DP= (0..7)
150 150 150 150 150 150 150 150 
##$DP07= 0
##$DPNAME0= <>
##$DPNAME1= <>
##$DPNAME2= <>
##$DPNAME3= <>
##$DPNAME4= <>
##$DPNAME5= <>
##$DPNAME6= <>
##$DPNAME7= <>
##$DPOAL= (0..7)
0.5 0.5 0.5 0.5 0.5 0.5 0.5 0.5 
##$DPOFFS= (0..7)
0 0 0 0 0 0 0 0 
##$DQDMODE= 0
##$DR= 18
##$DS= 0
##$DSLIST= <SSSSSSSSSSSSSSS>
$$ [...]
##$SUBNAM0= <"">
##$SUBNAM1= <"">
##$SUBNAM2= <"">
##$SUBNAM3= <"">
##$SUBNAM4= <"">
##$SUBNAM5= <"">
##$SUBNAM6= <"">
##$SUBNAM7= <"">
##$SUBNAM8= <"">
##$SUBNAM9= <"">
##$SW= 18.051750892319
##$SWIBOX= (0..15)
0 0 2 0 0 0 0 0 0 0 0 0 0 0 0 0 
##$SW_h= 3612.71676300578
##$TD= 16384
##$TD0= 1
##$TE= 0
##$TE2= 300
##$TE3= 300
##$TEG= 300
##$TL= (0..7)
0 120 120 120 120 120 120 120 
##$TP= (0..7)
150 150 150 150 150 150 150 150 
##$TP07= 0
##$TPNAME0= <>
##$TPNAME1= <>
##$TPNAME2= <>
##$TPNAME3= <>
##$TPNAME4= <>
##$TPNAME5= <>
##$TPNAME6= <>
##$TPNAME7= <>
##$TPOAL= (0..7)
0.5 0.5 0.5 0.5 0.5 0.5 0.5 0.5 
##$TPOFFS= (0..7)
0 0 0 0 0 0 0 0 
##$TUNHIN= 0
##$TUNHOUT= 0
##$TUNXOUT= 0
##$USERA1= <user>
##$USERA2= <user>
##$USERA3= <user>
##$USERA4= <user>
##$USERA5= <user>
##$V9= 5
##$VALIST= <valist>
##$VCLIST= <CCCCCCCCCCCCCCC>
##$VD= 0
##$VDLIST= <DDDDDDDDDDDDDDD>
##$VPLIST= <PPPPPPPPPPPPPPP>
##$VTLIST= <TTTTTTTTTTTTTTT>
##$WBST= 1024
##$WBSW= 4
##$XGAIN= (0..3)
0 0 0 0 
##$XL= 0
##$YL= 0
##$YMAX_a= 246078
##$YMIN_a= -335593
##$ZGOPTNS= <>
##$ZL1= 120
##$ZL2= 120
##$ZL3= 120
##$ZL4= 120
##$ABSF1= 10
##$ABSF2= 0
##$ABSG= 5
##$ABSL= 3
##$ALPHA= 0
##$AQORDER= 0
##$ASSFAC= 0
##$ASSFACI= 0
##$ASSFACX= 0
##$ASSWID= 0
##$AUNMP= <proc_1d>
##$AZFE= 0.1
##$AZFW= 0.1
##$BCFW= 1
##$BC_mod= 2
##$BYTORDP= 1
##$COROFFS= 0
##$CY= -3
##$DATMOD= 1
##$DC= 2
##$DFILT= <>
##$DTYPP= 0
##$F1P= 0
##$F2P= 0
##$FCOR= 0.5
##$FTSIZE= 0
##$FT_mod= 4
##$GAMMA= 1
##$GB= 0.15
##$INTBC= 1
##$INTSCL= 1
##$ISEN= 128
##$LB= 0.25
##$LEV0= 0
##$LPBIN= 0
##$MAXI= 10000
##$MC2= 0
##$MEAN= 0
##$ME_mod= 0
##$MI= 1.114404
##$NCOEF= 0
##$NC_proc= 0
##$NLEV= 6
##$NOISF1= 3.799351
##$NOISF2= 2.8
##$NSP= 1
##$NTH_PI= 0
##$NZP= 0
##$OFFSET= 14.38212
##$PC= 1
##$PHC0= 258.5987
##$PHC1= 1.992229
##$PH_mod= 1
##$PKNL= yes
##$PPARMOD= 0
##$PSCAL= 0
##$PSIGN= 0
##$REVERSE= no
##$SF= 200.129724274929
##$SI= 16384
##$SIGF1= 3
##$SIGF2= 2
##$SINO= 400
##$SIOLD= 16384
##$SREGLST= <1H.CDCl3>
##$SSB= 0
##$STSI= 0
##$STSR= 0
##$SW_p= 3205.1282051282
##$SYMM= 0
##$S_DEV= 0
##$TDeff= 0
##$TDoff= 0
##$TI= <>
##$TILT= no
##$TM1= 0
##$TM2= 0
##$TOPLEV= 0
##$USERP1= <user>
##$USERP2= <user>
##$USERP3= <user>
##$USERP4= <user>
##$USERP5= <user>
##$WDW= 1
##$XDIM= 8192
##$YMAX_p= 0
##$YMIN_p= 0
$$ End of Bruker specific parameters
$$ ---------------------------------
##NTUPLES= NMR FID
##VAR_NAME=  TIME,          FID/REAL,        FID/IMAG
##SYMBOL=    X,             R,               I
##VAR_TYPE=  INDEPENDENT,   DEPENDENT,       DEPENDENT
##VAR_FORM=  AFFN,          ASDF,            ASDF
##VAR_DIM=   8192,          8192,            8192
##UNITS=     SECONDS,       ARBITRARY UNITS, ARBITRARY UNITS
##FACTOR=    0.0002768,     1,               1
##FIRST=     0,             0,               0
##LAST=      2.2672688,     0,               0
##MIN=       0,             -335593,         0
##MAX=       2.2672688,     246078,          0
$$ Real data points
##PAGE= N=1
##DATA TABLE= (X++(R..R)), XYDATA
$$ plain form
0 0 0 0 0 0 0 0 0 0 0 0 0 0 0 0 0 0 0 -4 8 -8 8 -8 8 -8 14 -16 16 -21 24 -26 29 -34 38 -44 50 -55 61 -69 78
39 78 -86 95 -104 117 -129 142 -156 173 -191 211 -229 254 -281 307 -342 379 -419 470 -526 592 -672
60 -672 771 -894 1056 -1280 1599 -2098 2981 -4846 10461 -64960 -335593 -299671 -38208 150083
74 150083 92837 -75916 -135114 -18181 122907 135775 32922 -37581 2092 76454 47527
85 47527 -89455 -179721 -98515 67562 126364 21309 -103450 -89170 50161 137633 54052
96 54052 -109358 -146143 5542 184861 189022 5864 -168028 -151247 9874 109030 35143
107 35143 -103442 -127707 -1929 129419 117103 -8101 -74031 3359 110842 86770 -66493
118 -66493 -179582 -112578 71882 172810 87951 -71075 -128200 -46728 48898 37553 -46726
$$ packed form
0@%%%%%%%%%%%%%%%%%mJ2j6J6j6J6j6K2l0L2l7M5n0N5o3P2q2R4j05J16j30J47
39G8j64J81j99K21k46K71k98L29l64M02m40M83n35N88o49P21p98Q89r96J118j264
60f72J443j665J950k336K879l697N079p827J5307p5421k70633L5922K61463J88291
74A50083n7246j68753n9198J16933J41088J2868j02853p0503L9673P4362k8927
85D7527j36982r0266Q1206J66077N8802j05055j24759J4280J39331Q7472q3581
96E4052j63410l6785J51685J79319M161j83158j73892J6781J61121R9156p3887
107C5143j38585k4265J25778J31348j2316j25204o5930P7390J07483k4072j53263
118f6493j13089O7004J84460J00928q4859j59026n7125Q1472R5626j1345q4279
$$ plain form
129 -46726 -62348 43133 149114 113127 -37697 -135539 -69764 75466 115260 -14478 -168275
140 -168275 -162093 4493 154066 136142 -8990 -103583 -41673 89445 121202 11658 -112535
151 -112535 -115262 -6435 75662 35498 -62754 -83712 476 79661 59227 -20550 -46172 20253
163 20253 86698 42963 -84142 -148174 -55858 108785 169794 53377 -118330 -158651 -31065
174 -31065 108699 105769 -14221 -96200 -45149 68833 104210 20515 -74977 -69081 18415 68548
186 68548 15561 -73593 -78799 19900 106687 74846 -37351 -96653 -40352 54703 68760 -12515
198 -12515 -80492 -38320 67798 105826 22096 -93354 -112378 -14239 85504 73582 -24183 -79157
210 -79157 -24722 68543 81604 -8976 -97186 -73552 37665 104160 47790 -61289 -95586 -19439
$$ packed form
129d6726j5622J05481J05981l5987j50824r7842O5775J45230L9794j29738j53797
140a68275O182J66586J49573j7924j45132r4593O1910J31118L1757j09544j24193
151a12535k727J08827Q2097m0164r8252k0958Q4188P9185k0434p9777k5622O6425
163B0253O6445m3735j27105o4032R2316J64643O1009j16417j71707m0321J27586
174c1065J39764k930j19990q1979N1051J13982L5377q3695r5492N896Q7496N0133
186F8548n2987q9154n206R8699Q6787l1841j12197n9302N6301R5055J4057q1275
198a2515o7977M2172J06118L8028q3730j15450j9024R8139R9743j1922r7765n4974
210g9157N4435R3265J3061r0580q8210K3634J11217O6495n6370j09079l4297P6147
$$ plain form
222 -19439 72776 71693 -14466 -76093 -40716 39710 66117 12954 -47843 -37319 26857 50677
234 50677 -10757 -83322 -66085 38489 119917 82991 -36245 -105000 -51040 50143 74099
245 74099 -4520 -87541 -73493 26157 98798 63676 -31337 -73847 -22464 52068 58616 -5586
257 -5586 -57621 -32613 31553 45368 -10111 -63292 -43580 28551 67545 23515 -47720 -52795
269 -52795 20517 84853 58834 -34936 -94644 -53769 38559 73544 15451 -59768 -60960 8394
281 8394 61275 34261 -36056 -55836 4812 73441 66218 -9217 -67360 -47211 18359 43091
293 43091 -4997 -61700 -49239 22712 73044 45580 -24750 -52901 -7842 49597 44142 -16981
305 -16981 -55496 -23669 39456 54134 -3939 -68644 -62919 4730 55132 34099 -24022 -40961
$$ packed form
222a9439R2215j083q6159o1627L5377Q0426K6407n3163o0797J0524O4176K3820
234E0677o1434p2565J7237J04574Q1428l6926j19236o8755N3960J01183K3956
245G4099p8619q3021J4048R9650P2641l5122r5013m2510N1383P4532O548o4202
257e586n2035K5008O4166J3815n5479n3181J9712P2131L8994m4030p1235n075
269e2795P3312O4336k6019r3770n9708M0875R2328L4985n8093p5219j192O9354
281H394N2881k7014p0317j9780O0648O8629p223p5435n8143K0149O5570K4732
293D3091m8088n6703J2461P1951N0332k7464p0330k8151M5059N7439n455o1123
305a6981l8515L1827O3125J4678n8073o4705N725O7649N0402k1033n8121j6939
$$ plain form
317 -40961 11310 74095 66596 -10014 -73123 -58824 6856 43172 12215 -41536 -45790 6452
329 6452 49558 33647 -17468 -38099 -1634 47135 45898 -7403 -47837 -27542 23915 37483
341 37483 -8567 -62514 -54934 13419 66533 46359 -17614 -47168 -10614 44503 49419 -3930
353 -3930 -52054 -38386 17011 45843 15534 -37795 -49780 -7374 35558 27245 -16271 -33253
365 -33253 2408 49332 49499 -1506 -46954 -35972 13069 35698 4946 -39803 -43162 2079 43595
378 43595 31476 -19016 -43498 -11095 40817 52204 11170 -34085 -31105 10900 32209 1816
390 1816 -44722 -49832 -4063 42612 39843 -3448 -31067 -9237 30890 35842 -2947 -40809 -31969
403 -31969 14813 43521 18040 -29661 -43300 -9920 26552 22072 -15313 -34702 -4314 42896
$$ packed form
317d0961N2271O2785p499p6610o3109J4299O5680L6316l0957n3751m254N2242
329F452M3106j5911n1115k0631L6465M8769j237n3301m0434K0295N1457J3568
341C7483m6050n3947P580O8353N3114k0174o3973k9554L6554N5117M916n3349
353c930m8124J3668N5397K8832l0309n3329j1985M2406M2932q313m3516j6982
365c3253L5661M6924J67n1005m5448J0982M9041K2629l0752m4749l359M5241M1516
378D3595j2119n0492k4482L2403N1912J1387m1034m5255K980M2005K1309l0393
390A816m6538n110M5769M6675k769m3291k7619K1830M0127M952l8789l7862Q840
403c1969M6782K8708k5481m7701j3639L3380L6472m480l7385j9389L0388M7210
$$ plain form
415 42896 51068 10194 -35047 -37811 -1135 26372 9373 -28547 -35982 558 39185 34767 -6352
428 -6352 -36849 -21072 19189 33496 5990 -26255 -22036 13412 36664 16288 -27256 -43368
440 -43368 -13659 25030 27799 -4886 -29426 -12890 26630 39028 7777 -30653 -30237 5151 33106
453 33106 19888 -19225 -37261 -13621 21694 25057 -4891 -28552 -13501 24856 40431 12385
465 12385 -26630 -31870 -1646 23579 12294 -19323 -30521 -2711 33576 33711 -2163 -33247 -26277
478 -26277 8709 28344 10477 -20988 -23641 7944 34221 23108 -14409 -36789 -20335 14457
490 14457 25489 2655 -20049 -11775 17678 30397 6990 -27072 -31711 -2115 26489 21112 -8578
503 -8578 -24803 -7595 22240 26485 -4062 -33183 -24642 11921 34495 17704 -16608 -27520 -3573
$$ packed form
415D2896Q172m0874m5241k764L6676K7507j6999l7920p435L6540L8627m418m1119
428f352l0497J5777M0261J4307k7506l2245M219L5448K3252k0376m3544j6112
440d3368K9709L8689K769l2685k4540J6536L9520J2398l1251l8430M16L5388K7955
453C3106j3218l9113j8036K3640L5315L363k9948k3661J5051L8357J5575k8046
465A2385l9015n240L0224K5225j1285l1617j1198K7810L6287J35l5874l1084O970
478b6277L4986J9635j7867l1465k653L1585K6277j1113l7517k2380J6454L4792
490A4457J1032k2834k2704Q274K9453J2719k3407l4062m639K9596K8604n377k9690
503h578j6225J7208K9835M245l0547k9121Q541L6563K2574j6791l4312j0912K3947
$$ plain form
516 -3573 22996 17323 -12697 -29870 -11866 22071 32831 8515 -22265 -23481 2282 19834 7361
529 7361 -18499 -22707 3392 29685 24103 -7467 -27538 -15121 12014 19864 -777 -23269 -16187
542 -16187 15899 34386 15473 -20775 -33628 -11141 18785 21148 -4006 -22231 -9526 19511
554 19511 29251 7228 -22242 -26382 -1647 20345 12270 -12093 -20955 -1236 21958 19584 -7162
567 -7162 -25155 -11624 16896 24990 3139 -22699 -21727 5069 25437 14135 -15150 -25679 -3804
580 -3804 24232 25056 -3273 -27950 -20887 7520 22108 8317 -13074 -13356 8490 26515 15087
593 15087 -16169 -32603 -16670 10903 18164 1077 -13718 -4139 20872 28699 5865 -23903 -29940
606 -29940 -8158 14177 12848 -7001 -15304 2859 26499 23459 -5925 -30327 -23781 5628 22744
$$ packed form
516c573K6569n673l0020j7173J8004L3937J0760k4316l0780j216K5763J7552j2473
529G361k5860m208K6099K6293n582l1570k0071J2417K7135P850k0641k2492P082
542a6187L2086J8487j8913l6248j2853K2487K9926K363k5154j8225J2705K9037
554A9511R740k2023k9470m140K4735K1992q075k4363q862J9719K3194k374k6746
567g162j7993J3531K8520Q094k1851k5838R72K6796K0368j1302k9285j0529K1875
580c804K8036Q24k8329k4677P063K8407J4588j3791k1391k82K1846J8025j1428
593A5087l1256j6434J5933K7573P261j7087j4795R579K5011P827k2834k9768o037
606b9940K1782K2335j329j9849q303J8163K3640l040k9384k4402O546K9409J7116
$$ plain form
619 22744 9579 -13583 -16204 6788 26320 18208 -12026 -31768 -18369 10569 21897 5730
631 5730 -12813 -9794 11027 21736 6250 -18033 -22007 -1852 17140 11514 -10773 -20792 -3997
644 -3997 21913 25315 1107 -22298 -17878 7588 22576 7771 -20223 -27213 -5163 21347 23758
657 23758 2921 -14079 -7491 11029 14958 -4642 -24405 -19445 5293 22251 13210 -8222 -14017
670 -14017 3676 19809 11375 -15851 -30968 -15661 14413 27812 11899 -10610 -12911 4880
682 4880 16257 3142 -20794 -26889 -5911 19371 21625 2240 -12110 -3420 14911 17123 -4425
695 -4425 -26917 -22954 4214 24140 16308 -7639 -18480 -3901 16504 17230 -3645 -20038 -12402
708 -12402 8953 18326 5334 -12471 -12458 5196 17088 5532 -15787 -20788 -1683 19726 18499
$$ packed form
619B2744j3165k3162k621K2992J9532q112l0234j9742J3399K8938J1328j6167
631E730j8543L019K0821J0709j5486k4283l974K0155J8992n626k2287j0019J6795
644c997K5910L402k4208k3405M420K5466J4988j4805k7994o990K2050K6510K411
657B3758k0837j7000O588J8520L929j9600j9763M960K4738J6958r041k1432n795
670a4017J7693J6133q434k7226j5117J5307L0074J3399j5913k2509k301J7791
682D880J1377j3115k3936o095K0978K5282K254j9385j4350Q690J8331K212k1548
695d425k2492L963K7168J9926p832k3947j0841J4579K0405P26k0875j6393P636
708a2402K1355R373j2992j7805J3J7654J1892j1556k1319n001J9105K1409j227
$$ plain form
721 18499 -5028 -21669 -11071 14600 24410 7578 -17062 -21837 -2840 15145 11165 -8923 -17855
734 -17855 -4055 15603 18129 724 -13876 -7641 9482 12849 -4610 -21952 -16928 7757 25760
747 25760 16762 -8940 -21197 -7607 13092 15494 -3339 -20305 -14063 8894 21920 10876 -8856
760 -8856 -13749 -1020 10727 4670 -11779 -16469 125 19125 17489 -3083 -19457 -12458 9742
773 9742 19929 5686 -15687 -18616 869 20324 16409 -5355 -19372 -10606 8156 13780 1779
786 1779 -10901 -6398 9551 15024 1201 -16927 -16366 3358 18642 11822 -9467 -19644 -6091
799 -6091 15402 18467 -716 -19542 -15872 4530 19061 11307 -7907 -14822 -3123 9516 7062
812 7062 -7291 -13814 -2063 15247 16551 -1054 -16552 -11779 6983 16369 4334 -15161 -18282
$$ packed form
721A8499k3527j6641J0598K5671R810j6832k4640m775J8997J7985l980k0088q932
734a7855J3800J9658K526j7405j4600O235J7123L367j7459j7342N024K4685J8003
747B5760q998k5702j2257J3590K0699K402j8833j6966O242K2957J3026j1044j9732
760h856m893J2729J1747o057j6449m690J6594J9000j636k0572j6374O999K2200
773I742J0187j4243k1373k929J9485J9455l915k1764j4017Q766J8762N624j2001
786A779j2680M503J5949N473j3823j8128N61J9724J5284o820k1289j0177J3553
799f091K1493L065j9183j8826L670K0402J4531p754j9214o915J1699J2639k454
812G062j4353o523J1751J7310J304j7605j5498M773J8762R386j2035j9495l121
$$ plain form
825 -18282 223 19403 17470 -2000 -16458 -10574 6485 13548 2640 -11312 -9766 5180 13023
838 13023 3327 -12083 -13537 2225 16230 10842 -7488 -16399 -4630 14553 17579 -445 -19663
851 -19663 -17692 2514 18361 13298 -5038 -14212 -5310 9370 9329 -4259 -12527 -4334 10306 13566
865 13566 978 -11730 -8971 5416 12504 1679 -15280 -17338 82 18525 17536 -1691 -16781
878 -16781 -11109 6896 15128 4880 -10420 -12371 1382 12828 7006 -7595 -13374 -3673 8687
891 8687 8604 -3675 -10712 -1548 14617 17194 1646 -15776 -16169 -192 13182 8234 -8435 -14926
905 -14926 -3670 11438 12848 -137 -11444 -6731 7812 13663 3558 -9546 -10483 1702 10035
918 10035 2835 -12926 -17146 -2563 15438 16823 1797 -11816 -8735 5957 13784 4804 -10153
$$ packed form
825a8282J8505J9180j933j9470j4458N884J7059P063j0908j3952J546J4946P843
838A3023r696j5410j454J5762J4005n388j8330q911J1769J9183L026j8024j9218
851a9663J971K0206J5847n063j8336r174Q902J4680m1j3588q268Q193J4640L260
865A3566j2588j2708K759J4387P088j0825j6959k058J7420J8443r89j9227j5090
878a6781N672J8005Q232j0248j5300j951J3753J1446n822j4601n779R701J2360
891H687q3j2279p037R164J6165K577j5548j7422l93J5977J3374m948j6669o491
905a4926J1256J5108J410j2985j1307M713J4543N851j0105j3104r37J2185Q333
918A0035p200j5761m220J4583J8001J385j5026j3613L081J4692P827q980j4957
$$ plain form
931 -10153 -13131 -1861 9380 7774 -4699 -11259 -3890 7849 8189 -2212 -9822 -2816 11393 15555
945 15555 2669 -13522 -14724 -449 12422 8826 -6151 -14729 -5832 9926 13748 1872 -11199
958 -11199 -9765 3560 12555 7672 -4226 -7886 78 7155 2134 -9511 -13965 -3804 10728 12923
972 12923 1265 -9288 -5820 6704 12934 4097 -11208 -14637 -2078 11355 10833 -1994 -10978
985 -10978 -6928 4745 8002 -1003 -9930 -5941 7247 14397 7091 -6041 -10903 -2501 7266 5661
999 5661 -6345 -12922 -5490 8060 12915 3131 -8612 -8538 3084 10954 5556 -5712 -9186 -680
1013 -680 8519 6736 -4958 -11774 -5426 6634 10523 1304 -9375 -7771 4875 13085 6346 -7087
1027 -7087 -12038 -3162 9205 10570 -99 -9689 -8099 1639 5967 582 -6650 -5348 5190 12380
$$ packed form
931a0153k978J1270J1241j606j2473o560P369J1739L40j0401p610P006J4209M162
945A5555j2886j6191j202J4275J2871l596j4977q578Q897J5758L822j1876j3071
958a1199J434J3325Q995m883j1898l660P964P077n021j1645m454J0161J4532K195
972A2923j1658j0553L468J2524O230q837j5305l429J2559J3433n22j2827q984
985a0978M050J1673L257r005q927L989J3188P150p306j3132m862Q402R767j605
999E661j2006o577P432J3550M855r784j1743P4J1622P870n398j1268l474Q506
1013f80R199j783j1694o816O348J2060L889r219j0679J604J2646Q210o739j3433
1027g087m951Q876J2367J365j0669r590J590R738M328n385p232J302J0538P190
$$ plain form
1041 12380 6610 -4939 -9584 -2465 6456 5510 -5142 -11859 -5212 7659 12763 4052 -7949 -10089
1055 -10089 -415 8489 5713 -4658 -9326 -1659 8860 10027 -84 -9825 -8119 1246 6467 1367
1069 1367 -5852 -5061 4110 10963 5849 -6517 -11152 -3604 7196 8906 -18 -8365 -6321 3838
1083 3838 8997 2699 -6766 -7981 572 8987 6794 -2977 -8198 -2677 6363 7093 -1933 -9640 -6899
1098 -6899 3672 10513 5705 -4536 -7372 -1134 5879 4668 -4128 -8729 -2748 7720 9744 953
1112 953 -8359 -7496 1126 7242 3244 -5126 -6443 1023 8249 5877 -3531 -9626 -4791 5085 8300
1127 8300 654 -7856 -6231 3101 9646 5662 -4622 -8084 -2080 5842 5376 -2308 -7485 -3585 4482
1142 4482 7075 -48 -7577 -5939 3270 10140 6536 -3624 -7975 -3049 4439 3907 -3605 -7896 -3166
$$ packed form
1041A2380n770j1549m645P119Q921r46j0652o717O647J2871N104q711j2001k140
1055a0089R674Q904k776j0371m668P667J0519J167j0111r741J706R365N221n100
1069A367p219P91R171O853n114j2366m635P548J0800J710q924q347K044J0159
1083C838N159o298r465j215Q553Q415k193r771n221N521R040P30r026p707K741
1098f899J0571O841m808j0241k836O238P013j211q796m601N981J0468K024q791
1112I53r312Q63Q622O116l998q370j317P466P226k372r408o095M835R876L215
1127H300p646q510J625R332O545l984j0284l462O004P922m66p684n177L900Q067
1142D482K593p123p529J638R209O870l604j0160m351M926P488n32p512m291M730
$$ plain form
1157 -3166 6511 9910 2515 -6509 -7605 287 6628 4173 -3161 -6340 -672 7203 7179 -882 -7927
1172 -7927 -6000 1429 4849 -120 -6141 -4711 4813 11504 7271 -3004 -8888 -5214 2973 4381 -1894
1187 -1894 -7196 -3687 4881 8593 3128 -5750 -7592 -431 6813 4919 -2744 -6637 -1947 5165 6250
1202 6250 -195 -6796 -5353 2179 5465 784 -6258 -6517 1374 8962 7112 -1516 -6651 -2745 5064
1217 5064 6515 -527 -8150 -7620 429 5405 3260 -2764 -4059 2155 8375 6381 -2896 -8524 -5227
1232 -5227 2538 6031 1375 -4576 -3677 3355 6642 1547 -6672 -8717 -1736 6124 7010 397 -4468
1247 -4468 -693 6433 6965 -474 -9134 -9437 -1550 5220 3837 -2353 -3887 1872 8108 6552 -1842
1262 -1842 -8218 -5315 2570 6013 1649 -4248 -4707 773 5810 3053 -3938 -6262 -1240 5407 5227
$$ packed form
1157c166R677L399p395r024j096P892O341k455p334l179N668P875k4q061p045
1172g927J927P429L420m969o021J430R524O691m233j0275n884L674Q187J408o275
1187a894n302L509Q568L712n465q878j842P161P244j894p663l893M690P112J085
1202F250o445o601J443P532L286m681p042k59P891P588j850q628n135L906P809
1217E064J451p042p623N30Q049M976k145o024j295O214O220j994r277n628L297
1232e227P765L493m656n951Q99P032L287n095q219k045O981P860Q86o613m865
1247d468L775P126N32p439q660l03P887O770j383o190j534N759O236j556q394
1262a842o376K903P885L443m364n897m59N480N037k757o991k324N022O647j80
$$ plain form
1277 5227 -1337 -6005 -2368 5130 7592 1191 -6287 -6807 -348 5467 3355 -4351 -7401 -1870 6475
1292 6475 7703 1489 -4694 -3625 3082 6008 828 -6512 -6764 -1121 5480 4681 -1259 -4457 -275
1307 -275 5227 4292 -2394 -7231 -4088 4135 8465 3573 -4218 -5986 -378 5009 2797 -4424 -8236
1322 -8236 -2890 5547 8349 2551 -3834 -3710 2372 5485 1113 -5787 -7440 -697 5539 5452 -937 -5189
1338 -5189 -2415 3950 5118 -394 -5358 -3465 3263 6627 2326 -5168 -6306 -199 5734 4105 -2639
1353 -2639 -6023 -2031 5331 6628 215 -6464 -5540 1777 7045 4295 -3351 -5923 -1233 4601 3914
1368 3914 -2027 -5926 -2695 3511 5988 1596 -4085 -3649 1663 4680 1060 -4796 -5662 738 6900
1383 6900 5301 -2312 -6367 -2944 3495 5737 203 -6395 -5028 2182 7631 4530 -3586 -6850 -2530
$$ packed form
1277E227o564m668L637P498K462o401p478n20O459N815k112p706l050N531Q345
1292F475J228o214o183J069O707K926n180p340k52N643O601p99n940l198M182
1307b75N502r35o686m837L143Q223M330m892p791j768N608N387k212p221l812
1322h236N346Q437K802n798o385J24O082L113m372o900j653O743O236q7o389m252
1338e189K774O365J168n512m964J893O728L364m301p494j138O107N933j629o744
1353b639l384L992P362J297o413o679R24P317N268k750p646k572M690N834o87
1368C914n941l899L231O206K477m392n681M36N312L017l620n856q66O400O162
1383F900j599p613m055L423O439K242n534o598J367P210N449l101q116l264M320
$$ plain form
1398 -2530 4037 4752 -592 -5197 -2454 3843 5593 539 -4966 -4972 1162 5105 2078 -3216 -4507 469
1414 469 5250 3980 -2752 -6999 -2935 4461 6448 783 -5338 -4995 1527 6188 2777 -4505 -7546
1429 -7546 -1787 5194 6643 472 -4694 -3537 2331 4643 315 -4786 -4613 375 5089 3119 -2532
1444 -2532 -4748 -466 4355 3312 -2156 -5619 -1940 5169 6702 1001 -5564 -5607 529 5236 3172
1459 3172 -3386 -6179 -934 5743 6083 7 -5282 -3967 1868 5288 1510 -4220 -4193 557 4574 2636
1475 2636 -3274 -5634 -1213 4195 4783 -228 -4059 -1857 3210 5083 332 -5609 -5014 1002 5464
1490 5464 3063 -3054 -5587 -750 4839 4919 -1111 -5945 -3700 2812 6896 3066 -3880 -5554 -830
1505 -830 3742 2981 -2235 -4722 -1335 3774 4913 35 -3974 -2565 2131 4130 641 -4005 -3621 1915
$$ packed form
1398b530O567P15n344m605K743O297J750n054n505oO134L943l027n294j291M976
1414D69M781j270o732m247M064P396J987n665o121L43O522M661l411p282l041
1429g546N759O981J449o171n166J157N868K312m328n101J73M988M714j970n651
1444b532k216M282M821j043n468l463L679P109J533n701o565m3O136M707k064
1459C172o558k793N245O677L40o076n289J315N835L420l778n730K7M750M017j938
1475B636n910k360M421N408N88n011l831K202N067J873m751n941N95O016M462
1490E464k401o117k533M837N589Q0o030m834K245O512M084l830o946j674M724
1505h30M572p61n216k487L387N109J139m878m009J409M696J999l489m646L84N536
$$ plain form
1521 1915 5434 2585 -4169 -6432 -2156 4520 5591 324 -4869 -3076 3007 6241 2212 -4404 -6328
1536 -6328 -1640 3469 3597 -536 -3472 -1295 2647 3130 -589 -4714 -2584 2429 5257 2240 -3336
1551 -3336 -3511 589 4017 1968 -3678 -6333 -2016 4055 5455 870 -3814 -3060 1845 4720 1657
1566 1657 -4055 -4983 -395 4445 3728 -1854 -5112 -2534 2719 4307 412 -3328 -2450 1864 4792 1927
1582 1927 -2957 -4028 -591 3178 2558 -1667 -4166 -1299 3184 3248 -883 -4300 -2844 2772 5883 2415
1598 2415 -3405 -5245 -408 3847 3319 -1915 -5653 -3106 2741 5359 2245 -2089 -2913 301 2718
1613 2718 823 -2855 -3592 247 3895 2923 -982 -3643 -1510 2595 2965 -1269 -4691 -2874 2532 6004
1629 6004 3221 -2448 -5118 -1139 3043 2930 -1317 -4546 -2230 2464 4609 1418 -2802 -2882 548 2952
$$ packed form
1521A915L519k849o754k263M276O676J071n267n193J793O083L234m029o616j924
1536f328M688N109J28m133k936K177L942M83l719m125K130N013K828l017n576
1551c336j75M100L428k049n646k655M317O071J400m585m684P54M905K875l063
1566A657n712r28M588M840p17n582l258K578N253J588l895l740Q78M314K928k865
1582A927m884j071L437L769o20m225k499K867M483O4m131l417J456N616L111l468
1598B415n820j840M837M255n28n234l738K547N847K618l114m334q24L214K417
1613B718j895l678p37L839L648r72l905k661K133M105L70m234l422J817N406L472
1629F004k783n669k670L979M182j13m247l229K316M694K145l191m220q0L430K404
$$ plain form
1645 2952 1439 -2423 -3239 -106 3620 2769 -1221 -4471 -2366 2272 3834 962 -2624 -2777 1028 3349
1661 3349 1481 -2561 -3748 -214 3277 3655 -752 -3797 -1846 2304 3511 338 -3506 -3545 1019 4269
1677 4269 2813 -1590 -3976 -1653 2223 2697 -325 -3041 -1791 1967 3370 900 -2429 -2722 338
1692 338 2344 570 -2386 -2690 724 3967 3183 -919 -4285 -2725 1941 3825 1179 -2780 -3571 201
1708 201 3214 2432 -1127 -3302 -1412 2309 2910 160 -2349 -1809 1208 2251 432 -2909 -2615 1005
1724 1005 3395 2074 -1367 -3079 -879 2412 2313 -1069 -3530 -2424 1971 3964 2014 -1690 -2802
1739 -2802 4 1783 1279 -1803 -3062 -620 2866 3166 340 -2694 -2344 950 2879 1006 -2361 -2807
1755 -2807 614 3049 2400 -738 -2837 -1437 1689 2114 -210 -2436 -1873 1543 2805 1195 -2071 -2512
$$ packed form
1645B952j513l862q16L133L726q51l990l250K105M638J562k872l586j53L805K321
1661C349j868m042j187L534L491L78m407l045J951M150J207l173l844l9M564L250
1677D269j456m403k386K323L876M74l022k716J250L758J403k470l329k93L060
1692C38K006j774k956l04L414L243p84m102l366J560M666J884k646l959p91L772
1708B01L013p82l559k175J890L721O01k750k509N40L017J043j819l341K94L620
1724A005K390j321l441j712K200L291r9l382k461J106M395J993j950l704j112
1739b802K806J779n04l082j259K442L486L00k826l034L50L294J929j873l367m46
1755b807L421K435o49l138k099J400L126M25k324k226N63L416J262j610l266m41
$$ plain form
1771 -2512 485 2659 2085 -1466 -3187 -1428 1710 2735 321 -2252 -2142 876 3129 1597 -1485
1786 -1485 -2796 -995 1625 1403 -684 -1773 -429 2432 3072 182 -2766 -2442 330 1829 868 -1781
1802 -1781 -1930 650 3324 2805 -588 -3230 -2187 504 1860 699 -1696 -1406 1089 3018 1536 -1096
1818 -1096 -2707 -1101 1151 1601 -444 -1746 -542 2047 2795 720 -2016 -2690 -216 2193 1023 -1357
1834 -1357 -2200 -411 1916 2403 -314 -2439 -1393 722 2135 433 -1542 -2049 571 2313 1373 -1137
1850 -1137 -2302 -680 1572 2007 -393 -2167 -1285 1200 2275 1111 -942 -1383 125 1899 1129 -1499
1866 -1499 -2939 -1221 1073 1709 241 -1074 -334 1171 2336 453 -2284 -2792 -772 1842 1679 -150
1882 -150 -1602 -514 1544 1890 93 -1888 -1586 303 2118 994 -824 -1629 -78 1601 1405 -1378
$$ packed form
1771b512K997K174n74l551j721J759L138J025k414k573J10L018K253j532l082
1786a485j311J801K620k22k087j089J344K861O40k890k948L24K772J499r61k649
1802a781j49K580K674n19l393k642J043K691J356j161k395K90K495J929j482k632
1818a096j611J606K252M50k045j302J204K589P48k075k736o74K474K409j170k380
1834a357q43J789K327M87k717k125J046K115J413j702j975n07K620J742r40k510
1850a137j165J622K252M35k400j774Q82K485J075j164k053m41J508J774p70k628
1866a499j440J718K294O36j468j315P40J505J165j883k737n08K020K614j63j829
1882a50j452J088K058L46j797j981L02J889J815j124j818q05J551J679j96k783
$$ plain form
1898 -1378 -2627 -1433 1102 2060 828 -836 -1212 759 1805 783 -1584 -2045 -315 1832 1401 -448
1914 -448 -2083 -1084 1176 1950 439 -1197 -1469 540 1823 951 -1170 -1933 -443 1725 1357 -256 -1759
1931 -1759 -1092 1058 1991 164 -1964 -1671 102 2320 1579 -636 -1726 -614 1237 1598 -775 -1986
1947 -1986 -1231 846 2293 999 -695 -905 259 1194 626 -1146 -1920 -373 1624 1856 -167 -1665
1963 -1665 -1243 500 1786 829 -1279 -2084 51 1990 1206 -386 -1927 -1051 688 1356 -49 -1241
1979 -1241 -501 899 1839 627 -1545 -1704 -129 1505 1127 -527 -1502 -384 1544 1612 15 -1737 -1380
1996 -1380 428 1693 1276 -823 -1305 129 1502 681 -681 -1537 -836 1399 1846 444 -1196 -1261 804
2013 804 1684 566 -1184 -1516 -332 1669 1535 -289 -1679 -911 711 1155 137 -1183 -1008 1069 2041
$$ packed form
1898a378j249J194K535R58j232j664l76J971J046j022k367m61J730K147m31j849
1914d48j635R99K260P74j511j636k72K009J283q72k121p63J490K168l68j613j503
1931a759O67K150R33j827k128K93J773K218p41k215j090J112J851L61k373j211
1947a986P55K077J447j294j694k10J164R35n68j772p74J547J997K32k023j498
1963a665M22J743J286r57k108q05K135J939p84j592j541Q76J739O68j405j192
1979a241P40J400R40j212k172j59J575J634l78j654r75J118J928O8j597j752L57
1996a380J808J265m17k099m82J434J373q21j362q56P01K235M47j402j640o5K065
2013H04Q80j118j750l32J184K001j34j824j390P68J622M44j018j320J75K077R72
$$ plain form
2030 2041 589 -1195 -1699 -393 1474 896 -984 -1649 -801 1344 2104 723 -1331 -1923 -249 1559
2046 1559 1185 -501 -1101 -299 889 903 -587 -1786 -1009 969 1473 594 -934 -715 653 1727 832
2063 832 -818 -1676 -712 1560 1548 -217 -1921 -1324 451 1349 674 -844 -1055 364 2010 1579 -547
2080 -547 -1553 -881 749 919 -474 -1510 -995 1221 1906 628 -1036 -1591 177 1790 1188 -341 -1382
2097 -1382 -615 865 989 -673 -1834 -1424 293 1459 768 -715 -1126 944 1727 1526 -888 -2246 -1053
2114 -1053 793 1278 -140 -1520 -1354 640 1416 920 -729 -1209 193 1587 1554 -242 -1086 -740 812
2131 812 955 -618 -1891 -1503 440 1544 700 -1009 -1014 227 1647 1316 -249 -1365 -1104 756 1492
2148 1492 -666 -1642 -1293 189 1450 1107 -381 -1050 389 1451 1193 -590 -1588 -856 569 1383 166
$$ packed form
2030B041j452j784n04J306J867n78j880o65Q48K145P60j381k054n92J674J808
2046A559l74j686o00Q02J188J4j490j199P77J978N04q79j528K19J368J074q95
2063H32j650q58R64K272j2j765j704N97J775Q98o75j518k11J419J646m31k126
2080e47j006O72J630J70j393j036N15K216O85j278j664n55J768J613o02j529j041
2097a382P67J480J24j662j161M10J717J166o91j483m11K070P83k01k414j358J193
2114a053J846M85j418j380J66J994P76m96j649m80J402J394l3j796q44L46J552
2131H12J43j573j273L88J943J104q44j709nJ241J420l31j565j116K61J860P36
2148A492k158r76L49J482J261l43j488o69J439J062k58j783r98P32J425Q14j217
$$ plain form
2165 166 -1493 -1720 326 1340 700 -948 -1402 22 1916 1712 367 -775 -678 401 825 -511 -1761
2182 -1761 -1501 812 1566 944 -601 -1150 217 1718 1401 -537 -1720 -834 969 1345 286 -1206 -1478
2199 -1478 -139 861 544 -758 -979 67 1438 1680 -187 -1394 -855 888 1336 28 -1142 -1480
2215 -1480 1 1275 678 -745 -1507 200 1657 1800 177 -1223 -883 810 866 -269 -1286 -1414 146
2232 146 1522 940 -561 -1002 -376 1492 1160 -220 -1395 -635 745 1546 176 -1216 -1212 -430 815 214
2250 214 -755 -1147 -97 1386 1429 -16 -1391 -1197 647 1273 319 -1293 -1024 192 1230 1061 -741
2267 -741 -1286 -575 876 1190 -56 -1027 -561 488 1162 237 -922 -1358 142 1371 900 -426 -888 -64
2285 -64 717 711 -438 -1295 -998 455 1149 280 -828 -1043 220 931 568 -915 -1338 -284 1167 1088 73
$$ packed form
2165A66j659k27K046J014o40j648m54J424J894k04j345j142R7J079M24j336j250
2182a761K60K313P54o22j545n49J367J501l17j938j183Q86J803L76j059j492k72
2199a478J339J000l17j302k21J046J371K42j867j207N39J743M48j308j170l38
2215a480J481J274n97j423p62J707J457J43j623j400L40J693N6j135j017j28J560
2232A46J376n82j501m41O26J868l32j380j175P60J380Q01j370j392MP82J245o01
2250B14r69l92J050J483M3j445j375J94J844O26r54j612K69J216J038j69j802
2267g41n45P11J451L14j246r71M66J049O74r25j159m36J500J229m71j326m62Q24
2285f4P81oj149q57K97J453O94q69j108k15J263P11l63j483m23J054J451p9j015
$$ plain form
2304 73 -1208 -1102 431 1061 342 -624 -955 75 1229 986 -210 -1123 -541 402 735 -257 -1052 -619 515
2323 515 1033 119 -745 -981 51 1528 942 -377 -1241 -535 610 831 -41 -1361 -1069 333 1039 960
2341 960 -630 -716 -145 1067 912 -500 -844 -496 707 916 -135 -1313 -1087 20 416 -2 -725 -674
2359 -674 523 1706 1409 53 -857 -779 326 503 -565 -1220 -594 331 1275 640 -516 -1105 289 1023
2377 1023 1151 -386 -1078 -572 612 783 69 -925 -1156 -371 312 37 -574 -194 663 1069 1044 -40 -840
2396 -840 -366 644 774 -219 -1220 -1084 -118 1136 456 -424 -771 251 1419 1394 142 -1082 -890 -72
2414 -72 586 91 -715 -727 -162 437 303 -557 -538 101 967 492 -210 -627 23 884 1105 -243 -1659 -1560 -589
2435 -589 263 536 20 -392 440 1289 918 -202 -1051 -448 215 355 -46 -448 -868 -45 728 99 -669 -785
$$ packed form
2304G3j281J06J533O30p19r66l31J030J154k43j196r13N82R43L33r92p95M33J134
2323E15N18r14q64k36J032J477n86j319q64P06J145K21q72j320K92J402P06p9
2341I60j590q6N71J212j55j412l44L48J203K09j051j178K26J107L96m18p23N1
2359f74J197J183k97j356r10P8J105J77j068o55O26R25R44o35j156n89J394P34
2377A023J28j537o92N06J184J71p14r94k31P85O83k75o11L80Q57M06k5j084q00
2396h40M74J010J30r93j001J36R66J254o80q80l47J022J168k5j252j224J92Q18
2414g2O58m95q06j2N65N99j34q60J9O39Q66m75p02m17O50Q61K21j348j416R9R71
2435e89Q52K73n16m12Q32Q49l71j120q49O03O63J40m01m02m20Q23P73o29p68j16
$$ plain form
2455 -785 -8 601 887 239 -445 -220 187 563 -188 -1108 -704 -394 504 594 -447 -284 323 769 752 -259
2475 -259 -810 -155 910 1106 157 -1147 -1493 -843 125 747 81 -243 158 644 787 140 -372 100 133 365
2495 365 16 -613 -346 178 469 -36 -742 -779 -242 561 862 141 -418 -432 495 796 139 -964 -1262 -529
2515 -529 492 780 279 -14 -253 131 254 -106 -116 -292 473 637 -59 -307 -837 -111 190 332 -400 -565
2535 -565 -170 582 902 330 -206 -479 58 475 7 -387 -507 385 609 334 -30 -977 -629 175 265 299 219
2556 219 206 503 773 80 -570 -690 -329 325 655 101 -198 271 298 325 -371 -547 -433 278 749 227 -295
2577 -295 -570 -186 476 150 -314 -774 -401 432 1025 372 -200 -613 -249 92 -107 -359 -479 26 454 401
2597 401 26 -332 -404 116 458 -55 -271 -105 316 679 135 -463 -678 -482 374 667 315 -311 109 210
$$ packed form
2455g85P77O09K86o48o84K25M07L76p51r20M04L10Q98R0j041J63O07M46j7j011
2475b59n51O55J065J96r49j304l46O50R68O22o66l24M01M86J43o47n12M72L3K32
2495C65l49o29K67N24K91n05p06l7N37Q03L01p21n59j4R27L01o57j103k98P33
2515e29J021K88n01k93k39L84J23l60j0j76P65J64o96k48n30P26L01J42p32j65
2535e65L95P52L20n72n36k73N37M17m68l94j20Q92K24k75l64r47L48Q04R0L4q0
2556B19j3K97K70o93o50j20L61O54L30n54k99M69K7K7o96j76J14P11M71n22n22
2577b95k75L84O62l26m64m60L73Q33N93o53n72m13L64L41j99k52j20N05M28n3
2597D01l75l58p2N20L42n13k16J66M21L63n44n98k15J96Q56K93l52o26M20J01
$$ plain form
2617 210 493 99 -399 -673 -325 338 369 42 -190 92 494 122 -150 -496 -411 323 524 179 -405 -365 197
2638 197 318 -115 -390 -870 -99 692 1023 452 -174 -489 -353 -26 -76 -196 -398 194 269 -29 -171 -349 -5
2659 -5 206 133 -10 -397 136 692 332 -51 -790 -783 -534 208 77 -6 -359 130 325 614 293 -401 -409 -195 101
2682 101 98 43 112 159 111 -413 -851 -473 65 598 1005 577 -56 -62 -122 304 -449 -574 -498 -201 204 -187 70
2705 70 -123 0 -148 322 19 -335 -202 225 480 301 -147 -970 -692 -17 82 -84 53 49 679 420 215
2726 215 -282 -277 -353 -135 -18 -153 171 707 90 -144 -918 -902 227 701 773 179 -390 -242 96 603 338
2747 338 -205 -762 -756 -381 433 597 361 375 -8 -392 -305 -286 381 868 614 92 -366 -328 -87 21 -245 -672
2769 -672 -511 22 753 641 291 -105 -666 -100 193 347 33 -403 22 119 48 -128 -76 116 -131 117 -113
$$ packed form
2617B10K83l94m98k74L48O63L1l27k32K82M02l72k72l46Q5P34K01l45n84M0N62
2638A97J21m33k75m80P71P91L31n71o26l15J36L27n0j20k02N92P5k98j42j78L44
2659eK11p3j43l87N33N56l60l83p39PK49P42j31q3l53M89J95K89l21o94qK14K96
2682A01ln5O9M7m8n24m38L78N38N33M07m28o33oo0M26p53j25P6K97M05l91K57
2705G0j93J23j48M70l03l54J33M27K55j79m48q23K78O75R9j66J37mO30k59k05
2726B15m97Np6K18J17j35L24N36o17k34p74J6J129M74P2n94n69J48L38N07k65
2747C38n43n57OL75Q14J64k36J4l83l84Q7J9O67M87k54n22m58L8K41J08k66m27
2769f72J61N33P31j12l50l96n61N66K93J54l14m36M25R7p1j76N2J92k47K48k30
$$ plain form
2790 -113 -134 199 219 473 -30 -324 -786 -291 -83 -9 260 563 391 188 -272 -589 -353 18 508 734 71
2811 71 -164 -472 92 372 400 -93 -730 -415 259 729 660 554 -244 -432 -627 142 485 557 23 -161 -184 52
2833 52 328 442 454 -246 -599 -489 408 827 1188 -59 -636 -682 -313 228 682 503 -29 -351 -336 -47 331
2854 331 212 57 -209 -679 61 538 553 281 87 -784 -693 -271 215 331 319 -189 21 -253 -55 165 -101
2875 -101 -436 -112 8 361 157 157 147 -133 -201 -48 -468 -318 277 198 303 129 50 -256 -617 -450 27 272
2897 272 385 241 -154 -94 -124 271 427 -211 -458 -479 -5 703 942 341 -216 -746 -612 -77 388 514 269
2918 269 -141 -209 -87 164 171 221 -212 -740 -663 110 431 1126 492 -447 -829 -579 9 604 682 37 -138 -366
2940 -366 -98 443 248 -328 -387 -624 176 337 625 458 -75 -318 -734 -435 65 553 694 307 -191 -203 -100
$$ packed form
2790a13k1L33K0K54n03k94m62M95K08P4K69L03j72k03m60l17K36L71M90K26o63
2811G1k35l08N64K80K8m93o37L15O74M70o9j06p98j88j95P69L43P2n34j84k3K36
2833E2K76J14J2p00l53J10Q97M19L61j247n77m6L69N41M54j79n32l22J5K89L78
2854C31j19j55k66m70P40M77J5k72j94q71R1M22M86J16j2n08K10k74J98K20k66
2875a01l35L24J20L53k04%j0k80o8J53m20J50N95p9J05j74p9l06l61J67M77K45
2897B72J13j44l95O0l0L95J56o38k47k1M74P08K39o01n57n30J34N35M65J26k45
2918B69m10o8J22K51PN0m33n28P7P73L21O95o34r39l82K50N88N95P8o45j75k28
2940c66K68N41j95n76n9k37Q00J61K88j67n33k43m16K99N00M88J41l87m98j2J03
$$ plain form
2961 -100 48 33 -140 -448 235 284 427 469 119 47 -470 40 -135 -159 -250 277 436 500 271 -121 -395 -146
2983 -146 -73 179 274 344 73 58 -314 -250 -389 -130 -165 -112 -143 12 760 570 138 -128 -819 -503 100 613 251
3006 251 104 -579 -93 55 596 -175 -399 -430 -87 241 708 464 185 -183 -309 -437 -304 55 382 455 104
3027 104 -415 -371 -6 358 216 -151 -497 -180 396 997 886 -6 -523 -535 -130 229 101 -292 -28 105 435
3048 435 212 -305 -368 -301 -52 73 311 59 449 431 -107 -499 -468 -146 -58 425 -26 -127 246 394 354 -209
3070 -209 -330 -485 -36 376 612 151 -57 -229 87 346 -299 -355 -312 -63 373 718 110 -22 -412 -298 -375
3091 -375 -267 -14 193 406 353 -48 -216 -350 -37 441 -34 -427 -482 218 495 330 -667 -629 -829 -126 271
3112 271 482 -86 -97 355 692 202 -214 -408 -573 249 560 132 -121 -49 -37 25 -229 -585 -371 204 318
$$ packed form
2961a00J48j5j73l08O83M9J43M2l50p2n17N10j75k4r1N27J59O4k29l92k74K49
2983a46P3K52R5P0k71j5l72O4j39K59l5N3l1J55P48j90m32k66o91L16O03N13l62
3006B51j47o83M86J48N41p71k24l1L43L28M67k44k79l68j26j28J33L59L27P3l51
3027A04n19M4L65L64j42l67l46L17N76O01j11q92n17j2M05L59j28l93K64J33L30
3048D35k23n17o3O7K49J25K38k52L90j8n38l92L1L22Q8M83m51j01L73J48m0n63
3070b09j21j55M49M12K36m61k08j72L16K59o45n6M3K49M36L45o08j32l90J14p7
3091c75J08K53K07K13n3m01j68j34L13M78m75l93n5P00K77j65r97L8k00P03L97
3112B71K11n68j1M52L37m90m16j94j65Q22L11m28k53P2J2O2k54l56K14N75J14
$$ plain form
3133 318 575 -73 -173 -74 364 -89 -546 -718 -398 546 868 236 16 -290 -171 480 134 -465 -821 -143
3153 -143 513 576 -74 -421 -524 -284 277 -41 161 129 421 373 -58 -234 -259 -188 35 465 12 -319 -216 383
3175 383 339 57 -644 -556 -187 744 402 139 -60 75 60 261 -240 -593 -236 55 448 348 -91 -307 2
3196 2 6 -121 -484 -557 -82 452 426 65 -678 -223 62 182 -117 -316 -309 435 602 611 -86 -497 -289 -48 206
3219 206 -304 -374 -63 191 463 -36 -529 -630 -26 -41 57 -83 101 298 347 396 -398 -405 -639 389 689 424
3241 424 -4 -158 94 155 -175 -705 -943 -185 493 471 259 -269 -539 159 227 47 -409 -691 63 424 429 -100
3263 -100 -853 -545 9 -34 187 -101 164 727 939 351 -323 -432 -378 200 194 -421 -165 198 537 419 300
3284 300 -480 -643 114 282 185 -61 -155 122 412 259 -367 -623 -582 98 401 138 -40 -49 322 155 42 -398
$$ packed form
3133C18K57o48j00R9M38m53m57j72L20R44L22o32k20l06J19O51l46n99l56O78
3153a43O56O3o50l47j03K40N61l18K02l2K92m8m31j76k5P1K23M30m53l31J03N99
3175C83m4k82p01Q8L69R31l42k63j99J35j5K01n01l53L57K91L93j00m39k16L09
3196BMj27l63p3M75N34k6l61p43M55K85J20k99j99PP44J67Ro97m11K08K41K54
3219B06n10p0L11K54K72m99m93j01O04j5R8j40J84J97M9M9p94pk34J028L00k65
3241D24m28j54K52O1l30n30k38P58O78k2k12n28k70O98O8j80m56k82P54L61Nn29
3263a00p53L08N54m3K21k88K65N63K12n88o74j09N4N78oo15K56L63L39j18j19
3284C00p80j63P57J68r7k46r4K77K90j53o26k56M1O80L03k63j78rL71j67j13m40
$$ plain form
3306 -398 -1008 -49 174 356 -216 -504 -115 447 393 -16 -348 -344 1 607 440 -195 -735 -256 379 169 -416
3327 -416 -440 -296 367 536 352 -258 -308 102 536 20 -70 -217 -7 333 277 -340 -756 -703 125 367 123 15
3349 15 -74 256 632 245 -391 -758 -202 525 580 -59 -8 -464 -55 532 76 -287 -545 -153 468 281 -114
3370 -114 -401 -240 406 163 -481 -636 -310 325 609 360 99 -354 -192 466 442 -142 -508 -46 548 678
3390 678 242 -786 -379 83 197 286 -153 -135 309 564 252 -234 -653 -260 167 530 251 -556 -566 144 313
3411 313 264 -470 -622 -199 558 583 68 -430 -545 398 327 -209 -596 -239 160 595 328 -263 -422 -11 453
3432 453 58 -542 -512 -437 712 1063 445 -319 -552 -92 272 357 -111 -389 316 634 456 -270 -471 -261 87
3453 87 429 -47 -635 -272 499 666 309 -644 -803 -365 464 401 -17 -556 -125 256 132 -230 -615 -817 123
$$ packed form
3306c98o10R59K23J82n72k88L89N62n4m09l32ML45O06j67o35n40M79O35k10n85
3327d16k4J44O63J69j84o10n0M10M34n16r0j47K10L40n6o17m16N3Q28K42k44j08
3349A5q9L30L76l87o36l67N56P27N5o39N1m56M09N87m56l63k58L92O21j87l95
3370a14k87J61O46k43o44j55L26O35K84k49k61m53J62O58k4n84l66M62N94J30
3390F78m36j028M07M62J14Q9m39J8M44K55l12m86m19L93M27L63k79q07j0P10J69
3411C13m9p34j52M23P57K5n15m98j15R43p1n36l87L57L99M35k67n91j59M11M64
3432D53l95o00L0P5J149L51o18p64k33M60L64Q5m68k78P05L18j78p26k01K10L48
3453H7L42m76n88L63P71J67l57r53j59M38Q29o3m18n39M31L81j24l62l85k02R40
$$ plain form
3474 123 557 250 -94 -363 -281 912 315 -295 -840 -582 260 1192 474 -612 -683 -482 282 142 -137 -595
3494 -595 -120 340 902 145 -432 -332 142 452 96 -754 -361 273 719 440 -429 -960 -364 291 718 -23
3514 -23 -519 -451 348 503 297 -344 -509 -38 398 283 -35 -212 31 424 596 -214 -779 -453 384 1024 529
3535 529 -295 -558 -112 402 370 -382 -752 -533 642 883 290 -57 -382 -25 155 72 -583 -396 324 905
3555 905 788 46 -681 -511 257 370 231 -462 -481 431 798 704 -444 -795 -162 128 507 -50 -279 -87
3575 -87 706 455 -41 -460 -632 369 476 519 -602 -386 -17 721 436 -180 -950 -658 310 790 270 -239
3595 -239 -428 148 670 111 -856 -701 291 801 662 -236 -634 -422 442 401 -202 -822 -635 180 808 700
3615 700 -216 -499 -357 289 362 -90 -335 -81 431 986 -163 -772 -515 97 571 -79 -42 -610 -41 729
$$ packed form
3474A23M34l07l44k69Q2J193n97o10n45K58Q42R32p18j086p1K01P64j40k79m58
3494e95M75M60N62p57n77J00M74L10l56q50L93O34M46k79q69n31N96O55M27p41
3514b3m96O8P99J55k06o41j65M71M36j15l18j77K43L93J72q10n65L26Q37O40m95
3535E29q24k63M46N14l2p52l70K19J175K41n93l47l25L57J80q3o55J87P20N81
3555I05j17p42p27J70P68J13j39o93j9R12L67r4j148l51O33K90L79n57k29J92
3575h7P93k51m96m19j72J001J07M3j121K16L69P38k85o16p70K92R68M80n20n09
3595b39j89N76N22n59r67J55R92N10j39q98l98K12Q64m1o03o20J87Q15O28j08
3615G00r16k83J42O46P3m52k45K54N12N55j149o09K57O12M74o50L7n68N69P70
$$ plain form
3635 729 480 -101 -886 -915 356 937 136 -469 -374 -91 482 327 -66 -570 -223 395 388 -150 -346 162 443
3656 443 449 20 -338 -539 269 517 531 -452 -750 -464 408 764 174 -721 -425 367 700 177 -401 -558 10
3677 10 559 162 -670 -759 21 891 1020 140 -579 -860 12 723 271 -200 -578 -151 746 322 -216 -679 -487
3698 -487 216 536 -47 -221 -290 477 410 187 -881 -1189 -3 604 709 -282 -649 -289 573 648 -315 -654
3718 -654 -651 74 951 428 -204 -438 -123 103 229 -144 -443 -25 793 545 67 -808 -544 367 684 285 -418
3739 -418 -483 -209 673 678 -251 -1094 -529 455 497 11 -471 -191 412 775 329 -542 -795 -44 426 601 -249
3760 -249 -544 -250 419 311 -2 -738 -687 102 695 619 -316 -415 -381 260 235 -309 -780 47 410 707 357 -361
3782 -361 -213 135 662 474 -584 -595 -414 786 705 -2 -660 -651 -13 633 210 -496 -289 176 964 105 -253
$$ packed form
3635G29k49n81p85k9J271N81q01o05R5K83N73j55l93n04L47O18pn38j96N08K81
3656D43Om29l58k01Q08K48J4r83k98K86Q72L56n90q95K96P92L33n23n78j57N68
3677A0N49l97q32q9P80Q70J29q80p19k81Q72P11m52m71l78M27Q97m24n38m63J92
3698d87P03L20n83j74o9P67o7k23j068l08J186O07J05r91l67L60Q62P5r63l39
3718f54LP25Q77n23o32k34L15K26J26l73k99M18Q18k48m78q75K64R11L17l99p03
3739d18o5K74Q82Nr29q43N65R84M2m86m82K80O03L63m46q71k53P51M70J75q50
3760b49k95K94O69j08l13p36N1P89N93p6r35r9L4O41k5n44m71Q27L63K97l50p18
3782c61J48L48N27j88j058j1J81J200q1p07o58RO38O46m23p06K07M65P88q59l58
$$ plain form
3803 -253 -709 -187 524 200 -296 -371 -19 576 724 64 -721 -670 -120 662 449 -191 -344 -283 -51 276 -99
3824 -99 -659 -393 48 632 196 -335 -705 -49 247 -67 -455 -607 -84 369 577 146 -452 -360 233 503 113
3845 113 -357 -204 322 841 376 -212 -521 -298 324 168 319 -529 -72 302 599 329 -642 -991 -316 327
3865 327 174 -105 -461 -238 433 715 -48 -621 -631 140 340 49 -318 -516 -138 592 343 -47 -901 -185
3885 -185 514 796 330 -386 -485 87 560 526 -27 -521 87 599 659 -33 -479 -391 -141 367 162 -458 -199
3906 -199 251 455 314 -413 -545 -202 189 148 46 -343 -313 411 203 -63 -415 -804 84 719 461 -137 -292
3927 -292 -13 696 516 -204 -716 -396 -59 732 -48 -297 -314 209 389 210 -373 -515 -316 537 515 -171 -293
3948 -293 -406 155 545 95 -643 -420 -170 554 417 -34 -510 -421 419 366 62 -363 -280 216 614 373 -376
$$ packed form
3803b53m56N22P11l24m96p5L52N95J48o60p85N1N50P82k13o40j53O1K32L27l75
3824i9n60K66M41N84m36n31l70O56K96l14l88j52N23M53K08m31n98R2N93K70l90
3845A13m70J53N26N19m65n88l09K23O22j56J51q48M57L74K97k70r71l49O75O43
3865C27j53k79l56K23O71K82p63n73j0P71K00k91l67j98L78P30k49l90q54P16
3885a85O99K82m66p16r9N72M73l4n53m94O08N12O0o92m46Q8K50N08k05o20K59
3906a99M50K04j41p27j32L43L91m1j02l89L0P24k08k66l52l89Q88O35k58n98j55
3927b92K79P09j80p20n12L20L37P91p80k49j7N23J80j79n83j42J99Q53k2o86j22
3948b93j13N61L90m50p38K23K50P24j37m51m76Q9Q40n3l04m25Q3M96L98k41p49
$$ plain form
3969 -376 -237 -19 422 466 -174 -416 -138 111 644 223 -741 -419 -71 507 395 -257 -313 -81 554 379 -312
3990 -312 -675 -454 391 500 139 -348 -263 39 584 272 -588 -665 -156 596 463 -128 -333 -319 329 483 98
4011 98 -662 -399 288 573 696 -162 -503 -137 520 214 -367 -486 173 659 500 272 -329 -362 99 337 197
4032 197 -546 -402 6 477 423 -221 -633 -103 242 593 454 -228 -420 233 687 69 -224 -529 -45 208
4052 208 733 10 -85 -112 161 600 127 -368 -599 159 325 510 -78 -399 -404 118 573 -169 -781 -522 62
4073 62 966 357 -492 -702 -241 431 776 -362 -612 93 521 559 -82 -432 -467 -64 502 277 -195 -425 -132
4094 -132 440 646 168 -694 -570 281 599 216 -473 -210 279 512 288 -320 -390 -19 387 475 71 -323 -299
4115 -299 270 698 -305 -590 -577 252 475 229 -224 -526 -245 686 601 -181 -574 -588 219 832 97 -396 -393
$$ packed form
3969c76J39K18M41M4o40k42K78K49N33m21r64L22L48N78j12o52n6K32O35j75o91
3990c12l63K21Q45J09l61m87Q5L02N45l12q60p7N09P52j33n91k05J4O48J54l85
4011I8p60K63O87K85J23q58l41L66O57l06n81j19O59M86j59k28o01l3M61K38j40
4032A97p43J44M08M71n4o44m12N30L45L51j39o82j92O53M54o18k93l05M84K53
4052B08N25p23r5k7K73M39m73m95k31P58J66J85n88l21nN22M55p42o12K59N84
4073F2R04o09q49k10M61O72L45j138k50P05M28L8o41l50l5M03N66k25m72k30K93
4094a32N72K06m78q62J24Q51L18l83o89K63M89K33k24o08p0L71M06Q8m04l94K4
4115b99N69M28j003k85J3Q29K23k46m53l02K81R31q5p82l93j4Q07O13p35m93L
$$ plain form
4136 -393 -131 659 381 -152 -719 -143 421 781 -42 -690 -429 249 366 11 -625 -551 -160 554 654 -349
4156 -349 -769 -207 413 577 44 -802 -245 322 426 172 -637 -579 212 798 455 4 -264 -312 394 440 -96
4177 -96 -773 -397 217 663 179 -232 -384 -232 435 407 -470 -701 -82 634 411 13 -674 -333 453 184 154
4198 154 -595 -456 -8 477 671 -1 -683 -261 61 611 108 -568 -493 199 668 245 -557 -660 -185 597
4218 597 525 -327 -569 -232 341 655 68 -611 -273 114 997 271 -417 -631 -29 557 635 -199 -519 -657 543
4239 543 660 42 -527 -168 188 598 388 -756 -612 -107 268 551 -37 -650 -286 154 727 100 -497 -349
4259 -349 227 494 224 -375 -748 -373 570 483 -33 -721 -282 558 603 256 -501 -1009 -100 512 587 -199 -649
4280 -649 -159 518 383 -60 -793 -418 406 358 196 -531 -538 300 680 197 -518 -715 -140 401 755 169 -828
$$ packed form
4136c93K62P90k78n33n67N76N64L60q23o48K61O78J17l55o36P4L91P14J00j003
4156c49m20N62O20J64n33q46N57N67J04k54q09N8P91N86l43m51k68m8P06M6n36
4177i6o77L76O14M46m84m11j52J52O67k8q77k31O19P16k23l98o87L41P86k69l0
4198A54p49J39M48M85J94o72o82M22L22N50n03o76P5O92M69m23q02j03M75P82
4218E97p2q52k42L37N73L14n87o79L38L87Q83p26o88k14O02N86P8q34l20j38J200
4239E43J17o18n69L59L56M10k10j144J44N05L75K83n88o13L64M40N73o27n97J48
4259c49N76K67k70n99l73L75R43q7n16o88M39Q40M5l47p57n08R09O12P5p86m50
4280f49M90O77j35m43p33L75Q24m8j62p27pQ38L80m83p15j97N75N41L54n86r97
$$ plain form
4301 -828 -154 530 867 157 -798 -909 41 498 502 -187 -475 -359 496 548 58 -498 -338 500 401 122 -493
4322 -493 -543 -205 539 418 -104 -650 -341 463 781 -292 -676 -389 351 593 350 -344 -832 300 840 279
4342 279 -214 -687 -367 519 518 191 -616 -479 290 718 260 -328 -311 75 706 636 -280 -590 -270 593 410
4363 410 -225 -488 -320 203 910 -3 -617 -519 13 749 537 -10 -932 -291 706 962 14 -493 -460 149 884
4384 884 522 -551 -286 18 589 296 -559 -717 33 481 564 -436 -578 -309 309 811 325 -435 -617 -307
4404 -307 383 381 75 -188 -235 596 406 165 -710 -485 315 414 100 -562 -457 88 677 309 -402 -598 -485
4425 -485 660 323 86 -820 -519 236 517 393 -573 -692 232 404 320 -302 -671 -191 465 563 75 -673
4445 -673 -582 427 732 268 -491 -825 -249 310 417 -125 -608 -428 253 399 35 -208 -375 164 404 -278
$$ packed form
4301h28O74O84L37p10r55j11R50M57Mo89k88J16Q55N2m90n56J60Q38r9k79o15
4322d93n0L38P44j21n22n46L09Q04L18j073l84K87P40K42k43o94m88J132N40n61
4342B79m93m73L20Q86jl27q07J37P69M28m58n88J7L86O31p0r16l10L20Q63j83
4363D10o35k63J68N23P07r13o14R8N32P36k12n47r22O41R97K56r48n07L3O09P35
4384H84l62j073K65L04N71k93q55j58P50M48Q3j000j42K69O18N02m86p60j82L10
4404c07O90kl06k63m7Q31j90k41q75K25Q00R9l14o62J05N45N89l68p11j96J13
4425d85J145l37k37r06L01P55K81j24r66j19R24J72q4o22l69M80O56R8m88p48
4445f73R1J009L05m64p59l34N76N59J07n42m83J80O81J46l64k43j67N39K40o82
$$ plain form
4465 -278 -488 -461 11 672 352 -306 -778 -459 247 692 -50 -520 -558 297 511 319 -403 -472 -565 317 572
4486 572 186 -657 -330 216 434 99 -492 -253 196 697 452 -402 -486 -330 622 474 -364 -505 -506 212 523
4507 523 28 -637 -643 31 474 254 -559 -547 256 740 404 -384 -575 -388 176 593 -56 -366 -671 262 320
4528 320 370 -13 -583 -243 223 489 -99 -460 -62 397 566 83 -762 -364 359 650 165 -550 -494 -48 535
4549 535 574 -358 -624 -332 92 541 310 -465 -344 -343 539 177 -222 -443 -321 246 366 54 -351 -384 313
4570 313 703 214 -410 -505 426 445 543 -82 -604 -219 550 505 -62 -689 -259 476 406 -21 -438 -455 148 517
4592 517 144 -412 -354 -7 385 365 -97 -670 -279 40 475 536 -511 -551 -37 580 185 -138 -446 -267 249
4613 249 424 -308 -350 -141 103 377 -65 -265 -485 181 894 346 -446 -709 -261 253 479 158 -800 -416
$$ packed form
4465b78k10K7M72O61l20o58m72L19P06M45p42m70l8Q55K14j92p22o9r3Q82K55
4486E72l86q43L27N46K18l35n91K39M49N01k45q54q4J56R52j48q38j41jP18L11
4507E23m95o65oO74M43k20q13J2Q03M84l36p88j91J87N64M17o49l10l05R33N8
4528C20N0l83n70L40M66K66n88l61L98M59J69m83q45L98P23K91m85p15N6M46N83
4549E35L9r32k66K92M24M49k31p75J21JQ82l62l99k21J22N67J20l12m05l3O97
4570C13L90m89o24r5R31J9R8o25n22L85P69m5n67o27M30P35p0m27m17j7O03L69
4592E17l73n56N8L47L92k0m62n73L91L19M35O1j047m0N14O17l95l23l08J79N16
4613B49J75p32m2K09K44K74m42k00k20O66P13n48p92k63M48N14K26l21r58L84
$$ plain form
4633 -416 284 354 114 -291 -370 74 529 205 -76 -295 -300 193 518 103 -228 -279 280 533 234 -443 -469 57
4655 57 496 506 150 -453 -468 28 353 76 -493 -148 -81 378 -16 -593 -375 -43 391 455 -45 -285 -246 427
4677 427 388 -73 -649 -152 187 428 242 -369 -316 -309 213 322 -187 -740 -185 388 412 213 -83 -296 116 206
4699 206 93 -102 -282 401 654 303 -226 -576 -330 55 376 462 -103 -241 -125 411 46 26 -458 -183 488
4720 488 247 167 -355 -239 246 499 116 -323 -225 -95 426 162 -38 -170 -26 396 112 -206 -246 -263 259
4741 259 429 40 -5 -274 323 220 167 -147 -358 -60 513 327 -262 -396 -386 35 442 326 -160 -212 98
4762 98 270 449 -277 -635 -246 341 392 65 -328 -266 217 386 19 -378 -242 -166 325 57 -39 -462 -43 195
4784 195 266 175 -519 -110 285 638 -8 -261 -303 209 733 239 -306 -635 -220 406 339 39 -451 -195 9
$$ packed form
4633d16P00P0k40m05p9M44M55l24k81k19nM93L25m15l31n1N59K53k99o77k6N26
4655E7M39J0l56o03j5M96L25k77n69L45O7M59l94n77K18L32M34O4n00k40L9O73
4677D27l9m61n76M97L39K41j86o11N3PN22J09n09n53N55N73K4j99k96k13M12R0
4699B06j13j95j80O83K53l51n29l50K46L85L21Q6n65j38J16N36l65k0m84K75O71
4720D88k41q0n22J16M85K53l83m39R8J30N21k64k00j32J44M22k84l18m0j7N22
4741B59J70l89m5k69N97j03n3l14k11K98N73j86n89j34J0M21M07j16m86n2L10
4762I8J72J79p26l58L89N87N1l27l93O2M83J69l67l97J36P6M91k68r6m23M19K38
4784A95P1r1o94M09L95L53o46k53m2N12N24m94n45l29M15O26o7l00m90K56K04
$$ plain form
4805 9 260 250 -326 -10 91 367 370 -98 -371 -162 5 22 80 -365 -172 101 266 192 -161 -380 -90 355 207
4828 207 147 -309 -42 172 152 -2 -124 -442 128 347 214 -18 -277 1 168 163 -89 -539 -160 186 523
4849 523 -147 -198 -340 238 694 16 -230 -360 -234 500 374 31 -493 -362 108 330 199 -160 -471 23
4869 23 261 278 -48 -361 -377 -232 144 -314 -44 -331 230 341 207 -176 -703 -293 265 204 -102 -364 -36
4890 -36 340 322 -40 -741 -336 362 185 140 -111 -358 24 50 164 -98 -245 -22 10 341 -45 -343 -369 -155
4912 -155 241 42 -663 -64 45 733 339 -12 -364 -190 246 329 139 -313 -308 274 706 299 -280 -334 289
4933 289 56 260 -87 -12 -60 372 375 138 -377 -590 -130 334 252 -335 -388 -35 105 240 -158 -281 -27 257
4955 257 308 106 -314 -177 101 356 150 -144 -405 21 386 260 -5 -503 -110 261 196 -55 -358 -284 206
$$ packed form
4805IK51j0n76L16J01K76Lm68k73K09J67J7N8m45J93K73J65p4l53k19K90M45j48
4828B07o0m56K67K14k0j54j22l18N70K19j33k32k59K78J67nk52m50L79L46L37
4849E23o70n1j42N78M56o78k46j30J26P34j26l43n24J31M70K22j31l59l11M94
4869B3K38J7l26l13j6J45L76m58K70k87N61J11j34l83n27M10N58o1l06k62L28
4890c6L76j8l62p01M05O98j77m5k51k47L82K6J14k62j47K23L2L31l86k98k6K14
4912a55L96j99p05N99J09O88l94l51l52J74M36Q3j90m52NN82M32m07n79n4O23
4933B89k33K04l47P5m8M32Lk37n15k13M60M64q2n87n3L53J40J35l98j23K54K84
4955B57N1k02m20J37K78K55k06k94k61M26L65j26k65m98L93L71o5k51l03P4M90
$$ plain form
4976 206 305 34 -53 -12 102 345 210 -90 -344 -114 374 457 267 -80 -238 254 144 235 -256 -230 -52 280
4998 280 340 0 -451 -54 438 381 -22 -351 -385 56 602 6 -303 -300 -27 316 333 184 -291 -352 288 183
5020 183 -18 -10 -137 -88 357 171 -202 -125 -167 190 146 -151 -165 -85 370 585 466 -272 -183 -78 172 58 -209
5043 -209 -485 -4 317 329 -174 -363 -259 47 181 75 0 -278 203 236 -25 -56 -400 -230 189 604 87
5064 87 -81 -34 95 341 -187 -326 -208 43 332 220 -93 -212 -263 105 377 -82 -472 -160 234 594 446
5085 446 -160 -250 -24 276 -37 -289 -402 88 350 446 32 -384 -346 31 123 42 -426 -250 -99 463 247 65
5107 65 -364 -206 565 3 -220 -353 21 145 364 -28 -101 -307 -158 170 332 -183 -428 -110 455 417 14
5128 14 -497 -359 183 532 231 -278 -255 58 271 101 34 -70 -104 167 396 -74 -483 -231 28 537 -86
$$ packed form
4976B06R9k71q7M1J14K43j35l00k54K30M88Q3j90l47j58M92j10R1m91K6J78L32
4998B80O0l40m51L97M92n7m03l29l4M41N46n96l09LK73L43J7j49m75o1O40j05
5020A83k01Qj27M9M45j86l73P7m2L57m4k97j4Q0M55K15j19p38Q9J05K50j14k67
5043b09k76M81L21J2n03j89J04L06J34j06p5k78M81L3k61l1l44J70M19M15n17
5064H7j68M7J29K46n28j39J18K51K89j12l13j19n1L68K72m59l90L12L94L60j48
5085D46o06r0K26L00l13k52j13M90K62R6m14m16L8L77R2q1m68J76J51N62k16j82
5107F5m29J58P71n62k23j33L74J24K19l92p3k06J49L28J62n15k45L18N65l8m03
5128A4n11J38N42L49l01n09K3L13K13j70o7j04l4K71K29m70m09K52K59N09o23
$$ plain form
5149 -86 -332 -479 100 695 127 70 -121 -3 105 385 29 -367 -297 95 348 373 -271 -307 -22 124 451 -271
5171 -271 -280 335 107 436 -26 -296 -181 122 292 175 -165 -136 -38 436 412 210 -283 -146 28 563 -51 -152
5193 -152 -17 282 153 -42 -223 -65 39 217 308 -6 -250 -103 207 178 -46 -253 -254 112 432 217 -69
5214 -69 -239 -140 294 229 -102 -399 -193 254 425 83 51 -293 229 180 30 -291 15 46 232 229 136 -324 -596
5237 -596 -77 107 -179 -84 -261 -146 352 281 -50 -422 75 128 304 -32 -287 -246 99 204 -131 -517 -183
5258 -183 -124 425 340 174 -405 124 229 45 -163 -238 8 358 259 39 -480 -226 -76 269 184 -339 -233 128
5280 128 414 229 105 -318 -250 -22 174 -218 -72 33 105 220 111 -390 -149 -116 243 313 137 -65 -113 200
5302 200 175 102 -315 -280 38 87 139 -282 -270 -209 164 128 153 -104 -114 113 413 166 -182 -323 1 229 -9
$$ packed form
5149h6k46j47N79N95n68n7j91J18J08K80l56l96P0L92K53K5o44l6K85J46L27p22
5171b71rO15k28L29m62k70J15L03J70j17l40K9R8M74k4k02m93J37J74N35o14j01
5193a52J35K99j29j95j81J58J04J78R1l14k44J47L10k9k24k07jL66L20k15k86
5214f9j70R9M34o5l31k97K06M47J71l42l2l44N22m9j50l21L06L1J86lr3m60k72
5237e96N19J84k86R5j77J15M98p1l31l72M97N3J76l36k55M1L45J05l35l86L34
5258a83N9N49q5j66n79N29J05j84k08p5K46L50r9k20n19K54J50L45q5n23J06L61
5280A28K86j85j24m23O8K28J96l92J46J05P2J15j09n01K41L3L59P0j76k02m8L13
5302B00k5p3m17L5L18M9N2m21J2O1L73l6K5k57j0K27L00k47l48j41L24K28k38
$$ plain form
5325 -9 -334 -211 -33 193 272 -142 -372 -254 85 338 -75 -83 72 -2 196 54 -150 -120 121 38 -54 66 -390
5348 -390 -125 265 150 168 -64 -286 179 201 372 -109 -420 303 165 232 -31 -216 -118 -128 311 70 -69 -63
5370 -63 105 26 81 -73 -503 -13 295 231 -108 -195 -98 336 261 -5 -316 -354 -35 324 -46 131 -328 -183 -1
5393 -1 343 -98 -248 60 184 294 -200 -390 92 -148 142 -124 -150 -182 -132 170 -26 -37 -369 -141 99 222
5415 222 326 -117 93 8 84 258 -93 -379 -163 74 255 62 -306 58 36 277 -17 -176 -23 10 -4 22
5437 22 102 -182 -92 115 79 -9 -284 39 56 -56 113 -90 -71 -19 -32 -182 6 -184 -272 -57 236 190 -467 -21
5461 -21 -197 207 54 -265 63 138 23 -75 -5 -341 -70 193 340 133 -326 119 278 148 130 -335 -364 12
5483 12 72 -107 -66 -99 50 462 107 -96 -377 -29 134 268 274 -311 166 4 207 -254 -90 -425 -355 267
$$ packed form
5325il25J23J78K26P9m14k30J18L39K53m13qJ55p4J98j42k04L0K41q3r2J20m56
5348c90K65L90j15J8k32k22M65K2J71m81l11P23j38O7k63j85R8j0M39k41j39O
5370f3J68p9N5j54m30M90L08o4l39q7R7M34p5k66l11l8L19L59l70J77m59J45J82
5393aL44m41j50L08J24J10m94j90M82k40K90k66k6l2N0L02j96j1l32K28K40J23
5415B22J04m43K10q5P6J74l51k86K16K37J81j93l68L64k2K41k94j59J53L3j4K6
5437B2Q0k84R0K07l6q8k75L23J7j12J69k03J9N2j3j50J88j90q8K15K93m6o57M46
5461b1j76M04j53l19L28P5j15r8P0l36K71K63J47k07m59M45J59j30j8m65k9L76
5483A2O0j79M1l3J49M12l55k03k81L48J63J34On85M77j62K03m61J64l35P0O22
$$ plain form
5505 267 434 148 -150 -134 -17 346 -132 -198 -434 111 217 310 130 -359 8 -126 194 123 -35 112 -27
5526 -27 74 -19 99 -317 -133 235 133 71 -167 -227 179 88 -126 -105 -237 229 169 387 17 -248 -31 -18 62
5549 62 -221 -189 -159 96 136 -228 -317 -240 56 -121 -31 -236 -187 -116 356 -9 -27 -464 -240 57 109 157 -379 202
5573 202 -109 236 379 -98 -215 -284 -152 179 5 -184 -452 181 215 107 -378 -286 -44 -17 95 -33 -306
5594 -306 351 221 54 -5 -127 -252 260 513 -179 -251 62 70 -35 5 16 -405 -111 155 104 57 74 107 331
5617 331 104 82 -215 -136 107 513 -165 95 -358 -184 89 64 26 -74 -89 278 224 182 -289 -179 178 227 179
5640 179 52 -26 -109 338 120 -106 -439 -126 315 115 -136 -278 -58 115 87 78 -80 -212 29 241 178 -253
5662 -253 -202 -4 288 147 71 -37 -322 -110 306 195 -334 94 -175 299 -119 -96 -123 -244 29 -126 -52 22
$$ packed form
5505B67J67k86k98J6J17L63m78o6k36N45J06R3j80m89L67j34L20p1j58J47j39
5526b7J01r3J18m16J84L68j02o2k38o0M06r1k14K1j32M66o0K18l70k65K17J3Q0
5549F2k83L2L0K55M0l64q9P7K96j77R0k05M9P1M72l65j8m37K24K97N2M8n36N81
5573B02l11L45J43m77j17o9J32L31j74j89k68O33L4j08m85R2K42K7J12j28k73
5594c06O57j30j67n9j22j25N12K53o92p2L13Qj05M0J1m21K94K66n1m7J7L3K24
5617C31k27k2k97P9K43M06o78K60m53J74K73k5l8j00j5L67n4m2m71J10L57M9m8
5640A79j27p8q3M47k18k26l33L13M41k00k51j42K20J73k8rj58j32K41K12o3m31
5662b53N1J98K92j41p6j08k85K12M16j11n29M28k69M74m18K3k7j21K73j55P4P4
$$ plain form
5684 22 -369 -94 57 303 -416 -242 19 308 -12 -153 -88 -50 191 52 162 -103 -91 264 683 232 -171
5705 -171 -130 -454 125 392 -53 113 5 129 206 304 -294 -306 111 378 39 257 38 -163 265 55 37 -269
5727 -269 178 300 220 6 -214 70 235 442 94 88 -260 -7 307 56 -68 62 -90 58 152 -42 -282
5748 -282 -235 -188 416 106 -85 -102 -343 325 -107 -139 -138 -305 219 89 79 -194 -62 41 328 63 11 -144 -48
5771 -48 528 149 -60 -382 -240 38 45 -75 -140 -81 190 340 -62 -133 -197 4 -69 250 19 -83 -78 8 352 -23
5795 -23 -241 -316 138 383 284 107 -425 6 11 111 17 -82 -65 308 89 279 -128 26 -33 193 139 89 -160 122
5819 122 298 149 -210 118 -158 268 18 -233 -98 -228 -224 358 281 -154 -413 -156 51 208 9 -257 -4
5840 -4 4 125 250 -78 -309 -112 340 -107 -137 -103 -99 206 6 76 -155 -318 0 -56 280 162 -67 -123 97 -23
$$ packed form
5684B2l91K75J51K46p19J74K61K89l20j41O5L8K41j39J10k65J2L55M19m51m03
5705a71M1l24N79K67m45J66j08J24P7R8n98j2M17K67l39K18k19k01M28k10j8l06
5727b69M47J22q0k14k20K84J65K07l48ol48K53L14k51j24J30j52J48R4j94k40
5748b82M7M7O04l10j91j7k41O68m32l2Jj67N24j30j0k73J32J03K87k65n2j55R6
5771d8N76l79k09l22J42K78Pj20o5N9K71J50m02p1o4K01p3L19k31j02NQ6L44l75
5795b3k18p5M54K45r9j77n32M31NJ00r4r9J7L73k19J90m07J54n9K26n4n0k49K82
5819A22J76j49l59L28k76M26k50k51J35j30MN82p7m35k59K57K07J57j99k66K53
5840dQJ21J25l28k31J97M52m47l0L4ML05k00P0k31j63L18n6L36j18k29n6K20j20
$$ plain form
5864 -23 -34 -313 -242 -280 108 -34 -122 -170 126 90 -51 -326 -215 139 354 83 -112 -274 -129 244 -52 -114 -487
5887 -487 13 127 -75 410 -22 -118 162 333 -6 25 -241 -133 103 153 -6 -325 -207 -127 40 150 -238
5908 -238 -129 -31 -36 58 53 -284 -189 170 137 183 -217 -255 50 330 6 89 -89 -37 314 394 100 73 -76 85 278
5933 278 -359 -140 -275 111 -122 256 -21 -185 -349 218 220 -7 -319 -242 45 333 15 -339 -154 61 -196
5954 -196 209 -69 -329 307 78 245 -59 -245 -161 224 -138 -37 -59 -51 2 161 57 9 -91 54 230 247
5976 247 54 -77 -55 122 296 -48 -183 -242 86 61 -69 -50 -325 -380 -70 326 -164 -285 -211 15 126 89
5998 89 -305 -243 56 -37 85 -189 -79 115 78 -5 -119 -162 -94 -61 262 182 -267 56 -82 316 285 -72 -276
6021 -276 -89 136 43 107 15 -25 0 112 -140 -184 -30 -282 338 171 -137 -287 -205 206 11 -213 -50 187
$$ packed form
5864b3j1k79P1l8L88j42q8m8K96l6j41k75J11L54K15k71j95j62J45L73k96o2l73
5887d87N00J14k02M85m32r6K80J71l39L1k66J08K36N0j59l19J18Q0J67J10l88
5908b38J09R8nR4nl37R5L59l3M6m00l8L05K80l24Q3j78N2L51Q0k94k7j49J61J93
5933B78o37K19j35L86k33L78k77j64j64N67Kk27l12P7K87K88l18l54J85K15k57
5954a96M05k78k60O36k29J67l04j86Q4L85l62J01k2QN3J59j04m8j00J45J76J7
5976B47j93j31K2J77J74l44j35n9L28k5j30J9k75n5L10L96m90j21P4K26J11l7
5998H9l94O2K99r3J22k74J10J94l7q3j14m3O8L3L23q0m49L23j38L98l1l57k04
6021b76J87K25r3O4r2m0K5J12k52m4J54k52O20j67l08j50Q2M11j95k24J63K37
$$ plain form
6043 187 105 385 -333 86 -147 -20 68 0 -185 -78 95 352 -215 113 -33 -130 50 103 162 -29 -320 190
6065 190 -78 141 59 -107 -138 42 100 -121 -226 -66 205 5 303 -89 -228 111 406 93 -115 -350 67
6086 67 270 455 47 -311 61 -180 230 205 -200 -50 -239 -137 121 -76 -156 245 176 111 -62 39 -52 240
6108 240 210 -151 -217 -315 120 -104 245 16 -10 -36 244 114 -9 -257 -34 185 -36 48 -33 -21 -34 271 12
6131 12 -182 -85 137 244 5 -106 19 -50 63 77 14 -301 52 -14 170 -54 24 53 27 276 -106 -38 -37 114
6155 114 115 367 204 -242 -333 191 56 99 16 -70 86 32 195 -183 -280 -147 261 2 -158 -106 71 -13 408
6178 408 12 -186 152 25 153 -69 70 -196 199 360 104 91 -192 111 -24 128 -124 172 197 -148 -6
6199 -6 153 -159 205 -231 152 2 139 -194 -203 72 -65 192 -98 -46 109 76 76 -92 -175 -111 -151 126 181 1
$$ packed form
6043A87q2K80p18M19k33J27Q8o8j85J07J73K57n67L28j46r7J80N3N9j91k91N10
6065A90k68K19q2j66l1J80N8k21j05J60K71k00K98l92j39L39K95l13k08k35M17
6086F7K03J85m08l58L72k41M10k5m05J50j89J02K58j97q0M01o9o5j73J01r1K92
6108B40l0l61o6r8M35k24L49k29k6k6K80j30j23k48K23K19k21Q4q1J2j3L05k59
6131A2j94R7K22J07k39j11J25o9J13J4o3l15L53o6J84k24P8K9k6K49l82O8JJ51
6155A14JK52j63m46r1N24j35M3q3q6J56n4J63l78r7J33M08k59j60N2J77q4M21
6178D08l96j98L38j27J28k22J39k66L95J61k56j3k83L03j35J52k52K96K5l45J42
6199fJ59l12L64m36L83j50J37l33rK75j37K57k90N2J55l3%j68q3O4m0K77N5j80
$$ plain form
6223 1 254 -57 276 128 -396 -28 -64 134 245 -46 -308 -198 148 75 15 -110 89 -258 402 228 -172 -326
6245 -326 -95 -333 -205 307 43 -236 -130 135 63 144 55 82 197 -326 -101 -49 19 275 379 26 -126 -293
6267 -293 273 203 150 -83 57 -81 190 200 -35 -235 -191 5 -134 155 96 5 114 -6 193 29 -369 -65
6289 -65 186 -3 -13 -132 9 -110 266 98 1 -52 193 225 353 98 -73 -8 -76 -154 56 -68 -129 -62 416
6312 416 112 -118 -168 -129 312 31 -53 -30 -50 85 216 -17 -87 -107 130 182 -448 74 -63 82 225 -290 -138
6335 -138 -221 -42 17 303 113 -81 -231 227 166 -129 188 -246 -193 276 -87 -41 -177 -91 367 -59 -14 -38 -93
6358 -93 -71 129 -136 104 106 130 -237 210 86 -168 -73 296 119 235 -68 -77 -71 -104 -162 -110 -224 7 57 -91 239
6383 239 -61 41 -66 351 -107 38 -49 246 203 -15 25 269 -12 140 -130 -41 -69 -56 27 -70 213 -68 -56
$$ packed form
6223AK53l11L33j48n24L68l6J98J11k91k62J10L46p3o0j25J99l47O60j74m00j54
6245c26K31k38J28N12k64k79J06K65p2Q1q9K7J15n23K25N2O8K56J04l53j52j67
6267b93N66p0n3k33J40j38K71J0k35k00M4J96j39K89n9r1J09j20J99j64l98L04
6289f5K51j89j0j19J41j19L76j68r7n3K45L2J28k55j71O5o8p8K10j24o1O7M78
6312D16l04k30n0L9M41k81q4K3k0J35J31k33p0k0K37N2o30N22j37J45J43n15J52
6335a38q3J79N9K86j90j94j50M58o1k95L17m34N3M69l63M6j36Q6M58m26M5k4n5
6358i3K2K00k65K40KK4l67M47j24k54R5L69j77J16l03rOl3n8N2j14K31N0j48L30
6383B39l00J02j07M17m58J45q7K95m3k18M0K44k81J52k70Q9k8J3Q3r7K83k81J2
$$ plain form
6406 -56 114 97 -228 -73 -283 -20 -66 18 -222 92 131 -145 -113 48 213 -41 -145 64 82 -171 -325 -17
6428 -17 132 78 73 -27 8 116 -102 -24 7 -64 135 59 49 -73 47 214 392 -78 -171 73 -4 64 49 -222 -417
6453 -417 -89 59 139 -106 -53 -141 -150 341 82 -165 -176 -111 21 56 -42 158 -119 65 55 136 -149 -326 -68 138
6477 138 179 68 -185 196 -127 83 -138 -122 11 124 65 -84 -60 -124 65 -138 185 -207 -34 57 -35 374
6499 374 -39 -47 -26 -75 82 99 207 -174 77 74 184 -41 -68 -51 136 167 37 -328 103 69 174 -13 -153 -72
6523 -72 2 16 4 -146 -240 55 181 -211 275 -40 -28 28 71 61 34 -116 97 -80 -160 -126 -234 -142 77 432
6547 432 -13 -295 94 308 199 -46 -69 -124 -125 -81 -34 -135 -139 12 190 160 149 -348 17 -42 45 63 174 -63
6571 -63 -60 -73 82 -8 -16 99 -107 46 122 -44 -437 156 70 -26 -54 -46 -173 217 65 -26 114 -34 -44 109 -69
$$ packed form
6406e6J70j7l25J55k10K63m6Q4k40L14L9k76L2J61J65k54j04K09J8k53j54L08
6428a7J49n4nj00L5J08k18P8L1p1J99p6j0j22J20J67J78m70r3K44p7O8j5k71j95
6453d17L28J48Q0k45N3q8rM91k59k47j1O5J32L5r8K00k77J84j0Q1k85j77K58K06
6477A38M1j11k53L81l23K10k21J6J33J13n9j49K4o4J89k03L23l92J73R1r2M09
6499C74m13qK1m9J57J7J08l81K51lJ10k25k7J7J87L1j30l65M31l4J05j87j40Q1
6523g2P4J4j2j50r4K95J26l92M86l15J2N6M3j0k7j50K13j77q0L4j08R2K19L55
6547D32m45k82L89K14j09k45k3n5jM4M7j01mJ51J78l0j1m97L65n9Q7J8J11k37
6571f3Lj3J55r0qJ15k06J53P6j66l93N93q6r6k8Qj27L90j52r1J40j48j0J53j78
$$ plain form
6596 -69 65 87 298 46 -279 -329 -85 47 0 -133 -4 169 -54 86 138 -113 -179 -213 72 21 -162 14 169
6619 169 -208 6 139 -10 -34 272 134 223 34 59 -33 -41 5 -16 161 -34 -90 169 -56 168 -112 -118 109 -129
6643 -129 101 58 -88 -40 -75 92 -23 -35 263 230 287 67 57 -151 109 35 -121 68 -111 68 19 -114 110
6666 110 -211 163 180 51 72 -265 -55 297 231 46 -67 -264 10 81 87 -79 -146 -67 291 15 30 -348 259
6689 259 -188 248 -176 -259 -70 223 -14 -191 -176 197 -76 112 72 82 145 113 185 75 176 42 170 -263
6711 -263 77 -176 49 33 100 -9 176 184 -80 -166 156 206 -181 -77 -96 -197 193 150 46 4 42 15 -53 -127
6735 -127 -170 86 -122 -251 -199 -217 -171 -86 -167 259 241 68 -47 -68 223 -221 2 -85 84 260 187 -248 0
6758 0 108 333 3 221 -276 -216 -209 137 -50 -84 -177 125 164 -190 58 -87 -246 147 146 77 -65 147 124 144
$$ packed form
6596f9J34K2K11k52l25n0K44J32m7j33J29J73k23J40N2k51o6l4K85n1j83J76J55
6619A69l77K14J33j49k4L06j38Q9j89K5r2qM6k1J77j95n6K59k25K24k80oK27k38
6643a29K30m3j46M8l5J67j15j2K98l3N7k20j0k08K60p4j56J89j79J79m9j33K24
6666A10l21L74J7j29K1l37K10L52o6j85j13j97K74P1Oj66o7P9L58k76J5l78O07
6689B59m47M36m24q3J89K93k37j77J5L73k73J88m0J0O3l2P2j10J01j34J28m33
6711b63L40k53K25j6O7j09J85Qk64q6L22N0l87J04j9j01L90m3j04m2L8k7o8p4
6735a27m3K56k08j29N2j8M6Q5q1M26j8j73j15k1K91m44K23q7J69J76p3m35K48
6758@J08K25l30K18m97O0PL46j87l4r3L02L9l54K48j45j59L93jo9j42K12k3K0
$$ plain form
6782 144 18 -101 -227 56 -57 -67 -90 -218 -4 247 295 -99 -88 -83 -134 -49 -50 -61 38 -157 115 59 70 -120 10
6807 10 -217 63 205 65 105 -59 -60 122 -215 -71 18 -15 -196 -41 -308 -192 -48 31 -12 -36 421 -161 135
6830 135 44 -231 110 152 129 12 -65 103 207 3 110 81 -144 -70 14 322 -62 -25 45 294 121 -16 1
6853 1 66 -40 -43 -131 -218 84 -167 71 55 -51 168 1 -66 -65 -169 -109 27 18 -4 136 -111 2 46 235 210 346
6879 346 -81 -163 -85 107 127 -343 240 20 -121 281 18 -230 220 226 222 34 -135 56 257 -115 79 118 -101
6902 -101 -247 220 -161 100 -162 -4 253 336 57 27 258 -39 253 42 -268 -91 -52 206 -73 -42 87
6923 87 -272 -99 332 175 -51 19 193 37 -131 -91 5 -118 83 -40 38 95 69 54 307 -32 -218 -29 85
6946 85 -155 -54 155 -137 -44 58 164 -284 -133 -140 149 106 391 89 273 -209 3 180 -79 1 6 148 -21
$$ packed form
6782A44j26j19j26K83j13j0k3j28K14K51M8l94J1Nn1Q5jj1R9j95K72n6J1j90J30
6807A0k27K80J42j40M0j64jJ82l37J44Q9l3j81J55k67J16J44P9m3k4M57n82K96
6830A35r1k75L41M2k3j17p7J68J04k04J07k9k25P4Q4L08l84L7P0K49j73j37J7
6853AO5j06lq8q7L02k51K38j6j06K19j67o7Jj04O0J36rk2J40k47J13M4J89k5J36
6879C46m27q2P8J92K0m70N83k20j41M02k63k48M50Omj88j69J91K01l72J94L9k19
6902a01j46M67l81K61k62J58K57Q3k79l0K31k97K92k11l10J77L9K58k79L1J29
6923H7l59J73M31j57k26P0J74j56j68M0R6j23K01j23P8N7k6j5K53l39j86J89J14
6946H5k40J01K09k92R3J02J06m48J51pK89m3K85l02J84m82K12J77k59Q0NJ42j69
$$ plain form
6969 -21 21 -119 -74 210 0 -81 285 125 -186 -71 265 319 -126 -236 -32 -97 96 193 -87 3 -298 -140 40
6992 40 118 206 -18 103 -220 78 -18 -20 -47 107 -232 68 100 59 -27 -265 55 -104 238 -160 -175 -45 97 -170
7016 -170 147 403 -168 -79 -114 -188 172 -163 -243 -6 -44 171 -179 -153 66 61 -112 258 216 7 228 -6 -180
7039 -180 -91 -17 163 -260 40 -165 -140 130 -56 16 -110 117 6 15 -94 -111 160 -138 74 46 -13 -56 -38 -173
7063 -173 -171 275 121 -193 -127 -135 179 -143 37 -236 -361 -15 -43 -206 20 88 351 96 180 7 -212 38 265
7086 265 243 -97 202 -112 -33 -70 15 -47 -18 220 129 126 -205 7 19 -26 -101 195 -86 -34 -68 152 -67 -45 112
7111 112 -66 173 245 159 22 -41 216 211 66 -497 -214 -21 142 40 59 157 -56 -220 -115 -63 -206 -22 11
7134 11 166 -190 44 -135 -37 92 220 -10 -500 40 204 3 97 266 -49 203 81 123 22 -117 133
$$ packed form
6969b1M2j40M5K84k10q1L66j60l11J15L36N4m45j10K04o5J93R7k80R0l01J58J80
6992D0P8Q8k24J21l23K98r6kk7J54l39L00L2m1q6k38L20j59L42l98j5J30J42k67
7016a70L17K56n71Q9l5p4L60l35q0K37l8K15l50K6K19nj73L70m2k09K21k34j74
7039a80Q9P4J80m23L00k05K5K70j86P2j26K27j11Rj09j7K71k98K12k8n9m3J8j35
7063a73KM46j54l14O6qL14l22J80k73j25L46k8j63K26O8K63k55Q4j73k19K50K27
7086B65k2l40K99l14P9l7Q5o2K9K38r1ll31K12J2m5p5K96k81N2l4K20k19K2J57
7111A12j78K39P2q6j37o3K57nj45n63K83J93J63j02J9R8k13j64J05N2j43J84L3
7134A1J55l56K34j79R8J29J28k30m90N40J64k01R4J69l15K52j22M2j01j39K50
$$ plain form
7155 133 312 50 -124 -49 105 39 56 -70 127 35 479 287 -28 11 -88 141 164 -20 -109 -85 36 217 -46
7178 -46 -111 -5 -70 267 157 -159 -99 425 75 -40 41 -400 -107 135 -39 163 -129 79 -18 71 -115 43
7200 43 84 -28 79 82 147 -61 47 69 227 -263 133 -74 -41 62 -122 91 10 -146 58 3 -352 -139 252
7223 252 137 92 -199 59 -8 279 -94 13 -84 -185 -117 -18 47 -228 28 -404 -28 114 -31 3 73 53 150
7246 150 20 -371 -34 34 102 56 -139 -211 -66 363 36 22 -141 203 227 -18 29 -82 -3 -15 152 216 206 37
7270 37 115 -168 212 -169 -52 244 32 97 -63 301 -45 -7 172 -24 185 247 -77 -78 -78 -13 73 -352 -230 2
7294 2 -35 -287 -26 50 -67 -120 -140 -171 -161 -44 149 39 -235 44 18 -29 39 -79 22 53 -149 -123 -165 -116 -438
7319 -438 -167 -46 306 -207 204 -144 117 -121 -128 0 -83 106 25 -206 -102 200 189 142 -212 15 -112 139
$$ packed form
7155A33J79k62j74P5J54o6J7j26J97r2M44j92l15L9r9K29K3j84q9K4J21J81k63
7178d6o5J06o5L37j10l16O0N24l50j15Q1m41K93K42j74K02k92K08r7Q9j86J58
7200D3M1j12J07LO5k08J08K2J58m90L96k07L3J03j84K13q1j56K04n5l55K13L91
7223B52j15m5k91K58o7K87l73J07r7j01O8R9O5k75K56m32L76J42j45L4P0k0R7
7246A50j30l91L37O8O8m6j95p2J45M29l27j4j63L44K4k45M7j11P9j2J67O4j0j69
7270C7P8k83L80l81J17K96k12O5j60L64l46L8J79j96K09O2l24j%O5Q6m25J22K32
7294Bl7k52K61P6j17n3k0l1J0J17J93j10k74K79k6m7O8j18J01L1k02K6m2M9l22
7319d38K71J21L52n13M11l48K61k38pJ28q3J89q1k31J04L02j1m7l54K27j27K51
$$ plain form
7341 139 28 -43 150 36 -78 -181 151 161 -191 110 239 28 53 -88 -142 71 -14 149 35 7 -146 135
7363 135 -257 -31 11 4 -31 139 -31 -128 45 -188 213 1 -124 115 179 168 131 150 -13 -87 -106 -132 92 155
7387 155 -18 -223 174 -183 92 110 308 -23 -60 93 -28 22 100 18 1 -65 -260 -137 -238 38 -25 -82 -68
7410 -68 -5 127 336 351 -198 -160 -1 -81 348 80 -78 253 472 78 -204 -168 -138 248 260 42 -66 -15 -80
7433 -80 101 -225 -24 -49 38 8 -37 -42 -150 27 3 -10 91 27 -49 293 6 -25 -102 101 -76 -12 143 230 141
7458 141 -48 90 -25 -157 -22 -225 -10 232 113 239 134 -112 5 38 28 -252 18 41 -190 -209 -44
7479 -44 -134 71 -72 69 -188 -93 175 -59 -188 -24 -80 110 10 78 -218 -273 446 22 132 -98 56 -85
7501 -85 -223 37 40 171 216 244 -113 -53 100 99 -162 126 -207 8 -109 -348 39 -34 163 6 82 -90 -16 208
$$ packed form
7341A39j11p1J93j14j14j03L32J0l52L01J29k11K5j41n4K13q5J63j14k8j53K81
7363A35l92K26M2pl5J70j70r7J73k33M01k12j25K39O4j1l7J9j63p4j9k6K24O3
7387A55j73k05L97l57K75J8J98l31l7J53j21N0P8q2j7o6j95J23j01K76o3n7J4
7410f8O3J32K09J5n49L8J59q0M29k68j58L31K19l94k82L6L0L86J2k18j08N1o5
7433h0J81l26K01k5Q7l0m5nj08J77k4j3J01o4p6L42k87l1p7K03j77O4J55Q7q9
7458A41j89J38j15j32J35k03K15K42j19J26j05k46J17L3j0k80K70K3k31j9J65
7479d4r0K05j43J41k57R5K68k34j29J64n6J90j00O8k96n5P19m24J10k30J54j41
7501h5j38K60LJ31M5K8l57O0J53jk61K88l33K15j17k39L87p3J97j57P6j72P4K24
$$ plain form
7525 208 -112 -290 -20 -79 -97 26 -52 -271 127 -86 188 58 262 18 -24 -304 -163 -65 -257 69 145 -233
7547 -233 91 -20 21 4 77 -278 -80 -18 -76 388 89 -36 68 -121 -65 130 -104 -7 170 127 -130 -174 -24
7570 -24 -32 -61 -14 58 25 100 287 191 -188 -185 178 -55 21 155 34 197 398 -199 62 -248 136 76 483 -223
7594 -223 -24 95 96 363 98 -86 -267 -149 -72 91 -84 154 31 88 -26 151 -104 132 -69 -172 365
7615 365 91 -60 202 158 -61 -73 -61 -114 78 160 22 -111 14 -1 226 -75 -45 -227 9 255 233 34 72
7638 72 -187 -116 -91 -59 20 136 -16 147 189 87 -32 -285 -235 -180 -153 -123 94 -58 211 52 32 -88 -112 84
7662 84 6 302 -49 -60 95 -335 184 -90 -339 -280 66 7 6 219 -47 184 86 258 -42 179 66 79 28
7685 28 339 -185 -203 39 -239 212 -47 -312 280 313 80 224 -139 -175 112 136 -33 250 -56 300 -110 42
$$ packed form
7525B08l20j78K70n9j8J23p8k19L98k13K74j30K04k44m2k80J41R8j92L26P6l78
7547b33L24j11M1j7P3l55J98O2n8M64k99j25J04j89N6J95k34R7J77m3k57m4J50
7570b4qk9M7P2l3P5J87r6l79LL63k33P6J34j21J63K01n97K61l10L84o0M07p06
7594b23J99J19JK67k65j84j81J18P7J63j75K38j23N7j14J77k55K36k01j03N37
7615C65k74j51K62m4k19j2J2n3J92Q2j38j33J25j5K27l01L0j82K36K46k2j99L8
7638G2k59P1K5L2P9J16j52J63M2j02j19k53N0N5K7L0K17j52K69j59k0j20k4J96
7662H4p8K96l51j1J55m30N19k74k49N9L46n9jK13k66K31r8J72l00K21j13J3n1
7685B8L11n24j8K42k78M51k59k65N92L3k33J44l63l6K87K4j69K83l06L56m10J52
$$ plain form
7707 42 -12 -62 -22 63 -179 69 -91 171 57 186 117 0 -201 -91 -173 90 -278 25 185 48 -97 67
7729 67 -61 -170 239 -110 -86 -209 1 25 277 6 -305 10 121 120 -82 118 -210 37 -51 -134 -199 -56 168
7752 168 194 14 60 188 42 111 226 105 -104 -265 -21 -78 38 164 -33 404 -143 -69 234 -53 209 28
7774 28 33 -158 -119 -9 -36 -94 45 -41 196 197 161 29 69 123 -65 -1 10 -48 250 -211 -123 3 170 107 11 193
7800 193 -142 82 105 192 344 -39 174 -100 54 -64 100 39 -91 227 128 -16 79 -95 209 136 -94 52
7822 52 -174 179 191 -286 -112 96 50 209 -123 -265 135 209 105 -332 -115 73 -93 180 130 62 -25 117
7844 117 33 -125 200 -121 53 204 -113 12 -2 -356 -208 166 -133 -140 270 399 317 -29 -22 80 60 118 4
7867 4 -105 -157 305 -104 -114 -41 -59 29 -148 90 24 42 204 -204 91 238 150 -57 -39 -244 -72 -154 53 148
$$ packed form
7707D2n4n0M0Q5k42K48j60K62j14J29o9j17k01J10q2K63l68L03J60j37j45J64
7729F7j28j09M09l49K4j23K10K4K52k71l11L15J11jk02K00l28K47q8q3o5J43K24
7752A68K6j80M6J28j46O9J15j21k09j61K44n7J16J26j97M37n47P4L03k87K62j81
7774B8Nj91L9J10k7n8J39q6K37Jl6j32M0N4j88O4J1n8K98m61Q8J26J67o3r6J82
7800A93l35K24K3Q7J52l83K13k74J54j18J64o1j30L18r9j44R5j74L04p3k30J46
7822E2k26L53J2m77J74K08m6J59l32j42M00P4j04m37K17J88j66K73n0o8q7J42
7844A17q4j58L25l21J74J51l17J25j4l54J48L74k99pM10J29q2l46PJ02k0N8j14
7867Dj09n2M62m09j0P3j8Q8j77K38o6J8J62m08K95J47q8k07J8k05J72q2K07R5
$$ plain form
7891 148 102 -293 80 -144 -182 -20 55 255 94 -106 138 103 2 -109 -230 -59 115 14 224 52 -10 -55
7913 -55 108 174 -226 -139 -46 161 8 113 -193 -29 127 117 86 82 -39 102 217 186 138 39 -262 72 -19 -5
7937 -5 13 -75 260 18 81 -81 1 108 136 28 -166 -112 -49 189 -127 -231 127 2 77 288 -9 55 238 58
7961 58 -166 -105 -241 -21 -75 -21 93 29 200 -197 200 -95 -78 30 -15 23 162 -90 -54 115 -43 45 46 84
7985 84 -317 -109 236 -50 -42 -87 -66 91 -80 -33 75 103 365 -189 -118 -40 74 246 -210 277 172 -142 -65
8008 -65 362 -92 -205 -160 -124 -241 44 96 -95 129 41 76 149 5 -221 -202 -140 -145 453 -18 158 125 54 -129
8032 -129 116 -161 -363 -8 29 104 78 -16 15 99 -126 -136 79 37 -290 36 -93 -22 -265 -32 63 -102 -2
8055 -2 -6 112 -42 -21 66 -233 -35 83 -133 -76 -71 10 18 -119 182 -41 138 235 92 100 115 15 -160 -16 -22 -29 -90
$$ packed form
7891A48m6l95L73k24l8J62P5K00j61k00K44l5j01j11j21J71J74j01K10j72o2m5
7913e5J63O6m00Q7R3K07j53J05l06J64J56j0l1mj21J41J15l1m8r9l01L34r1J4
7937eJ8q8L35k42O3j62Q2J07K8j08j94N4O3K38l16j04L58j25P5K11k97O4J83j80
7961E8k24O1j36K20n4N4J14o4J71l97L97k95J7J08m5L8J39k52L6J69j58Q8JL8
7985H4m01K08L45k86Qm5K1J57j71M7J08K8K62n54P1P8J14J72m56M87j05l14P7
8008f5M27m54j13M5L6j17K85N2j91K24q8L5P3j44k26J9O2nN98m71J76l3p1j83
8032a29K45k77k02L55L7P5k6r4L1Q4k25j0K15m2l27L26j29P1k43K33R5j65J00
8055bmJ18j54K1Q7k99J98J18k16N7NQ1Qj37L01k23J79R7j43QJ5j00j75J44opo1
$$ plain form
8082 -90 -373 -118 248 285 41 172 9 -109 -14 -148 -304 171 -72 64 3 233 -16 -214 -20 -340 -68
8103 -68 162 228 134 -225 -22 -32 -37 -146 -55 -3 -27 14 -20 -215 -82 -226 -181 -178 -103 454 358 203 -182 69 78 -85
8129 -85 -21 -29 1 -45 127 41 148 67 -196 67 164 117 17 20 152 292 72 -76 14 75 -169 -230 -122 -240 178
8154 178 184 -90 -1 -180 -95 -17 -111 -285 -132 187 74 256 302 162 -102 70 -101 -143 -69 149 -84 -32 -55 -62
8178 -62 -1 -44 14 21 68 -59 53 207 306 62 -115 -136 234
$$ packed form
8082i0k83K55L66L7k44J31j63j18R5j34j56M75k43J36o1K30k49j98J94l20K72
8103f8K30O6r4l59K03j0nj09R1N2k4M1l4j95J33j44M5LP5N57r6j55l85K51Rj63
8129h5O4qL0m6J72q6J07q1k63K63R7m7j00LJ32J40k20j48R0O1k44o1J08j18M18
8154A78Ok74Q9j79Q5P8r4j74J53L19j13J82M6j40k64J72j71m2P4K18k33N2k3p
8178f2O1m3N8PM7j27J12J54R9k44j77k1L70
8191B34
$$ Imaginary data points
##PAGE= N=2
##DATA TABLE= (X++(I..I)), XYDATA
$$ plain form
0 0 0 0 0 0 0 0 0 0 0 0 8 -8 8 -8 14 -16 18 -24 32 -34 41 -49 59 -72 82 -97 113 -130 150 -172 196 -225 256
33 256 -289 326 -369 414 -462 518 -578 643 -715 792 -878 970 -1072 1183 -1304 1439 -1584
50 -1584 1745 -1922 2119 -2338 2586 -2863 3177 -3541 3961 -4460 5057 -5791 6718 -7930 9593
65 9593 -12022 15931 -23266 41900 -199512 -269352 144421 246078 145063 -56067 -51840 62881
77 62881 157781 68590 -70613 -132718 -46382 36552 22411 -81610 -102834 5117 133392
88 133392 103704 -44824 -140028 -56772 102563 158953 41206 -99545 -90987 60111 154611
99 154611 61061 -138944 -222132 -92416 113298 171864 43812 -99550 -91067 39260 123522
110 123522 59926 -61933 -78794 32059 114588 41668 -117657 -176725 -57242 114088 148387
$$ packed form
0@%%%%%%%%%%Qj6J6j6K2l0L4m2N6o6P5r0J08j31J54j79K10k43K80l22L68m21M81
33B56n45O15o95P83q76R80j096J221j358J507j670J848k042K255k487K743l023
50a584L329l667M041m457M924n449O040o718P502q421R517j0848J2509j4648J7523
65I593k1615K7953l9197O5166k41412o9840M13773J01657j01015k01130M227J14721
77F2881R4900q9191j39203o2105Q6336Q2934j4141j04021k1224J07951J28275
88A33392k9688j48528r5204Q3256J59335N6390j17747j40751Q558J51098R4500
99A54611r3550k00005q3188J29716K05714N8566j28052j43362Q483J30327Q4262
110A23522o3596j21859j6861J10853Q2529p2920j59325n9068J19483J71330L4299
$$ plain form
121 148387 18160 -113055 -95506 31431 107421 49271 -55510 -64068 35971 104936 37203
132 37203 -91909 -120157 -7761 108994 76161 -86099 -189959 -98958 101992 206000 119346
143 119346 -43623 -102565 -15586 82433 48726 -87559 -164864 -88279 62373 129422 58937
154 58937 -44328 -50531 28193 69946 13298 -63094 -53614 34811 87534 24743 -85905 -103806
166 -103806 8132 124529 103324 -46996 -161994 -104453 73134 176131 97739 -60591
176 -60591 -123209 -43011 64742 69237 -22375 -81348 -29296 64370 77200 -10837 -94766 -70807
188 -70807 36213 97472 39322 -59161 -72576 11678 83242 48568 -55339 -100504 -27867 76957
200 76957 85514 -10152 -92047 -62204 44231 98713 32282 -75818 -93466 33 91902 76496
$$ packed form
121A48387j30227j31215J7549J26937P5990n8150j04781q558J00039O8965o7733
132C7203j29112k8248J12396J16755l2833j62260j03860R1001K00950J04008q6654
143A19346j62969n8942Q6979R8019l3707j36285p7305P6585J50652O7049p0485
154E8937j03265o203P8724M1753n6648p6392R480Q8425N2723o2791j10648j7901
166a03806J11938J16397k1205j50320j14998N7541J77587J02997p8392j58330
176f0591o2618Q0198J07753M495r1612n8973N2052R3666J2830q8037q3929K3959
188g0807J07020O1259n8150r8483j3415Q4254P1564l4674j03907m5165P2637J04824
200G6957Q557r5666q1895K9843J06435N4482o6431j08100j7648R3499R1869j5406
$$ plain form
212 76496 -23421 -85468 -35724 60083 75513 -15401 -102132 -76916 36864 114494 72416 -34871
224 -34871 -83563 -31511 39753 39679 -20888 -55263 -12754 56380 58915 -15883 -74599 -37091 56281
237 56281 91750 18942 -82925 -93488 3401 93226 69082 -38148 -102925 -52011 55153
248 55153 98919 36375 -50588 -57713 12609 65002 30482 -51564 -83875 -29705 44231 50956
260 50956 -4103 -38572 -4301 52274 50886 -17703 -75239 -46177 41783 86338 33129 -57657
272 -57657 -84633 -20107 56790 52915 -24434 -76110 -34450 53420 86970 32286 -43120 -50746
284 -50746 10093 52754 17541 -54266 -73249 -14248 56477 57260 -9908 -60199 -32301 37213
296 37213 63291 17133 -40991 -38258 22190 61597 24011 -48980 -72025 -21532 39579 39635 -16228
$$ packed form
212G6496r9917o2047M9744R5807J5430r0914q6731K5216J13780P7630m2078j07287
224c4871m8692N2052P1264p4o0567l4375M2509O9134K535p4798n8716L7508R3372
237E6281L5469p2808j01867j0563R6889Q9825k4144j07230o4777N0914J07164
248E5153M3766o2544q6963p125P0322N2393l4520q2046l2311N4170P3936O725
260E0956n5059l4469L4271N6575j388o8589n7536K9062Q7960M4555n3209r0786
272e7657k6976O4526P6897l875p7349n1676M1660Q7870L3550n4684p5406p626
284e0746O0839M2661l5213p1807j8983N9001P0725P83o7168n0291K7898O9514
296C7213K6078m6158n8124K733O0448L9407l7586p2991k3045N0493O1111N6n5863
$$ plain form
309 -16228 -52943 -17539 50773 68044 13345 -49623 -46864 17811 65998 36137 -40050 -74791
321 -74791 -32043 31648 41695 -9371 -52362 -29447 37383 70303 35009 -21098 -33614 2283
333 2283 31109 7740 -44140 -57685 -8947 46620 44643 -11218 -53137 -28540 34649 59980
345 59980 16059 -40925 -40263 16708 60797 36698 -31860 -69367 -36791 21714 37668 637
357 637 -35138 -20861 29305 54542 20202 -32699 -40860 2970 41865 28442 -20677 -45003 -14612
370 -14612 30262 29821 -17477 -53966 -33725 24082 57241 32045 -17093 -28174 8496 41099
382 41099 22824 -30726 -59215 -29281 25146 40859 3859 -35359 -26277 18554 43571 18446
394 18446 -26292 -34243 5774 44657 32957 -15746 -46649 -27304 15986 28504 -4508 -38081
$$ packed form
309a6228l6715L5404O8312J7271n4699o2968K759O4675M8187k9861p6187l4741
321g4791M2748O3691J0047n1066m2991K2915O6830L2920l5294n6107j2516L5897
333B283K8826k3369n1880j3545M8738N5567j977n5861m1919K4597O3189K5331
345E9980m3921n6984O62N6971M4089k4099o8558l7507L2576N8505J5954l7031
357F37l5775J4277N0166K5237l4340n2901q161M3830L8895j3423m9119k4326L0391
370a4612M4874m41m7298l6489K0241N7807L3159k5196m9138j1081L6670L2603
382D1099j8275n3550k8489K9934N4427J5713l7000l9218R082M4831K5017k5125
394A8446m4738p951M0017L8883j1700m8703l0903J9345M3290J2518l3012l3573
$$ plain form
406 -38081 -24657 22556 49393 24294 -22071 -35039 -1162 35365 26863 -16020 -41402 -20046
418 -20046 21724 33379 -368 -38813 -33374 11101 42528 27145 -12298 -27677 -1045 30488
430 30488 22744 -18002 -43228 -22214 20668 37264 10203 -26341 -28466 5796 30162 13261
442 13261 -23343 -32652 456 40140 39983 -1280 -35254 -25706 8035 20826 -3347 -33285 -28411
455 -28411 12413 44580 32110 -8420 -29319 -11610 18790 20380 -10714 -34231 -17224 21551
467 21551 36330 9146 -27151 -31060 567 28965 19706 -14298 -27948 -3952 28858 30124 -4617
480 -4617 -35834 -27416 9941 31170 13739 -18143 -24493 1153 27002 18814 -14435 -31731 -11025
493 -11025 22655 29643 3017 -23546 -18340 10517 24011 3004 -26190 -27209 3887 33603 27464
$$ packed form
406c8081J3424M7213K6837k5099m6365j2968L3877L6527q502m2883k5382K1356
418b0046M1770J1655l3747l8445N439M4475L1427j5383l9443j5379K6632L1533
430C0488p744m0746k5226K1014M2882J6596k7061l6544k125L4262K4366j6901
442A3261l6604r309L3108L9684j57m1263l3974R548L3741J2791k4173k9938M874
455b8411M0824L2167j2470m0530k0899J7709L0400J590l1094k3517J7007L8775
467B1551J4779k7184l6297l909L1627K8398r259l4004j3650K3996L2810J266l4741
480d617l1217Q418L7357K1229j7431l1882o350K5646K5849q188l3249j7296K0706
493a1025L3680O988k6626k6563N206K8857J3494k1007k9194j019L1096K9716o139
$$ plain form
506 27464 -7378 -30058 -14680 16472 23015 -3732 -29799 -20752 14759 36216 18110 -17648
518 -17648 -29370 -6818 19450 18382 -8482 -25818 -10158 21007 28753 2927 -25193 -23707 4455
531 4455 23885 11848 -14759 -20204 2865 25462 17590 -12524 -31213 -14950 17952 28935 5001
544 5001 -22694 -20651 7021 26325 11660 -19800 -29558 -4461 26289 28159 987 -22202 -17462
557 -17462 6515 17019 -914 -23002 -18616 10653 31666 20656 -9161 -22693 -6703 14133
569 14133 10411 -14336 -27301 -9120 23404 34997 11047 -21262 -26168 -1955 18315 9757 -15948
582 -15948 -24907 -1710 27760 29840 2023 -22992 -19104 3574 15574 1349 -20466 -20102 6371
595 6371 28287 20500 -7656 -21996 -7714 15996 17927 -5254 -24637 -16175 9799 21986 7264
$$ packed form
506B7464l4842k2680J5378L1152O543k6747k6067R047L5511K1457j8106l5758
518a7648j1722K2552K6268j068k6864j7336J5660L1165P746k5826k8120J486K8162
531D455J9430j2037k6607n445K3069K2597p872l0114j8689J6263L2902J0983k3934
544E001k7695K043K7672J9304j4665l1460r758K5097L0750J870k7172k3189M740
557a7462K3977J0504j7933k2088M386K9269K1013j1010k9817j3532J5990K0836
569A4133l722k4747j2965J8181L2524J1593k3950l2309m906K4213K0270q558k5705
582a5948q959K3197K9470K080k7817k5015L888K2678J2000j4225k1815L64K6473
595F371K1916p787k8156j4340J4282K3710J931k3181j9383Q462K5974J2187j4722
$$ plain form
608 7264 -16084 -18114 5472 25718 16275 -12219 -26244 -10209 15785 19433 -2893 -22654 -13154
621 -13154 15630 29542 11662 -18748 -28996 -8677 16389 16807 -4010 -16187 -2312 20193
633 20193 22834 -268 -23972 -22060 500 13837 4092 -12427 -10374 13224 31085 19432 -13485
646 -13485 -32903 -19223 7998 17647 891 -17603 -11117 15846 31534 15911 -14117 -27420
658 -27420 -13164 8390 11661 -4699 -15016 -1962 19533 22088 265 -21912 -19377 4034 19212
671 19212 7609 -15297 -19221 1738 23663 20438 -4987 -24029 -14730 9904 18849 2451 -17412
684 -17412 -16189 5939 22354 12512 -9569 -16401 639 18719 13378 -10954 -26612 -14777 11897
697 11897 22606 6370 -14023 -13677 7975 23280 12642 -13561 -25847 -11084 10886 15443 1241
$$ packed form
608G264k3348k030K3586K0246r443k8494j4025J6035K5994L648k2326j9761R500
621a3154K8784J3912j7880l0410j0248K0319K5066M18k0817j2177J3875K2505
633B0193K641k3102k3704J912K2560J3337r745j6519K053K3598J7861j1653l2917
646a3485j9418J3680K7221R649j6756j8494O486K6963J5688j5623l0028j3303
658b7420J4256K1554L271j6360j0317J3054K1495K555k1823k2177K535K3411J5178
671A9212j1603k2906l924K0959K1925l225k5425j9042R299K4634Q945j6398j9863
684a7412J223K2128J6415r842k2081o832J7040J8080n341k4332j5658J1835K6674
697A1897J0709j6236k0393L46K1652J5305j0638k6203j2286J4763K1970M557j4202
$$ plain form
710 1241 -11004 -4162 12897 15600 -3670 -23745 -19967 4445 22209 14381 -7335 -15512 751
723 751 19935 15787 -10046 -29311 -20855 6465 23083 13625 -6743 -10907 3679 15590 7316
736 7316 -12673 -20236 -5147 14133 13857 -3931 -16619 -6438 14470 19700 1105 -21001 -20019
749 -20019 3604 22996 16377 -7222 -20844 -9087 12248 17418 1177 -14131 -9894 7068 14994
762 14994 2912 -14409 -14483 3676 17099 9815 -9400 -15649 -596 18758 17341 -5547 -24620
775 -24620 -17847 7000 21413 11851 -9544 -16145 -1489 13671 10428 -7401 -16396 -5472 11600
788 11600 13825 -1192 -14267 -8047 9609 15414 101 -19100 -18017 3935 23125 17768 -5664
801 -5664 -20208 -10750 9243 15330 1175 -14871 -12384 5389 16728 8236 -8314 -12419 -31
$$ packed form
710A241j2245O842J7059K703j9270k0075L778K4412J7764p828k1716q177J6263
723G51J9184m148k5833j9265Q456K7320J6618r458k0368m164J4586J1911q274
736G316j9989p563J5089J9280k76j7788j2688J0181K0908N230j8595k2106R82
749b0019K3623J9392o619k3599j3622J1757K1335N170j6241j5308M237J6962P926
762A4994j2082j7321p4J8159J3423p284j9215o249J5053J9354j417k2888j9073
775b4620O773K4847J4413r562k1395o601J4656J5160l243j7829q995J0924J7072
788A1600K225j5017j3075O220J7656N805j5313j9201J083K1952J9190n357k3432
801e664j4544R458J9993O087j4155j6046K487J7773J1339q492j6550m105J2388
$$ plain form
814 -31 12227 7201 -9112 -15954 -2034 16323 16688 -2221 -19746 -15627 5879 19818 11155 -8191
828 -8191 -15166 -2498 12808 11599 -4922 -17366 -9977 7450 12976 2315 -9299 -5334 9327
841 9327 14827 1251 -17167 -17448 1092 18303 14873 -5236 -18711 -9731 10382 17214 2774
854 2774 -14501 -15505 1551 15575 11273 -4545 -11313 -2006 8702 6506 -7037 -13343 -3414 12214
868 12214 14038 -1794 -16298 -12245 5997 18136 9273 -9606 -16050 -2308 15337 15155 -2564
881 -2564 -17038 -13492 2995 12312 4657 -7458 -7158 4761 12937 5554 -8709 -12442 -133 14136
895 14136 11335 -4811 -16527 -9730 7075 13234 1443 -14649 -13733 3847 18016 13808 -2140
908 -2140 -10843 -4207 7424 6900 -6214 -14839 -7603 7831 13398 2768 -11335 -10737 4367 15743
$$ packed form
814c1J2258n026j6313o842J3920J8357L65j8909j7525M119K1506J3939q663j9346
828h191o975J2668J5306j209j6521j2444P389J7427N526j0661j1614L965J4661
841I327N500j3576j8418k81J8540J7211l430k0109j3475Q980K0113O832j4440
854B774j7275j004J7056J4024m302j5818o768R307J0708k196j3543o306R929J5628
868A2214J824j5832j4504M053J8242J2139q863j8879o444J3742J7645j82j7719
881b564j4474L546J6487R317p655j2115L00J1919Q176p383j4263l733J2309J4269
895A4136k801j6146j1716O797J6805O159j1791j6092R16J7580J4169m208j5948
908b140q703O636J1631n24j3114q625P236J5434N567j0630j4103N98J5104J1376
$$ plain form
922 15743 9099 -7010 -13967 -3263 12322 14134 -1041 -15411 -13738 -76 9552 5021 -5134
935 -5134 -6191 4473 12938 7334 -6474 -12018 -2701 9273 9380 -3881 -13982 -7387 8478 13878
949 13878 2687 -13455 -15494 -790 15109 14397 -179 -10372 -4820 7064 9899 -969 -12283
962 -12283 -10485 1951 9248 3233 -6855 -7362 3372 12019 7388 -6304 -11751 -2089 11456 12607
976 12607 -442 -13788 -12444 1520 10850 5103 -7248 -10079 19 11746 9989 -2253 -10523
989 -10523 -4839 6945 10020 264 -9723 -7964 3605 10235 2821 -10160 -12901 -1634 10980 11975
1003 11975 992 -7915 -3493 7515 9280 -1437 -12346 -11025 1289 10401 6304 -4572 -7677
1016 -7677 396 8906 5968 -5610 -12548 -4793 9935 14455 4147 -9676 -10159 334 8248 4348
$$ packed form
922A5743o644j6109o957J0704J5585J812j5175j4370J673J3662R628m531j0155
935e134j057J0664Q465n604j3808n544R317J1974J07j3261j0101O595J5865N400
949A3878j1191j6142k039J4704J5899p12j4576j0193N552J1884K835j0868j1314
962a2283J798J2436P297o015j0088n07J0734Q647m631j3692n447R662J3545J151
976A2607j3049j3346J344J3964R330n747j2351k831J0098J1727j757j2242q270
989a0523N684J1784L075r756r987J759J1569O630p414j2981k741J1267J2614R95
1003A1975j0983q907M422J1008J765j0717j0909J321J2314R112m097j0876l105
1016g677Q073Q510k938j1578o938P755J4728M520j0308j3823m83J0493P914l900
$$ plain form
1030 4348 -7397 -11644 -3101 8913 10810 2215 -5666 -3880 4237 6905 -1064 -9735 -7725 3199
1044 3199 9967 4703 -7051 -11186 -2595 9011 9276 -848 -8965 -5238 5993 10783 2379 -9222
1058 -9222 -10898 -577 8993 6958 -2784 -8378 -3094 6446 6941 -1660 -8283 -4446 5701 9872 3096
1073 3096 -7199 -7920 1144 8358 4001 -6833 -11512 -3548 8355 11314 2286 -6716 -5854 2393 6729
1088 6729 856 -7881 -7949 2009 10524 7431 -3270 -9424 -4480 5191 7719 424 -7151 -5609 4075
1103 4075 9084 3523 -6130 -9154 -1378 7128 5971 -2822 -7629 -2422 6544 8526 83 -8484 -7504
1118 -7504 1227 7494 3706 -4485 -6365 747 7984 5472 -4491 -10627 -5011 6190 10444 3828 -5612
1133 -5612 -6656 594 5458 1574 -6454 -7837 -113 8752 8403 -192 -6511 -3168 4651 6378 -470
$$ packed form
1030D348j1745m247Q543J2014J897q595p881J786Q117K668p969q671K010J0924
1044C199O768n264j1754m135Q591J1606K65j0124q117L727J1231M790q404j1601
1058i222j676J0321R570k035r742n594N284R540M95q601o623L837J0147M171o776
1073C096j0295p21R064P214m357j0834m679P964J1903K959r028r002Q62Q247M336
1088F729n873q737o8R958Q515l093j0701o154M944R671K528p295p575J542R684
1103D075N009n561r653l024P776Q506j157q793m807N207Q966J982q443q567R80
1118g504Q731O267l788q191j880P112P237k512r963o136N616J1201M254o616r440
1133e612j044P250M864l884q028j383P724Q865l49q595o319L343P819J727o848
$$ plain form
1148 -470 -8756 -8135 924 8230 5391 -3290 -6511 -831 6118 5654 -2623 -8167 -3813 5874 9240 2851
1164 2851 -6032 -7554 -705 5661 3785 -3990 -6989 -981 5967 6172 -1301 -6937 -3267 5855 9432
1179 9432 2461 -6951 -8437 -1330 5106 3484 -4383 -7456 -1131 7795 8898 1326 -6182 -5333 2133
1194 2133 5740 644 -6744 -6878 1129 8166 6423 -1687 -7160 -3969 2765 3395 -1704 -6010 -2446
1209 -2446 6745 11270 5033 -5630 -8933 -2952 3539 2960 -3539 -7486 -2203 6608 9017 2664 -4548
1224 -4548 -4710 1672 5645 1738 -5754 -7026 -239 6870 6140 -1447 -7125 -4314 3242 5299 -14
1239 -14 -5595 -3575 3730 8013 4258 -3989 -6925 -1178 5471 4447 -3456 -8835 -5208 3430 7172
1254 7172 2337 -3570 -3147 4034 8439 3938 -5243 -9240 -3728 3494 4752 -1084 -5188 -2602 4686
$$ packed form
1148d70q286O21R059P306k839q681l221N680O949m64q277n544M354R687L366o389
1164B851q883j522O849O366j876p775k999O008O948K05p473n636L670R122L577
1179I432o971r412j486P107O436j622p867l073O325Q926J103p572p508Q49P466
1194B133L607n096p388j34Q007P037j743q110n473L191O734O30n099m306L564
1209b446R191M525o237j0663l303N981O491n79o499l947N283Q811K409o353p212
1224d548j62O382L973l907p492j272O787P109p30p587n678K811P556K057n313
1239a4n581K020P305M283l755q247k936N747O649j024p903n379L627Q638L742
1254G172m835n907M23P181M405m501r181l997N512P222J258n836m104K586P288
$$ plain form
1269 4686 6962 1844 -5577 -6243 -36 5247 3376 -2861 -4378 1290 7323 5520 -3308 -9976 -6578
1284 -6578 1614 6312 2386 -3623 -3592 3240 8554 5150 -3744 -8234 -4118 3326 5213 -378 -5414
1299 -5414 -3598 3093 6361 2154 -4579 -5469 707 5908 3820 -2867 -5292 -845 5380 5483 -1838
1314 -1838 -7867 -5370 2691 6914 2464 -4782 -5893 425 6869 5776 -1557 -5758 -2566 4123 5172
1329 5172 -1093 -7271 -6092 1384 6152 3609 -2455 -3842 775 5804 3947 -3178 -6914 -2674 4047
1344 4047 5116 -48 -5139 -3696 3035 6648 1542 -5805 -6643 -346 6638 5968 -1557 -6142 -2675
1359 -2675 4516 5779 -297 -6786 -6244 1329 6795 3929 -2454 -5066 -753 4263 3583 -1912 -5848
1374 -5848 -2451 4159 5816 266 -4580 -4131 1990 5783 1652 -4803 -5856 506 6895 5546 -2005
$$ packed form
1269D686K276n118p421o66O207N283j871o237j517N668O033j803q828o668L398
1284f578Q192M698l926o009L1O832N314l404q894m490M116P444J887n591n036
1299e414J816O691L268m207o733q90O176N201k088o687k425M447O225J03p321
1314a838o029K497Q061M223m450p246j111O318O444j093p333m201L192O689J049
1329E172o265o178J179P476M768k543o064j387M617N029j857p125l736M240O721
1344D047J069n164n091J443O731L613n106p347q38O297O984o70p525m585L467
1359b675P191J263o076o489N42P573N466k866o383k612M313N016o80n495l936
1374e848L397O610J657n550m846M49O121L793m131o455j053O362O389j349p551
$$ plain form
1389 -2005 -7063 -3774 3446 6458 1297 -5076 -4744 1714 6426 3510 -3573 -6478 -2162 4284 4696
1404 4696 -430 -4544 -2051 3768 4980 -275 -5455 -4718 1700 5509 3041 -3094 -4708 455 5643
1419 5643 3998 -3025 -7479 -3920 4224 6950 1847 -5072 -5383 1005 6111 3649 -3002 -6266 -1393
1434 -1393 4656 5192 -311 -5423 -3815 1420 4210 1048 -3716 -3100 2330 5819 2709 -3658 -5587
1449 -5587 -716 4687 4005 -2139 -5988 -2575 4381 6538 1029 -5880 -6059 661 6388 4614 -1941
1464 -1941 -5049 -1657 4183 4068 -1589 -6125 -4080 2105 5360 2019 -3088 -3513 1015 4812 2562
1479 2562 -3587 -5000 -853 4650 4563 -878 -4988 -3069 2800 4690 235 -4856 -4375 2169 6957 4320
1495 4320 -2767 -6017 -2125 3619 4421 -705 -6158 -4197 2554 5995 2438 -3485 -5243 -592 3961
$$ packed form
1389b005n058L289P220L012n161o373L32O458M712k916p083k905M316O446M12
1404D696n126m114K493N819J212n255n180P37O418L809k468o135j614N163N188
1419E643j645p023m454L559Q144K726n103o919l11O388N106k462o651l264M873
1434a393O049N36n503n112J608N235K790l162m764O16N430L489l110o367j929
1449e587M871N403o82o144l849L413O956K157n509o909j79O720N727j774o555
1464a941l108L392N840j15n657m536K045O185L255l341n107m25M528L797k250
1479B562o149j413M147N503q7n441m110J919N869J890m455n091M81O544M788k637
1495D320p087l250L892N744Q02n126n453J961O751L441l557n923j758M651M553
$$ plain form
1510 3961 3405 -1345 -3330 -416 3756 3565 -1555 -5556 -3424 1987 4425 472 -4329 -3898 2214 6839
1526 6839 3827 -2927 -6464 -2500 4279 5552 743 -4940 -4484 699 4504 2060 -3218 -4487 -202
1541 -202 4032 3654 -577 -3555 -1261 3096 3340 -1076 -4934 -3088 2832 5046 1341 -4088 -5045 325
1557 325 5027 3549 -1356 -4041 -977 3951 4896 -169 -6024 -4827 268 4471 2207 -2578 -3885
1572 -3885 649 5110 3558 -1823 -5075 -2851 2434 4239 694 -3083 -2686 1576 3765 688 -3970
1587 -3970 -4275 -161 4241 3112 -836 -3067 -313 4176 3860 -1394 -5925 -4556 1650 5597 3013
1602 3013 -2425 -4470 -985 3959 3945 -738 -4010 -2551 1879 3887 770 -2800 -2816 748 3316 716
1618 716 -2945 -3284 486 4040 2971 -2048 -4354 -1593 3594 4532 380 -4408 -3633 1263 4735 2010
$$ packed form
1510C961n56m750j985K914M172j91n120m001K132N411K438l953m801M31O112M625
1526F839l012o754l537L964O779J273m809n683M56N183L805k444n278j269M285
1541b02M234l78m231k978K294M357K44m416l858J846N920K214l705n429r57N370
1557C25M702j478m905k685L064M928R45n065n855J197N095M203k264m785j307
1572c885M534M461j552n381l252K224N285J805l545l777L97M262K189l077m658
1587c970l05M114M402j129l948k231K754M489l16n254m531J369O206L947k584
1602C013n438k045L485M944j4m683l272J459M430K008l117l570j6L564K568k600
1618G16l661l39L770L554j069n019k306K761N187R38m152m788P75M896L472k725
$$ plain form
1634 2010 -3108 -4969 -1357 3593 3898 408 -2856 -1486 1976 2853 -456 -4005 -3182 763 4055 2435
1650 2435 -1810 -3187 -68 3398 2672 -1530 -4491 -2033 2284 3994 972 -2783 -2618 1024 3116
1665 3116 1168 -3025 -3872 -181 4017 4084 -499 -3870 -2561 1824 3901 583 -3368 -3268 819 3922
1681 3922 2942 -1332 -3749 -1611 1940 2381 -318 -2539 -1483 1680 3066 -123 -3135 -2751 1086 3645
1697 3645 1580 -2217 -3516 -442 3658 3317 -899 -4621 -3391 1392 4040 2193 -1465 -2539 49
1712 49 2420 1397 -1677 -3255 -1069 2374 2886 38 -2490 -1538 1538 2820 176 -3140 -2890 444
1728 444 3564 2057 -1718 -3570 -1057 2436 3364 -142 -3112 -2400 1152 3298 800 -2482 -2774 -69
1744 -69 2960 1995 -938 -2714 -823 2276 2191 -629 -3273 -2283 1223 3028 1845 -1210 -2271 -180
$$ packed form
1634B010n118j861L612M950L05l490l264J370L462Q77l309l549Q23L945L292j620
1650B435m245j377L119L466p26m202k961K458M317J710l022l755J65L642K092
1665C116j948m193q47L691M198O7m583l371J309M385K077l318l951J00M087L103
1681C922r80m274k417K138L551M41k699k221J056L163J386l189l012L84L837K559
1697C645k065l797j299L074M100l41m216l722J230M783K648j847l658j074K588
1712D9K371j023l074j578K186L443N12k848k528R52L076J282k644l316K50L334
1728D44L120j507l775j852K513L493R28l506k970P12L552K146k498l282k92K705
1744f9L029r65k933j776J891L099q5k820k644R90L506J805j183l055j061K091
$$ plain form
1760 -180 2103 1239 -1852 -3128 -879 2410 3097 594 -2077 -1878 1224 2383 92 -2886 -3029 79
1776 79 3425 3223 -561 -2612 -1382 1330 2039 -61 -2925 -2514 728 3284 1659 -866 -1894 -212
1792 -212 1990 1125 -1144 -3032 -837 2086 2725 681 -2221 -1883 783 2732 1236 -1818 -2933 -700
1808 -700 2137 2203 -115 -2103 -1137 1517 2669 763 -1854 -1959 -69 1976 740 -1650 -1843 378
1824 378 2504 2324 -170 -2745 -1937 812 1839 148 -1952 -1796 886 2721 1917 -852 -2335 -1092
1840 -1092 1238 1303 -480 -2072 -912 1651 2769 951 -2091 -2550 -456 1581 1003 -824 -1636 203
1856 203 2465 2543 -88 -2362 -2168 303 1461 138 -1919 -1533 384 2326 2200 -502 -1961 -863
1872 -863 1396 1749 -421 -2223 -1539 959 2285 879 -1394 -2131 -12 1912 2042 -364 -2070 -951
$$ packed form
1760a80K283q64l091j276K249L289O87k503k671J99L102J159k291k978j43L108
1776G9L346k02l784k051J230K712P09k100k864M11L242K556j625k525j028J682
1792b12K202q65k269j888K195K923O39k044k902L38K666J949j496l054j115K233
1808g00K837O6k318j988R66K654J152j906k617j05J890K045j236k390j93K221
1824C78K126j80k494k575Q08K749J027j691k100J56K682J835q04k769j483J243
1840a092K330O5j783j592J160K563J118j818l042m59K094K037n78j827q12J839
1856B03K262P8k631k274J94K471J158j323k057L86J917J942j26k702j459J098
1872h63K259L53k170j802O84K498J326j406k273p37K119J924J30k406j706J119
$$ plain form
1888 -951 1273 1781 -151 -1632 -1389 638 2285 583 -1686 -2292 -278 1827 1703 -110 -1588 -315
1904 -315 1946 1677 -134 -2547 -2161 168 1803 1006 -721 -1176 246 2048 1964 -213 -2225 -1545 637
1921 637 2082 479 -1181 -1242 645 1689 604 -1533 -2244 -380 1696 2047 -213 -1479 -871 1336
1937 1336 1578 483 -2024 -2113 -31 1946 1252 -687 -1314 -412 1378 1632 -14 -1599 -973 1063 1753
1954 1753 291 -1428 -1533 22 1171 677 -1107 -1858 -420 1945 2233 -441 -2101 -1740 456 1666
1970 1666 690 -1033 -1206 105 1541 1133 -801 -1838 -823 1103 1380 227 -1235 -813 492 1639
1986 1639 203 -1211 -1536 -114 1923 1586 -439 -1533 -722 1025 1150 -98 -1695 -1491 525 1949
2002 1949 764 -1065 -1526 -220 1440 1271 -676 -1745 -530 1390 1746 141 -1794 -1620 82 1675
$$ packed form
1888i51K224N08j932j481K43K027J647j702k269o06K014K105j24j813j478J273
1904c15K261k69j811k413L86K329J635p97j727m55J422J802q4k177k012O80K182
1921F37J445j603j660o1J887J044j085k137p11J864K076L51k260j266O08K207
1937A336K42j095k507q9K082J977o94j939o27R02J790K54j646j585O26K036O90
1954A753j462j719j05J555J149m94j784p51J438K365K88k674j660L61K196J210
1970A666r76j723j73J311J436m08j934j037J015J926K77j153j462M22J305J147
1986A639j436j414l25J422K037l37k025j094Q11J747J25j248j597K04K016J424
2002A949j185j829m61J306J660j69j947j069J215J920L56j605j935J74J702J593
$$ plain form
2018 1675 771 -1019 -1424 -3 1616 1220 -532 -1702 -826 753 1445 111 -1193 -1193 770 1661 681
2035 681 -1512 -2096 -274 1617 1910 -7 -1563 -1134 792 1598 98 -1698 -1637 -261 1327 1081 -440
$$ packed form
2018A675r04j790m05J421J619l96j752j170Q76J579O92j334j304%J963Q91r80
2035F81k193n84J822J891K93j917j556M29J926Q06j500j796O1J376J588k46j521
$$ [...]
8191i7
##END NTUPLES=NMR FID
##END=
