##TITLE=1H_Ser GBR-Boc
 CDCl3
 8 sc, 
 31.05.2022
##JCAMPDX= 6.0         $$ Bruker NMR JCAMP-DX V2.0
##DATA TYPE= NMR FID
##DATA CLASS= NTUPLES
##ORIGIN= UXNMR, Bruker Analytische Messtechnik GmbH
##OWNER= root
$$ XWIN-NMR		Version 3.5
$$ Tue May 31 16:30:47 2022 Russian Standard Time (UT+4h)  she@DPX200
##.OBSERVE FREQUENCY= 200.1313499996
##.OBSERVE NUCLEUS= ^1H
##.DELAY= (6, 6)
##.ACQUISITION MODE= SIMULTANEOUS
##.ACQUISITION SCHEME= undefined
##.AVERAGES= 8
##.DIGITISER RES= 18
##SPECTROMETER/DATA SYSTEM= spect
##.PULSE SEQUENCE= zg30
##.SOLVENT NAME= CDCl3
##.SHIFT REFERENCE= (INTERNAL, CDCl3, 0, 15.7039)
##AUDIT TRAIL= $$ (NUMBER, WHEN, WHO, WHERE, WHAT)
$$ ##TITLE= Audit trail, XWIN-NMR		Version 3.5
$$ ##JCAMPDX= 5.01
$$ ##ORIGIN= Bruker BioSpin GmbH
$$ ##OWNER= she
$$ F:/spectra/data/she/nmr/H-F/1/audita.txt
$$ ##AUDIT TRAIL=  $$ (NUMBER, WHEN, WHO, WHERE, WHAT)
(   1,<2022-05-31 16:29:13.23 +0400>,<she>,<DPX200>,
      <created by zg, POWCHK disabled, PULCHK disabled
       configuration hash MD5:
       00 E9 B6 7A A2 85 ED C7 34 08 36 98 17 FE 4E 26
       data hash MD5: 16K
       D6 7F 1B 4D 25 78 28 73 96 33 C1 9F 33 F3 C7 C5>)
$$ ##END=
$$ 
$$ hash MD5
$$ 8C F4 9F C7 0F 52 BE 75 C4 CF D7 2B AC A8 9C D3
##$RELAX= 
##$RELAX= 
##$RELAX= 
##$RELAX= 
##$RELAX= 
##$RELAX= 
$$ Bruker specific parameters
$$ --------------------------
##$DU= <F:/spectra>
##$EXPNO= 1
##$NAME= <H-F>
##$PROCNO= 1
##$TYPE= <nmr>
##$USER= <she>
##$AMP= (0..31)
100 100 100 100 100 100 100 100 100 100 100 100 100 100 100 100 100 100 
100 100 100 100 100 100 100 100 100 100 100 100 100 100 
##$AQSEQ= 0
##$AQ_mod= 1
##$AUNM= <au_zg>
##$AUTOPOS= <>
##$BF1= 200.13
##$BF2= 200.13
##$BF3= 200.13
##$BF4= 200.13
##$BF5= 200.13
##$BF6= 200.13
##$BF7= 200.13
##$BF8= 200.13
##$BYTORDA= 1
##$CFDGTYP= 0
##$CFRGTYP= 5
##$CHEMSTR= <none>
##$CNST= (0..31)
1 1 145 1 1 1 1 1 1 1 1 1 1 1 1 1 1 1 1 1 1 1 1 1 1 1 1 1 1 1 1 1 
##$CPDPRG= <>
##$CPDPRG1= <>
##$CPDPRG2= <>
##$CPDPRG3= <>
##$CPDPRG4= <mlev>
##$CPDPRG5= <mlev>
##$CPDPRG6= <mlev>
##$CPDPRG7= <mlev>
##$CPDPRG8= <mlev>
##$CPDPRGB= <>
##$CPDPRGT= <>
##$D= (0..31)
0 1.2 0 0 0 0 0 0 0 0.06 0 0.03 0 0 0 0 0.0002 0 0 0 0 0 0 0 0 0 0 0 0 
0 0 0 
##$DATE= 1654000152
##$DBL= (0..7)
120 120 120 120 120 120 120 120 
##$DBP= (0..7)
150 150 150 150 150 150 150 150 
##$DBP07= 0
##$DBPNAM0= <>
##$DBPNAM1= <>
##$DBPNAM2= <>
##$DBPNAM3= <>
##$DBPNAM4= <>
##$DBPNAM5= <>
##$DBPNAM6= <>
##$DBPNAM7= <>
##$DBPOAL= (0..7)
0.5 0.5 0.5 0.5 0.5 0.5 0.5 0.5 
##$DBPOFFS= (0..7)
0 0 0 0 0 0 0 0 
##$DE= 6
##$DECBNUC= <off>
##$DECIM= 32
##$DECNUC= <off>
##$DECSTAT= 4
##$DIGMOD= 1
##$DIGTYP= 9
##$DL= (0..7)
0 120 120 120 120 120 120 120 
##$DP= (0..7)
150 150 150 150 150 150 150 150 
##$DP07= 0
##$DPNAME0= <>
##$DPNAME1= <>
##$DPNAME2= <>
##$DPNAME3= <>
##$DPNAME4= <>
##$DPNAME5= <>
##$DPNAME6= <>
##$DPNAME7= <>
##$DPOAL= (0..7)
0.5 0.5 0.5 0.5 0.5 0.5 0.5 0.5 
##$DPOFFS= (0..7)
0 0 0 0 0 0 0 0 
##$DQDMODE= 0
##$DR= 18
##$DS= 0
##$DSLIST= <SSSSSSSSSSSSSSS>
$$ [...]
##$SUBNAM2= <"">
##$SUBNAM3= <"">
##$SUBNAM4= <"">
##$SUBNAM5= <"">
##$SUBNAM6= <"">
##$SUBNAM7= <"">
##$SUBNAM8= <"">
##$SUBNAM9= <"">
##$SW= 18.0517283424761
##$SWIBOX= (0..15)
0 0 2 0 0 0 0 0 0 0 0 0 0 0 0 0 
##$SW_h= 3612.71676300578
##$TD= 16384
##$TD0= 1
##$TE= 0
##$TE2= 300
##$TE3= 300
##$TEG= 300
##$TL= (0..7)
0 120 120 120 120 120 120 120 
##$TP= (0..7)
150 150 150 150 150 150 150 150 
##$TP07= 0
##$TPNAME0= <>
##$TPNAME1= <>
##$TPNAME2= <>
##$TPNAME3= <>
##$TPNAME4= <>
##$TPNAME5= <>
##$TPNAME6= <>
##$TPNAME7= <>
##$TPOAL= (0..7)
0.5 0.5 0.5 0.5 0.5 0.5 0.5 0.5 
##$TPOFFS= (0..7)
0 0 0 0 0 0 0 0 
##$TUNHIN= 0
##$TUNHOUT= 0
##$TUNXOUT= 0
##$USERA1= <user>
##$USERA2= <user>
##$USERA3= <user>
##$USERA4= <user>
##$USERA5= <user>
##$V9= 5
##$VALIST= <valist>
##$VCLIST= <CCCCCCCCCCCCCCC>
##$VD= 0
##$VDLIST= <DDDDDDDDDDDDDDD>
##$VPLIST= <PPPPPPPPPPPPPPP>
##$VTLIST= <TTTTTTTTTTTTTTT>
##$WBST= 1024
##$WBSW= 4
##$XGAIN= (0..3)
0 0 0 0 
##$XL= 0
##$YL= 0
##$YMAX_a= 66534
##$YMIN_a= -108600
##$ZGOPTNS= <>
##$ZL1= 120
##$ZL2= 120
##$ZL3= 120
##$ZL4= 120
##$ABSF1= 10
##$ABSF2= 0
##$ABSG= 5
##$ABSL= 3
##$ALPHA= 0
##$AQORDER= 0
##$ASSFAC= 0
##$ASSFACI= 0
##$ASSFACX= 0
##$ASSWID= 0
##$AUNMP= <proc_1d>
##$AZFE= 0.1
##$AZFW= 0.1
##$BCFW= 1
##$BC_mod= 2
##$BYTORDP= 1
##$COROFFS= 0
##$CY= 11.3945322036743
##$DATMOD= 1
##$DC= 2
##$DFILT= <>
##$DTYPP= 0
##$F1P= 2.36226072786647
##$F2P= -0.459571619588291
##$FCOR= 0.5
##$FTSIZE= 0
##$FT_mod= 4
##$GAMMA= 1
##$GB= 0.15
##$INTBC= 1
##$INTSCL= 1
##$ISEN= 128
##$LB= 0.24
##$LEV0= 0
##$LPBIN= 0
##$MAXI= 10000
##$MC2= 0
##$MEAN= 0
##$ME_mod= 0
##$MI= 1.114404
##$NCOEF= 0
##$NC_proc= 0
##$NLEV= 6
##$NOISF1= 3.799351
##$NOISF2= 2.8
##$NSP= 1
##$NTH_PI= 0
##$NZP= 0
##$OFFSET= 15.70392
##$PC= 1
##$PHC0= -18040.91
##$PHC1= 23.40074
##$PH_mod= 1
##$PKNL= yes
##$PPARMOD= 0
##$PSCAL= 0
##$PSIGN= 0
##$REVERSE= no
##$SF= 200.130013532006
##$SI= 16384
##$SIGF1= 3
##$SIGF2= 2
##$SINO= 400
##$SIOLD= 16384
##$SREGLST= <1H.CDCl3>
##$SSB= 0
##$STSI= 0
##$STSR= 0
##$SW_p= 3612.71676300578
##$SYMM= 0
##$S_DEV= 0
##$TDeff= 0
##$TDoff= 0
##$TI= <>
##$TILT= no
##$TM1= 0
##$TM2= 0
##$TOPLEV= 0
##$USERP1= <user>
##$USERP2= <user>
##$USERP3= <user>
##$USERP4= <user>
##$USERP5= <user>
##$WDW= 1
##$XDIM= 8192
##$YMAX_p= 0
##$YMIN_p= 0
$$ End of Bruker specific parameters
$$ ---------------------------------
##NTUPLES= NMR FID
##VAR_NAME=  TIME,          FID/REAL,        FID/IMAG
##SYMBOL=    X,             R,               I
##VAR_TYPE=  INDEPENDENT,   DEPENDENT,       DEPENDENT
##VAR_FORM=  AFFN,          ASDF,            ASDF
##VAR_DIM=   8192,          8192,            8192
##UNITS=     SECONDS,       ARBITRARY UNITS, ARBITRARY UNITS
##FACTOR=    0.0002768,     1,               1
##FIRST=     0,             0,               0
##LAST=      2.2672688,     0,               0
##MIN=       0,             -108600,         0
##MAX=       2.2672688,     66534,           0
$$ Real data points
##PAGE= N=1
##DATA TABLE= (X++(R..R)), XYDATA
0@%%%%%%%%%%%%%%qJ6j6J6j6K4l2L2m0M8n6O4p2Q8j04J20j36J52j75J99k24K56
$$ 0 0 0 0 0 0 0 0 0 0 0 0 0 0 0 -8 8 -8 8 -8 16 -16 16 -24 24 -32 32 -40 48 -56 64 -72 80 -95 104 -120 136
36A36k88L21l57L97m42M93n49O10o74P45q24R09j002J103j215J338j474J626j794
$$ 136 -152 169 -188 209 -233 260 -289 321 -353 392 -432 477 -525 578 -637 701 -773 853 -941
55i41J985k202K446k730L063l457L936m531N294o311P744r937J3750k2279Q0704
$$ -941 1044 -1158 1288 -1442 1621 -1836 2100 -2431 2863 -3448 4296 -5641 8109 -14170 66534
70F6534k4052p8792Q9722N605k7783J5317L233o9410R497N5523j7124m2548K5193
$$ 66534 42482 -36310 53412 59017 31234 46551 49784 -19626 -10129 45394 28270 -14278 10915
83A0915q782l9753K5311M0156l7326k3974K6502n887k5677L7889K5905m0981j4555
$$ 10915 2133 -37620 -12309 27847 -9479 -33453 -6951 -12838 -38515 -626 25279 -15702 -30257
96c0257L2560n861j0318K9513l039m3796J1296M1320j2495k0488K0293n236k5862
$$ -30257 2303 -3558 -13876 15637 12598 -31198 -19902 21418 8923 -11565 8728 3492 -22370
109b2370K0296K3086k7264j2082K2827p122k0363K1347J7761k3162n201J9989
$$ -22370 -2074 21012 -6252 -18334 4493 -2629 -22992 -1645 16116 -7046 -12247 7742
121G742o322l604K2506q891l0803J8468K8385k6646j9079L5395P776l4113Q898
$$ 7742 1420 -2184 20322 11431 -19372 -904 27481 835 -18244 17151 24927 -9186 -288
134b88K8374j7408j4085K3973K87k4054P933J2660j8768k712J9362j5725k1642
$$ -288 28086 10678 -3407 20566 20853 -3201 4732 17392 -1376 -4088 15274 -451 -22093
147b2093K1699J3578k4430o980J2703r664p224J9808k76k4063O912J9700q754
$$ -22093 -394 13184 -11246 -18226 -5523 -15187 -22411 -2603 -2879 -26942 -20030 -330 -9084
160i084j926J6529q274j3342J9923J3510j9467k767J8470p563r745J8515K588
$$ -9084 -11010 5519 -2755 -16097 3826 17336 -2131 -4898 13572 6009 -3736 14779 17367
173A7367j9537O911J4548j5732j0142J5822r39j7700N711N886j3260M709J6043
$$ 17367 -2170 4741 19289 3557 -6585 9237 8298 -9402 -3691 2195 -11065 -6356 9687
186I687j4384j3265K1342R731j9718j143J7134p892j0462J5855K892j7145N316
$$ 9687 -4697 -17962 3380 13111 -6607 -7750 9384 1492 -8970 6885 9777 -7368 -2052
199b052J3871r137n517J3065m920j4327J0538J0362j6723n586J4927m768j1343
$$ -2052 11819 2682 -2835 10230 5310 -9017 1521 11883 -4840 -10426 4501 -267 -11610
212a1610J1943O261j5457l55J4179m971q696J1149o33j5309Q428J4935j0949q167
$$ -11610 333 6594 -8863 -9218 4961 -10 -8706 2443 1810 -13499 -5071 9864 -1085 -9252
226i252J2934J382r697R072Q159j5530l938J6285l691j2413R757N585j3669J789
$$ -9252 3682 5064 -4633 4439 12598 -2932 -6870 9415 5724 -6689 3068 8653 -5016 -3227
240c227J3942p289r521J2035N53j5847N899J2191j3158o363J3680k504j2272R984
$$ -3227 10715 3426 -6095 5940 6493 -9354 -3455 8736 -4422 -10785 2895 391 -11881 -1897
254a897J0867j3355m528J3760k679r228J0575K585j3898L495J3755o551q182J1451
$$ -1897 8970 -4385 -8913 4847 2168 -7060 3515 6100 -7798 -4303 9452 2901 -5281 6170
268F170J493j2760N603J0736j2351n992J2278k682j1440Q186P302j1362j627J2632
$$ 6170 7663 -5097 506 11242 -1109 -7101 5177 2495 -8945 -759 6543 -4819 -6446 6186
282F186m775j0191J0946L927j2996J576J0974o944o179J1380J607j1799N834R957
$$ 6186 1411 -8780 2166 6093 -6903 -5327 5647 -1297 -7476 3904 5511 -6288 -454 9503
296I503r241l929J1115l918j0766Q134O248j0734j848J0885m688p946J0698K993
$$ 9503 262 -3667 7448 3530 -7236 898 7146 -3588 -5436 5449 761 -7185 3513 6506
310F506j2767K364R738p032n957R365P64j0560M932R274q435k562J0980k925r290
$$ 6506 -6261 -3897 5841 -1191 -7148 2217 2981 -7579 -2647 6627 -1808 -4370 6610 3685 -5605
325e605P492N419r808j088R369m572p563R436L212j1040K165Q955p557n253Q889
$$ -5605 1887 7306 -2502 -3590 5779 1207 -6356 3080 6292 -4748 -2583 6372 -1185 -6438 2451
340B451n20j0593M592P586p955k588J0407k086q363P902N371r007m0Q659m530
$$ 2451 1931 -8662 -4070 3516 -4439 -7027 3380 1294 -7069 833 6204 -2803 -2843 5816 1286
355A286o749Q986K801r859L145R069p040m222Q995j043r343M690N908r023k765
$$ 1286 -5463 3523 6324 -3535 -390 8679 1639 -2583 6412 5369 -3974 716 6624 -2399 -5164
370e164R544k518q353P154M136q669N92P982m901n755P438J239r010L195P603
$$ -5164 4380 1862 -6491 663 4799 -3870 -3278 4704 -197 -5952 1486 2725 -6285 -3090 4513
385D513o790l275R700j358p771M942N084p750k079Q411l002p039O619L696q254
$$ 4513 -2277 -5552 4148 2790 -4981 -39 5045 -2705 -4784 3627 625 -6414 205 3901 -4353
400d353J686P637m795n339P365J463q564K288O663o455k997P970q38o864N278
$$ -4353 -2667 4970 175 -5164 2201 3664 -4900 -2612 4051 -2404 -5401 2569 1731 -5133 145
415A45N039o618r88P412k409o451O557K995p544J634P541n143m114P734Q25q112
$$ 145 5184 -1434 -2422 4990 2581 -3870 2687 5682 -1862 -228 7313 2170 -1944 5790 6615 -1497
431a497K119O325o670m004O988j666p022M249L508o410j44O645l753n556O769
$$ -1497 622 6947 277 -3727 3261 1595 -5427 -1178 2330 -4080 -4224 2421 -1332 -6888 -119
446a19K134q668J988P293n133l952P604J613o429K793N762n623k331P254k123
$$ -119 2015 -6653 -4665 2628 -2505 -6457 1147 2760 -3669 -876 4886 -737 -3068 4186 2063
461B063o734M883L280o333J69O728l563m930O296K018p022J412N422m937k400
$$ 2063 -4671 212 3492 -2841 -2672 4056 493 -4437 1859 3877 -3145 -1733 3689 -1248 -3648
476c648N926k08m911K983L874m621n93O141k027n376M609K140o092N16O183l421
$$ -3648 2278 2070 -2841 142 4016 -605 -1198 4943 2916 -2460 2149 4289 -1803 -1287 4896 1475
492A475m675M812K905n374J82M798l733l074N243j238n572L357L505n702j430
$$ 1475 -3200 1612 4517 -857 -675 4123 390 -2684 2559 1321 -4251 -894 2611 -3091 -4521
507d521P133j497p041M298M102o069j229N975j817n252M348L193n556J275O424
$$ -4521 2612 1115 -5926 -1628 2474 -3595 -4824 1151 -666 -5918 -1570 1623 -3933 -2658 3766
522C766m375l278P029O87o596K543M668m795k385O690k98o567L989L557n931o
$$ 3766 -609 -3887 3142 3829 -2767 -224 4444 -351 -2736 3954 3656 -2911 1078 4635 -1296 -1302
538a302N534l205m628M697J119n712K157N161n226j842O908o99n301L193L801
$$ -1302 4232 1027 -3601 1096 2215 -3497 -1340 3821 -1405 -3247 3661 2962 -2339 854 4655
553D655n409r63N041j219m609L559J747m582J284M700m676k851N006K20o333K234
$$ 4655 -754 -1717 3324 2105 -2504 1055 2802 -1780 -496 4204 -472 -3323 1683 1903 -4430 -2196
569b196M753m580l268N692M48m675K719L307m269p68M675j326m171L198K435m428
$$ -2196 2557 -2023 -5291 401 849 -3826 -1107 2200 -2069 -2837 1838 512 -3659 -461 1974 -2454
585b454O73N071k409l555L780J618m008Q31L863l048k720M402K05m242K279K856
$$ -2454 -1781 3290 881 -2674 1106 2724 -1284 -453 3410 362 -2358 2044 2249 -1993 286 3142
601C142l487o87M487j528m119K881J963m602J83N189l158l506M146J105l927J288
$$ 3142 -345 -1032 3455 1927 -2192 689 2652 -1950 -1767 3422 264 -3242 904 2009 -1918 -630
617f30L841l516k070M296p65m622L898K220n203L71N450k832l620L940J730n368
$$ -630 3211 -305 -2375 1921 1156 -3466 432 2652 -2551 -2180 3270 438 -3182 758 2488 -2880
633b880J139M386l714k705M221l2m052L209K832m153n16M363r40l655L087K328
$$ -2880 -1741 2645 -1069 -3774 447 415 -3637 -428 2404 -1749 -2265 2098 1158 -2497 590 2918
649B918m831O84M153k296k294L332J135m192J686K995l462j834L496p99l247K282
$$ 2918 -1913 -1229 2924 628 -1666 1666 2801 -1391 295 3290 -172 -2006 1490 691 -2556 -274
665b74K215l302j079L854o83l258K786J846l923j50L830j858k322L522N40k908
$$ -274 1941 -1361 -2440 1414 731 -2527 259 2105 -1818 -1968 1862 4 -2318 1204 1744 -1164
681a164J351K479k525j656L662l61m121K552K295l685j285L982q44l345K613J986
$$ -1164 187 2666 141 -1515 2147 1786 -2335 217 2512 -1173 -2458 1524 680 -2665 -52 1934
697A934l789j96L637k089k469L436O01l851J735L125k534j603M130k74l673K473
$$ 1934 -1855 -2051 1586 -503 -2972 464 1065 -2786 -1051 2074 -460 -2063 2067 1793 -1880 593
713E93K403l692o40L817j547k825L236J298l959L87L691k555k395L478m9l988
$$ 593 2996 -696 -1336 2481 934 -1891 1345 2643 -1316 -929 2762 207 -2188 1290 1241 -2747
729b747J643K391k901j083L500o92k987K993J662l227LL164j504k226L174O16
$$ -2747 -1104 1287 -1614 -2697 803 111 -2876 117 1779 -1448 -1445 1719 215 -2011 1163 1779
745A779l170J347L110k464j422L200l55l176J643J868k899r36K778q41k845K254
$$ 1779 -1391 -44 3066 602 -820 2380 2025 -1151 492 2360 -539 -1475 1303 462 -2383 -129
761a29J480l353K33K676j975j806K611P79k818R19K700j981j177L523j78k926
$$ -129 1351 -2002 -1769 907 -1068 -2874 -263 516 -2302 -1383 1317 -664 -1841 1682 1504 -1422
777a422K038J865k353m74K653p97k573K044J777l278K98K588j714j965K497j22
$$ -1422 616 2481 128 -346 2307 1510 -1063 981 2758 -520 -222 2366 652 -1313 1184 1062
793A062k933P04J956k285j247K861l34k772K089J738k315m09L080j290j874K326
$$ 1062 -1871 -1167 789 -1496 -2743 118 -216 -2988 -899 839 -1476 -1885 1195 -95 -1969 357
809C57J389l240J027K810j744j327K658J77k553R94J791k110j511K433n02k667
$$ 357 1746 -1494 -467 2343 599 -728 1930 2107 -446 548 2339 229 -1282 1151 649 -2018
825b018J559J409k661Q2K171p69k283K274Q17k209k1K895j435j258K775J68j910
$$ -2018 -459 950 -1711 -1629 542 -227 -2510 -236 581 -1628 -1649 1246 -189 -1447 1328 1496 -414
842d14J135K114j721j224K473n00k451J711J468k710k06K236j493j937K074O09
$$ -414 721 2835 1114 -110 2363 1863 -588 1123 2591 -119 -325 1911 418 -1519 555 1164
858A164k924K30K192k127j485K513l41k068J302J756j948m07K553q7k528J926
$$ 1164 -1760 -1530 662 -1465 -2950 -437 -778 -2846 -1544 212 -1736 -2143 410 323 -2205 -279
874b79J535k225o3K522j016j178K288M14k374O16K222j770j234K324m72k412J225
$$ -279 1256 -969 -1032 1490 474 -704 1584 1998 -376 240 2462 692 -542 1782 1310 -1102 123
891A23J405j960r70K365n38k005J444J481k437PK439j682j177K506J19k105Q97
$$ 123 1528 -432 -1402 963 425 -1580 -136 1345 -1092 -1085 1354 -328 -1505 1001 1120 -985 -88
908h8K258j590j273K818n67k413J678R82k223j52J598p60k037J863P55k828L52
$$ -88 2170 580 -693 2125 1558 -855 823 1805 -418 -570 1028 268 -1769 94 849 -1979 -1627
925a627J955j712j641K401n1k133J252J871j889l94K146J72j803J725J238k376
$$ -1627 328 -1384 -3025 -624 -675 -2808 -1556 315 -1574 -1968 178 350 -1453 272 1510 -866
941h66O71J822p33r79J693Q06k462N02J887j280j314J909m66k134J237P43j379
$$ -866 -195 1627 894 -85 1608 2414 -48 454 2341 1061 -253 1656 1190 -944 293 1036 -343
958c43p05J644l48j549J334J145j973l14J801p33r49R19R67j660J93J672j261
$$ -343 -1048 596 248 -1301 33 1178 -795 -1109 692 -41 -990 -71 896 -764 -571 1101 -160
975a60o40J956j33j835R31R37j245q49J686m06j878J297J023j922o7J969q81j679
$$ -160 -800 1156 1023 -812 119 1056 -189 -1038 648 242 -1636 -339 684 -1238 -1305 664 -217 -1896
993a896J691N32j768J53J948j121j026K486p4j800J513R57j475k83J723r7k078
$$ -1896 -205 327 -1441 -1288 660 -461 -1487 999 925 -875 638 1595 120 -163 1560 1463 -615
1010f15J581R67k037K21J908j536j020J331L58k161P36J014j303o88J681l59j767
$$ -615 966 1933 -104 117 2025 489 -531 800 1158 -1003 -267 747 -556 -1244 437 78 -1689
1027a689J169P78j452L28J433r38o27R78P20j485P64J079j221m22J708m34r50
$$ -1689 -520 258 -1194 -866 567 -371 -998 -20 700 -785 -21 1058 -163 -585 1123 689 -261
1044b61O68N90j063l20J073p0j800Q37Q75q54n67J192n78o54P01O39j204n4J494
$$ -261 407 997 -66 -386 687 617 -1183 -346 529 -325 -892 300 -278 -932 -231 408 -796 -850 644
1063F44q79q51J716M50j793O24J300p70r26J793O7j817L54J322j416j29J382n95
$$ 644 -235 -1086 630 1080 -713 -89 1211 441 -485 1308 1375 -442 -88 1234 -182 -311 1071 476
1081D76j447P74R59j213m41J523q20j346J610N2j506O26J214j252j70J634m20
$$ 476 -971 -197 762 -451 -892 631 -189 -1535 75 127 -1379 -753 461 -791 -961 673 253
1098B53j168J149R69j664L64J885j170j264J334M73j309L94J304j443r30J729
$$ 253 -915 234 1203 -461 -97 1788 618 -646 688 1161 -148 246 1550 107 -823 906
1114I06m00j547J134L13j121m69J458l20j157R18N66j563L63J797j123m31R26
$$ 906 506 -1041 93 406 -715 -1184 274 -46 -1203 -285 281 -1282 -919 878 -245 -676 250
1131B50J17p27O50O84p45l81J013J68j246P34M67r30k98P92k36o50o6Q76r98j14
$$ 250 367 -360 290 974 229 -152 861 1029 -217 517 984 54 -244 548 312 -338 -404 472 -526 -640
1151f40J278q67r32Q57j2n19L05Q13n08q95J042O22j099L16J281j012o22J365
$$ -640 638 -229 -1161 -304 -316 -835 -530 283 -225 -1120 -78 544 -555 -239 1042 30 -592 773
1169G73J2j222P48P58r91n20J768p45j520J419K18j165K65P86q17r20J289J34
$$ 773 785 -437 311 1069 78 -442 1326 581 -939 480 698 -467 -202 584 -233 -1153 136 270
1187B70j240P86Q01j437J2J575m14j095Q86O73j351J79J489o97j098J711J72j651
$$ 270 -970 -184 617 -820 -808 767 353 -742 144 817 -534 -355 1134 437 -661 1050 1222 -429
1205d29Q24P31j141k18J054m91j047O20O25j423J27J184r60n05R84Q2j128K39
$$ -429 395 1126 -15 -233 821 330 -717 -97 528 -895 -768 416 -544 -1049 -65 17 -1111 -872
1223h72J168l26j236J210K89r79O37R45j191J5J091k60j137R79R13j422L9J372
$$ -872 296 -30 -1266 -56 233 -746 -109 836 -355 -340 751 491 -646 333 1246 -176 -137 1235
1241A235m58j197J304qr03j52R41n07r43J192j34j107P72O16r22l51J105r5r42
$$ 1235 777 -420 884 876 -27 -179 762 255 -688 504 370 -737 35 651 -271 -622 483 388 -554
1260e54Q80O51j423j90J078j22j045J183J67j227N03R57q13o24J120k32j706J035
$$ -554 326 977 -446 -636 442 320 -725 458 625 -602 -99 858 45 -579 541 309 -1397 -362
1278c62P58j059j57R38m10q86J005L74j058k18J585q48n95J086N3p15M83P26o27
$$ -362 396 -663 -820 118 -292 -1178 -173 201 -857 -1075 510 -338 -933 153 206 -509 -26 700 73
1297G3n47J219J25j001N93Q41j226k62J293o01p83R19M92j393J87J027q40o09
$$ 73 -474 745 870 -131 462 1303 77 -185 1108 507 -276 643 1135 -258 -71 956 116 -493
1315d93Q91L5r35J77R71q59l20P91n7p23L20Q65r85l63J218n79p00Q42K24j033
$$ -493 398 433 -502 -325 646 -213 -533 258 201 -522 -202 663 -322 -685 533 -46 -746 96 320 -713
1335g13K70J118q23p36J104K1j377P75N19o74QP63l48n15L79P22j010K1J059p38
$$ -713 -443 675 -148 -884 220 241 -1136 -361 158 -516 -508 255 -93 -608 -229 493 -517 -496 563 -175
1355a75l20P09K07o09M94M79k44p88J044n2j054P15N03q81p5P62o03m53N40K93
$$ -175 -495 214 421 -188 306 785 541 -247 797 745 -309 406 909 28 -47 715 112 -341 199 492
1375D92p14q3J054q11m79Q22P1r60R8P72m50n61R24J28j037M97P39r66J52P06
$$ 492 -222 -305 749 -62 -541 281 352 -608 -510 262 -188 -749 175 303 -734 -237 502 -464 -312 394
1395C94r5p86P75J97j037J43O25R2q36R96k29o19j37N93o39j35Q95Qq54P14K06
$$ 394 299 -487 288 485 -552 -409 216 308 -528 468 239 -380 -517 76 -563 -698 197 205 -649 65 271
1416B71l85p6P98n19k31N29K18o38J07Q48p13l82Q58K90j122K32O77q04n41Q87
$$ 271 -114 -190 608 89 -142 387 605 -33 74 922 209 -173 685 975 -147 85 762 -42 -583 304
1436C04J1r80N35K64o08L0O19n42n22O62J17l23l68Q72k10n32Q07O9p94O02M51
$$ 304 315 -665 -130 134 -474 -444 175 -367 -889 -227 -110 -433 -801 71 -139 -671 136 205 -589 13 464
1457D64o12j11Q68R1j121Q18M57j075r8J022p04m74O76L38r22P6Q65j062j93P28
$$ 464 -148 -259 609 700 -421 397 854 -221 -319 703 -1 -475 201 539 -383 -307 558 -504 -697 31
1477C1M4j079Q78L86p27l10P66k93k58Q27M82r81l5R33n86l82J156l73n34M45
$$ 31 75 -1004 -126 260 -467 -777 -11 -304 -562 265 747 -234 -269 664 78 -304 852 479 -55 390
1497C90J35m33k10R2L98q91M57L84n34k05J96n6o01P35J55p75K12N77j68k98M26
$$ 390 525 92 -118 -26 372 -519 -62 322 -212 -417 -221 -277 -878 -143 12 -763 -551 26 -142 -440 -14
1518a4L78o52R1P03l13j7L38L6n61L95O70r83L1M40m36k81K62J78q40J44P36m94
$$ -14 364 -288 -197 506 193 176 514 550 -11 384 1054 71 102 542 106 -175 87 265 -575 -431 305 -189
1540a89p28P57P7q76M87Q66p09l89R52j33o49N18O76q61Q4R56l82p96Q87L68r37
$$ -189 -917 -160 -83 -959 -472 394 -315 -704 248 115 -534 -16 660 -201 -117 839 457 -339 548 916 -21
1561b1r3J126o35n65Q41M1j183L27N67q87J5N66n75l30N90L30q46O5J011r14q3
$$ -21 -114 1012 377 -188 653 694 -489 -162 405 -482 -467 99 -476 -806 -216 114 -732 -667 344 -570 -653
1582f53R24p8p50N66N49n69K43K65P2p57M17N00o37K27M28o89J54J15k39j88j00
$$ -653 271 193 -557 9 558 -11 232 497 569 -188 229 729 92 319 747 58 212 327 88 -100 -200
1603b00M60n16m93Q51k96j57j35K46J51l35O99j04n56Q7N62k81J4M29j54j81L
$$ -200 260 -256 -749 102 -194 -351 -486 -240 -89 -424 275 171 -385 -298 264 -17 -3 426 272 91 94
1624I4M02l12j08O19o98k84O05L4p52N1N23l34k41K66J98r89L87N94n36n3O82
$$ 94 496 184 76 695 -3 -287 318 352 -400 -349 174 -160 -401 -135 63 -926 -539 55 -481 -534 148
1645A48j81o56P89M1m57J71Q57n45l06N09K85p61O77J96p63m6O11l6p57O46L17
$$ 148 -33 -689 100 141 -316 -145 712 167 -139 370 655 -106 571 767 4 -42 569 533 -224 422 739
1666G39p24j71N57m53n77N39J65n87L20J69j36m07O67J14o88O28m5m77J15P40
$$ 739 15 -156 401 -52 -629 -90 75 -512 -192 -23 -159 -566 101 215 -473 155 110 -367 -252 488
1686D88k44n5N3K7l91L16J64k71l30K51J62o65L34m1Q6m00M04J12n81K76O2K4
$$ 488 244 189 242 269 -122 194 358 87 -243 8 170 -495 -161 -202 -116 -516 -112 0 -581 -305 -243 -219
1708b19l03N81j90j72M56K49l03k60N82J50m94L66K12n44L10M34l70k49L1M25
$$ -219 -522 59 -131 -303 153 402 99 -161 421 571 77 443 655 111 421 855 485 236 267 692
1728F92n29k61M07l12k63M30l05k40J82J83l98j61N83n9n83M00K42j62L19N0j78
$$ 692 163 -98 309 -3 -266 164 -141 -381 -199 -16 -414 -575 8 -51 -634 -234 8 -154 165 215 37
1749C7p9M43J52m62j35M43m05j33N38n29j22m2M12n73l9L06J21j37L69q1m52K61
$$ 37 -42 401 553 91 -44 399 -6 -139 399 -130 -252 -294 118 -455 -494 -188 -67 -204 165 84 -368 -107
1771a07o5j76J6L72J07n15O18K26m23O1M27k04l18M49N4k06o2K69m48k77L31J33
$$ -107 -172 -348 -332 40 147 -368 250 476 53 114 541 337 19 468 522 316 254 523 75 -202 129 262
1793B62n42K81O3l66l61L20K38o31J55M55k42j88K77N9l58M67J0k04K54L70j72
$$ 262 -280 1 64 -302 -663 -343 -105 -736 -581 -126 -368 -556 -279 -220 -578 -111 -101 -305 -51 319 147
1814A47j85J67P0p0j10K30j36j33M23k25j69J08J46m96N2K93l74m07N05L39o60
$$ 147 -38 129 199 129 19 249 113 -20 403 178 9 117 263 -233 -181 112 -262 -669 -164 175 -485
1835d85K69K76k52l75N75M25o28J32N22o64k0P69l06k75L39nl38O9L77m3m19M84
$$ -485 -216 60 -192 -567 8 433 -195 -63 459 -205 -225 544 238 -37 302 297 -41 28 405 362 -57 427
1857D27l38k77OK28o0o04O52o4l41l63P50l49j42M54j35j98M08m8m6K5K87j53
$$ 427 89 -188 -182 46 -14 -618 34 -30 -371 -734 16 -333 -475 -21 -156 -354 54 6 -40 -15 272 119
1879A19k08J31K87o6k1K09n24P2M28J1m87K29J77m27k51K79Q1k91P0Rk72J58K41
$$ 119 -89 42 329 263 242 451 -73 -1 427 438 -49 180 357 -70 -321 -42 39 -252 -182 -173 -445 -287 -46
1902d6k24l54K23N29l60J06N13l34k03N80n9l22K35J79m13j6N97j88o90L92Mk52
$$ -46 -270 -624 -401 128 -232 -126 387 53 -150 430 371 49 284 463 50 34 631 443 -247 145 149 -103
1924a03J88J61m19k91N75k97j60O2M1k81J12J69K38l28L73L58m66L3M14j19n55
$$ -103 85 246 -173 -464 111 -186 -346 -284 -243 -524 -412 -243 -5 -333 40 398 -68 -35 379 260 -295
1945b95P78r8k57R8K17m10L4K96k3m33R8J53k65O3J86k39j04K82j37j90J7L00
$$ -295 483 385 128 226 443 33 67 363 340 -93 5 158 -107 -44 142 -97 -201 81 -56 -246 -229 71
1967G1L0n43L96J32k41J03Q9J32k78N06J10n05K17K63r4r8o0k59J04J48J42n55
$$ 71 101 -442 -46 86 -155 -52 37 169 -109 397 507 2 219 482 388 290 230 -29 75 223 365 -190
1989a90Q9L8K4l09J66J68k03J63MM1m54L70K02k92J56L76k62m37L29K25L3j72
$$ -190 -101 -63 -39 -348 -182 -14 -217 -54 -50 -9 -463 -93 109 -183 -27 349 87 -350 -21 204 237 65
2011F5L88j09k69K74P9p41L17K39j96j56L10k33k77nN14m20j95N74k19j93K39
$$ 65 453 344 75 349 428 -313 4 243 47 -109 201 -32 -309 -314 200 -220 -415 159 -60 -253 -14
2032a4K4l41J99L42m38k78O80j71j94K14J77l62R7O17o17r2L75q1p8J56J06m45
$$ -14 10 -331 -132 210 -228 -506 174 3 -191 23 200 -162 -65 552 -65 -157 218 137 59 215 321 -124
2054a24LJ58j66k28K32L29n50J14M18m26j3L10l8k84N09lk32p4L56oJ6Q3J16q9
$$ -124 -121 37 -129 -357 -125 204 -346 -232 186 -240 -253 57 19 -265 244 241 9 -65 291 285 301 384 500 411
2078D11k73J9K3j70R9l4m47K79J39Q9l31K7L3J5k27L80k87J57J45k14J03r9J90
$$ 411 138 157 180 10 109 75 -372 -93 46 135 -196 -169 -136 -121 -348 32 -255 -98 47 -167 -64 -163 27
2101B7j75P0R5K12m69K03K61k93p9K22R5j32RQ8p1j94J43j55l79M78j46m2K65
$$ 27 -148 -78 17 229 -240 -37 224 -69 -148 74 169 37 46 134 63 -131 12 -143 -522 -44 -190 -232 33
2124C3K7k26M28l98O3J86k00K55o08M38M21l11k18N65j59l25P8L90k26l01L78
$$ 33 60 -166 262 -136 -73 113 -87 168 -440 -2 419 108 -110 455 296 -29 49 439 213 -88 290
2145B90l96J13J13O8l56J06J56k73k48L33J31k16l9J64k77QL43j09l17K92J73
$$ 290 -106 7 120 188 -168 -62 94 -179 -427 -94 37 -179 -218 -54 -331 -323 20 -89 -406 -114 59
2166E9k00J89P8q7j53J51M31m77K05j3PL8l4j33J18j26Q9J11j67l7l2k79J71K33
$$ 59 -141 48 126 39 -114 37 468 -9 196 183 190 228 194 61 179 53 142 253 86 49 17 -262 -91 142
2190A42k50LO0J17j79RL13k47M15k33j37P3Q8m4k71M16K06k20m2O6j22k19j13
$$ 142 -108 -105 -45 72 -107 -98 215 -32 383 150 13 86 174 130 -141 275 481 261 219 285 163 -56 -169
2213a69K28k50j02M17j02n18M82j30l08K52K87m09L1L40k96J51j36N02j11k2J99
$$ -169 59 -191 -293 124 22 -496 -14 -144 -452 -200 87 -322 -291 49 -247 -96 -232 270 159 137 336
2234C36k40j14M01l30R0k7P2N5k97M40Rn08K69J31o22l0M59l01Q5m6K0K4o3K55
$$ 336 96 -18 383 53 143 116 188 243 -54 386 395 -113 156 287 -335 -365 94 -207 -122 -168 -148 -124 -187 68
2258F8p0m07K78O0j59J87Q5K4j44K70R8k24K29j4j85l1L0q3L5j37K83j68k50R8
$$ 68 -2 -409 -131 -71 -230 -43 42 66 -78 192 290 66 295 281 96 65 95 12 47 -90 193 25 -225 -127
2282a27J10k60oM53l02j70K65l50K54L69k52Rk01L07Q2l05L73r5j69J17L3J87
$$ -127 -17 -277 -283 170 -132 -302 -37 -387 -133 236 -16 -7 -208 99 181 -124 249 154 -15 102 135 322
2304C22n5J96l89J45p2J07j0j30Q4j84k50K7J92k37j2J2Q2o7K18J9j96J23k0L3
$$ 322 267 463 74 219 147 254 244 114 198 14 -236 -209 -17 -254 -266 -254 -172 -239 -21 -2 -198 -75 -95 -62
2328f2p7J44L0P1J18n3j17r8K43j12J03K62l19j48J38J53k98M2o3Qk86K66j37
$$ -62 -139 5 35 106 224 171 54 -44 199 87 190 452 133 -15 123 276 -22 20 -43 -35 -321 -55 -192
2351a92q1Q5n5j19J26J15o6K3J86Q2m8J28P8r4q3O7K27j67K3N0k94K09J46k98
$$ -192 -273 -188 -243 -362 -236 -121 -187 -164 22 104 56 184 262 168 85 152 379 212 235 285 -9 200 346 48
2375D8q7KJ60j44l16K93j45j55J7M20k13k16K45J73q8J48k78J4r1K75Q1k64L12
$$ 48 -39 -37 123 -21 -337 -44 -189 -344 -327 93 -120 -336 -91 82 -6 142 -136 -122 -213 62 143 -121 191
2398A91K9k49K51pk26K24l05J55q5J42j32P3l32M04j98j22J08R6o2j67O7l4p2
$$ 191 220 -29 222 215 -11 213 -92 63 -22 120 -12 61 -271 133 -65 -187 -79 17 -45 -212 -145 -179 -251
2421b51K40l1o2J36K1j91J75k5K33j68J18L5p2j39K99q2j2p0r9j4o6lJ19J43l41
$$ -251 -11 -42 -104 32 53 -138 37 12 245 77 195 230 158 19 318 236 224 154 55 41 -25 -28 91 234 -107
2446a07mJ04Q4j73q2J95k85L77j57l66M30P2P8m09M84j68KL6J7N6MJ45k99J68
$$ -107 -111 -7 77 -96 -178 17 -268 109 -48 -414 16 88 166 -243 241 73 75 111 128 184 188 333 34 202
2470B02k67o4k1K29k66j26M12Om95K90L9p8J56k5k26j26L76lJ68k53K65m1R3k43
$$ 202 -65 -129 -150 79 -187 -313 99 105 -390 -100 -61 -139 17 -8 -234 -360 16 13 181 -72 193 152 245 2
2494BJ06j19L0P1K49l71K82m0J6k14K3J34j77j94q4j86L14K9j14J25OP7l80K52
$$ 2 108 -11 19 90 339 -32 250 210 226 12 35 169 -8 -202 -286 -472 -158 -129 -243 -118 -112 -35 -415 -163
2518a63MK73j72RJ54k81J93J08j76J15O1J75N2j82j82L10k61R2qm09K48m7L9o4
$$ -163 -159 114 -58 -49 105 -176 17 125 -51 64 125 300 352 170 -12 298 37 129 121 -288 -40 -87 -48 -112
2542a12K2j96o3K47m5k98K01L52k29J12l4J59j52M9oj53J82K60k30j8J29l7j5
$$ -112 -90 -286 -349 -102 -147 -445 -244 108 -121 -9 -43 116 -36 13 7 -146 36 296 66 48 177 140 125
2565A25k31J24J04k28K00Pm20J47M58j70k17N4k21o8M7K19k02L3K24l91K78L25
$$ 125 -106 18 122 -106 94 101 -319 -172 286 116 -101 -47 -268 -336 -289 -70 -272 -239 -15 -406 -128 197
2587A97L4n26O51k16j32J72J8j22j79L72P3n96L92o8k34J49J07j17j15K40ml74
$$ 197 231 -295 356 140 8 180 198 76 -103 269 342 -254 138 70 -164 -15 92 -25 -140 100 96 -278
2609b78R6J18j38K12k74J77L88n11J89R6n8k9K5l06O64j97J2j81K5J90M8k4k54
$$ -278 -182 -64 -202 10 -264 -87 301 -210 -21 75 17 -12 13 -293 371 174 186 5 30 220 268 244 -10
2632a0j94L74l3J17m27K45K2k69K3p7J51j27R3k07K21Jkr3j15K93n0P8J77o3Q1
$$ -10 -204 170 137 254 -173 72 94 -175 -152 -229 -78 -205 -112 -319 -98 -97 -99 -192 -307 -14 -64 14 191 128 209
2657B09j46m9J50L5J4J87k35j32J54J8j89J33j38k09K54k65l7R5J90J28l89O6
$$ 209 63 14 164 199 213 400 165 33 187 205 16 149 11 -198 56 -209 -246 -151 39 167 -222 -156
2679a56j94K9L02l7j36N6Q8K04n30K87P6n0J76J12j5o5N2K7j83M35o65Q1K13j03
$$ -156 -350 -321 -19 -56 -192 -136 -48 156 -374 -87 -11 -61 115 227 212 147 199 226 43 478 -187 -106 107 4
2703Dp7m5O7k72K36LR4k09J33j2L0l8L38j4l51J41k12J3K66L1J35k16K78L3n08
$$ 4 -73 -118 -51 -323 -87 -84 10 -199 -66 -78 -48 -86 252 238 -113 28 -184 -171 95 126 261 45 323 356 -152
2728a52K27J29Q4k50L8kj22L0j25j66J84Q4J7j0q3k4K00n7O4L5k64J76O2K8k57
$$ -152 75 204 288 38 76 74 -48 -18 -143 -309 -125 -41 -24 -34 -117 -141 59 2 66 101 -163 13 75 103 -154
2753a54K00K10j63J12RL1K7l21L32m46R1K95r1ol0j56M6o7J25l20J46J68j02j98
$$ -154 46 256 93 205 214 245 272 -49 283 -163 -72 223 132 126 96 -60 -14 -81 44 -276 -130 38 -64 -262
2777b62K7L30k4k48J27j24L78j65Q0j55K55O6l67K60j9j9m36L43j66m6k4Q2k2
$$ -262 -235 95 71 -177 -50 -174 204 39 119 -36 219 285 -82 178 159 140 -296 47 -119 -165 -189 -107 -129
2800a29r6k4K31k5M7Q5r4j57K4K0M9l01M40m5j24P8K56J1p0O0K4m29K54L3KJ35
$$ -129 -225 -249 -18 -43 4 89 -5 -162 -138 -118 -69 -370 70 25 -99 -21 235 246 176 236 260 -169 85 118 120 255
2826B55n19K75K9R3k23K05k32K31k57J55n7o6J04j57L45m62K26M8R2k56J71K41
$$ 255 -264 11 40 133 -90 115 -117 114 -143 12 -45 -111 -7 -164 181 -281 -55 -7 85 -171 0 241
2848B41k93j7K70Lk12K71M1j03O0j95R8k67M6n6J04J74j87l1j88J73j85J90J82
$$ 241 -52 -69 201 204 -8 263 304 201 261 66 164 -103 -57 -113 -9 165 -22 -53 -241 -68 -253 -63 119
2871A19l43k7L09k56J87k2K83l02j07L69m28K71l5r8J19M9n4J18J16j76J81rm21
$$ 119 -224 -251 58 -198 -11 -33 250 -52 -159 210 -218 53 18 -80 39 88 34 152 268 92 273 264 -157
2894a57L5j28K31l34R3J85k5o7J79l82M30p9R7o7j51R7o6J16J30j63j14J77KJ
$$ -157 -122 -250 -19 -353 -260 -75 -100 -167 12 -370 60 -19 78 11 -140 -43 -109 7 137 -26 -140 37 39 40
2918D0K34m03K20j41Q5Jj1O6l3m5q0n9J22ro7J1p1J63j15J51l08Q9K34j10J9j49
$$ 40 274 -129 91 -50 35 36 25 91 58 13 -67 -126 -4 -13 -80 -69 -140 23 -92 59 -249 -160 74 -36 -17 -166
2944a66L22q0lM5j32J23P1K8p8N9n1J65m35p1L97k70J51j05K7J20qj66J02p3k12
$$ -166 156 76 73 118 -14 109 180 208 130 189 138 303 -132 -203 194 -76 75 -30 -3 117 109 -57 45 -28 -240
2969b40J82l5K16l03J05l5O8K0k89K06K95r8jj24J11q9J32P3r2rp8R9k86J68K05
$$ -240 -58 -93 123 -180 -75 -110 -42 -22 -311 -105 190 92 91 -33 78 -11 121 194 102 93 15 114 -172 -4 201
2994B01j77q8K36k85j9n5j4K58n6l38M63j85L2M4r1K92m28K08Q6n6J04R5l48L70
$$ 201 24 -64 172 -113 -132 -187 -201 57 1 -337 126 -59 -27 17 -74 218 -210 -2 84 28 132 227 -121 249
3018B49J3R3k35P0l41L80k75j4k88K35j62L27l6m4l0J31j86m4Q2k20K46K43k55
$$ 249 262 355 120 190 -151 229 -46 -60 -348 -113 -275 52 16 -28 -58 73 -113 -157 -75 -295 -49 194 -61
3041f1K23l05J59KJ25j76j41L27N7l0k07K88k01q3P1m8k03L24j22J12j25k47J83
$$ -61 162 -143 16 18 143 -33 -174 153 210 180 -27 261 60 -23 48 0 -203 121 -1 111 -14 -261 -78
3064g8O2J80j48q5L1J35k02j38K04j00Q1k81K57J29L01k35pp4K9j09O3p6r2J03
$$ -78 -16 164 16 -69 -38 97 -105 -243 -39 -139 -58 -339 -82 47 348 113 106 32 61 -48 15 -61 -153 -50
3088e0q3o7J87j59p6m8J87N5j72J06J70l49K19R1k0n6J88j18Q0pj19J49o7O5Q
$$ -50 -133 -200 -13 -172 -248 -296 -109 -54 -226 -120 50 -299 -80 11 -9 -65 123 5 85 78 -41 108 41 106 114
3113A14J00l22L5K48Kk9m9j65K03l57N7L4K34k33L2l3j99K41J81k73J16R0p6j4
$$ 114 214 -108 -73 175 177 148 99 -66 137 -220 -163 -129 105 -128 -96 -129 -328 -87 94 -179 -63 27 -49 -63
3137f3n7J87k75J26J40k2j01J55o1J13j84q9o6K82j10L0J9l6Rl5L03m25N1N4k1
$$ -63 -120 67 -208 -82 58 36 -65 90 29 142 -42 -131 -197 85 -25 5 24 -12 -3 -38 265 -160 -109 -55 -76
3162g6O2j87L18k29j5K35m1k35K91O2k13J89K4Q3m5j08j92r3L07j67J87lj14K4
$$ -76 -14 -201 117 -112 -127 108 67 -168 123 185 -28 161 185 268 223 115 -77 -170 137 -30 157 154 40 64
3186F4L7k76J65j8j28R8J36l23J72k74L55p2j52J54j66J86L4j17K22j38K9p0L08
$$ 64 101 -175 -10 -28 -156 -58 78 -245 -73 -347 8 -64 -216 -62 -228 -42 -8 -125 97 -41 -12 -82 226
3209B26P5m6r1L0k17J64j73m2J84MN6j36j02j04P5J56l14L96l50P8LJ93j50ML71
$$ 226 301 255 164 194 -23 141 -32 -74 110 114 170 34 -68 -172 -97 59 -255 141 -209 -131 -128 65 -85 -81 290
3234B90k90p1J02Q7J9q2K7k10O8L11j55J52j52J98l64J0K29j80m6j57J10k4K70
$$ 290 0 -71 31 118 137 55 82 -128 -60 251 96 248 96 294 -70 -60 169 -11 -57 -214 -104 -128 142
3257A42j35m6n6K74k76J85k99M07l09k11M67k6Q1j88K65m4l89L81o1M4j67J1J6
$$ 142 7 -39 -95 179 -97 88 -211 196 -113 -324 143 117 198 10 275 231 -158 223 162 206 39 50 66
3280F6P5j98l0J22j33QJ7r3J44j32J2J10j69J55j37L3qL3J73J02l21J76j41M28
$$ 66 141 -57 -87 35 -98 -90 -73 -166 -22 -154 -142 -32 -201 -46 -183 -150 -158 -125 48 150 -171 5 -136 292
3304B92k82L5l21L34O0n3Q1R0j03k05Q8j84P5m9J50k99J57q9k0L67j08k55K27
$$ 292 10 45 -276 58 118 65 146 236 133 -72 16 -168 -93 -142 8 -291 -134 -223 -243 124 16 -239 -12
3327a2r5J12j4p3k3J36Q0j81J60j46M5J57N4r6k00M68l52L6J77l22p4J03j27j7
$$ -12 -107 5 -9 -82 -105 31 111 -70 90 -56 -11 146 200 104 -96 372 20 56 233 -89 -163 -60 -187 -204
3351b04K07l0M6p0j3j84K10j59R0j33M04r3R1j87j62L18O8J28n75L15M2o9m2k2
$$ -204 3 -27 19 -51 -64 -248 -38 -197 -107 -240 164 71 162 -25 -187 131 199 327 -248 67 109 40 -2 -24
3375b4K44j04m8j85n1K1K95k15J12j15K8l1k12L79l21K87j29O4J89l55M5K6K11
$$ -24 220 116 68 -117 -168 -147 148 -67 45 -70 -42 -73 -285 94 -227 60 -69 -5 184 -171 -126 -100 111
3398A11O3K6j73n6K03J5RJ9j53J51j51J09R0j57N3j63j94K16k80K06j0k9q6L6
$$ 111 174 200 27 -29 174 189 198 217 64 215 64 173 263 106 159 -4 -198 18 -262 -56 -66 -95 -181 -145
3422a45J78j79L90l94J32PK60l2k96P2J56n4j21J71j8r9o9J77k17j40L62k49q3
$$ -145 33 -146 244 -150 -18 -11 249 217 -79 -7 149 95 -26 145 127 28 -41 136 -81 -221 141 -108 -191
3445a91L62k27J32n5K4j03N0r3J93k23J01j48k9J48L0m6K00k37m1J22j88L28n2
$$ -191 171 -56 76 21 45 -58 -8 -101 92 -131 -30 -178 -207 -59 -29 -75 125 -112 -153 -31 -219 109 57
3468E7P7M3O1l30q9K19K57o19M87L0l63J87O5K9k34J43J6n3j91o4M51k71n4N0
$$ 57 134 177 238 -92 -181 38 295 -324 163 193 -170 17 82 111 -123 20 36 -17 -208 -272 179 -92 -146 -96
3492i6J76j22J9j87J75j24K26K01k97Q8k37L08j31K63j90k44K10p6J42K00j84
$$ -96 80 -42 -23 -210 -35 -159 67 268 -29 59 -178 130 -1 262 72 -172 38 -38 104 304 120
3513A20l5j24j04K4O5R4l72P4J01N4m4O9j15J25P2J06j98J07K37O8j30r7J98m33
$$ 120 85 -39 -143 -119 -54 40 -332 -258 -157 -103 -147 -78 -193 -68 4 110 -88 19 256 324 194 97 295 -138
3537a38L54k13o4qn6K14k25q0Q1K15J2k28M8P5p4L97n27K02q1m8J80l03P2K80
$$ -138 216 3 -61 -69 -125 89 -136 -216 -135 80 92 -136 -88 -13 -87 310 -217 -15 -96 -144 36 -267 -195 85
3561H5j26P9J35o9j75J55P2Pk66J59n3j42K17o4p7Q7J2j84R5N8l3J18O6m20K03
$$ 85 -41 38 173 104 -71 84 156 163 -103 56 3 -139 78 14 -63 24 36 -148 -53 5 -28 90 156 -264 -61
3586f1n4m8P4N5r5J07m3J12J2O1k62O2Q6Q7J12l94L47k08J15j70qJ13J66k50O5
$$ -61 -115 -163 -89 -34 -129 -22 -65 47 59 120 -142 -80 6 93 205 -189 158 -50 65 -105 -113 0 166 -84 -19
3611a9k2o1K13p4K8M1k16J73j73M62l20q7O9j41J5L00l3l9m0l1O2j98O3J7l1R0
$$ -19 -41 -102 111 37 65 106 -110 63 -110 352 32 -55 14 -127 -112 188 155 116 76 45 107 -91 -28 -11 -42 48
3637D8J86m47K10p7K18k00P7J70l24K48l75L77k31L03j16j37m7J27J85l02l0R7
$$ 48 234 -213 -3 -80 138 -62 15 185 -139 109 -266 111 -120 183 67 -70 -117 10 195 -107 -137 -40
3659d0Q8J99k47p7J79J12j85l0q8L3j4J43o8R3J8j5J71l62k3N0l2J41n9K24j05
$$ -40 48 247 0 -77 102 214 29 -1 -89 -56 -70 73 5 98 116 101 272 -90 -113 -63 -95 46 -13 211 106
3684A06j81R2j53l6J39L90j14j78P5k83L1l7K62j39nJ16k21J89r5O8j62J54L3
$$ 106 -75 17 -136 -172 -33 357 243 65 140 -143 -112 -149 113 -26 -31 85 -136 53 -42 26 -136 18 51
3707E1l91J13K50k44p4L83n3j18K8K62m10J81K3J13p0J07j85K5M4K1M4m2O6k11
$$ 51 -340 -227 23 -221 -295 88 35 -83 -55 207 -203 -22 1 114 44 151 -34 -9 35 56 100 58 124 -87
3731h7J5K00j88L0J04qP6j39l00K43L6n6P9j17R0L1k26K29J09k7j75p6J07P3k37
$$ -87 -72 128 -60 -30 74 66 142 3 -297 -54 -18 -74 5 -112 -22 9 -217 12 121 94 -81 -157 -50 23 -214
3756b14L68J09k50N2j7J20j84R7J00j72j2K71k21O4j01p9J81m23L93j38n0O0J6
$$ -214 154 263 13 65 48 168 -16 81 181 9 -3 268 47 111 10 -69 112 -311 82 -56 -106 -46 -30
3779c0k04J49J70q6j84J08R3R3j77L67j41j63Q9R9q8j22r6K61l5Nl67L10o7l5
$$ -30 -234 -85 85 -1 -185 -77 16 109 -68 299 158 -5 84 183 95 -27 -123 138 103 108 -259 51 -16 -51
3803e1j48Q1L00r5J07m80K78k89J04K40N2PK6k24k8J16M0J27k04K66j55J31k58
$$ -51 -199 -118 182 87 194 -286 -8 -297 -193 47 99 106 132 -92 -120 -4 36 163 -41 225 70 201 -57
3826e7R7r8Q7K39j32j23J69j9k60J22j28K54k14R5j11K53l00M3J84j33J7j46J36
$$ -57 40 -58 29 268 136 13 182 163 -97 25 -103 151 -63 32 -79 174 -126 -83 101 -32 -15 -161 -25
3849b5J23l31Q6j24N73l08Q9j33J3M8M5k1J10p1j59J81j40J54J05k02j02j15K27
$$ -25 98 -233 -147 -271 302 -6 83 -50 -37 11 56 35 145 74 -85 96 -44 110 215 13 -89 -204 23
3872B3r4k06K86N5Q2k55N4j0M4Q6k81LL38k10n2J21lj03J54j9l7p3J01j13J20
$$ 23 -71 -277 9 64 146 -109 -55 -65 -21 65 -216 -213 125 -85 -137 -16 -19 -122 32 13 -24 -97 4 -109 11
3897A1m0mM4J16j65j60K12l4K8L9p4j44K47k21L23k38N9o6K01p9K26j19o4k10
$$ 11 -29 -33 11 127 -38 -198 14 -20 8 47 -27 -171 76 -145 178 -60 -1 -67 134 55 281 162 98 -112
3921a12qJ34J69j79L02l50LJ32M8j31n1J59j27mL7Q3k87J67r3M6j75J30j38K28
$$ -112 -120 14 183 4 306 -44 -41 91 139 8 -43 116 -11 -15 22 105 -182 -15 -108 -62 -237 -107 -245 -17
3945a7J4l13L19N0K6K65j51k13K67r5k37J74j0J31l48L33k12J10j28k4LJ18k46
$$ -17 -3 -316 3 53 79 344 193 -20 247 152 -85 89 79 210 -138 195 -17 93 -35 -59 -56 62 -184
3968a84l2J13l2Kl12N07O9r8j00n7o9J70K64m48K92M4J8q0q2R8l0k7K42J7k02
$$ -184 -216 -103 -135 -133 -445 62 131 33 -67 -124 -193 -23 241 -207 85 129 147 67 -15 83 53 26 268 285 83
3993H3k26K21J35l87K41J47k21k90M00o2lRk3j76n4J94p0L0J38r0r6L62l68J06
$$ 83 -143 78 213 -174 67 214 -7 -297 103 41 38 47 24 -152 -206 -12 -82 -52 86 -4 -100 262 -106 0
4017@L31k07J54k57Ml1K31k75K4K55l45P4n8J05M1k85K13j22Q1K26l27k0L17j56
$$ 0 331 124 278 21 25 -6 225 -50 -26 229 -116 -42 -100 5 46 -239 -26 -148 -67 159 -168 -188 129 -27
4041b7j10J59j02K12j7k25J82k7j34O0R7M0k10M6O2K65m22L87j83q7K77k73k2
$$ -27 -137 22 -80 132 115 -110 72 45 -89 -29 68 108 -102 -56 6 271 -151 236 53 -34 243 -30 -52
4064e2M1R6j97p5J26J35r7P0K5j55Q6k38R1K0J94l2j45K63J79j93l4mN8L6k11
$$ -52 -11 85 -112 -187 -61 74 -23 47 72 -83 3 -235 -144 -124 70 38 -107 156 335 142 108 104 162 198 -13
4089a3J55j19J0n3k8j5J37j96J56o2J03r6J15l20K47K69l07J30p0m7r4O1k04J32
$$ -13 142 23 33 -20 -48 -63 74 -122 34 -28 75 -21 94 -226 21 290 -17 113 43 -4 -98 -37 -241 -109
4113a09N6K9R0r7J28j74J57O6L2j36k12L90j56k06K14n0k9o8J14J4j50k3j25J58
$$ -109 -53 -24 66 -31 97 -77 80 146 178 42 -170 220 64 -142 72 22 -7 -75 39 53 -97 -120 -245 -87
4137h7j28K07k12K25%j2K3o8K59o3m2o8j18J71j25N0j21J42l6R5%Q8n0l4q0M4
$$ -87 -215 -8 -220 5 5 -7 16 -52 207 144 102 34 -84 87 -38 12 -109 33 -3 92 92 180 130 96 16 60
4163F0J7k23M08k26J04k66J85N2p6k4N1N4j87j0J93j79Q7J58j13n0J17k35J98
$$ 60 77 -146 262 36 140 -126 59 111 35 11 62 116 -71 -81 112 -67 20 178 65 15 132 -103 95
4186I5o4j4Q5j75qp0M81k31l40K93J57l74K23j38K6m2K13k75J45P0k50K13l1k01
$$ 95 31 17 102 -73 -81 -151 330 99 -241 52 209 -165 58 -80 -54 -96 117 -158 -13 57 -193 20 -11 -212
4210b12L69j59p8N3K5K46j22l2j15j27J56K91j73k73q1J87j05j22K95r5k28L01
$$ -212 157 -2 -80 -27 -2 244 122 90 -25 -152 4 295 122 -151 -232 -45 -150 -272 23 -72 -300 1
4232Aj91R4K6O7K2k8q9K42p8Q4k3j24k0J04k00K23k80J77j59R1J80K14m47K02
$$ 1 -190 -96 -70 -3 19 -9 -98 144 66 150 127 3 -17 87 -113 110 -170 7 -152 -61 119 333 -114 88
4256H8P1k53q7J49j43L04j57P1k16J67j31J81J05r4j3K37k10j37J99j24Q1l32
$$ 88 159 -94 -181 -32 -175 129 -28 43 -173 -6 -137 44 149 55 42 279 69 -68 131 7 88 -244
4278b44N63l79j00J37l4K7K37j70J48j97k5J54j77k24L54J29j66J19k10j94L45
$$ -244 319 -60 -160 -23 -57 -30 207 37 185 -12 -37 117 -60 -284 70 199 33 152 -58 -252 93
4299I3j60j77J99J29L1k09L38n03J34L23m15K04J75j30j1Q3k91L84j27q6n9m3
$$ 93 -67 -244 -45 84 115 -94 244 -259 -125 198 -217 -13 162 32 21 104 -187 197 70 -16 -75 -118
4321a18k8q5L72ok70J58J55j68j52p2M87m51L45j12k99K51J84k00O4j27m0M7Q9
$$ -118 -146 -231 141 135 -135 23 178 10 -142 -214 273 -178 167 55 -244 7 191 -9 55 -72 -112 -65 24
4344B4k6J5Q0k03K17R7n5k15K69k82j01OO4K39k88J84J85m25K64j69J5J39k50
$$ 24 -2 13 93 -110 107 204 149 -66 203 -79 -180 -174 -110 129 -159 25 210 -215 49 -120 -105 34 -216
4367b16L63k45R0K11j39Ml51M51q9L7l25L33N2k20K04Rj1pl13L48q9k34J55J86
$$ -216 147 -98 -8 203 64 68 -283 168 79 116 -209 124 176 -44 160 169 158 151 -162 186 97 -137 18 204
4391B04j45m30K38J35k66K62l15L25n3P3m3j98L60k45j87M82q0N7k66K45j54R3
$$ 204 59 -371 -133 2 -264 -2 -317 8 -45 28 -15 -213 147 -98 -285 197 117 174 -92 153 -1 92
4413I2j59R3N8n5J10k0J2j96K77q4K3l06K95k07pJ09j13K66J1j12n8O0k77jJ97
$$ 92 -67 26 84 29 139 119 131 -65 212 128 151 -155 140 -67 -74 35 -78 188 199 87 29 89 -188 -189 8
4438HJ66j20J70j14j4k5k56K35j36J17J0J5j58K27k86j33J48J02r1O1j16J38j11
$$ 8 174 54 224 110 96 71 -185 50 -86 31 41 56 -102 125 -161 -294 -146 -44 -135 -74 -190 -52 -163
4461a63N71n39O4L3j10R0L10k05N5m3n2J62l64J80j6J17n7k0K2L29l03O5j39J09
$$ -163 408 -131 -67 -34 -144 -54 256 51 106 63 11 173 -191 -11 -27 90 33 13 35 364 61 126 -13 96
4485I6K3j53r2l8P3Q9j71J09j23O5kJ92j08j69N19k27O4j22j81O7P6p6N1N6J49
$$ 96 119 -34 -126 -164 -91 -2 -173 -64 -187 -122 -124 68 -40 -209 310 83 147 25 -156 -89 -13 -89 -38 18 167
4510A67Rk50M4k3J76k50K02k09P0L2nJ85k22m8K16Pj3j05j90K99n2O9O1l41K06
$$ 167 176 -74 -30 -53 123 -127 75 -134 -64 -32 -37 148 -74 -122 94 101 88 -17 -207 92 40 109 170 -171 35
4535C5P7Ok18J78k16J59K94k02j84K59Qj31j10L66j09p1m64J53J96P7J32k61n0
$$ 35 112 118 -100 78 -138 21 315 113 -71 188 196 65 -45 321 212 141 -323 -170 26 103 235 -26 -76
4558g6k2J68k64L30j0k28L30j47n5J59l30O1J19J1j60K83p18M38J82l55R3K15
$$ -76 -98 70 -194 136 126 -102 228 81 26 185 -145 -84 35 46 -114 169 -549 -111 71 -284 -191 24
4580B4j16K3J91j16J21j05q3K94l61j5L9L0m5K99m6l18M25k97K80j74o3L04l33
$$ 24 -92 -69 122 6 127 22 -61 233 -128 -143 -104 -74 -119 180 134 -184 241 -56 224 50 -13 291 -42
4603d2L01l85J16jj73J24j05K35Q4k91K64o7n4j68M2J92j70M38l11K8o3j5j75
$$ -42 259 -126 -10 -11 -184 -60 -165 70 154 -137 127 60 6 -162 -120 72 -98 340 29 57 -6 -21 -196
4626a96K42n3M1l15L05k32J95L0j16J55K47n33L86k22j73P6J83K12m00J98P6j2
$$ -196 46 -7 34 -281 24 -208 -13 17 -99 56 303 -230 156 -66 -239 -163 20 232 -168 30 106 94
4648I4rj42p4K84k12J18j12J76l28K99j81jL34p8j37J44k3k19jj3J49K5r2j0M10
$$ 94 85 -57 -131 153 -59 59 -53 123 -205 94 -87 -88 246 168 31 175 152 -67 -68 -81 68 93 1 -9 401
4673D01m32j22K65j68L0J66j27J7l78K59q2K00l2j57J38J63l54M37j81Nj58J69
$$ 401 -31 -153 112 -56 -26 140 13 30 -348 -89 -171 29 -3 -160 -22 141 -213 224 43 48 -110 59
4695E9k14J48o9L24k06J5L3j44%J29MR2j28j56L9M8r8L8M27J2l86j03M67l80l8
$$ 59 -155 -7 -76 248 42 57 90 -54 -54 75 79 171 43 -113 -74 -26 -124 -86 341 353 -33 -136 331 -49 -87
4720h7L3K55m18M22j27l13L73k23J23J51m46M35P9q8j50L6k44N48l05k34M01l0
$$ -87 -54 201 -217 205 78 -235 138 -85 38 189 -257 178 257 169 19 55 -189 359 54 -180 221 191
4742A91l08P7M4j29K52k85M95l98P5R2n0R2p3j06N6o4K02k86M5J40n5RQJ12o3
$$ 191 -117 -40 4 -125 127 -158 337 -61 14 106 56 148 75 -31 25 -39 163 -123 -78 62 7 16 24 136 73
4767G3q3K39l81J32r9OJ56qo4N6Q0R6q1l6l70K23O7n1k4k78O39n81K72Pl6J70
$$ 73 -10 229 -152 -20 -119 -113 43 35 -29 27 107 203 122 86 -284 -61 6 -45 -69 -347 292 -289 -17 -10 -46 124
4793A24r4j47K70j05Q7K04j46l38K20k04r0J95Q4k42J95j86J06qq2J64k06L86
$$ 124 30 -117 153 48 135 339 193 -145 75 -129 -219 -24 60 -182 13 -173 -67 -75 -157 7 -199 187
4815A87k51J10J06l82K50r0J60n4J45j51J37j3j55N4k34q8M99k66M7j15K16j09
$$ 187 -64 46 152 -230 20 -70 90 36 181 30 167 154 -1 53 -181 -269 230 -36 11 -104 112 3
4837Cj27K69k03K4K36o04N09n7j94J49j83L0J50j90K20J87r4j24k34J25N1J74
$$ 3 -124 145 -58 -34 202 -402 107 50 -144 5 -178 -148 2 -188 32 219 125 1 -233 -108 -57 117
4859A17Q9j34L4k25L0K1r5M79l16OK05m18J49J12p3r8J12L93n36j08K11J41J72
$$ 117 206 72 106 -119 -89 -68 -163 316 0 6 211 -207 -58 54 -19 -117 -5 388 -148 -256 -45 96 268
4882B68k10j25j99L79j65J90n2j01R4k33K39o4q5%K20k65N9M6qM1O2k51L04m38
$$ 268 58 -67 -266 113 -52 138 86 -15 79 -154 85 21 -64 -64 156 -109 -50 -4 -12 29 91 -160 144 -294
4906b94K01J77j75J25m20K64P8j94J62Q4l02O2L6J36M1r1K98j67M7J98m06K94
$$ -294 -93 84 -91 34 -386 -122 -44 -238 -76 8 -294 -232 -196 -60 -19 -110 188 21 68 266 -140 154
4928A54q5Pj82L6Q0mJ27l0n7j07M5q9Q1j87K31J33l17J51J50k50O9l8k53N26l35
$$ 154 69 76 -106 -70 10 6 133 103 46 -61 -16 -105 -24 -211 20 153 -164 -13 137 -113 -44 -82 -335 191 -144
4953a44om7kO1L63k00l3J2P8K17l41o9K65j12j40J66Q1l18J84j68K22j4m8k3j3
$$ -144 -150 -197 -199 -138 225 25 -8 4 82 299 -42 -111 154 42 -98 68 149 -169 15 -153 69 55 7 -16 -29
4978b9m1k19n8L64j49J36j16J89j83j24L36J38l42k1p3J82j7L25m25M8L4J93l86
$$ -29 -70 -289 -347 17 -132 4 -112 77 -106 -230 106 244 -98 -119 -192 -10 -27 298 -127 -79 -45 148 -238
5001b38K30M7k3o9M6P9P5k74J48m6R5p4O7m3k24K5N5Q5N9P1k85L90l24N3n0K81
$$ -238 -8 39 16 -53 -7 72 147 -127 21 -25 70 -4 63 20 -204 -179 -124 -39 20 91 -194 196 -128 -75 -125 156
5027A56l94M49j03j44O9j6N0j37J94k62N8K40q1P6k46j71K89l19L68J24j05J10
$$ 156 -238 211 108 -36 33 17 67 -70 124 -138 -80 160 79 155 -91 -262 27 -292 76 200 95 205
5049B05k39J62J62k94J3O6o1J41j23kN2j13j16J27k19J81K66j33j31J8p1K71k86
$$ 205 -34 128 290 -4 9 75 14 155 32 30 82 -31 -147 -20 -239 -58 208 75 -56 -38 -109 162 -124
5072a24M43j8k7j74l52L67K8k62M4J98Pk75J74l15K54Qk1K64j93j3J33j42k10
$$ -124 319 301 274 100 -252 115 143 -119 -75 123 130 -145 29 -286 -32 -24 -45 219 26 13 146 4 -206
5095b06N2K35K2p1J9n6QK25k72O8j37K83j26M4N7O4k59J90r9k36n9N18k23j29
$$ -206 -154 81 103 32 51 -5 3 228 -44 24 -113 170 44 88 145 209 -50 140 41 -195 -254 264 41 -88
5119h8J63k80L46j53J14j25l2P3k40J99P7k41P9J17k80K44P5Q1j92n2jR0r0J28
$$ -88 75 -205 141 -12 102 -23 -55 18 -222 -23 54 -187 -108 9 -271 -27 48 129 -63 -115 -116 -26 -116 12
5143A2K17k52K16J6j78o7j54J63j53K65K66m66J03K2J44j51K98j78m2r7J42r8
$$ 12 229 -23 193 209 31 -36 -190 -27 -180 85 351 -115 -12 10 154 3 301 123 81 -16 126 28
5165B8P4j16K16j90j96J15k25J00K64q3j25P1o1K80r1J27j36l88L48Q1j00J31
$$ 28 102 -14 202 12 -184 -69 -294 -194 70 -13 -138 -67 -128 152 61 188 52 -336 12 93 -7 124
5187A24j98J01N8j7J04k68J31m6J45k97K13m4q0Q9J0Q1m9j94j0L30j23j74q2J87
$$ 124 -74 27 85 68 172 -96 35 -11 134 -163 50 6 -74 15 25 106 57 -137 -147 183 60 -114 -196 -9
5211iK31l10J48k35L2J90l2p1J14l92K45o0K61Q2M1l08L31m39M69j42l68J59J40
$$ -9 222 -88 60 -175 -143 47 15 -56 58 -334 -89 -149 112 194 235 -73 258 -181 288 146 -222 -63 77
5234G7O4j87j1L8n8J74j57m1M9j7J44K02m14J19m4K44k71K05m0o6J26k91J40K27
$$ 77 141 -46 -57 -19 -77 97 -60 -101 -52 -69 75 277 -137 -18 -62 182 -89 116 76 10 136 -155 -15 212
5258B12j57k26m1j2L27J17l56O5%P1j05J67j05j23M55r9l14n9K23j01K29k38N8
$$ 212 55 -171 -212 -224 103 220 -136 -71 -71 0 -105 62 -43 -166 289 190 -124 -183 40 -61 168 -70 -12
5281a2k91K28J03l14L26k0J37K1%q4o7r5J89k29K21j14k02J96j98K09P9j06J20
$$ -12 -303 -75 28 -286 40 20 157 178 178 94 27 -68 121 -108 113 -1 -203 -7 -205 4 83 -23 97
5304I7j17j79R0K38m5k90M52j6l32Q4K73k55n7rP1K03l98J23J27L5j93J30n8k5
$$ 97 -20 -199 -109 129 84 -206 246 230 -102 -18 255 0 -57 -66 5 208 -190 -67 60 95 -98 32 -26 -51
5328e1j8n3J84k69K85p1J12p3l8j15p3j1OJ47J1m88L11Q1K01P5k76O2J78J7l29
$$ -51 -69 -122 62 -207 78 7 119 46 8 -107 -180 -191 -185 -38 -27 -515 -204 -123 78 153 -123 -61 117 134 -195
5353a95K73K16j03k30J34k41R2L25j47r2k57M18nj57k0q8J54k53L87l65J06j89
$$ -195 78 294 191 -39 95 -146 -54 271 124 32 -225 193 188 31 11 -77 77 -176 211 -154 -48 -237
5375b37N19n08N04j97J24j40N1j61L3K2r8J19j51K63k61q4K61k44J73J3Q7k2m7
$$ -237 282 -226 278 81 205 65 116 -45 -12 10 -88 31 -120 143 -118 -202 59 -185 -12 1 88 66 19
5398A9KN4k3l25L34P2l05L03n4j00r0J18r5J15j08J82O9l51L9j0M33k08j53K25
$$ 19 21 75 52 -273 61 133 -172 131 77 -23 -113 5 -90 25 -83 99 168 -183 -144 -154 279 71 -82 143
5422A43j36n1R6m43O34n9mk90R9q4J73j51K00k61P7K62k18J48k33j04L89j36o1
$$ 143 7 -44 52 -391 243 184 180 -110 -11 -95 78 -73 127 -134 -57 205 -13 135 -98 -202 187 51 -10
5445a0K56k87j40J17q5K37M5j15l3j98P1K19q7O4j40J27j28K06r8M2p4M0k4P2
$$ -10 246 -41 -181 -64 -149 88 133 18 -15 -213 -142 77 -10 54 -86 41 -87 119 21 63 -11 29 5 77
5469G7n7O4J2k37J98M5j0L5l32J34l2J24q1K18l75K63M0L9j47Q5j52nOO6p9kl3
$$ 77 20 84 96 -141 57 102 92 127 -205 -71 -103 21 -60 158 -217 46 86 125 -22 63 -89 -94 -88 -22 -101 -103 -136
5496a36J48N6j15J95m38K23OK01j4M3k05j61L43j81k7Q1l8J28k2l7j65K15j31
$$ -136 12 68 -47 148 -290 -67 -61 140 126 169 -36 -197 146 -35 -62 19 -19 109 87 50 -115 100 -31
5519c1k4R1r9L16j48k80N2K2N6J00N6l0j71J74k32K87k02K77j79r2j59j39M09
$$ -31 -55 36 -63 253 105 -175 -123 -101 -45 55 111 81 -90 84 -148 139 -63 214 35 -57 -216 -355 54
5542E4J59j32k60K86m1M6l38K37k9J10p9n6j34J67J57j32k41K07J94j58R9j64
$$ 54 213 81 -179 107 66 112 -226 11 -18 92 13 -43 -177 -10 147 15 -226 -19 175 17 116 -48
5564d8L2l6q7L25N8m65K2K22N4P1j54n4k2M04n74K9K68Q5j5Kk58Q6K22J05j62
$$ -48 -16 -52 -139 186 244 -221 -199 23 77 148 -6 -60 -82 322 -252 -223 45 130 115 117 -141 -55 167 272 110
5589A10N4k10Q9j15J05j33J66j91J07L8Lk1L5ml5q1o5K82k01K97k63K6k30M79
$$ 110 164 -46 43 -72 33 -100 66 -125 -18 20 23 2 37 33 -2 -83 -148 134 -67 230 -33 -7 -237 242
5613B42k98L40j10n0J4q8P1J6j76L18n24J20O2oK38l89J26M1K37k96J67J80j4
$$ 242 -56 284 174 124 138 50 121 137 -39 279 -245 -125 -63 -69 169 -220 -94 -53 184 -112 55 235 221
5636B21j03j83K6K46j05J05p8M9j09j18l14L51R1Q9q8j82m0L89k67J03l04J40
$$ 221 118 -65 -39 207 102 207 129 178 69 -49 -363 -12 79 168 80 -102 -142 247 -20 83 -221 -81
5658h1o7k7M02m09k51M07j42JJ53r2K56l22R5Q5K49k75k1K11k99L53k01R5j0j92
$$ -81 -148 -175 227 -182 -433 -26 -168 -167 -14 -106 150 -172 -77 8 257 -18 -39 172 -127 226 25 120 110 -82
5682h2j5j00M6K15k43J14J84j58J99j42L1j67J18O1L3m24N46m09J55O8p6L7L85
$$ -82 -97 -197 -151 64 -179 -65 119 -39 160 18 49 -118 0 61 94 -330 216 -193 -38 30 -46 -9 376
5705C76l26j94K71k81J71Q7l16J61J02k1J71J07r6k90l0K08k31K51P9Pl25k3J70
$$ 376 50 -144 127 -154 17 104 -212 -51 51 30 201 308 212 -78 -108 100 -131 120 199 206 -119 -142 28
5728B8K41j93o3j40J33r6o4J96r0q4n3o2J48J97Jq9O8Q6r4j0k02J31K13j73J37
$$ 28 269 76 13 -127 6 -90 -154 42 -48 -132 -185 -247 -99 98 99 10 78 164 70 60 -142 -11 202 29 166
5753A66m5k64K11j21R2K43m65K72l74N3m5K17J6R5j15JK08j74k60K04R6Q1N3j4
$$ 166 121 -143 68 -53 39 282 -183 89 -285 -232 -277 -60 -44 51 -64 -63 145 -29 -289 -85 11 92 145 131
5777A31nj00L94m48O0j61K61k13J7J88o0j86K05P5j34k39K49j07K15o8J0j12J49
$$ 131 126 26 420 -28 32 -129 132 -81 -64 124 64 -122 83 158 24 -215 34 -73 142 74 84 -28 121
5800A21R3m20K01K82m13k6K6K51m3j21K0j0L33m05M36l09j5m9M4l7J02k2N9m12
$$ 121 214 -206 -5 277 -136 -162 -136 115 72 -49 -29 -39 294 -111 325 16 1 -48 -4 -41 61 39 98 -314
5824c14J43K88k68Q6L80k66n7j43J48n6O3J72r4k21M22q9J1j35R5l36J57N4q0
$$ -314 -171 117 -151 -65 315 49 -8 -151 -3 -59 4 176 82 -139 283 194 205 70 165 -171 -14 40 -40
5847d0J87j00lp7p9k6j8K94L4l9k68J59J37pk41M8j98K69pq0q6j27J10R8K1L6
$$ -40 147 47 44 -33 -112 -138 -156 138 172 133 -135 24 161 154 -87 -39 -237 32 25 -55 -141 -268 -158 -60 -39 -3
5873cM4L6r6OJ29k24K20n8j87J88O7k42o9P5K27n5pj41J55k14Q4J46j25r3J15
$$ -3 41 77 -19 -13 116 -108 112 54 -133 55 122 -120 -189 -114 113 58 51 -90 65 -149 -65 81 -44 -137 -22
5898b2Q5p5J29j10j42J99j56K68j13k62L53j60J44p2J2J1j42L18l74J20j18L13
$$ -22 63 -12 117 7 -135 64 -92 176 63 -199 154 -6 138 66 78 89 -53 265 -109 11 -107 206
5920B06j88P5n2J3J08j89j28J56j31L93k54K46k05l11L71j64J14J66Lk91P4K0
$$ 206 18 93 41 54 162 -27 -155 1 -130 263 9 255 50 -261 110 -54 60 226 229 -62 12 32
5942C2j46J29j53J33r8K94j30Pk17J13j24O7p6q4K35K70q7Q6l29P3kk46J95K42
$$ 32 -114 15 -138 -5 -103 191 61 68 -149 -36 -160 -93 -169 -253 -18 252 165 251 -78 -5 -7 -253 -58 184
5966A84j17j48r0J41R6r1n4O3j81J46L6Q2j73J74J11m3k20n5L42k47K4l5J17j11
$$ 184 67 -81 -171 -30 66 -25 -79 -16 -197 -51 -15 67 -106 68 179 136 -84 -139 203 -44 -20 -55 62 -49
5990d9J19o5P1J7Qj14j17L1j3J85K72o99N36J5m76L98n7p6L6pK7L8K10j12k96
$$ -49 70 5 76 93 101 -13 -130 -99 -112 73 345 -354 182 197 -279 119 62 -14 22 15 42 80 290 178 -118
6015a18L28j57l12J08J99Pm9j03j90M2L71k14K54j51K09l31o9K40j36J9r1K09
$$ -118 210 53 -259 -151 48 55 6 -97 -287 -245 126 -88 166 15 224 -107 -176 64 -72 -53 -144 65
6037F5M0j26J96r9j66J27j64J29k44MM38k96K05j72k3J29k05N3J86j37P6J39k51
$$ 65 105 -21 175 76 -90 37 -127 2 -242 -238 200 -96 109 -63 -86 43 -162 -109 77 -60 16 155 -96
6060i6j45K02J20p3m20M82q0j24J82j61k27L92oj80K29l32J4PK47j4m8j2op5J52
$$ -96 -241 -39 81 8 -412 70 -10 -134 48 -113 -340 52 46 -134 95 -237 -223 -216 31 17 -31 -43 -49 -124 28
6085B8P9j82o3K25j43J14j06l4o2J22K19j38J36j44K5q5Q9o3J49j34J14k89J24
$$ 28 107 -75 -138 87 -56 58 -48 -82 -144 -22 197 59 195 51 76 -9 80 17 166 32 146 -143 -19
6108a9P0J24k22lK43j72K6k36J18J47r0J13l75M91q5j04J10j94R2K07J5l52j01
$$ -19 51 175 -47 -50 193 21 47 -189 -71 76 -14 99 -276 215 130 26 136 -58 34 241 256 -96 -197
6131a97N18l30K54k01J8k02J53l3J30n9r7J45O7L0j79r7J46k46J76jj01N8K28
$$ -197 321 -9 245 44 62 -140 13 -20 110 51 -46 99 166 196 17 -80 66 -180 -4 -5 -106 -48 180
6154A80j58j34L4L7K02j49N5Q8j83l6k94M62j18K23j42J55k10q1L29k21J3Mkj86
$$ 180 22 -112 -78 -41 161 12 67 155 -28 -64 -358 104 -14 209 67 222 12 -69 260 39 52 56 54 -132
6178a32L03j00R3L2k43L26k6k28k4j25k07L98k51M1K08J96j13l30K60k85K84L8
$$ -132 171 71 164 196 -47 279 253 25 1 -124 -331 67 -184 -143 65 261 148 -182 78 -207 77 115
6200A15K84l20Po0l8M2k31K12N8j97O2p7K13m72O45k43L22m51K52l58J50P0N6
$$ 115 399 79 86 26 -12 30 -201 11 69 -128 -66 -143 70 -402 243 0 322 -129 123 -235 -85 -15 41
6223D1m7k17K06k9K9K46l63P2J76o4L4m7j55m6P2Q3k1J11o6M8r8J1K06k95N8j41
$$ 41 -6 -223 -17 -46 -17 229 -134 -62 114 50 84 37 -118 -164 -92 -9 -30 81 15 63 -35 -24 182 -113 -55 -196
6249a96J85k5J34P7j15k7j72K82O2l32J38o4M8J04p8K00m36L36r1j4j64Q2K1R
$$ -196 -11 -36 98 175 60 33 -139 143 205 -127 11 -53 -5 99 21 221 -215 121 30 16 -148 -66 -45 -36
6273c6O6k24J31J02j00J93k5%Ro1k5q5J07k60J03m3J65p0J1L82k96J87l77J05
$$ -36 30 -194 -63 39 -61 132 107 107 116 55 30 -55 52 -208 -105 -148 17 -53 -42 340 44 231 -146 -41
6297d1j3M9L2k3P3j18q7K13Nk65J60l21K49K26j50m7j0J03O2k66P8J6K87l62J
$$ -41 -54 -5 27 4 77 -41 -128 85 90 -175 -15 -336 -87 139 -11 -58 -68 35 97 -169 -91 -75 212 -150 -149
6322a49Q4J87k81J14Pp2O2j5L7J14j00o9k8K68N1r1l81O7K24k38K51o4l7J29j87
$$ -149 -65 122 -159 -45 -38 -110 -48 -63 -26 88 -12 -81 -109 159 210 119 -262 -195 29 -209 42 -22 -59 70 -117
6347a17O4L4k11K52J10j95Q7r2L38k07R3L3j99q3p0M79j04l47K55j72L90k55P
$$ -117 -53 -19 -230 22 132 -63 24 -68 270 63 156 189 -10 -93 -163 316 212 -135 120 -52 338 83 90
6370I0j76J0K2k14L25j53K91j81N7k80K2L46l15K72j99L37k34j79J29M1K31k97
$$ 90 -86 -76 -54 -268 57 -96 195 14 71 -209 -187 159 -156 116 -83 254 20 -159 -30 11 242 -55
6392e5RK1J16j01J03J96j48K0k39J44k98J36J75Q4j02Q7l74R8J83k25K76k42K19
$$ -55 -46 -25 91 -10 93 289 141 161 -78 66 -232 -96 79 163 61 148 -226 -128 55 -170 106 -136 83
6415H3N2J61l40K72m36M48j85O1k56K28rj53K50j69P3N2N2l59K18j30K89P4l06
$$ 83 135 296 -44 228 -208 240 55 116 -140 88 79 -74 176 7 80 132 184 -175 43 -87 202 276 -30
6438c0J72k64J56k78J23k17K23R0n5j11M02k39k3j00R3j5J09k54K82k15J23j28
$$ -30 142 -122 34 -244 -121 -338 -115 -25 -80 -191 211 -28 -51 -151 -58 -73 36 -218 64 -151 -28 -156
6460a56M24k32r4R3j04P2J38l88O0j6L95j62j63J12o6K67j31j30n5J04J96l39
$$ -156 268 36 -58 35 -69 3 141 -247 -187 -203 192 30 -133 -21 -87 180 49 -81 -136 -32 164 -175
6482a75L24r9j35K05Q1Jk28J15j37j48K75lj53J83l3r3l1LK30k75j8m2J68K06
$$ -175 149 50 -85 120 201 202 -26 89 -48 -196 79 76 -77 106 73 -20 -51 -48 182 -93 -111 -153 15 221
6506B21N3k20Qkk12J65j92J55j82M12Jj42oJ37j54L47m61J00j52P5J26K4m7J71
$$ 221 274 54 62 60 -152 13 -179 -24 -206 206 207 65 59 196 42 389 -72 28 -124 -49 77 101 54 225
6530B25m2m26K43n6m8R4P7n1J49k80J16k47J85R9Pl50L83k23K01j2j58K82j64
$$ 225 183 -243 0 -56 -104 -10 67 16 165 -115 1 -246 -61 38 45 -305 78 -145 56 44 -114 168 4
6553Dq5k5J57j55K7P3J19l6L6J4j65J86j52r5n2J62q4M9J09n5l9M3k10K4J90o
$$ 4 -81 -106 51 -104 -77 -4 115 79 115 129 -36 150 -2 -97 -149 13 -71 -22 87 32 -7 36 -174 -150 40 34
6579C4J99l80N6J24K4J97j77m0qR7j18j66J84J62j43N4Nj2r3J0l3j57J10J33l35
$$ 34 233 -147 -91 33 57 254 77 37 29 126 8 -158 26 188 45 99 104 92 -1 9 -24 -181 -71 62 -273
6604b73J67J93k42J27J95j48K00k56L2j16R7o1J02L5j17J46n0j38K91l7j98p2
$$ -273 -106 87 -155 -28 167 19 219 -37 -5 -121 -24 -85 17 52 -65 81 31 -107 184 147 -51 -123
6626a23J27Kj94O6K6r1L57l43J01O6O6K13k75K11k7m6k04P4j60J93m7K05l95Q9
$$ -123 4 6 -188 -122 -96 -187 170 -173 -72 -6 60 273 -2 209 182 136 -68 6 -154 39 -8 197 -198 -109
6650a09j62K46K85o3k36q9L02k19J30k38K60l04J96k56J90J23j16o3J37j87L73
$$ -109 -271 -25 260 197 -39 -128 174 -45 85 -153 107 -197 -1 -257 -67 56 -60 -123 14 -173 200
6671B00j27r3k26K18J07J10k26l6M3J03L1l2k27R9k0J00J07j70j16J72r1K1j65
$$ 200 73 -20 -246 -28 79 189 -37 -73 -30 73 104 72 -155 -56 -76 24 131 -39 -155 17 -74 -53 -218
6694b18L82J8Nj06K9q9j3oK47k93q3K45j4j5k54L3J27J21l76J10M21k45m1O7k3
$$ -218 164 182 187 81 110 21 8 2 249 -44 -127 118 104 89 -165 -132 -5 116 -260 -150 271 26 -15 52 29
6719B9k01j02k9L38P5l14K86K44k43o7K1K7O0j29O1k25j4Q3p0K08j87K0K91l57
$$ 29 -172 -274 -303 35 110 -204 82 326 83 16 37 64 124 -5 56 -169 -183 -100 -170 38 -149 -129 162 -195
6743a95o2M26O3k19j20J96o2j53J16j54KO5j9J47J6N2lk03J61p8r9j9J95N1k5
$$ -195 -257 169 232 13 -107 89 27 -126 -10 -164 -162 -97 -116 31 47 99 96 -107 54 -24 -123 -142 53 104 79
6768G9q0j40L37j26k08K13l33O3M58j77k11p9J83q1J01J03j12M4Q4r8j6l4kQ8
$$ 79 -1 -141 196 70 -138 75 -258 -195 263 86 -125 -204 -21 -102 -1 102 -10 34 118 20 4 -30 -32 56
6792E6J35k71o1K12M1k01J98K9m74J38K27j0r5M9Q2N8j84J13p1k32M9R5J20J50
$$ 56 191 -80 -141 71 112 -89 109 138 -336 -198 29 19 -76 -27 55 113 -71 42 -29 -261 -212 -117 3 153
6816A53Q5k15n3O9qrl2k8lR2j47J84Nk62J24m8Q7J68J37k42j55N3L81j98k18J32
$$ 153 238 23 -30 39 31 22 -10 -38 -41 51 -96 88 93 -169 -45 -93 -6 162 299 57 -98 -45 336 138 -80 52
6842E2J2l3pj58J50J43k68N4K6J38j44N9p0J08J78P6l06j07j78M1K20N9j47M3
$$ 52 64 31 24 -134 16 159 -109 -55 -29 109 -35 24 -46 62 240 316 10 -97 -275 -234 -14 45 -102 -59
6866e9J24j46J93k42K23m7Q4L1k98J21L5j9J31J41k19L9Rk3k87J42K23j94k12
$$ -59 65 -81 112 -130 93 46 130 161 -137 -16 19 0 131 272 53 92 101 78 -209 -67 156 -38 -250
6889b50K24j6l0Jo7J81r3L6l4O9J82m08K46k00M3mQ6p7L68j13Rj93k50L04K52
$$ -250 -26 -42 -72 -71 -138 43 -50 -14 -48 21 203 -205 41 -159 -116 -120 -34 -111 257 144 153 -40 -290 14 266
6914B66k73Q2n1m0J49k14K23j43J00j35o0n1K93p2K2j41p3K26k81L8j3K2J26o
$$ 266 -7 75 24 -16 133 -81 142 -1 99 -36 -96 -147 146 74 96 -45 -118 108 -173 -135 -148 -126 0 -6
6938fo5NK77n9j47l4j18P6K46J05k71K72m10P8L64k18j15K23k98K5K57k95R4K34
$$ -6 -71 -66 211 152 5 -29 -147 -71 175 280 9 281 -129 -51 313 95 -20 203 -95 -70 187 -108 -14 220
6962B20l89J33j41R1L14l38K64j92LJ09N5j96K6J56k66J44L3r9J33o2J34q4k6
$$ 220 -169 -36 -177 -86 228 -110 154 -38 -35 74 129 -67 -41 115 -151 -7 26 -73 60 -2 132 48 22
6985B2Lp1J31l8j75J48J6j77J46p4j03K68j20J73J12l00J67J19l35J04K8l9k10
$$ 22 25 -46 85 47 -128 20 36 -141 5 -69 -172 96 -24 149 261 -39 128 247 -88 16 44 5 -205
7008b05J15J52J1O6n3m6o9O8O6k6q1L7q5J43K7j33M3K58k59q2J4J51j27j29R1
$$ -205 -90 62 73 139 86 40 -29 39 105 79 -2 35 -50 93 120 -13 30 288 29 -53 -39 112 -15 -144 -53
7033e3j10J14k22M43l8L4k05J86m2r3M0P4j51J42m3j57J24K09j96J49j75J26K5
$$ -53 -163 -49 -271 172 134 168 -37 149 107 14 54 128 -23 119 76 -81 43 252 56 205 30 156 181
7056A81k06oJ65R9l63L18j93p6J78J17l64L17l83K03o4n3J10J01pn0rL2j1r4J83
$$ 181 -25 -31 134 233 -130 188 -5 -81 97 214 -150 167 -216 -13 -77 -130 -20 81 74 24 15 47 36 -58 125
7081A25J7k16J07J79k4Jm72K6N2K58K11j56j82l7J00jn6J14J18k45M2J04j98n
$$ 125 142 -74 33 212 188 189 -283 -257 -205 53 264 108 -74 -111 -11 -12 -68 46 164 -81 -39 65 -133 -138
7105a38r1L39N5k49K55k4M4j88nK18j42p0j96P0J31J23k13L1K88l62J57J4j18
$$ -138 -229 110 165 -84 171 147 191 3 -2 216 74 4 -192 -122 9 132 -81 -50 238 -124 33 47 -71
7128g1J35J9J25k44m8K92j43j93J75%J00j05Kj6n7J08J08j05k7j8o7J45j10J76
$$ -71 64 83 208 -36 -84 208 65 -128 47 47 147 42 44 28 -29 79 187 82 55 37 -30 115 5 181
7152A81j14k1J35r6j54j48L75j86M4j82K53j63j37J02M1l47M12J71k54K38k43
$$ 181 67 46 181 85 -69 -217 158 -28 16 -166 87 -76 -213 -111 -70 -417 -5 166 -88 150 -93
7173i3K57j2p4k03J37n0K64k46o4l0K52l37L64k13J27o9k9jL38j43Nk86p0J52
$$ -93 164 152 78 -125 12 -38 226 -20 -84 -114 138 -199 165 -48 79 10 -19 -20 318 175 180 -106 -176 -24
7197b4j00Q4l9J31p1k13K07j23J08J0j78NQ2L52j98P3L5qj44l52L77l9J10k72
$$ -24 -124 -40 -79 52 -19 -232 -25 -148 -40 -30 -208 -203 -121 231 33 106 141 133 -11 -363 14 -25 85 -187
7221a87J14j02J79P4p9J48K32l35L5j8K4j35K90J01j9k82k19o6QJ77R3L8j35K82
$$ -187 -73 -175 4 78 -1 147 379 44 79 61 85 -50 240 341 322 40 -179 -245 -237 -60 33 71 -64 218
7245B18k47R7k8n9j63J42J8N9l37J2K04K7K5O3j10j71J21K57k92J2K89k52J32
$$ 218 -29 68 40 -19 -182 -40 -22 37 -300 -288 -84 -57 -32 31 -79 -250 -129 128 -164 -152 137 -115 17
7268A7k73M88j79j05K16k96J43j45L68k10R7j08j52J35P1k10R2j0N0k14J31j12
$$ 17 -256 232 53 -52 164 -132 11 -134 234 24 121 13 -139 -4 67 -143 -51 -61 -11 -225 -94 -206
7290b06J64K45l16K12k47M32j56LK8j67k12K76m7J03L0J09j02M3n50M52k02j29
$$ -206 -42 203 -113 99 -148 284 128 131 159 -8 -220 56 9 112 142 251 149 192 -358 94 -108 -237
7312b37J2K75k0l0K40n36L86Qk9k26J40j62J3K07j6j43Q8J38k30L04j50J52M4
$$ -237 -225 50 30 0 240 -296 90 98 69 -157 -17 -179 -166 41 25 -118 -30 108 -122 182 32 184 228
7335B28j05q9n1M7j27j07J45j41K61p5J49l62L00m5Q9O7l55N0Q8j78L28k58K90
$$ 228 123 34 -17 30 -97 -204 -59 -200 61 -14 135 -227 73 28 117 184 -171 -121 -33 -211 117 -141 149
7358A49k90J09L61m79R7ln3J30j68K59mJ4k87R9R2r0j59L21k08K28k00L28l96
$$ 149 -141 -32 329 -150 -53 -56 -109 21 -147 112 108 122 -165 -66 26 -64 -223 98 -110 118 -82 246 -150
7381a50K5mJ87l5M7l31J28j36K83j24R5j73J43J85l07J92Oj50J23nM1J02j81K39
$$ -150 -125 -129 58 23 70 -261 -133 -269 14 -110 -15 -188 -45 140 -167 25 31 -119 4 -1 40 142 -39 200
7405B00l51L47k37M88n71J84k09O4N6o3J98q8nj7M1P8m4J47k51L6mJ14k26pJ21
$$ 200 -151 196 -41 447 -124 60 -149 -85 -29 -92 106 18 13 -4 37 115 71 218 -33 3 -1 113 -113 -120 1
7430An5K00k79L2J81n4n9J08q5k80M47n6j74j25J90j42j5J09nk40J06M4L54k05
$$ 1 -54 146 -133 -101 80 26 -33 75 -10 -290 157 101 -73 -198 -8 -150 -165 -56 -61 -301 -195 -151 203 -2
7454bjj27R1J2J18k6o7P0J70j05l47J17m8L24k81J40k66J68j41J97LJ42j56K47
$$ -2 -3 -130 -39 -27 91 65 -2 68 238 133 -214 -97 -145 179 -102 38 -228 -60 -201 -4 -1 141 -15 232
7478B32l74J83j34q5K5J42J27M0j86J90o9lq7K40k24r0K04k56R1j5J09k95K29
$$ 232 -142 41 -93 -178 -153 -11 116 156 -30 160 91 88 1 241 17 -73 131 -125 -34 -49 60 -235 -6
7501fj45L16j24l34L81k01J24L27n09R3J4J18o4J81k3j12Q1j17m2j45K59j68J59
$$ -6 -151 165 41 -293 88 -113 11 338 -171 -78 -64 54 -10 171 148 36 117 0 -42 -187 72 -96 63
7524F3k34K14k17L11k38J4k8L41k70L48l80J39q4Q2m0r3M4p2J6L11k70k06K41
$$ 63 -171 43 -174 137 -101 -87 -115 226 -44 304 -76 63 -21 61 21 -72 -28 -100 -84 227 -43 -249 -8
7547hq9J57j01O4j85J28N9j24L24j47j18J06k26Q7N4K67j21lk21M37k63j63J44
$$ -8 -97 60 -41 23 -162 -34 25 -99 225 78 -40 66 -160 -73 -19 248 127 124 -97 340 77 -86 58
7570E8q2k9k37J94Pj5j1L69n10L87m2j29M3j18R1Q0j76j55L63J05l2j76J84m4
$$ 58 -24 -53 -290 -96 -89 -104 -115 254 -256 131 89 -40 3 -115 -24 56 -120 -275 88 193 161 -15 169 125
7594A25m4n4k8J09k15M3q9J58lKK17j89L4k28J31J40J19l18J57k33K84o6m7Q6
$$ 125 81 27 -1 108 -107 -64 -153 5 2 4 221 32 66 -162 -31 109 228 -90 67 -166 118 52 5 91
7618I1j26r1l5M96m30%K3M4M51n84O8J07n5N1j44K66o7Q9j4o2k69J93N4l5r1K02
$$ 91 -35 -126 -161 335 -95 -95 -72 -28 423 -161 -93 14 -41 10 -134 132 65 154 140 78 -191 2 56 21 -70 132
7644A32m06M37j04n5Jq1K25nq2j19j8P7j09K07kj12P8j95l0K52k30K19m3j4O0
$$ 132 -274 163 59 4 5 -76 149 144 62 -57 -75 2 -107 100 98 -14 64 -131 -161 91 -139 80 37 23 83
7669H3k3j11K63j37k17j40K53j22M73k25m4j62n6K72Rj89K4K19l08L72j42j96
$$ 83 60 -51 212 75 -142 -282 -29 -151 322 97 53 -109 -165 107 116 -73 -49 170 -138 234 92 -104
7691a04L1K49k97Q1J01J20l15J18R2j01k84J58K81Mk13j94J60Q2k34K22j53L16
$$ -104 -73 176 -121 -40 61 181 -134 -16 76 -25 -309 -151 130 134 -79 -273 -113 -31 -265 -43 -196 120
7713A20j26J0O1l04L34l9j6J59k08J95l09J33l4M1m6n5J60k5k19J92Pq4j17K46
$$ 120 -6 4 65 -239 95 56 40 199 -9 186 -123 10 -24 17 -29 -84 76 51 -168 24 31 -53 -170 76
7737G6j20P5N8p4J9J3q6m1M5n4J58J5k87K47j54L0L0J3R5j32O8o4nP7R1j10J46
$$ 76 -44 31 89 15 34 47 -39 -80 -35 -89 69 84 -203 44 -110 -80 -50 -37 58 -74 -6 -70 -75 2 93 -17 129
7764A29j93J58j85J25j92q1M01j7l21L90o1j7r4r5K89l30J63j61r3K73j08p2P6
$$ 129 -64 94 -91 34 -158 -239 162 145 -176 214 153 136 42 -53 236 -94 69 -92 -185 88 -20 -92 -16
7787a6k04L36l77K40M7r3K02k35O6J05j28j48M18k06p7N0q3J60J8m4M5l72N00
$$ -16 -220 116 -261 -21 26 -67 135 -100 -34 71 -57 -205 213 7 -70 -20 -103 57 75 31 76 -296 204
7810B04j12q5j00Kl2k9L81k60N5k66L00j57L51l28J44r0K57j05j84J50k59j43
$$ 204 92 7 -93 -91 -123 -152 229 -31 24 -242 58 -99 252 -76 68 -22 235 130 -54 96 -163 -306
7832c06L12J01j3r6j33J22q8L98m62P6J76J68l84qK4k2M6j11L11j76O1J7q5J83
$$ -306 6 107 94 -2 -135 -13 -101 297 -165 -89 87 255 -129 -137 -113 -135 -89 -200 111 -65 -4 13 -72 111
7856A11l58L01J48m95M63q3l00J48l1M0J1j12J42L5J9m3j93K4J74p8K64m68J05
$$ 111 -247 54 202 -293 170 87 -213 -65 -96 -56 -45 -157 -15 20 39 -4 -197 -173 1 -77 187 -281 -176
7879a76K5K85j93J11j53L9jO9k21J62J50l36J41K1Q0K05l03J72J2LK31j43n1N5
$$ -176 -151 134 -59 52 -101 -62 -63 6 -215 -53 97 -239 -98 -77 3 208 -95 77 89 92 323 180 129 184
7903A84k49K09J1p6Kk01O6pj58L24p7lm0o7J49m9o9nPL40k25j93RQ4J31l6j96
$$ 184 -65 144 155 79 81 -120 -54 -61 -219 105 28 25 -15 -82 67 18 -51 -56 -49 291 66 -127 -118 -34 97 61 -135
7930a35K57j69j7J70m25K99j21N7pK33j80J3K7N2R6Q0k66N6K4O0k12J40j82L5
$$ -135 122 -47 -64 106 -319 -20 -141 -84 -91 142 -38 -25 2 54 150 230 -36 20 44 104 -108 32 -150 -115
7954a15K76l57K39M8j04J91j16m4r9r8J10k10K74m9lJ94j84N2L2Q9k73K75k21
$$ -115 161 -196 43 91 -13 178 62 18 -81 -179 -69 -279 -5 -54 -57 137 -47 5 37 126 -147 128 -93
7977i3J57o1k4J05j18j15J81q0J59p1j40L1j11K06J6j90N5K10R3k71J62J44m14
$$ -93 64 3 -21 84 -34 -149 32 -48 111 40 -100 -69 -180 26 42 -148 -93 117 210 -61 101 245 -169
8000a69j20K04l7J86j13j63K72K12j93j21J48j90J52j09J16M4q1j12k29K92j25
$$ -169 -289 -85 -122 64 -49 -212 60 272 79 -42 106 -84 68 -41 75 119 38 -74 -303 -11 -136
8021a36N0j2K93k04J61j01J92j55Nj29j5L17m28K84p8l9j64K09M8k5k5K36j49
$$ -136 -86 -98 195 -9 152 51 243 88 93 -36 -51 266 -162 122 44 5 -159 50 98 73 48 284 135
8044A35j23n1n9J57r2J28k53O2J49J2k30L23m2l20P3J99jj79J94J20k74M9J1j62
$$ 135 12 -39 -98 59 -33 95 -158 -96 53 65 -165 158 116 -204 -131 68 67 -112 82 202 -72 -23 -12 -174
8068a74J28R1l3p3q1M7O6J63j52N8K27k74K15j99j54J39k47L85k99J02J32j03
$$ -174 -46 45 12 -61 -142 -95 -29 134 -18 40 267 -7 208 9 -145 -6 -253 132 -167 -65 67 -36
8090c6n5P4N9o8j58L92l88P4L9J85J6j11n5o2J44j72J77K56k01l0j01M9r0J68
$$ -36 -91 -17 42 -26 -184 208 -180 -106 -67 118 134 23 -32 -94 50 -122 55 311 110 80 -21 28 -62 106
8114A06N1j11L2j35%J94k02J69M7k67L56l75j7M0J33m4m7N3r6L11k11R1j04J9
$$ 106 157 46 78 -57 -57 137 -65 104 151 -116 240 -135 -152 -112 21 -23 -70 -17 -113 198 -13 78 -26 -7
8138gj8P9J59j01m50K45r5J69K4J99k14q1J13j54N1l5J29q9l1K04q0j6j0p0Q2
$$ -7 -25 54 213 112 -338 -93 -188 -19 5 204 -10 -91 22 -132 -81 -116 13 -76 -107 97 17 1 -9 -79 3
8163CR6j04j18J88j39P0jo8j61L12j63K11j11j14J45K40m34J79K4K66k57j8j35
$$ 3 99 -5 -123 65 -74 -4 -5 -73 -234 78 -85 126 15 -99 46 286 -148 31 55 321 64 46 -89
8186h9n4K20j66J42m0
$$ -89 -143 77 -89 53 13
8191A3
$$ Imaginary data points
##PAGE= N=2
##DATA TABLE= (X++(I..I)), XYDATA
0@%%%%%%%%%%%%%%%%%oJ4j6J6j6J6j8K6l2L2m0M8n3O1o9P7q6R9j14J28j42J60
$$ 0 0 0 0 0 0 0 0 0 0 0 0 0 0 0 0 0 0 -6 8 -8 8 -8 8 -10 16 -16 16 -24 24 -29 32 -37 40 -46 53 -61 67 -75 85
39H5j78J95k16K40k65K94l26L58l93M34m78N26n82O41p07P83q66R60j070J199
$$ 85 -93 102 -114 126 -139 155 -171 187 -206 228 -250 276 -306 335 -372 411 -455 505 -565 634
59F34j350J533j758K042k414K922l666M863p083J2528n0167o6684J13965M1895
$$ 634 -716 817 -941 1101 -1313 1609 -2057 2806 -4277 8251 -41916 -108600 5365 47260
73D7260m3203O573K2626m3875J0059O6117j1561n4628J9722J2323l4900J6259
$$ 47260 4057 10630 33256 -10619 -560 65557 53996 -632 19090 31413 -3487 12772
85A2772L9763l7757l6050K9419Q779k7708K2280K3971m4302k4297L7252L428k2448
$$ 12772 52535 14778 -21272 8147 16926 -10782 11498 35469 -8833 -33130 4122 7550 -14898
98a4898J7617L045l7616R458M6397r930l1222J7390P753k3382J4494K5470k6908
$$ -14898 2719 5764 -31852 -22394 24003 14073 -17149 241 7994 -15388 -894 24576 -2332
111b332j9608K3861J549k2660J4437J9201k4280j2379K2836m71j2257J5088l303
$$ -2332 -21940 1921 3470 -19190 -4753 14448 -9832 -22211 625 154 -12103 2985 -318
124c18k7377J4406L1235k2337k3880L2175J4324l5113J382L2984j3034k0539K2847
$$ -318 -27695 -13289 17946 -4391 -28271 3904 18228 -16885 -15503 17481 4447 -16092 6755
137F755Q322k2624O152K1554j1783o626K1701n578k0580J9338J7333k5766j2752
$$ 6755 15077 -7547 -1395 20159 8376 1750 23451 17873 -2707 16631 33964 8198 -4554
150d554J6515l005j2481J3447J055k5595J827K1387j0023j2512J1377n011j6201
$$ -4554 11961 8956 -3525 9922 10977 -14618 -12791 8596 -1427 -13939 -2562 -7573 -23774
163b3774J4097J3989k0271q087K1148N4j1999J5487Q698j7695M313J8953j0727
$$ -23774 -9677 4312 -15959 -24046 -2898 -2844 -14843 644 9342 -8353 -4040 14913 4186
176D186j1394J6331N113j7525K594J1698j0170j734J4260j1502j6180J7490J0861
$$ 4186 -7208 9123 14236 -3289 -695 11003 833 -901 13359 1857 -14323 3167 14028
189A4028k2293o593J8599k967j4011J3052P588j6595K902J6726o944q998J1735
$$ 14028 -8265 -14858 3741 774 -13237 -185 7403 -9192 -6290 10436 3492 -5506 6229
202F229O56j4267P884J3382j4068q501J6930Q37j3936Q861Q181j4831m145J4756
$$ 6229 6885 -7382 502 13884 -184 -8685 8245 9082 -4854 4007 12188 -2643 -6788 7968
216G968k924j3203P109L597j3572M241J6194j0133j1992J2209N068j1173M352
$$ 7968 5044 -8159 -1050 2547 -11025 -6784 9410 -723 -12715 -506 4562 -6611 -2259
229b259Q983j3219n627J7080L42j4494P765J0127j2002j231J4959m206j2156R809
$$ -2259 6724 -6495 -12122 4958 5300 -9194 -1429 8698 -3304 -4535 10424 6218 -5938 3871
243C871N306j4411K602J4011r639r847J3229K101j3479N641J1215j2768q531J3323
$$ 3871 9177 -5234 -2632 11379 1740 -8107 5122 7223 -6256 -615 10600 -2168 -10699 2624
257B624M61j2217O367O323j2412R14J5310m615j0818R372N705j2250K500J2341
$$ 2624 3085 -9132 -2765 3558 -8854 -7940 7370 2755 -8063 1309 7014 -5236 -2736 9605
271I605r432q553J2907K180j1964N230R849r815n088J2215j914j2596P843O285
$$ 9605 173 -8380 4527 6707 -5257 -27 9822 7 -5081 7134 5220 -7376 467 6752
285F752j2796j116J1768m237q615R682L955j1858K345J1498p467p505J0883L54
$$ 6752 -6044 -7160 4608 371 -8244 1438 5393 -6465 -4120 7378 -89 -7594 3289 3643
299C643j1092O492R273r468l823J1363j250r884P667N543j2431j186J1129m867
$$ 3643 -7449 -957 8316 -1152 -4975 6388 5138 -4746 2921 8464 -3967 -5153 5976 1109
313A109q278Q573K846j0058K530R990o852o520R908J21j0713N554P645q849k857
$$ 1109 -7169 1404 4250 -5808 -3278 6712 -140 -6660 3248 3369 -7344 -1790 5855 -2994 -5851
328e851J0185j069q463P876N843j0259m80J0068n338p453Q057K172j0527K360
$$ -5851 4334 3265 -5198 2678 8521 -1738 -2218 7850 2512 -4941 3116 5288 -5239 -2879
342b879R024o532o017R707l00j0161M899O620r351k485R257k664p274P389N077
$$ -2879 6145 -387 -6404 3303 3003 -7158 -2259 4361 -4990 -7475 1782 -882 -8156 -767 4310
357D310r121O30J0154n030o111Q385J774r344K883Q025o561m398R892J6r315N416
$$ 4310 -4811 -4181 5973 943 -5168 3217 4991 -4353 -1470 6555 -6 -4404 5488 5504 -3811 1605
373A605O224q609j957P973l364o883O091L671q733R82Q571n128n264Q566Q47q771
$$ 1605 7829 -780 -2737 5236 1872 -5011 1080 4751 -3982 -3000 5571 443 -4821 3745 4592 -4179
389d179K813O483o578l821Q097o28p745M962N799p511o84P823l479o647O431K809
$$ -4179 -1366 5117 -1461 -5282 2815 2187 -5558 -596 5203 -2308 -2992 4831 1352 -5295 1136 3945
405C945q298K67P933m605n149P915O54p451K582O106o333l674O917o73o988M465
$$ 3945 -4353 -4086 3847 -758 -5907 2008 2662 -4789 -2207 3899 -2434 -6108 809 136 -6852 -2387
421b387N208p060J46Q308l165n287O677K983p454P24P879m204n413P649J346o945
$$ -2387 2821 -4239 -4093 4215 1050 -4237 2440 5423 -2031 -1307 6572 2368 -3045 4604 5950 -995
437i95L147M995n397j994N763k106p370N125L472q546o16P752l364n947O599K487
$$ -995 2152 7147 1750 -244 5519 3413 -3957 1168 4640 -3906 -4522 3230 -134 -6081 518 3005
453C005p158N23O530m107l834O392L39p146L868N430n608j411O859j719o347M833
$$ 3005 -4153 -3630 2900 -1207 -5041 1351 1690 -5456 -1588 3842 -1766 -3177 3682 1963 -4384 449
469D49L376o802p90O139l274m114N847J117n635J852M789l819k738O040q64n641
$$ 449 3825 -2977 -3767 2372 -902 -5016 831 1948 -3687 -1835 2954 -865 -3603 2437 1573 -4068
485d068L249M071n557j28O248j531n431M197M129n184j053N185k581l649M991
$$ -4068 -819 3252 -2305 -2433 3815 2284 -3147 1050 5179 -5 -1058 4127 1546 -2103 2888
500B888N70n490K698M501m319k643O770k33p540K511N292n588l056N932r73n864
$$ 2888 3458 -2032 666 5167 848 -1795 4975 4742 -2798 -287 5005 -583 -3639 2293 1320 -4544
516d544L215L843n002j389O054l345m990O131J989p148Q19O356l490l204O439
$$ -4544 -1329 2514 -2488 -3877 2177 -1168 -6158 -27 1962 -5186 -4367 1989 -1501 -4705 1734
531A734J271o562K853M999m836j573N795j921n320L808K554m956N95N187l807
$$ 1734 3005 -3557 -704 4295 -541 -2114 3681 1760 -3560 248 2802 -2154 -1559 3628 -179
546a79l620N746J004o441J836M691l919k461N303J61m799K964L872m037k38M934
$$ -179 -3799 1947 2951 -3490 -1654 3037 -882 -3343 1960 2121 -2678 286 4158 121 -117 4817
562D817l009m278M920J369n686J008N206l354m481N332J847n892J158L950l841
$$ 4817 1808 -2470 2450 3819 -1867 -859 4347 993 -3488 1844 3691 -2201 -1043 2907 -934
577i34k098M145n72m402K237L177l803p02N273j898m228L241K730m324n66M369
$$ -934 -3032 1113 541 -3861 -1624 1553 -2250 -2952 2321 423 -3805 -564 2166 -2158 -2724 1645
593A645j927l434L784J977m623J275M110l089j646M227n00m315K160K986l777
$$ 1645 -282 -3716 68 2045 -2578 -1303 2807 -282 -1928 2299 1799 -2516 -356 2630 -1147
608a147q66M943j477m455L988K342m192j52L763k457l168M110N18m300K559L262
$$ -1147 -2013 2930 1453 -3002 986 3328 -864 -1016 2747 290 -2878 1232 1750 -2550 9 3271
624C271m549p24N849j833m840L626K771m831o42M838j835m347M196J353m365J521
$$ 3271 -1278 -2002 3847 2014 -2826 800 3571 -1260 -1902 2936 1101 -3246 950 2303 -2062 -541
640e41L326l945j631M103m90m314K252L206m102q14M785j364l098L241J533l427
$$ -541 2785 -1160 -2791 1312 822 -3492 -1240 1966 -2136 -2950 1835 471 -2627 614 2147 -1280
656a280M23L657k197k989L626O49l418J553K869l204j284L593l57l616J786K159
$$ -1280 -857 2800 603 -2386 1240 1889 -1529 24 2893 -311 -1595 1998 1641 -1975 -189 1970
672A970l457q81L553r22k971K858J229k706L40L095j856k487L329Q55l855J323
$$ 1970 -1487 -2368 1185 263 -2708 150 1379 -1327 -987 2108 252 -2235 1094 1949 -1906 -583
688e83L584l226j575L753L17l289J444K530l371j332L525j070l211K562J635l673
$$ -583 3001 -225 -1800 1953 2270 -1019 425 2955 -416 -1748 1777 707 -2504 58 1693 -1980
704a980L17L494k065k675L392P84m149J381L403l203j148L983n23l122K795K080
$$ -1980 -1663 1831 -234 -2909 483 1267 -2882 -1501 1902 -1301 -2449 1534 1011 -2111 684 2764
720B764l577j11L694j576k842L150Q88l638Q25K889k436j841L257Q7l461J531
$$ 2764 -813 -924 2770 1194 -1648 1502 2390 -1248 -423 2466 30 -1811 1446 1533 -1928 -397
736c97K379l709o12L354j457k668K657J562k959Q3L447j677k076K986J051l459
$$ -397 1982 -1727 -2339 1015 -442 -3110 -453 1109 -1850 -1767 1680 3 -2073 913 1964 -1495
752a495J357K549k242j277K906L81l010J692K128k790j132L150j482k984K238
$$ -1495 -138 2411 169 -1108 1798 2179 -831 861 2989 199 -933 2217 735 -2249 -11
767a1J361l487J26L068j644j894K455O29l141J139K413k360r76K872K01k648K020
$$ -11 1350 -2137 -2011 1057 -587 -2481 -26 603 -2538 -1399 1014 -1346 -2322 550 751 -1897 123
784A23K057k304k80K935j073j844K048R22k837K61K568j670j973K508L19l110
$$ 123 2180 -124 -404 2531 1458 -386 1662 2584 -253 8 2576 906 -1067 1441 1760 -1350
800a350R72K087k340j396K654p68k719J325K308k880l0L229j363j864K513J038
$$ -1350 -378 1709 -631 -2027 627 -141 -2860 -1535 773 -2107 -2137 1092 -271 -2135 378 1416
816A416k679Q75K403j503j714K493O89k842R40K324k442r61K478q13k329J446
$$ 1416 -1263 -388 2015 512 -1202 1291 1980 -862 78 2402 -40 -1001 1477 664 -1665 -219
832b19J242k584o34K701j217j863K192R03k508N76K309j535j139K230P39k386
$$ -219 1023 -1561 -2195 506 -711 -2574 -382 521 -1987 -1411 898 -637 -1776 454 1193 -1193
848a193J101K380k067k16K657p13j593J314J255k462l75K398j338k189K324L12
$$ -1193 -92 2288 221 5 2662 1949 356 1670 2925 463 88 2486 1148 -1041 1283 1595
864A595k772Q30J946k253j470K433l44k508J108J709k223n83K690p53j904K022
$$ 1595 -1177 -347 1599 -654 -2124 309 -35 -2543 -1435 274 -1949 -2532 158 -595 -2499 -477
880d77J196k198J81K309q12j800K304O65k428R41K163j865r00K153O1k443J052
$$ -477 719 -1479 -1298 1011 199 -1601 703 1368 -1060 -119 2044 179 -721 1432 1493 -950 102
897A02J353k245p71K461p82j969J925R90k322J57K193q37k110K566P31k360J096
$$ 102 1455 -790 -1561 900 118 -1851 74 1064 -1258 -1101 1092 255 -1855 711 1442 -918 178
914A78J656j643l39K287m15j691J280J546k378o82K496j427j974K006P7k351M46
$$ 178 1834 191 -148 2139 1724 33 1313 2859 481 -201 2295 868 -1106 900 977 -1374 -928
931i28J612j459j379J688M21k481J138J419j881p49K650p58j424J616J299j772
$$ -928 684 -775 -2154 -466 -45 -2526 -1388 31 -1850 -2599 51 -707 -2131 -515 784 -988
947i88J69K085p13j426J685N65j744M14J511r91p98J583J71j951M71J708j856
$$ -988 -819 1266 553 -873 812 1377 -367 47 1558 567 -231 1352 1523 -428 43 1751 -105
964a05p62J847o41j588J255P54j238l94J529k11j370J387Q39k347Q71J382q87
$$ -105 -867 980 339 -1249 6 760 -478 -872 657 446 -924 463 1302 -1045 -174 1208 321
981C21r02J598J25j851Q93J455j728p50K335q14k113J431O52j601m87J616p97
$$ 321 -581 1017 1142 -709 184 1639 -89 -839 1496 682 -1431 0 652 -949 -1436 180 -617
998f17j340J874M15k317Q44J669j370j050K163l73j542J161J891j680p8K199r35
$$ -617 -1957 -83 332 -1985 -1141 528 -842 -1892 271 -102 -1644 -483 1408 -272 -350 1849 914
1015I14j456J848L50j834J52J753j125j139J812k76j569N58J242j615m38J400
$$ 914 -542 1306 1656 -178 -26 1727 602 -537 1275 999 -570 -12 1230 -385 -823 577
1031E77n70j394J053P17j563P4J370o91p96J622L91j571O21R14m54r51J526K23
$$ 577 7 -1387 -334 383 -1180 -1106 264 -427 -1223 399 790 -781 -160 754 300 -651 875 1098
1049A098j688N21J321r33m79J090p54o91J35Q31r00n15J177m49j181J032P69j512
$$ 1098 -590 -69 1252 319 -160 930 176 -515 -380 451 -449 -964 213 -236 -1417 -385 384 -1128
1067a128J90J422m83j045J285L25j516J67J855p91q68J801j78j556J118P33j217
$$ -1128 -938 484 1 -1044 241 566 -950 -783 1072 281 -587 1214 1036 -520 598 1331 114
1084A14k42J167l83j784J429P28j931M43J051r06q92J590j18j769O75J337j443
$$ 114 -128 1039 656 -1128 301 1029 -902 -459 592 -314 -1206 384 266 -1503 -828 509 -934
1101i34m76K120q79j174J611L87j347L76J467q68r93J608K59j531N94J142j286
$$ -934 -1410 710 -169 -1343 268 655 -692 -316 1151 283 -710 898 1157 -374 220 1362 76
1118G6k16J257m66j329O13O65j220j6J340j098j002Q94P44j302K86J101q16n85
$$ 76 -140 1117 651 -678 -65 600 -620 -636 704 -394 -1396 -502 242 -1060 -774 327 -489 -1074
1136a074J246K39r63K30R00l21n02J332k78p83L05O67o71j72Q62k34j205O39N10
$$ -1074 172 411 -552 -322 578 257 -245 1087 809 26 331 998 327 155 1017 783 -422 217 727
1155G27j069OR43r92p24J102L72j091QJ168q68q41J168J38r18K93J377q24o82
$$ 727 -342 -336 607 -385 -1109 -7 365 -726 -718 450 -418 -1259 -91 47 -871 -578 799 -25 -707
1174g07J453J40j701J091R98j510P3J154r45p90J081K61j216L29J032r40p72J336
$$ -707 746 886 -815 276 1274 -236 -163 991 46 -744 337 598 -618 -289 743 -197 -969 367
1192C67k33j260J060O56j506l7J609o46j258J356N60j278O52J006o83p08J038
$$ 367 134 -1126 -66 590 -916 -953 656 10 -1248 108 668 -610 42 1048 365 -343 695
1209F95J97j127N16R00r50l60J629n81j335R77j77p85j39R97o96p21P18O74j394
$$ 695 892 -235 281 1181 231 -129 1500 919 -416 561 384 -401 -540 457 -239 -960 -242 432 -962
1228i62K20J156j028m98J175k00r11N87R11j012k46J308l52o33O87M12r11J28
$$ -962 -742 414 -614 -1112 63 -137 -1048 -461 450 -562 -808 500 148 -485 202 614 -297 -169
1246a69J054l23r82P69N53j077O7Q42p62m94J008jj316P98N85q07l52J063j03
$$ -169 885 562 -420 349 902 -175 -108 734 -28 -522 486 485 -831 -33 552 -255 -607 456 353
1265C53j015Q42N98j028J24J156o84m50P90J79j127L05J057r75p66J338j99j103
$$ 353 -662 180 778 -250 -126 1030 346 -104 686 865 -262 43 1100 125 -641 697 498 -605
1283f05L98R50q88n00O32mr02N21P65j280jP69m35m60Q52M06j149K14J137p94
$$ -605 -207 743 -145 -645 -13 -17 -919 -398 367 -913 -914 -145 -580 -1040 -188 218 -931 -717 420 -374
1303c74k98J046N0p83O48R10j200m09R61N0j049R81M01j189K3P13q6p93R51J69
$$ -374 -672 374 424 -359 289 1199 -1 -410 551 601 -448 533 934 -255 -232 481 395 -398 553 722
1323G22r29K5P21o86m14J291l40r22Q56O43r69k33R19l52r47P72M83j152L7Q71
$$ 722 -207 -182 539 -147 -561 730 390 -532 324 967 -2 -235 684 332 -615 157 640 -512 -475 396
1343C96o17n06R39r7q58K77Q42r14m46J322m67q94Q83J42r74K10Q64l59n92R58
$$ 396 -221 -727 212 115 -743 -466 376 -538 -984 338 -129 -1023 -140 2 -972 -762 102 -257 -849 109
1363A09K39q55K91J125q40l95R34l9r40N54N70n08o07J212m40p46O49L99r18l1
$$ 109 348 -507 -216 909 69 -326 608 569 -371 183 753 245 -362 850 410 -336 313 712 -206 -237
1383b37Q63l81p62O32L33r38jQ66n27m25R99L2p11J70M85p84K22P37k98p53P67
$$ -237 626 245 -517 115 448 -490 -491 375 -152 -577 422 454 -257 -87 398 -386 -164 573 275 -478 289
1404B89M03j015p9J057o48n03N61J1o94J8J129r23m58J186m56p71M67N58q22J20
$$ 289 692 -323 -402 655 7 -496 65 76 -618 -600 529 -394 -852 334 -122 -893 -426 132 -690 -570
1424e70N91Q1o33O69K87l39q2P35o93k28Q47R6q08N0O73m65p29J220j53p67M24
$$ -570 21 102 -531 138 425 86 4 739 46 -182 665 761 -47 3 676 211 -518 702 549 -218 206
1445B06P8n98j97M45R2p25N53Q8p88K97Q89o35j52L59K22o58N81M12m68m43J167
$$ 206 284 -314 -511 -66 26 -699 -146 -58 -846 -549 340 -295 -447 -88 134 -524 57 469 1 -442 725
1466G25j67r58O34N35p50j82P80k93n15N71J5r71N64N49p92k73N78q6o47K09Q17
$$ 725 558 -400 234 769 19 -163 617 324 -191 380 395 -576 -12 537 -255 -528 50 -36 -683 -474 343
1487C43q20m97J215k37q58J059N4n27L04L10j56m38P06J11o38J99O11p73m9Q90
$$ 343 -477 -974 241 4 -854 205 259 -268 36 346 190 -248 458 569 -69 130 741 -32 -81 809
1507H09l16q27N33J74p83J25O05o38m04N50K10r20J06Q88o45M2K73K33o76R9J036
$$ 809 493 -334 199 373 -410 -285 320 -318 -722 -172 38 -882 -776 112 -533 -491 -218 15 -661 -562 474
1528D74o35k31O44J78n81N96J63m37l44P50r7q96R79J5r89P6P09n37n24P77j57
$$ 474 -161 -392 252 430 -151 445 608 171 -173 577 480 -416 563 578 -411 -335 374 -163 -687 90 -67
1549f7o74K79Q00p57n79J084k08p13P31M43n37k41J048m50n08R04K71j073L95
$$ -67 -741 -462 338 -419 -998 86 -122 -835 -104 339 -198 -439 609 159 -349 555 826 -247 148
1568A48P97o59k33P68n60n35K73N87p93j19O03o20m04P11k25l84K33R0j10j69
$$ 148 945 286 53 821 261 -274 -1 586 -207 -326 277 -343 -747 -36 -261 -645 -412 -322 -432 -601
1588f01O20J23o42M24K81l94K05M27j57j56J41L46l41J0L66l55n02M07L40n73
$$ -601 19 142 -500 -76 205 -189 16 443 286 130 271 617 276 286 652 297 -205 202 542 -31
1608c1j69L09K2n58J67M66p50Q3M84k45N0J31k57j05K81L19K8m40M35L6n00M10
$$ -31 -200 109 131 -427 -260 206 -544 -461 23 -222 -172 -41 -298 -403 -122 197 225 -215 220 256 -244 166
1630A66M89m64j57L63O3n84L09M24o79J26L42l38n54N73k75p08K88L75l29k89
$$ 166 655 191 34 397 460 -124 185 609 -70 56 398 60 -494 79 -196 -904 -616 -241 -570 -859
1650h59K66R5k78L16N28n86j69J063m88k03P65L2p61L54O20o40K10N85m55l83
$$ -859 -593 -498 -776 -460 68 -518 -687 376 -112 -315 450 482 -279 75 695 55 265 850 395 12
1670A2K10N09o73Q3K79k85l72M16J79n97p3O50p04K62M51l29n79P09O0l71J25
$$ 12 222 731 58 141 420 135 -237 179 358 -239 -312 338 -366 -104 347 18 -561 148 208 -163 -38
1691c8N52m35J33j25J74j80n5M20j99k93K22J81n81j91O01l27k74M44l29L3k45
$$ -38 514 79 212 87 261 81 26 446 247 -46 176 357 -224 -415 186 -141 -415 29 -300 -267 -512
1712e12K94p8j70L22K6m48L75L49k13QL17J9n10L83L98j74m2K87l50k3K84n1l93
$$ -512 -218 -296 -466 -144 -118 -566 -191 158 -55 -47 270 289 -221 162 560 386 344 631 281 258 542 491 98
1735I8P4K10k32j29M32k84n69J81M66q02J03O86l75j10J73q4k74L02K62m18l28
$$ 98 172 382 150 21 453 169 -400 -219 247 -555 -452 234 -141 -251 -78 -162 -436 -134 128 -290 -618
1756f18R45k69q2N5L11m07o9L23k04m83N58K13n72K3L22k96q5M92n0o38j06N75
$$ -618 327 58 -24 31 342 -65 -134 189 -15 -498 60 273 -299 -276 46 -250 -335 157 107 -531 -637 -62
1778f2k73l44P35k73L3K01N07m75j10M79K0k98L19J63l88j6N44l88j97L52l74
$$ -62 -335 -679 56 -217 -184 17 524 49 -61 418 438 140 459 622 234 218 762 374 177 529 155
1799A55j70K88N8m06m3M40l69m00K61K84n85K65K2r5l76L73K05l85J92L84n7l47
$$ 155 -15 273 331 -75 -118 322 -47 -447 -186 98 -487 -222 -200 -295 -671 -298 -93 -478 -286 98 41 -306
1821c06M61n7k37L19K32j72n38M25K70o07K28L57n59p9L74k61M3J66j19m25J37
$$ -306 155 98 -139 180 412 240 -298 127 397 -210 18 375 -184 -263 111 -150 -107 59 -60 -485 -348
1842c48L50j48j52K51j00k08L27O3p5pK02L69m32L40J65o42L83K13k51m73O23
$$ -348 2 -146 -298 -47 -147 -355 -28 35 -40 -47 155 524 92 432 597 -45 338 551 300 -173 450
1863D50o0m29lK98k82l22J48P9l28J84L46l81l02L58J88l76j2N29k49Q3L32J4
$$ 450 390 -39 -42 256 -26 -348 -200 -121 -449 -265 81 -300 -602 -244 -56 -432 -444 85 -164 -81 251 265
1885B65n41N54J37l80J21K03j58k71N85j1n12kM63k74m76L55j91m85P39J37m49
$$ 265 -276 278 415 35 156 359 201 -70 515 504 -8 -10 453 179 -297 58 -133 -618 121 258 -191
1906a91k00J88j62r1M62J20l50r9N37l41M5K29J30k83K49K01j94k2K26r7k05j59
$$ -191 -391 -203 -365 -456 6 126 -224 -323 214 -127 -82 147 277 -6 243 444 250 228 454 357 152 -7
1928gK92m11J77Q5m31P4K24k70R7r9J91m8k29M0K72j44j2K49l94J74O66o23J81
$$ -7 285 -126 51 136 -295 -221 3 -267 -170 -269 -78 -126 -355 -315 -43 -187 -199 50 -344 -170 496 -127 54
1951E4Q1J8j6j73M81j29l9J54l17k98L76Ll69O3K62n2k83ML72m32N9m8oq8J24
$$ 54 135 153 137 -36 445 316 277 431 114 -184 192 195 -174 -111 151 99 -184 -180 192 -240 -181 -229 -235 -323 -199
1976a99J23j57o8M20R1k99L20K4k80J02Q2j23J42l8K99k37l02J50J14k53O4j0
$$ -199 -76 -233 -301 119 210 -89 231 255 -25 77 159 36 178 140 439 202 -100 50 164 -89 -25 -35
1998c5k3K80m85K80k22J55j44l30J45J40j90J27L42j64j42M13J07m85L23L53k42
$$ -35 -58 222 -263 17 -205 -50 -194 -524 -379 -239 -429 -302 40 -124 -266 147 254 -231 92 445 203
2019B03l66Q94o04j84K23N60n57l06K38J18l99l4L40k68Q3K06m82o1N50j86l65
$$ 203 -163 731 127 -57 166 726 169 -137 101 219 -180 -214 126 -142 -59 147 -335 -396 154 -32 -397
2040c97L82K06n57J14L12L1o47O69J30m02L98j07q5k64M63l9j8m5l7l17K35J04
$$ -397 -15 191 -366 -252 60 91 -556 113 243 -159 239 132 47 -217 246 207 189 144 107 -210 25 129
2062A29k43L4J64j91m62L15J70k59j8L93k09o7N0J63J8o8K75K07m87J55O6R1j51
$$ 129 -114 -80 84 -107 -569 -254 -84 -343 -361 32 -177 -244 -194 -31 -13 -81 194 401 -86 69 135 226 75
2085G5J79k59J49J28N4m0m65O06j70n28K07Q9j47K36p3o7k10R9L16k67k35L23
$$ 75 254 -5 144 272 326 286 -179 427 257 -271 -64 25 -122 114 41 -26 -236 -137 179 -88 -323 0
2107@j65j51O37k92k23K49K76k27k73M82k18l69L97k41l6J63P7j19m84N29j2k61
$$ 0 -165 -316 321 29 -194 55 331 104 -169 313 95 -274 123 -118 -154 9 86 -33 -517 12 0 -261
2129b61J72K44n48N0L01l3k03J56K32l39mM44j93j61P96j86n04K43O2m63N08n3
$$ -261 -89 155 -393 -343 -42 -75 -278 -122 110 -229 -233 211 18 -143 653 467 -37 206 268 -195 313 260
2151B60m2o4L28k33j91N1p4j80K47p4K31n58J41K18k7l56L16j70j02L26N6k93
$$ 260 218 154 482 249 58 109 35 -145 102 28 259 -299 -158 60 33 -323 -7 -177 -279 47 103 -190
2173a90n9O2P7J74J44lj61O1M3K50l23J60j69o6j27P9J8k70J45L21l78j30M02
$$ -190 -249 -187 -110 64 208 205 44 105 148 398 75 235 66 0 -127 -48 -30 -300 -155 166 -212 -342 60
2196F0k18l25N41q5j87m8J99O5k4J76j81J76J68J0N3j52J24l3l12L79K7n78L54
$$ 60 -158 -483 58 -27 -214 -262 -63 2 -22 154 -27 149 317 327 380 228 352 319 7 386 413 -165 189
2219A89J08k18P3K07m51k38K52j42l01K46J40n4p3k8j9K35q3J83K8j07N8J54m13
$$ 189 297 79 152 359 -92 -330 -78 -220 -521 -275 -135 -189 -262 -290 -309 -74 -157 26 54 -53 5 159 -254
2242b54K78K1J23j71L70l78j07L30j31k0J00mk00k77K56K15k32l8N2J7j03J51
$$ -254 24 45 168 -3 367 -11 -118 212 81 61 161 157 -43 -320 -64 151 -81 -119 -67 -50 -153 -2
2264bj04r4m0J16j18rL61p4K13j32l00K97K04k7k52n3K16ql66K39R2o4m8J64l15
$$ -2 -106 -200 -240 -124 -242 -251 110 36 249 117 -183 114 318 291 39 -14 202 194 -172 67 159 95 47 211 -104
2289a04n7L04p2j21k88O9L14k46K45j53r1j27P5N06k26M1Oj99K29L27j82j24L78
$$ -104 -161 143 71 -50 -338 -269 45 -201 44 -109 -200 -327 -252 254 28 69 75 -124 105 432 250 126 504
2312E04l25j19J43J71n46L13j0j38l7R8j01j31K43j35m4l8O0o9m7J62q2j70K19
$$ 504 179 60 203 374 -172 141 131 -7 -44 54 -47 -178 65 -70 -114 -152 -92 -161 -208 -46 -128 -298 -79
2335g9J78k58J93J27L29l95J36l6q4n6N9R3Q4m89K18P1l9J62k29rj69N99n17j26
$$ -79 99 -159 34 161 490 95 231 195 111 55 114 207 291 -198 20 91 52 214 -15 -24 -193 406 -111 -237
2359b37j2Q6r6J62J74m36K11P8K8K7P3k28J52J74Op5L65q0m74M18k97N4L3j37
$$ -237 -249 -163 -259 -97 77 -359 -148 -70 -42 -15 58 -170 -18 156 162 87 452 372 -102 316 19 73 106 -31
2383c1J14k32J01j8K4N1M5Q4m6k27p5L0j76K86J93l45L07j51K94l98J17L03j91
$$ -31 83 -149 -48 -66 -42 9 54 138 92 -135 -210 -180 -356 -70 123 -222 85 -66 228 -170 -53 250 59
2406E9K07J41l40n9L98k23J52k64q4j32L3J51k31J26j43K48k94L1K66l05J0J59
$$ 59 266 407 67 8 406 183 335 71 -13 -145 -112 39 -192 -66 -209 39 -255 -224 42 -263 -253 -94
2428i4O8j39J88n2J14k17k7n9L27L8M2j44P7J04J5k5r8J42j35K16j32k05k92J53
$$ -94 -26 -165 23 -29 85 -132 -159 -218 109 147 189 45 122 226 241 216 118 260 125 341 209 4 -288 -135
2452a35K81k7j32l33L72j75J14l23K18J40j11Q4r0K47o6o3j48K48K38n01M83m4
$$ -135 146 119 -13 -346 26 -149 -35 -358 -140 0 -111 -27 -117 130 64 1 -147 101 339 -162 321 277
2474B77m05K66j2k88J62q2Pj72L04M4l01k6K30r5P4m5r4k03M05j69P0P0j32J60
$$ 277 -128 138 126 -162 0 -82 -75 -247 57 101 -200 -226 4 -91 -17 -62 -156 -359 46 -123 -53 17 -115 45
2498D5k67J49K71k16rL28n8j46R3j22R4k74M4J73K9q9K6j75J0N4o9p3r9J29l0
$$ 45 -222 -73 198 -18 -27 301 243 97 190 68 162 -112 -68 105 134 45 71 -104 -94 -40 -109 -182 -281 -152 -182
2523a82Q7K21k67J63J85l27n1m1L20l27L64p4j19QJ61j94L75l86J90K19m4l51
$$ -182 -95 126 -141 22 207 -120 -171 -212 108 -219 145 71 -48 -40 121 -73 302 -84 106 325 281 -70
2545g0Nj6q5J74r7R4l62K83K25l98j75K80j17L25j76q9J06K19j80L29M9j91j30
$$ -70 -65 -81 -166 8 -89 5 -357 -74 151 -247 -422 -142 -259 66 -110 -199 -93 126 -54 275 324 133 3
2568Cq8M43l46J77Q6j80j21p8J78j32K3O7j99MJ17J39l42J61k16J90j59Q1N7O6
$$ 3 -85 358 12 189 275 95 -26 -104 74 -58 -35 32 -167 -163 -46 93 -249 -88 -304 -114 -273 -192 -135 -69
2592f9J4j61N3M9K78k32j85N18m54J75j5K75j66J22k11QK56j76j30mJ14r0j31
$$ -69 -55 -216 -163 -114 164 -68 -253 265 -189 -14 -29 246 80 202 -9 -1 255 79 -51 -55 59 -31 -162
2615a62J5m1P5o2l5J03J1N6lk67N48j76k32K69m6k61K51L25l57L55l62K5P0j22
$$ -162 -147 -188 -113 -175 -210 -107 -96 -40 -43 -310 238 62 -170 99 53 -208 43 368 11 366 4 29 99 -23
2639b3Q5j3p3M9N9jj95k17L57m1m07J00N61l60q8M1K11k92j12N19l58R1K52k73
$$ -23 62 49 -24 25 84 83 -112 -329 28 -13 -420 -320 241 -119 -207 -166 45 -247 -359 160 -198 -107 145 -128
2663a28L75r5l5J17k41J98j34K77r1j26k09q0K49o5l29L47j16n7L60l79o2R9J8
$$ -128 247 152 117 234 -7 191 57 334 243 117 -92 -172 77 12 -317 30 -86 -143 217 -162 -224 -125 -107
2686a07k04K58K54k25j41K46j51k98O33k42k07L73J47k03j43J67k82N8J03J16
$$ -107 -311 -53 201 -24 -165 81 -70 -368 265 23 -184 189 336 133 -10 157 -125 -67 36 152
2706A52m6k26J85l7k44J15n3L3M6J2l1o2l8J17Q0p0K75k99K77l62K09R4j6J39
$$ 152 106 -120 65 28 -216 -101 -154 -121 -75 -63 -94 -156 -194 -77 3 -67 208 -91 186 -176 33 127 111 250
2730B50k64P6p2K17k20J0Q1J12j09J41j59J47j62j64lq5J10j62K60j21K51k84
$$ 250 -14 62 -10 207 -13 -3 78 190 81 222 63 210 48 -116 -119 -204 -94 -256 4 -117 134 -150
2752a50j00K65l1M0q2M12l00j42K56k14J53o4MR4J65l33KJ93O7j30l2K57l89J18
$$ -150 -250 15 -16 24 -58 354 54 -88 168 -46 107 43 47 141 306 -27 -25 168 235 105 73 330 -59 59
2776E9Q0l32l0L8P6k10M05NJ31l95k0J45J80j76J27kj87K77j68J37q2mk07K03
$$ 59 139 -193 -223 -185 -109 -319 86 91 222 -173 -193 -48 132 -44 83 81 -106 171 3 140 58 54 -153 50
2800E0k61M59q4J25l16j29o8L5K54j72N7O5j15n6J15j22j18J0M68l06J8j54Q9
$$ 50 -211 248 164 289 -27 -156 -224 -189 65 -107 -50 15 -100 -156 -41 -163 -281 -271 197 -109 -91 -245 -156
2823a56n7K04J03M2m3J1J4J37l33J30J79j46JJ9j04j75J66m1j8J4o7JK19k46j2
$$ -156 -213 -9 94 136 93 104 118 255 -78 52 231 85 86 105 1 -174 -8 -49 -67 -53 -120 -119 100 -146 -158
2848a58K83l46M41k81J28n2k04K43q0L52m25L20Np4L8j71q4J06Q2l29M38Lk08
$$ -158 125 -221 220 -61 67 15 -189 54 -26 326 -99 221 226 152 190 19 -65 41 123 -206 232 235 27
2871B7j42L9Q5k12l1J55Q6q3j09J07o0O1O8l8Q6j33J30k0M2J09O0k53K91JM5j22
$$ 27 -115 -76 9 -203 -234 -79 7 -76 -185 -78 -138 -77 -9 -47 39 -94 36 16 58 167 227 -26 265 266 311 189
2897A89j49J29m8m3l38J34K07k55J56r3k3N3j89L87j97m9J92o8n6P3j96K20k19
$$ 189 40 169 121 78 -260 -126 81 -174 -18 -111 -134 -81 -270 117 -80 -129 63 -5 -61 12 -184 36 -183
2920a83L48J96k52r2K2L3J03J6Q4k16M0p9n6L9K59k60j1j50P1J8j42K5O1lR0j4
$$ -183 165 361 109 17 39 72 175 191 275 59 99 20 -36 3 262 2 -9 -159 -88 -70 -212 -187 -126 -129 -39 -53
2946e3l53L87O2pl8KM3R8mN6j20j33K84j83N9j26L08j92K5rk2k23o4J00J36q4
$$ -53 -406 -19 43 36 -2 0 43 141 137 193 73 -60 224 41 100 -26 282 90 115 106 84 -139 -203 -103 33 -51
2972e1r5j09j08L40l1k38L08J18j00Qj58J90j16O2J51%l02K76J02m07L08J8o3
$$ -51 -146 -255 -363 -23 -54 -292 16 134 34 42 -116 74 -42 20 171 171 -131 145 247 -160 148 166 103
2995A03k33J10j15P6K9j39J10J00j6j0J7p9j59j5K9K52l25p1L2K17J9j48K53j75
$$ 103 -130 -20 -135 -59 -30 -169 -59 41 25 15 32 -47 -206 -221 -192 60 -265 -336 -304 -87 -68 -216 37 -138
3019a38K59k9J21k36J93M6r7L7Kk87J73K03l40J15RM6j1k64J59p8r8M69l13J6
$$ -138 121 92 213 -23 170 216 119 156 158 -129 44 247 -93 22 31 77 66 -198 -39 -117 -215 254 -59 -43
3043d3J24k26J42j80p1K77j3J64l04J80l2R0J83k18j34P6J7k3K40k3m93M20j38
$$ -43 81 -145 -3 -183 -254 23 10 174 -130 50 18 108 291 73 -61 15 32 9 249 226 -267 153 15
3066A5j56K19k34J21j51m0K59r4j05n4j45J39K75j35J49n2L9J21j49J6Q3j54k
$$ 15 -141 78 -156 -35 -186 -226 33 -61 -166 -220 -365 -226 49 -86 63 11 50 171 22 38 121 -33 -35
3089c5M6K23mk38l0L15o0p9j22K4k60K63j08j42J35j40J51K66l65J73o3j32K63
$$ -35 11 234 230 -8 -38 277 217 138 16 40 -220 43 -65 -207 -72 -212 -61 205 -160 13 -50 -182 81
3112H1j81J6J32r9M8QR1j61p5M82k94o7O7j89L0M5k6j25K20J35j92K9j84Q2o0
$$ 81 -100 -84 48 -51 -3 5 96 -65 -140 342 48 -19 48 -141 -111 -66 -92 -217 3 138 -54 -25 -209 -127 -187
3137a87K16j06j87L88p2o0J08l7N1k8M7k54P2L33l38L1K49O4k33j0Q8j83l6P8
$$ -187 29 -77 -264 124 52 -8 100 63 114 86 133 -121 -49 284 -54 -23 226 290 57 47 135 -48 -84 -6
3161fo4J27M0J2o5k09K6L29j11l81K85k0k1L8K40k96J46k37Q8N8r0J51R2n9q9
$$ -6 -70 57 97 109 44 -165 -139 190 79 -302 -17 -37 -58 -20 220 -76 70 -167 -79 -21 -111 40 132 73 -16
3186a6J60R1l1n8k47L97j38j22O1j96k8J58k95L28j08pj24J90l4n9J71n9m62N69
$$ -16 144 235 204 146 -101 296 158 36 97 -99 -127 31 -264 64 -44 -51 -175 15 -19 -78 93 34 -428 141
3210A41M8k80M23n90L77r5M3j8l2o0K84j91O2J34k09P0Rk04K12m1k44J27k0j1
$$ 141 189 -91 332 -258 119 24 67 49 17 -43 241 50 112 246 37 107 116 -88 124 83 -161 -34 -54 -65
3234f5j94J29rJ86k54M2J45J88j68m5j6o7RJ66j91J73L55q6k88K11l47L59P9k99
$$ -65 -259 -130 -139 47 -207 -165 -20 168 0 -45 -61 -128 -119 47 -144 29 384 298 10 221 -126 233 312 13
3258A3P7k2L0J18j56j84J28M7k14L2m4J56p7k13N00l56J50j92K36n2j27L10k4
$$ 13 90 68 98 216 60 -124 4 51 -163 -131 -175 -19 -96 -309 191 -165 -15 -207 29 -23 -150 160 136
3281A36k40J37K38k38M8p9k6L8J22M0l42P7On5J8J78m3k24J87j59J63n4k77L83
$$ 136 -104 33 271 33 81 2 -24 14 136 176 -166 -89 -83 -138 -120 58 15 -209 -22 -181 -18 -72 -349 34
3305C4j09K8P0j35J89M2j78l0K08k17K9K17k6j14l0J65L5k06K54m54L78k52q2
$$ 34 -75 -47 23 -112 77 119 -59 -89 119 -98 -69 148 122 8 -22 143 178 -28 226 -228 150 -102 -184
3328a84K02K2L2k83K13k61K07q4K24l1K9N2j04L5l13J39KJ82j28L40j13j10R3
$$ -184 18 40 72 -211 2 -259 -52 -136 88 57 86 138 34 69 -244 -105 -103 79 -49 291 178 68 161
3351A61k4n8k20L32l30J28l22K30L04l70J43k50L94l99O8L64k63J34j76J31K43
$$ 161 137 79 -141 191 -139 -11 -333 -103 201 -169 -26 -276 118 -281 -213 151 -112 22 -154 -23 220
3372B20n5j89J88n8M1k99J17Q8R9p7K5n9j25J54J2q3J7M66m80p3L8j83p7Q7K21
$$ 220 165 -24 164 106 147 -152 -35 53 152 75 100 41 -84 70 82 -1 16 482 2 -71 -33 -216 -293 -206 15
3397A5j32q5J87p1J52l00N01n61K57q1K39J5Rj0j92j85M8p0L37N1j52P1j54K88
$$ 15 -117 -202 -15 -86 66 -234 267 -294 -37 -118 121 136 145 135 -57 -242 -194 -264 73 124 -28 43 -111 177
3421A77j39n1J80k06m1J61J1l7k85M9P9P4j80Q8kJ01j06q5K17K2K34k53j84L66
$$ 177 38 -13 167 -39 -80 81 92 55 -230 -181 -102 -28 -208 -120 -122 -21 -127 -212 5 27 261 8 -176 190
3445A90k3j48l45L25K73l33l0K20j9j1k71J72J78l60L77j57j07q5N4j3Jj71L45
$$ 190 167 19 -326 -1 272 -61 -91 129 110 99 -172 0 178 -182 195 38 -69 -154 -100 -113 -112 -283 62
3468F2n3j57L89k42k8J79k29K85o6l0K6l2k80Q0K19j19q2J90J35l20j42J36q4
$$ 62 9 -148 241 -1 -29 150 -79 206 140 110 136 104 -176 -96 123 4 -78 112 247 -73 -215 -79 -163
3491a63k66M19N2n2j40OM5j29K16N0J38p3k71J79J11J24k05J40k83R8K09j23J
$$ -163 -429 -10 42 -10 -150 -144 -99 -228 -12 38 176 103 -168 11 122 246 41 181 -102 -4 205 82 83
3514H3J8l7J0j09J10j40o5L07r9j40QQr3K28j01m3K47J4n56L00j5R7j22J56J72
$$ 83 101 64 74 -35 75 -65 -130 177 78 -62 -54 -46 -139 89 -12 -55 192 206 -350 -50 -65 32 -90 66 238
3539B38l75J60N2l3J2j9j69L51k53j76J84J07j89pK05P0j80j6q4j18m5J98K57
$$ 238 -137 23 75 42 54 35 -134 217 -36 -212 -28 79 -110 -117 88 158 -22 -38 -122 -240 -285 -87 170
3562A70j34l3k5n4ML00l8L2l37K51j72L19k86L31J05l63nj2k26K12l4K2q4q4Q3
$$ 170 36 3 -22 -76 -72 228 190 222 -115 136 -36 283 -3 328 433 70 65 53 -173 39 5 27 -57 -141 -58
3587e8j66J59L3K12j72J2J5l35J16K25m51O04j5k81K85j22o3L12j97k75K95j81
$$ -58 -224 -65 -32 180 8 20 35 -300 -184 41 -410 194 179 -102 183 61 -2 310 113 -162 133 -48
3609d8J84j44O5J8J43k62J68J18k36j82M9j66J41J37j03J83l5N1l90J62J82M4
$$ -48 136 -8 57 75 218 -44 124 242 6 -176 -127 -293 -152 -15 -118 65 30 81 -309 -147 35 79
3631G9J94n5k12J8P4J63j45j64K37k5l12L13k39P8q6Q3O1m16M40r7n3j6K6J40
$$ 79 273 218 6 24 98 261 116 -48 189 164 -148 165 -74 4 -82 1 62 -354 86 -11 -64 -80 -54 86
3655H6l13J05lJ11%n1K08j29L36m25J4J06R6j72J82k09J51J26k65P9J46l49J10
$$ 86 -227 -122 -125 -14 -14 -65 143 14 350 -75 -61 45 141 -31 151 -58 93 219 -46 33 179 -170 -60
3678f0J08OJ46k85J78j25j44L71k58q6P2k18K15O5l2q6K34k21J81q9K09j2r1l0
$$ -60 48 54 200 -85 93 -32 -176 195 -63 -149 -77 -295 -80 -15 -47 -133 101 -120 61 -28 181 169 78 48
3702D8L1J02j41j63n8P8o0M07k71m2L3J23n0q5J9J12j97j67O06j73j37j30l7K60
$$ 48 79 181 40 -123 -181 -103 -163 244 -27 -69 -36 87 37 -48 -29 83 -114 -281 325 152 15 -115 -152 108
$$ [...]
8191C7
##END NTUPLES=NMR FID
##END=
