##TITLE=1H_Ser EtOH6
 
 8 sc, 
 27.10.2023
##JCAMPDX= 6.0         $$ Bruker NMR JCAMP-DX V2.0
##DATA TYPE= NMR FID
##DATA CLASS= NTUPLES
##ORIGIN= UXNMR, Bruker Analytische Messtechnik GmbH
##OWNER= root
$$ XWIN-NMR		Version 3.5
$$ Fri Oct 27 16:10:42 2023 Russian Standard Time (UT+4h)  she@DPX200
##.OBSERVE FREQUENCY= 200.13135
##.OBSERVE NUCLEUS= ^1H
##.DELAY= (6, 6)
##.ACQUISITION MODE= SIMULTANEOUS
##.ACQUISITION SCHEME= undefined
##.AVERAGES= 8
##.DIGITISER RES= 18
##SPECTROMETER/DATA SYSTEM= spect
##.PULSE SEQUENCE= zg30
##.SOLVENT NAME= CDCl3
##.SHIFT REFERENCE= (INTERNAL, CDCl3, 0, 15.7039)
##AUDIT TRAIL= $$ (NUMBER, WHEN, WHO, WHERE, WHAT)
$$ ##TITLE= Audit trail, XWIN-NMR		Version 3.5
$$ ##JCAMPDX= 5.01
$$ ##ORIGIN= Bruker BioSpin GmbH
$$ ##OWNER= she
$$ F:/spectra/data/she/nmr/H-F/1/audita.txt
$$ ##AUDIT TRAIL=  $$ (NUMBER, WHEN, WHO, WHERE, WHAT)
(   1,<2023-10-27 16:09:27.15 +0400>,<she>,<DPX200>,
      <created by zg, POWCHK disabled, PULCHK disabled
       configuration hash MD5:
       00 E9 B6 7A A2 85 ED C7 34 08 36 98 17 FE 4E 26
       data hash MD5: 16K
       87 59 9B 5C 13 F1 6E 80 D9 9A 01 0D 99 5F 73 C4>)
$$ ##END=
$$ 
$$ hash MD5
$$ 18 DB 4F E0 2F D3 8A 46 28 DE 29 70 37 2D A9 8A
##$RELAX= 
##$RELAX= 
##$RELAX= 
##$RELAX= 
##$RELAX= 
##$RELAX= 
$$ Bruker specific parameters
$$ --------------------------
##$DU= <F:/spectra>
##$EXPNO= 1
##$NAME= <H-F>
##$PROCNO= 1
##$TYPE= <nmr>
##$USER= <she>
##$AMP= (0..31)
100 100 100 100 100 100 100 100 100 100 100 100 100 100 100 100 100 100 
100 100 100 100 100 100 100 100 100 100 100 100 100 100 
##$AQSEQ= 0
##$AQ_mod= 1
##$AUNM= <au_zg>
##$AUTOPOS= <>
##$BF1= 200.13
##$BF2= 200.13
##$BF3= 200.13
##$BF4= 200.13
##$BF5= 200.13
##$BF6= 200.13
##$BF7= 200.13
##$BF8= 200.13
##$BYTORDA= 1
##$CFDGTYP= 0
##$CFRGTYP= 5
##$CHEMSTR= <none>
##$CNST= (0..31)
1 1 145 1 1 1 1 1 1 1 1 1 1 1 1 1 1 1 1 1 1 1 1 1 1 1 1 1 1 1 1 1 
##$CPDPRG= <>
##$CPDPRG1= <>
##$CPDPRG2= <>
##$CPDPRG3= <>
##$CPDPRG4= <mlev>
##$CPDPRG5= <mlev>
##$CPDPRG6= <mlev>
##$CPDPRG7= <mlev>
##$CPDPRG8= <mlev>
##$CPDPRGB= <>
##$CPDPRGT= <>
##$D= (0..31)
0 1.2 0 0 0 0 0 0 0 0.06 0 0.03 0 0 0 0 0.0002 0 0 0 0 0 0 0 0 0 0 0 0 
0 0 0 
##$DATE= 1698408566
##$DBL= (0..7)
120 120 120 120 120 120 120 120 
##$DBP= (0..7)
150 150 150 150 150 150 150 150 
##$DBP07= 0
##$DBPNAM0= <>
##$DBPNAM1= <>
##$DBPNAM2= <>
##$DBPNAM3= <>
##$DBPNAM4= <>
##$DBPNAM5= <>
##$DBPNAM6= <>
##$DBPNAM7= <>
##$DBPOAL= (0..7)
0.5 0.5 0.5 0.5 0.5 0.5 0.5 0.5 
##$DBPOFFS= (0..7)
0 0 0 0 0 0 0 0 
##$DE= 6
##$DECBNUC= <off>
##$DECIM= 32
##$DECNUC= <off>
##$DECSTAT= 4
##$DIGMOD= 1
##$DIGTYP= 9
##$DL= (0..7)
0 120 120 120 120 120 120 120 
##$DP= (0..7)
150 150 150 150 150 150 150 150 
##$DP07= 0
##$DPNAME0= <>
##$DPNAME1= <>
##$DPNAME2= <>
##$DPNAME3= <>
##$DPNAME4= <>
##$DPNAME5= <>
##$DPNAME6= <>
##$DPNAME7= <>
##$DPOAL= (0..7)
0.5 0.5 0.5 0.5 0.5 0.5 0.5 0.5 
##$DPOFFS= (0..7)
0 0 0 0 0 0 0 0 
##$DQDMODE= 0
##$DR= 18
##$DS= 0
##$DSLIST= <SSSSSSSSSSSSSSS>
$$ [...]
##$SUBNAM2= <"">
##$SUBNAM3= <"">
##$SUBNAM4= <"">
##$SUBNAM5= <"">
##$SUBNAM6= <"">
##$SUBNAM7= <"">
##$SUBNAM8= <"">
##$SUBNAM9= <"">
##$SW= 18.05172834244
##$SWIBOX= (0..15)
0 0 2 0 0 0 0 0 0 0 0 0 0 0 0 0 
##$SW_h= 3612.71676300578
##$TD= 16384
##$TD0= 1
##$TE= 0
##$TE2= 300
##$TE3= 300
##$TEG= 300
##$TL= (0..7)
0 120 120 120 120 120 120 120 
##$TP= (0..7)
150 150 150 150 150 150 150 150 
##$TP07= 0
##$TPNAME0= <>
##$TPNAME1= <>
##$TPNAME2= <>
##$TPNAME3= <>
##$TPNAME4= <>
##$TPNAME5= <>
##$TPNAME6= <>
##$TPNAME7= <>
##$TPOAL= (0..7)
0.5 0.5 0.5 0.5 0.5 0.5 0.5 0.5 
##$TPOFFS= (0..7)
0 0 0 0 0 0 0 0 
##$TUNHIN= 0
##$TUNHOUT= 0
##$TUNXOUT= 0
##$USERA1= <user>
##$USERA2= <user>
##$USERA3= <user>
##$USERA4= <user>
##$USERA5= <user>
##$V9= 5
##$VALIST= <valist>
##$VCLIST= <CCCCCCCCCCCCCCC>
##$VD= 0
##$VDLIST= <DDDDDDDDDDDDDDD>
##$VPLIST= <PPPPPPPPPPPPPPP>
##$VTLIST= <TTTTTTTTTTTTTTT>
##$WBST= 1024
##$WBSW= 4
##$XGAIN= (0..3)
0 0 0 0 
##$XL= 0
##$YL= 0
##$YMAX_a= 233141
##$YMIN_a= -235981
##$ZGOPTNS= <>
##$ZL1= 120
##$ZL2= 120
##$ZL3= 120
##$ZL4= 120
##$ABSF1= 10
##$ABSF2= 0
##$ABSG= 5
##$ABSL= 3
##$ALPHA= 0
##$AQORDER= 0
##$ASSFAC= 0
##$ASSFACI= 0
##$ASSFACX= 0
##$ASSWID= 0
##$AUNMP= <proc_1d>
##$AZFE= 0.1
##$AZFW= 0.1
##$BCFW= 1
##$BC_mod= 2
##$BYTORDP= 1
##$COROFFS= 0
##$CY= 11.3945322036743
##$DATMOD= 1
##$DC= 2
##$DFILT= <>
##$DTYPP= 0
##$F1P= 15.7292609196834
##$F2P= 12.9074282941183
##$FCOR= 0.5
##$FTSIZE= 0
##$FT_mod= 4
##$GAMMA= 1
##$GB= 0.15
##$INTBC= 1
##$INTSCL= 1
##$ISEN= 128
##$LB= 0.24
##$LEV0= 0
##$LPBIN= 0
##$MAXI= 10000
##$MC2= 0
##$MEAN= 0
##$ME_mod= 0
##$MI= 1.114404
##$NCOEF= 0
##$NC_proc= 0
##$NLEV= 6
##$NOISF1= 3.799351
##$NOISF2= 2.8
##$NSP= 1
##$NTH_PI= 0
##$NZP= 0
##$OFFSET= 15.70392
##$PC= 1
##$PHC0= -23950.76
##$PHC1= 8.252729
##$PH_mod= 1
##$PKNL= yes
##$PPARMOD= 0
##$PSCAL= 0
##$PSIGN= 0
##$REVERSE= no
##$SF= 200.130013532006
##$SI= 16384
##$SIGF1= 3
##$SIGF2= 2
##$SINO= 400
##$SIOLD= 16384
##$SREGLST= <1H.CDCl3>
##$SSB= 0
##$STSI= 0
##$STSR= 0
##$SW_p= 3612.71676300578
##$SYMM= 0
##$S_DEV= 0
##$TDeff= 0
##$TDoff= 0
##$TI= <>
##$TILT= no
##$TM1= 0
##$TM2= 0
##$TOPLEV= 0
##$USERP1= <user>
##$USERP2= <user>
##$USERP3= <user>
##$USERP4= <user>
##$USERP5= <user>
##$WDW= 1
##$XDIM= 8192
##$YMAX_p= 0
##$YMIN_p= 0
$$ End of Bruker specific parameters
$$ ---------------------------------
##NTUPLES= NMR FID
##VAR_NAME=  TIME,          FID/REAL,        FID/IMAG
##SYMBOL=    X,             R,               I
##VAR_TYPE=  INDEPENDENT,   DEPENDENT,       DEPENDENT
##VAR_FORM=  AFFN,          ASDF,            ASDF
##VAR_DIM=   8192,          8192,            8192
##UNITS=     SECONDS,       ARBITRARY UNITS, ARBITRARY UNITS
##FACTOR=    0.0002768,     1,               1
##FIRST=     0,             0,               0
##LAST=      2.2672688,     0,               0
##MIN=       0,             -235981,         0
##MAX=       2.2672688,     233141,          0
$$ Real data points
##PAGE= N=1
##DATA TABLE= (X++(R..R)), XYDATA
0 0 0 0 0 0 0 0 0 0 0 -8 8 -8 8 -16 16 -24 24 -32 40 -48 56 -72 81 -96 113 -136 157 -182 209 -241 276 -315
32 -315 358 -406 458 -516 580 -649 727 -812 904 -1003 1114 -1234 1364 -1508 1665 -1834 2021
49 2021 -2228 2452 -2701 2975 -3279 3621 -4005 4436 -4933 5507 -6176 6973 -7938 9137
63 9137 -10668 12699 -15544 19840 -27163 43107 -146867 80304 92889 -18118 94790 -235981
75 -235981 180675 -79168 -37309 164878 -149192 99441 -103659 7517 138887 -196482
85 -196482 167281 -53420 -35233 41015 -133847 221741 -88175 -54073 66096 -128908 171868
96 171868 -84584 18645 40354 -161177 175835 -69895 4477 34979 -102312 156721 -144525
107 -144525 28580 93158 -100582 92679 -128320 79360 42394 -121765 145832 -99743
117 -99743 20416 649 -44305 158611 -161323 26687 50266 -50906 84565 -131067 103697
128 103697 8424 -105984 105117 -75445 77475 -37310 -56621 117663 -117498 66759
138 66759 2353 -36305 64128 -115072 104060 -13285 -53784 72987 -85414 79430 -41446
149 -41446 -17756 79251 -102237 73585 -27662 -14706 51302 -79873 92078 -54789 -24162
160 -24162 67030 -60934 64624 -63936 12272 56074 -85973 70677 -35192 8201 18376
171 18376 -65102 92397 -56818 -3675 34916 -44764 60613 -68706 32086 34510 -66483
182 -66483 53680 -43337 34734 3860 -52342 70346 -53388 19979 9282 -30369 52660
193 52660 -61934 36012 8120 -37355 46294 -45551 36264 -10703 -27121 51824 -48250 29708
205 29708 -8078 -16211 37433 -47554 40029 -11868 -19999 34050 -36009 35732 -22308 -7991
217 -7991 34944 -41155 30523 -16025 311 21223 -39602 38183 -18574 -3424 18860 -28593
229 -28593 33359 -26943 4884 20006 -29931 27641 -22673 10856 10078 -27793 31345 -22382
241 -22382 8281 6149 -19541 28144 -25560 11977 5009 -17911 23493 -22326 14858 -761
253 -761 -14976 22919 -21058 13819 -2943 -9789 19052 -21012 15298 -4083 -7676 15462 -18254
266 -18254 15520 -6961 -4559 13820 -16963 14272 -7788 -1319 10694 -15674 14284 -8467
278 -8467 208 8129 -13196 13597 -9603 2095 6152 -11459 12577 -9730 3564 3840 -9620
291 -9620 11646 -9646 4529 2020 -7704 10242 -9174 5385 239 -5878 8900 -8538 5621
304 5621 -999 -3990 7254 -7774 5732 -1759 -2535 5518 -6472 5426 -2597 -1102 4130 -5334
318 -5334 4701 -2835 155 2625 -4167 4065 -2739 738 1336 -2711 3103 -2624 1267 353 -1465
333 -1465 1977 -2049 1601 -611 -408 975 -1248 1349 -1284 817 -239 -363 996 -1556 1836 -1663
349 -1663 795 583 -1794 2526 -2781 2156 -460 -1727 3349 -3889 3320 -1613 -1003 3787 -5337 4831
365 4831 -2534 -586 3666 -6022 6557 -4329 64 4092 -6620 7342 -5940 1937 3623 -8016
379 -8016 8998 -6819 2779 2311 -7689 10879 -9403 3846 2596 -7526 10664 -11142 7049
392 7049 1067 -8861 12325 -11481 7957 -1655 -7052 14244 -14991 9215 -1233 -6002 12467
405 12467 -16482 13823 -3887 -7457 14050 -15651 14155 -8076 -3686 15736 -20016 15199
417 15199 -6846 -1795 11678 -20561 21057 -10491 -3725 13254 -17822 19824 -15842 2247
429 2247 14530 -22929 20233 -13074 4654 7919 -22169 27171 -17545 1841 9788 -17411 23992
442 23992 -23738 9901 10753 -23415 23793 -19257 12559 1672 -21283 31865 -24713 8754
454 8754 4120 -14610 26526 -31628 19050 4760 -21717 25613 -24838 21648 -7189 -17759
466 -17759 34838 -31211 16231 -3681 -8678 26467 -38444 28618 -2907 -17129 24214 -28320
478 -28320 30457 -17380 -11496 34177 -34668 22770 -12577 -396 23121 -41524 35939 -11325
490 -11325 -9742 19823 -28886 36536 -26745 -2842 29612 -35280 27744 -20589 8712 16403
502 16403 -40955 41761 -19999 -1718 13601 -26190 40228 -36570 7564 23754 -34142 30096
514 30096 -27657 20027 6953 -39216 46557 -27004 6656 4080 -20417 43268 -46017 17114
526 17114 16425 -28669 29429 -34837 31655 -2333 -34615 45851 -31372 16740 -7086 -14047 42584
539 42584 -49420 25014 5134 -19891 27723 -38504 37876 -11640 -24053 40745 -35046 24548
551 24548 -14699 -5752 34891 -49026 33745 -5427 -13097 22757 -35329 42252 -23943 -13075
563 -13075 37180 -35218 26384 -22624 7540 26410 -50661 39587 -11158 -4139 11722 -31720
575 -31720 49500 -33853 -5989 29862 -28623 28626 -34345 18668 20966 -46797 37891 -18532
587 -18532 10089 2283 -30498 49880 -35858 4309 15276 -22679 32718 -38822 22643 10291
599 10291 -33907 36183 -27772 17880 -2059 -21799 40623 -38669 17471 5919 -19669 27763
611 27763 -34399 29668 -4802 -25399 36426 -27583 18394 -11983 -7373 35730 -43579 21754
623 21754 2041 -9255 16739 -35072 39233 -11682 -20810 27815 -21604 25038 -24857 -770
635 -770 33246 -38357 20758 -9366 4750 13065 -36818 37665 -13992 -7127 14666 -22116 31677
648 31677 -26489 2816 19977 -27676 25534 -20229 8659 9962 -26259 30773 -22350 6292
660 6292 10011 -20790 25234 -24002 13738 6164 -24146 27026 -18372 10369 -2125 -14492 30407
673 30407 -27268 8232 5475 -9475 17559 -28138 21641 2269 -19012 18191 -15959 19163
685 19163 -11620 -11242 27067 -21929 10683 -6604 -346 17304 -28223 19620 -3134 -5784 10987
698 10987 -19613 23087 -12045 -5107 15026 -17559 17965 -13670 1427 12314 -19136 18433
710 18433 -12859 2850 9019 -16830 17844 -13980 5721 6493 -16616 17904 -12383 5935 1777
723 1777 -12559 19640 -15501 4695 3093 -8004 14588 -17990 10431 3050 -10779 11927 -13134
736 -13134 12652 -3751 -9476 15548 -12862 9012 -5240 -3211 13620 -16579 10716 -3346
748 -3346 -2313 9013 -15054 14119 -5977 -2791 8507 -12442 13650 -8918 -302 8226 -12055
761 -12055 12646 -9724 2357 6450 -11817 12428 -9806 4171 4034 -11019 12822 -9819 4695
774 4695 1799 -8872 12906 -11035 5147 1175 -6789 11221 -11863 7095 339 -6398 9898
787 9898 -10971 8387 -1847 -5483 9854 -10504 8323 -3386 -3482 9212 -10912 8636 -4027
800 -4027 -1949 7809 -10899 9522 -4773 -1090 6536 -10168 10095 -5955 -202 5755 -9293
813 -9293 9967 -7048 1186 4970 -8880 9637 -7362 2454 3649 -8334 9664 -7517 3081
826 3081 2396 -7187 9390 -7942 3696 1575 -6164 8666 -8051 4448 705 -5371 8011 -7860
840 -7860 4893 -186 -4495 7382 -7603 5159 -931 -3591 6688 -7349 5369 -1575 -2750
853 -2750 6024 -7045 5489 -2045 -2006 5291 -6613 5543 -2473 -1349 4580 -6118 5461 -2853
867 -2853 -709 3933 -5587 5253 -3051 -165 3268 -5055 4920 -3043 235 2545 -4364 4573 -3053
882 -3053 486 2039 -3646 3947 -2946 831 1586 -3223 3399 -2416 816 933 -2484 3033 -2214 555
898 555 869 -1689 2100 -1935 838 734 -1674 1516 -937 480 130 -1026 1464 -746 -325 626 -293
915 -293 252 -448 24 846 -902 -179 1007 -689 184 -312 241 910 -2025 1407 314 -1252 1126 -1362
933 -1362 1930 -1094 -1385 3079 -2471 1043 -453 -314 2453 -4174 3032 93 -2108 2422 -2963 3722
949 3722 -2195 -1807 4781 -4329 2460 -1418 -21 3442 -6339 5123 -905 -2118 3080 -4377 5890
964 5890 -4143 -1334 5818 -6007 4163 -3171 1259 3630 -8246 7582 -2721 -1217 2910 -5379
978 -5379 8301 -6943 238 6020 -7263 5985 -5543 3592 2783 -9545 10090 -5050 559
991 559 1767 -5553 10366 -10037 2619 5185 -7591 7270 -7931 6470 971 -9769 11789
1004 11789 -7199 2755 -219 -4744 11517 -12594 5156 3498 -6861 7663 -9834 9376 -1494
1017 -1494 -8934 12490 -8882 5090 -2826 -2998 11752 -14700 7893 1165 -5270 7256 -11239
1030 -11239 12465 -4715 -7110 12482 -10207 7567 -6038 -270 11064 -16319 10779 -1849
1042 -1849 -2738 5913 -11970 15278 -8353 -4273 11223 -10676 9697 -9403 3081 9144 -16520
1055 -16520 12809 -4913 385 3638 -11422 16768 -11338 -965 8834 -9866 10623 -11859
1067 -11859 6409 6264 -15322 13617 -7123 3333 708 -9564 17069 -13662 2190 6030 -8018
1080 -8018 10361 -13694 9820 2918 -13426 13518 -8721 6397 -2881 -7088 16717 -15361 5271
1093 5271 2448 -5251 9615 -15210 12805 -721 -10230 12216 -10110 9551 -6309 -4117 14771
1106 14771 -15675 8303 -1650 -2245 8107 -14898 14441 -4589 -6070 10176 -10315 10898 -8834
1119 -8834 -223 11398 -15029 10126 -4201 624 4889 -12883 15385 -7675 -2908 7622 -8343
1132 -8343 10697 -11351 3581 8459 -13502 9827 -5889 4307 1268 -11234 15430 -8979
1144 -8979 157 3474 -5828 11105 -13204 5882 5005 -9818 9017 -8615 7671 -1065 -8635
1157 -8635 13019 -9839 4644 -627 -4269 10158 -12371 8009 -231 -5882 8746 -9534 8386
1170 8386 -3840 -3664 10070 -11053 7086 -2369 -1442 6189 -10983 10601 -3626 -3762 6385 -7030
1184 -7030 8785 -7650 -59 8385 -9685 6214 -4521 3082 3225 -10546 10523 -4139 -343
1197 -343 1777 -5456 10267 -8901 1259 4630 -5712 6538 -8034 5325 2046 -7514 7815
1210 7815 -6224 4669 -790 -5158 8690 -7686 4569 -963 -3583 7579 -8138 5446 -1753
1223 -1753 -2389 6768 -8636 6103 -1764 -1562 4713 -8068 8082 -3141 -2381 4656 -5710 7322
1237 7322 -5978 -201 5982 -6715 5258 -4910 2830 3228 -8194 7284 -3579 1618 620 -5494
1251 -5494 8799 -6215 1038 1827 -3636 6660 -7767 3744 1948 -4697 5501 -6512 5456
1264 5456 -440 -4867 6535 -5900 5025 -2294 -3058 7164 -6988 4639 -2362 -1120 5912 -8186
1278 -8186 5877 -1999 -921 4080 -7469 7630 -3388 -1420 4071 -5886 7290 -5434 -7
1291 -7 4751 -6177 6065 -5376 2125 3430 -7079 6714 -4598 2294 1483 -6105 7855 -5485
1305 -5485 1829 1200 -4495 7361 -6888 2822 1519 -4246 6165 -6925 4465 589 -4674 6152
1319 6152 -6176 4898 -1095 -3947 6855 -6433 4490 -1716 -2371 6398 -7423 5061 -1560
1332 -1560 -1772 5152 -7343 6255 -2274 -1874 4741 -6487 6471 -3544 -1177 4858 -6292 5985
1346 5985 -4013 62 4289 -6543 6043 -3873 676 3210 -6232 6485 -4110 749 2562 -5379
1360 -5379 6441 -4766 1168 2385 -4830 5917 -5052 2010 1919 -4739 5645 -4860 2506 1067
1374 1067 -4337 5713 -4874 2601 452 -3571 5489 -5163 2879 160 -3012 4976 -5223 3362
1388 3362 -252 -2712 4559 -4942 3602 -853 -2239 4310 -4721 3575 -1234 -1612 3871 -4614 3624
1403 3624 -1425 -1189 3351 -4270 3622 -1684 -800 2937 -3946 3484 -1792 -403 2418 -3590 3426
1418 3426 -1905 -219 2061 -3077 3137 -2106 181 1830 -2864 2745 -1869 518 1147 -2546 2805
1433 2805 -1822 354 860 -1806 2375 -2098 705 912 -1734 1773 -1550 1002 166 -1506 1956 -1317
1449 -1317 469 24 -575 1401 -1631 791 370 -741 595 -750 995 -435 -637 996 -420 34
1465 34 -346 432 328 -865 354 331 -56 -587 296 543 -561 -149 166 667 -825 -257 1045 -572 -2
1484 -2 -407 786 180 -1518 1430 -199 -266 -85 -348 1703 -1944 336 1194 -1155 763 -1341 1687
1501 1687 -117 -2079 2433 -1134 408 -509 -448 2512 -3147 1227 884 -1292 1253 -2273 2791 -813
1517 -813 -2173 3088 -1948 1262 -1278 -142 2964 -4111 2191 266 -1003 1374 -2972 3872 -1722
1532 -1722 -1851 3330 -2522 2084 -2227 544 2991 -4806 3133 -565 -367 1106 -3327 4871 -2894
1547 -2894 -1094 3140 -2824 2818 -3357 1646 2495 -5143 4003 -1626 640 385 -3295 5670 -4145
1562 -4145 29 2443 -2686 3343 -4475 2951 1580 -4955 4458 -2563 1816 -653 -2822 5991 -5043
1577 -5043 1165 1445 -2093 3390 -5175 4087 507 -4297 4428 -3109 2769 -1733 -1991 5776 -5534
1592 -5534 2112 405 -1271 2982 -5457 5006 -705 -3349 4054 -3371 3552 -2898 -864 5148 -5721
1607 -5721 3003 -776 -141 2262 -5393 5745 -2022 -1992 3225 -3293 4208 -4069 525 4065 -5404
1622 -5404 3602 -1994 1184 1191 -4859 5999 -3083 -530 2019 -2716 4321 -4824 1818 2687 -4574 3632
1638 3632 -2709 2243 -27 -3859 5661 -3666 602 834 -1813 3875 -5062 2772 1332 -3487 3210
1653 3210 -2959 3041 -1165 -2645 4933 -3802 1555 -387 -736 3180 -4910 3459 -63 -2064 2490
1668 2490 -3032 3656 -2219 -1202 3742 -3631 2388 -1609 423 2095 -4282 3854 -1450 -586 1501
1683 1501 -2548 3716 -3118 344 2334 -3040 2535 -2299 1621 678 -3274 3781 -2131 544 224
1698 224 -1498 3353 -3576 1401 1071 -1904 2045 -2663 2555 -410 -2184 2985 -2201 1605 -1055
1713 -1055 -600 2747 -3298 1988 -452 -506 1611 -2807 2860 -1344 -575 1806 -2367 2484 -1872 374
1729 374 1405 -2620 2763 -1916 550 836 -2034 2860 -2631 1115 868 -2034 2370 -2451 1952 -138
1745 -138 -2078 2959 -2343 1561 -761 -921 2932 -3317 1851 -274 -637 1861 -3202 2975 -894 -1097
1761 -1097 1910 -2446 2897 -1992 -411 2328 -2744 2486 -2042 543 1802 -3199 2853 -1877 759
1776 759 1002 -2966 3484 -2287 700 694 -2362 3626 -3094 1034 862 -2046 3139 -3513 2025 629
1792 629 -2413 2952 -3135 2623 -435 -2327 3588 -3117 2289 -1039 -1340 3671 -3961 2402 -726
1807 -726 -798 2811 -4234 3339 -893 -1143 2393 -3580 3805 -1900 -1039 2811 -3288 3367 -2501 -83
1823 -83 2877 -3825 3174 -2188 624 2006 -4075 3888 -2110 401 1317 -3372 4396 -2955 361 1570
1839 1570 -2807 3855 -3649 1286 1629 -3144 3471 -3349 2075 745 -3343 3956 -3124 1920 -54
1854 -54 -2601 4301 -3725 1799 24 -1871 3754 -4252 2471 109 -1953 3156 -3908 3151 -563
1869 -563 -2086 3313 -3447 2987 -1310 -1457 3539 -3694 2668 -1299 -676 3014 -4050 3057 -1123 -618
1885 -618 2328 -3702 3552 -1591 -721 2258 -3163 3396 -2231 -213 2335 -3177 3037 -2282 483
1900 483 1880 -3368 3202 -2101 652 1209 -3006 3489 -2369 621 994 -2430 3300 -2787 967 961
1916 961 -2241 2911 -2785 1458 608 -2202 2777 -2547 1613 102 -1928 2795 -2495 1529 -199
1931 -199 -1414 2645 -2660 1573 -205 -1059 2169 -2646 1893 -331 -1055 1845 -2230 1992 -816 -822
1947 -822 1906 -2070 1704 -977 -253 1604 -2197 1782 -837 -117 1088 -1855 1950 -1141 -56 1031
1963 1031 -1528 1660 -1306 396 756 -1540 1625 -1155 456 334 -1122 1621 -1405 547 347 -890
1979 -890 1176 -1314 981 -40 -932 1229 -1009 764 -448 -319 1198 -1366 757 -166 -99 499 -1142
1996 -1142 1281 -546 -331 620 -602 880 -1010 380 633 -1035 720 -504 573 -204 -734 1271
2012 1271 -863 206 -36 -62 693 -1300 981 0 -549 469 -631 1073 -915 -153 1042 -984 571
2029 571 -644 595 292 -1371 1389 -551 4 39 -507 1402 -1525 430 661 -846 733 -1097 1229
2046 1229 -202 -1222 1575 -945 519 -466 -190 1479 -1945 978 199 -555 667 -1366 1762 -796
2062 -796 -863 1529 -1156 929 -1049 315 1282 -2169 1434 -316 -99 390 -1408 2186 -1371 -345
2078 -345 1245 -1144 1218 -1580 905 904 -2111 1704 -776 472 -47 -1266 2398 -1827 175 839
2094 839 -939 1325 -1955 1418 469 -1901 1765 -1090 888 -485 -981 2366 -2111 592 414 -679
2110 -679 1238 -2113 1795 -18 -1558 1678 -1245 1218 -924 -569 2170 -2211 964 -29 -268 997
2126 997 -2105 2086 -504 -1060 1379 -1223 1486 -1356 -50 1770 -2099 1199 -495 226 608 -1918
2142 -1918 2188 -910 -521 955 -1036 1520 -1638 409 1283 -1814 1225 -747 583 213 -1584 2074
2158 2074 -1099 -123 574 -765 1389 -1677 720 825 -1472 1127 -830 810 -126 -1168 1824 -1153
2174 -1153 180 227 -434 1125 -1586 916 384 -1020 868 -811 953 -460 -709 1417 -1055 375
2190 375 -147 -57 761 -1363 972 4 -543 502 -634 928 -685 -248 932 -795 391 -338 244
2207 244 341 -964 841 -172 -187 157 -310 709 -659 49 493 -439 234 -328 390 26 -539 544 -164
2226 -164 18 -113 -13 378 -509 172 133 -82 2 -227 406 -256 -113 187 -77 116 -328 313 -10 -252 229
2247 229 -164 274 -308 63 316 -439 308 -210 190 21 -407 624 -435 118 71 -250 546 -702 428
2266 428 79 -424 529 -623 583 -213 -376 747 -741 549 -285 -189 711 -951 747 -296 -184 650
2284 650 -959 909 -451 -135 666 -1005 1023 -590 -50 646 -1026 1116 -770 73 675 -1090 1144
2301 1144 -880 293 576 -1211 1286 -911 357 381 -1148 1489 -1133 378 358 -1017 1469 -1384
2317 -1384 609 361 -1067 1403 -1415 871 154 -1126 1491 -1395 937 -102 -972 1650 -1541 943
2333 943 -164 -750 1598 -1752 1117 -140 -689 1386 -1764 1411 -318 -774 1395 -1601 1476 -665
2349 -665 -604 1548 -1689 1368 -771 -270 1414 -1932 1500 -690 -160 1090 -1883 1817 -884 -219
2365 -219 1011 -1625 1865 -1261 -25 1128 -1595 1687 -1378 377 994 -1764 1719 -1247 555
2380 555 587 -1712 1998 -1312 436 423 -1355 2019 -1660 536 532 -1198 1706 -1774 932 435 -1356
2397 -1356 1601 -1553 1100 15 -1298 1811 -1516 950 -201 -909 1810 -1777 965 -105 -663
2412 -663 1487 -1873 1309 -157 -751 1271 -1624 1499 -532 -693 1384 -1483 1343 -794 -304 1369
2428 1369 -1626 1253 -730 -3 1026 -1701 1485 -688 -35 706 -1444 1638 -989 -64 738 -1159
2444 -1159 1448 -1246 266 767 -1233 1237 -1115 599 439 -1296 1378 -971 505 98 -965 1487
2460 1487 -1192 461 153 -665 1217 -1344 765 136 -720 1025 -1160 928 -171 -633 1060 -1092
2476 -1092 875 -371 -381 978 -1126 901 -466 -187 836 -1117 910 -531 6 623 -1109 1039
2492 1039 -548 31 389 -864 1142 -808 95 459 -682 883 -957 497 360 -865 863 -717
2508 -717 575 -88 -679 1124 -875 406 -67 -306 854 -1114 728 -39 -435 657 -861 874 -436
2525 -436 -310 834 -901 709 -466 31 574 -1038 971 -482 -52 432 -751 996 -844 178
2541 178 544 -855 800 -722 493 157 -903 1139 -752 289 31 -464 1066 -1191 565 246
2557 246 -623 757 -955 912 -221 -711 1113 -905 611 -390 -215 1029 -1347 849 -121 -325
2573 -325 641 -1088 1204 -573 -402 966 -959 867 -708 111 828 -1363 1081 -445 8 415 -1025
2590 -1025 1384 -907 -48 722 -887 988 -995 508 536 -1252 1183 -710 367 87 -864 1448
2606 1448 -1180 283 412 -707 997 -1223 830 199 -1076 1180 -899 644 -220 -649 1399 -1340
2622 -1340 557 120 -510 934 -1318 1078 -92 -828 1116 -978 853 -488 -395 1286 -1388 775
2638 775 -146 -257 782 -1324 1253 -368 -546 927 -946 996 -743 -94 1041 -1309 882 -405
2654 -405 31 535 -1205 1293 -611 -241 672 -828 1012 -911 169 770 -1146 918 -565 250 317
2671 317 -1029 1272 -734 -8 469 -701 990 -969 373 535 -974 897 -647 395 134 -841
2687 -841 1173 -798 151 272 -557 880 -956 459 323 -786 784 -649 472 -35 -640 1001 -768
2704 -768 266 108 -375 729 -869 512 139 -562 625 -579 503 -147 -424 798 -664 301 -12
2721 -12 -235 556 -737 495 21 -405 501 -492 435 -175 -299 610 -569 280 -51 -173 425 -604 419
2740 419 -13 -318 397 -408 347 -144 -242 495 -453 210 -29 -148 357 -461 327 24 -264 336 -302 249
2760 249 -47 -209 403 -336 145 50 -177 308 -339 207 75 -269 306 -256 140 39 -267 378 -289 72
2780 72 129 -260 318 -285 98 145 -336 363 -253 73 133 -328 413 -293 46 209 -354 399 -294 70 219
2801 219 -409 443 -290 60 216 -413 481 -333 70 241 -434 490 -350 96 228 -477 528 -382 83 234
2821 234 -473 554 -433 126 234 -502 575 -470 160 218 -526 632 -494 190 190 -515 652 -550 240
2840 240 181 -511 688 -594 271 145 -499 696 -627 341 106 -508 702 -655 383 46 -498 738
2858 738 -684 413 0 -440 729 -750 437 -15 -403 710 -771 522 -70 -389 685 -767 585
2875 585 -149 -356 700 -771 595 -211 -272 702 -807 641 -243 -197 636 -833 707 -289 -168 578
2893 578 -808 774 -398 -139 555 -763 754 -484 -27 534 -787 740 -503 71 432 -802 794
2910 794 -507 114 332 -726 845 -592 124 305 -629 818 -679 224 291 -617 754 -673 361
2927 361 193 -623 778 -645 386 52 -544 801 -691 377 10 -403 752 -781 449 0 -353
2944 -353 625 -767 590 -99 -356 593 -682 605 -270 -260 637 -669 552 -323 -83 555 -770 596
2962 596 -278 -20 392 -715 739 -364 -50 349 -558 719 -525 68 382 -554 618 -530 236 269
2980 269 -590 636 -496 271 108 -517 685 -565 276 24 -400 671 -626 322 -11 -305 583 -695
2998 -695 441 -32 -275 477 -629 579 -187 -282 522 -534 526 -358 -79 569 -654 487 -291 92
3016 92 344 -709 682 -311 -7 230 -513 727 -551 70 323 -491 585 -586 293 211 -575 648
3034 648 -533 303 62 -484 708 -642 351 33 -420 654 -659 451 -81 -359 691 -702 465
3051 465 -115 -219 595 -780 624 -140 -277 508 -651 699 -386 -206 633 -675 566 -428 66 506
3069 506 -870 705 -317 14 292 -699 874 -586 -17 431 -612 713 -682 254 372 -778 780
3086 780 -567 269 156 -655 914 -733 268 215 -563 783 -781 485 121 -635 841 -715 443
3103 443 -52 -460 896 -897 472 31 -407 700 -879 700 -133 -504 768 -743 614 -321 -263
3120 -263 809 -960 605 -198 -172 571 -909 861 -319 -291 637 -745 754 -517 -72 688 -921
3137 -921 721 -385 12 455 -884 944 -491 -80 492 -725 833 -658 123 526 -865 790 -529
3154 -529 183 293 -792 964 -637 97 338 -631 817 -781 300 336 -745 767 -615 348 99
3171 99 -642 912 -701 258 157 -468 759 -797 457 139 -563 704 -651 488 -60 -470 832
3188 832 -733 391 -14 -335 669 -813 537 -15 -428 624 -665 541 -194 -335 723 -721 464
3205 464 -157 -215 575 -777 583 -148 -281 525 -627 574 -291 -194 598 -668 510 -235 -80 460 -688
3224 -688 599 -228 -141 410 -544 575 -340 -63 445 -574 488 -293 14 321 -583 551 -288 -50 287
3243 287 -471 516 -366 13 312 -492 450 -317 73 233 -475 508 -305 20 224 -404 464 -355 73 250
3263 250 -413 428 -299 105 170 -400 458 -300 77 170 -333 411 -332 94 172 -340 368 -294 113 125 -328
3284 -328 378 -275 75 114 -286 344 -298 98 119 -284 310 -252 97 104 -270 328 -251 86 108 -245 309 -251
3306 -251 94 103 -257 308 -239 89 93 -245 303 -228 75 101 -237 289 -228 85 104 -249 280 -226 68 96
3328 96 -238 278 -222 76 100 -232 283 -221 78 100 -232 279 -212 77 89 -227 303 -227 100 104 -227 293
3350 293 -219 91 94 -232 291 -228 98 84 -210 292 -232 106 73 -228 290 -256 113 54 -227 283 -266 132
3372 132 54 -219 292 -278 144 34 -213 296 -276 161 22 -188 299 -276 172 12 -182 295 -281 189
3392 189 -5 -162 300 -301 205 -21 -157 285 -307 218 -50 -133 270 -306 227 -72 -122 266 -312 241 -101
3413 -101 -96 245 -321 258 -117 -81 223 -307 288 -145 -42 210 -297 283 -167 -11 203 -295 295 -180 9
3434 9 167 -281 294 -202 42 140 -273 299 -215 63 101 -262 313 -243 79 93 -238 293 -266 116 64 -231
3456 -231 280 -273 159 20 -211 288 -273 158 -14 -156 285 -293 181 -26 -125 245 -308 237 -64 -109 231
3477 231 -281 257 -108 -71 231 -296 257 -148 -22 212 -298 257 -178 10 165 -290 296 -202 29 142
3497 142 -272 310 -239 55 105 -250 316 -275 91 89 -233 291 -299 171 52 -247 292 -278 198 -22 -196
3518 -196 344 -302 182 -38 -113 305 -377 244 -36 -130 234 -339 321 -121 -134 276 -317 300 -199 -49 268
3539 268 -374 300 -177 -10 196 -364 372 -229 10 194 -347 371 -268 56 188 -349 407 -297 73 150
3559 150 -301 414 -361 136 161 -322 374 -348 217 57 -354 444 -337 173 -11 -244 452 -442 193 37
3579 37 -215 354 -460 333 -20 -285 369 -388 321 -145 -185 443 -449 306 -102 -109 363 -500 397 -141 -139 356
3601 356 -454 416 -207 -84 363 -484 428 -214 -45 296 -466 479 -301 -45 324 -445 431 -341 50 284
3621 284 -508 459 -280 72 166 -452 549 -371 31 208 -367 480 -450 172 214 -436 446 -370 218 73
3641 73 -409 550 -411 161 70 -299 490 -494 243 93 -343 458 -449 282 -5 -324 504 -476 266 -13 -261
3662 -261 444 -523 347 -40 -289 437 -460 347 -121 -227 477 -512 333 -87 -141 392 -533 424 -115 -195 370
3683 370 -438 430 -226 -123 426 -476 376 -185 -29 325 -505 453 -190 -65 282 -423 449 -283 -30 315
3703 315 -436 383 -265 50 235 -446 444 -275 12 197 -385 437 -334 58 215 -393 403 -300 114 152
3723 152 -383 452 -311 107 140 -322 418 -367 137 138 -326 376 -338 179 80 -316 405 -323 152 43 -255
3744 -255 372 -375 188 48 -252 337 -332 218 4 -244 352 -325 192 -13 -178 323 -344 223 -16 -178
3764 -178 284 -313 241 -58 -158 295 -309 216 -64 -121 279 -324 236 -47 -116 239 -301 252 -96 -86 234
3785 234 -296 221 -105 -68 212 -289 230 -110 -83 186 -264 231 -128 -52 186 -257 213 -125 -22 161 -241
3806 -241 223 -120 -16 147 -215 225 -121 -5 142 -195 199 -127 14 110 -203 212 -132 14 103 -185 195
3827 195 -134 18 95 -172 181 -131 21 80 -169 181 -132 20 73 -156 160 -126 34 65 -137 161 -131
3848 -131 37 61 -131 157 -114 54 64 -116 150 -115 46 61 -116 141 -116 51 44 -101 129 -114 51 24
3870 24 -98 118 -114 39 19 -98 111 -110 42 16 -88 112 -107 46 28 -84 120 -103 43 3 -81 110
3892 110 -92 46 6 -73 112 -101 56 8 -66 94 -93 67 1 -55 96 -97 49 -5 -61 92 -105 60 -16
3915 -16 -60 78 -106 60 -16 -49 84 -102 68 -23 -40 86 -90 69 -21 -37 80 -89 71 -19 -20 70 -90 90
3939 90 -21 -11 77 -87 82 -44 -12 80 -91 74 -45 -1 69 -93 82 -61 -5 52 -92 89 -73 8 36 -97
3963 -97 78 -72 10 34 -82 83 -78 30 22 -80 99 -87 34 23 -67 107 -101 45 17 -51 91 -95 66
3986 66 12 -58 106 -104 61 -17 -59 84 -116 79 -25 -42 80 -108 78 -48 -35 87 -123 91 -57 -9 72
4009 72 -125 109 -70 -13 83 -124 120 -76 -1 72 -121 128 -86 30 61 -133 129 -98 29 35 -118 144 -133
4032 -133 34 44 -119 122 -140 74 22 -117 134 -136 60 -2 -100 146 -154 64 -6 -91 137 -171 102 -9
4054 -9 -92 144 -155 115 -28 -70 155 -179 137 -36 -65 131 -187 160 -58 -62 148 -176 153 -76 -31 157 -205
4077 -205 166 -74 -24 114 -198 210 -113 -41 126 -180 184 -141 6 138 -210 179 -122 33 86 -207 232
4098 232 -140 7 93 -164 211 -179 58 92 -187 214 -172 79 57 -181 243 -194 87 52 -170 215 -215
4119 -215 112 33 -187 220 -209 113 6 -162 249 -247 116 16 -133 212 -268 167 -2 -166 221 -216
4139 -216 185 -60 -112 261 -250 151 -40 -71 211 -287 211 -39 -96 188 -241 219 -98 -87 216 -247 201
4160 201 -102 -46 185 -274 223 -108 -44 171 -258 226 -133 -32 169 -262 227 -141 -13 139 -266 259 -162
4181 -162 -17 139 -229 243 -202 26 166 -253 238 -172 65 98 -252 274 -174 27 94 -202 279 -231 61
4202 61 113 -215 237 -225 108 59 -218 245 -204 94 40 -179 262 -234 117 35 -164 245 -229 121 2 -155
4224 -155 238 -230 143 7 -124 226 -244 163 -4 -130 222 -232 173 -50 -123 231 -231 156 -44 -85 198
4245 198 -256 182 -45 -98 175 -244 188 -88 -91 177 -225 163 -105 -53 167 -244 179 -91 -39 149 -212 184
4267 184 -109 -29 137 -207 190 -128 -3 119 -198 192 -120 10 113 -177 187 -142 16 99 -173 186 -142
4288 -142 41 69 -175 188 -145 22 58 -161 181 -153 39 65 -162 169 -149 65 48 -143 174 -151 65
4309 65 29 -118 173 -151 80 25 -105 150 -150 88 3 -89 146 -132 79 -4 -87 138 -138 83 -8 -66 125
4332 125 -141 100 -31 -74 116 -131 85 -37 -52 103 -128 93 -29 -57 81 -112 93 -46 -20 92 -112
4353 -112 109 -53 -27 79 -110 101 -37 -10 77 -93 101 -54 -6 67 -94 99 -52 11 44 -92 90 -59
4375 -59 4 42 -86 84 -63 11 30 -79 83 -59 19 19 -63 75 -58 23 33 -54 72 -53 34 15 -55 72 -57
4400 -57 27 7 -51 70 -49 30 16 -45 58 -53 33 -12 -44 44 -55 33 0 -31 55 -61 31 -20 -30 42 -55 30 -26 -25
4428 -25 33 -47 32 -13 -18 37 -45 38 -23 -3 34 -36 41 -18 -2 26 -34 29 -23 9 10 -26 40 -27 0 11 -39 32 -29 -1 2 -44
4460 -44 35 -38 0 -5 -37 12 -34 -1 -2 -34 29 -35 9 8 -35 26 -34 10 10 -25 44 -28 14 4 -25 34 -20 25 0 -16 27 -22
4492 -22 22 0 -24 31 -41 30 -8 -22 26 -39 22 -2 -14 10 -39 19 -14 -25 28 -25 21 -11 -20 30 -40 36 -14 -16 32 -43 31
4523 31 -16 -14 45 -36 32 -6 -3 37 -39 35 -18 -6 36 -39 41 -26 -22 33 -51 38 -31 -3 30 -68 35 -25 -11 34 -59 48 -35
4554 -35 -21 25 -58 40 -48 1 44 -57 56 -26 16 24 -50 72 -40 0 33 -50 60 -45 11 46 -55 57 -55 8
4580 8 15 -72 69 -59 11 21 -65 61 -77 23 26 -73 66 -63 30 12 -71 93 -73 22 21 -67 74 -81 36 21
4606 21 -64 87 -71 46 7 -70 96 -79 45 9 -51 93 -95 52 9 -64 88 -88 80 -12 -58 90 -95
4629 -95 59 -12 -45 82 -122 66 -17 -47 85 -118 87 -35 -39 110 -121 82 -28 -28 87 -126 100 -34 -36 93
4653 93 -124 109 -69 -26 99 -119 106 -58 -2 90 -134 112 -60 -11 71 -115 117 -91 -12 70 -128 108 -86
4676 -86 3 55 -135 131 -90 -3 44 -106 130 -108 21 58 -117 134 -86 44 55 -122 148 -106 40 38 -86
4699 -86 142 -124 66 44 -104 124 -115 77 21 -111 144 -122 55 13 -84 148 -137 71 8 -94 125 -139
4721 -139 98 3 -82 129 -133 91 -18 -72 125 -131 98 -25 -72 123 -140 107 -38 -48 114 -144 108 -37
4743 -37 -37 111 -143 127 -37 -43 99 -126 127 -69 -32 106 -138 108 -75 -17 87 -148 125 -69 -14 81 -123
4766 -123 139 -85 -6 68 -129 134 -87 10 63 -113 133 -94 28 59 -111 133 -94 39 42 -102 130 -90
4788 -90 35 40 -99 121 -104 45 28 -85 116 -120 51 23 -80 115 -104 61 7 -88 117 -109 64 -11 -68
4811 -68 119 -121 78 3 -49 103 -101 95 -8 -50 109 -99 86 -12 -38 101 -102 92 -31 -30 92 -111 85
4834 85 -41 -28 76 -122 83 -48 -6 56 -98 84 -59 -16 58 -98 81 -66 1 52 -93 83 -59 10 43
4857 43 -81 91 -56 12 30 -71 93 -70 14 27 -63 92 -70 29 24 -66 79 -67 38 7 -59 73 -67 37
4881 37 -10 -60 64 -72 40 -12 -50 42 -78 41 -15 -34 63 -73 42 -17 -34 68 -64 44 -27 -16 67 -57 57
4906 57 -25 -12 43 -64 64 -26 0 34 -62 62 -40 4 35 -62 51 -40 6 26 -46 46 -54 4 19 -47 47 -44 8
4933 8 14 -46 47 -47 29 5 -37 57 -55 14 0 -25 52 -39 31 1 -12 44 -55 33 -7 -19 26 -50 37 -9 -12 31 -33 30 -29
4964 -29 -4 27 -56 28 -23 -5 8 -37 24 -24 -5 14 -38 36 -31 5 20 -27 30 -29 11 10 -32 37 -20 16 4 -17 38 -33 7
4995 7 1 -26 29 -27 11 -1 -19 27 -29 14 -3 -22 25 -28 7 -1 -23 11 -29 11 0 -21 18 -23 14 -3 -18 20 -31 22 -5 -7
5027 -7 19 -23 19 -2 -7 15 -11 16 2 -7 12 -29 9 -3 -4 12 -24 7 -13 -5 10 -24 7 -6 -9 17 -20 13 -13 -14 16 -31 -2 -10
5061 -10 -9 21 -29 3 -6 -13 22 -24 10 5 -10 21 -16 11 -1 -12 15 -12 12 -1 -20 27 -16 7 4 -21 13 -25 9 2 -30 32 -27
5094 -27 7 -4 -19 29 -29 1 2 -19 40 -30 3 -4 -41 29 -22 29 -2 -20 41 -37 20 3 -26 46 -46 26 15 -31 35 -43 32
5125 32 -7 -29 39 -55 32 -4 -19 41 -58 36 -11 -34 55 -53 39 -12 -40 54 -57 29 -17 -27 49 -72 40 -14 -28 48
5153 48 -68 64 -33 -16 50 -83 58 -24 -15 47 -74 70 -34 -17 44 -82 72 -59 -11 42 -79 63 -60 -6
5177 -6 31 -92 74 -60 0 28 -77 94 -62 1 46 -79 73 -63 21 34 -78 97 -59 27 40 -71 86 -75
5201 -75 30 27 -84 86 -75 36 17 -82 99 -89 38 8 -66 95 -104 47 -1 -67 94 -110 51 -12 -59 97
5225 97 -111 73 -14 -46 95 -122 73 -32 -36 84 -113 97 -30 -37 86 -112 94 -29 -25 80 -117 108 -33
5248 -33 -23 75 -104 97 -59 -14 71 -106 89 -65 -15 64 -126 100 -72 6 49 -108 102 -81 11 49 -95 108
5272 108 -94 28 42 -116 106 -89 41 41 -93 102 -98 45 27 -79 119 -99 56 17 -78 118 -101 58
5294 58 5 -75 98 -100 68 -12 -68 95 -108 69 -25 -61 101 -121 67 -28 -54 80 -110 82 -42 -29 78
5317 78 -100 93 -46 -25 77 -101 94 -51 -15 74 -99 95 -42 1 54 -93 103 -69 -3 57 -93 92 -77
5340 -77 10 43 -86 87 -74 13 36 -91 91 -88 25 18 -85 89 -88 40 17 -73 97 -93 51 4 -53 91
5364 91 -82 62 -5 -44 79 -90 57 -15 -44 76 -77 61 -20 -42 73 -86 62 -29 -34 59 -87 70 -52 -15
5388 -15 50 -84 63 -36 -12 40 -80 74 -54 -2 47 -72 75 -59 13 35 -63 67 -56 19 21 -70 80 -51 27
5413 27 21 -42 76 -71 36 10 -47 65 -67 39 -6 -46 60 -74 35 -20 -40 45 -82 35 -28 -43 49 -77 35
5438 35 -25 -14 56 -70 54 -27 -7 46 -54 61 -34 -10 51 -56 57 -38 2 31 -65 60 -45 4 29 -53 57 -52
5464 -52 17 16 -52 53 -65 15 10 -52 53 -54 15 -3 -51 46 -65 17 -6 -39 52 -72 24 -7 -26 57 -58 28 -11 -31
5492 -31 46 -58 35 -22 -16 40 -59 42 -13 -18 33 -45 38 -28 -8 27 -66 32 -29 -12 27 -60 41 -38 0 38 -55 28 -35 0
5522 0 19 -45 44 -36 -3 25 -42 38 -36 6 14 -36 33 -35 8 17 -31 38 -35 19 21 -27 33 -36 19 0 -34 43 -40 5 -2 -35 27
5555 27 -38 7 -10 -30 24 -34 6 -8 -17 18 -32 7 -9 -15 32 -28 18 -13 -17 29 -27 15 3 -19 17 -17 1 5 -10 19 -14 11
5587 11 7 -19 16 -18 8 -3 -28 13 -20 -6 5 -21 8 -10 -5 -7 -10 11 -18 -3 0 -27 4 -20 -8 11 -17 19 -22 -8 6 -31 21
5620 21 -14 -8 9 -24 18 -5 -3 25 -19 29 -10 -10 9 -42 27 -17 -6 11 -43 17 -36 -16 17 -49 22 -32 1 19 -47 26 -31 -14
5652 -14 20 -50 27 -37 -7 19 -38 37 -25 16 23 -53 51 -44 4 19 -51 59 -50 7 24 -58 46 -53 2 15 -57 55
5680 55 -56 7 9 -59 54 -73 19 9 -63 72 -67 26 -2 -56 62 -65 27 5 -45 70 -75 34 7 -45 77
5705 77 -79 52 -10 -43 73 -74 52 -9 -36 72 -92 57 -23 -37 64 -91 67 -36 -33 69 -94 65 -38
5728 -38 -30 67 -93 74 -41 -23 51 -104 87 -48 -8 61 -100 86 -54 2 58 -84 91 -54 14 52 -91 98
5752 98 -72 19 42 -84 93 -84 20 19 -92 95 -81 22 29 -86 86 -103 39 8 -81 89 -97 54 0
5775 0 -75 91 -96 53 0 -60 100 -103 73 -12 -50 91 -103 75 -22 -45 88 -103 89 -32 -42 79 -107
5798 -107 88 -33 -24 78 -110 88 -53 -18 74 -105 84 -63 -11 52 -101 90 -59 10 53 -101 108 -72 9
5821 9 39 -86 94 -84 25 39 -93 102 -82 37 18 -70 94 -88 42 9 -76 87 -99 36 2 -56 87
5844 87 -107 53 -12 -60 87 -93 62 -27 -50 80 -106 66 -35 -39 72 -96 70 -39 -26 75 -95 79 -38
5867 -38 -7 68 -95 93 -48 -5 55 -87 94 -47 9 60 -82 89 -59 16 38 -76 90 -76 18 20 -78 90
5891 90 -82 28 17 -75 87 -84 35 4 -63 78 -92 47 -6 -44 91 -84 70 -16 -43 80 -86 67 -18
5914 -18 -32 81 -88 81 -29 -24 76 -86 74 -28 -7 65 -83 79 -51 -6 46 -89 76 -64 4 35 -83
5937 -83 78 -64 3 32 -82 78 -70 10 29 -72 86 -68 31 12 -67 77 -73 42 11 -44 81 -80 51
5960 51 3 -46 88 -80 56 -2 -39 80 -86 53 -15 -39 63 -89 59 -32 -35 46 -95 69 -33 -30 59 -92 71
5985 71 -46 -22 54 -82 71 -53 9 35 -76 84 -57 4 43 -82 84 -56 10 36 -62 86 -67 26 28 -61 77
6010 77 -58 37 10 -63 75 -79 30 11 -60 68 -74 31 -3 -59 63 -76 35 -12 -38 51 -82 32 -13 -39
6034 -39 56 -80 38 -17 -26 57 -75 59 -24 -21 51 -72 56 -24 -18 42 -67 56 -32 -14 40 -54 48 -42 -21 31 -61
6061 -61 56 -44 -9 19 -58 55 -46 -3 24 -54 49 -46 12 18 -35 41 -37 11 21 -35 49 -35 26 9 -27 43 -32 16
6089 16 17 -36 40 -38 24 1 -37 25 -40 10 -9 -30 25 -35 0 -10 -17 15 -35 9 -9 -21 11 -36 21 -15 -18 8 -24 12 -6 -11
6121 -11 17 -21 7 -11 -12 7 -15 6 -12 -7 1 -9 0 8 -13 0 -20 -5 -5 -13 -1 -14 0 10 -15 1 -4 -14 1 -12 -11 -8 -19 2 -17
6156 -17 2 7 -18 10 -12 5 13 -22 8 -5 7 7 -20 7 -20 4 9 -23 19 -17 2 5 -34 20 -22 -6 4 -36 23 -48 -4 1 -39
6189 -39 25 -39 17 -1 -37 36 -36 21 -12 -37 37 -51 12 -5 -18 46 -50 47 -15 -28 51 -47 35 -7 -13 54 -59 29 -16 -23 44
6220 44 -56 41 -41 -21 33 -67 37 -39 -20 35 -59 53 -38 -9 29 -79 55 -52 -8 34 -67 54 -43 7 27 -57
6246 -57 71 -45 16 33 -62 71 -48 28 23 -53 69 -67 30 13 -60 66 -68 30 3 -59 66 -77 34 3 -55
6271 -55 70 -86 39 -12 -49 67 -82 47 -15 -43 67 -82 45 -13 -21 61 -79 55 -27 -23 62 -69 62 -37 -9
6296 -9 64 -68 68 -27 -4 48 -83 73 -51 -15 38 -81 70 -59 -7 28 -77 60 -64 6 21 -78 66 -75
6320 -75 25 17 -67 77 -76 31 12 -56 66 -72 43 16 -55 72 -80 44 -2 -44 69 -79 45 -15 -35 62
6344 62 -72 55 -38 -30 61 -87 52 -34 -27 47 -88 50 -43 -21 40 -82 52 -52 -3 23 -82 69 -51 3 37
6369 37 -63 82 -67 22 24 -58 79 -56 37 21 -50 77 -65 36 13 -48 76 -65 46 -13 -57 71 -86 41
6393 41 -17 -42 54 -85 47 -32 -30 50 -85 59 -51 -29 54 -74 71 -42 -15 52 -77 69 -41 -10 39 -72 79
6418 79 -61 14 36 -63 82 -63 29 36 -78 75 -65 38 21 -74 76 -74 26 -4 -62 86 -90 37 -6 -58
6442 -58 71 -92 47 -10 -40 57 -91 53 -21 -36 70 -80 63 -31 -12 67 -86 79 -42 -11 63 -83 76 -51
6466 -51 -4 53 -81 94 -51 -1 37 -85 100 -68 6 32 -98 81 -74 23 36 -78 76 -85 22 9 -83 87
6490 87 -84 26 6 -56 101 -89 42 6 -57 91 -86 57 0 -54 82 -95 67 -10 -40 78 -90 77 -23
6513 -23 -36 78 -98 62 -32 -25 71 -99 70 -43 -32 52 -97 77 -50 -8 49 -92 84 -54 -6 50 -85 84
6537 84 -61 7 46 -78 105 -58 17 39 -68 91 -72 30 28 -76 83 -66 42 11 -60 87 -81 30 1
6560 1 -55 69 -84 44 -9 -57 73 -88 47 -9 -46 69 -84 50 -17 -34 59 -82 55 -20 -19 54 -76 59 -32
6585 -32 -9 51 -66 61 -43 -4 43 -69 51 -34 -1 36 -62 65 -45 1 28 -59 56 -49 8 15 -59 51 -43 8
6611 8 5 -60 42 -64 15 -2 -51 52 -52 25 9 -34 55 -50 28 -8 -34 41 -45 28 -10 -7 48 -36 39 -2 -17 28 -50
6640 -50 40 -23 -4 19 -39 33 -22 6 5 -40 45 -35 4 0 -32 23 -37 8 1 -23 28 -32 12 2 -15 29 -44 20 -5 -5 23 -26
6672 -26 29 1 -2 16 -36 27 -16 -2 10 -24 15 -30 13 4 -28 23 -35 13 -7 -17 23 -41 19 -14 -24 6 -42 23 -11 -25 24
6703 24 -44 25 -19 -14 21 -43 35 -18 -5 18 -35 43 -34 9 29 -24 33 -31 3 8 -36 41 -37 14 2 -36 32 -52 8 7 -38 37
6735 37 -53 13 -12 -38 44 -59 21 -5 -27 27 -49 35 -3 -21 37 -45 45 -15 -11 33 -47 51 -13 -8 43 -38 49 -27 7 28 -44
6766 -44 50 -37 6 24 -48 46 -44 13 18 -50 44 -45 14 -2 -42 46 -52 11 13 -41 53 -45 28 5 -39 43 -44 22 -9 -20 56
6797 56 -43 45 -3 -32 43 -54 35 -21 -14 46 -49 33 -20 -28 33 -48 33 -22 -19 28 -58 38 -32 -15 25 -49 32 -30 -10 20 -50 45
6829 45 -43 9 7 -55 41 -33 17 4 -36 43 -37 26 9 -32 46 -37 21 -7 -21 32 -36 24 -10 -19 26 -48 29 -18 -24 23 -51 22
6861 22 -23 -6 18 -51 25 -35 0 -1 -29 30 -36 9 14 -37 25 -26 14 10 -25 39 -33 14 7 -19 41 -42 25 -3 -14 26 -41 22
6893 22 -21 -8 19 -45 30 -30 -6 16 -45 35 -30 -3 17 -42 34 -36 -2 11 -41 38 -46 2 16 -31 49 -33 26 5 -31 47
6923 47 -40 30 4 -26 46 -46 35 -8 -20 53 -59 36 -25 -20 35 -54 51 -35 -20 42 -65 45 -43 -3 25 -60 40 -44
6951 -44 5 30 -59 58 -43 13 20 -55 62 -50 24 9 -47 61 -52 38 25 -38 63 -65 28 1 -39 72 -63 46
6977 46 -12 -41 67 -72 46 -5 -40 61 -91 54 -26 -36 56 -90 57 -28 -26 63 -85 59 -45 -19 52 -86 71
7002 71 -46 0 54 -83 84 -43 12 50 -68 93 -56 25 33 -73 76 -57 19 29 -63 81 -69 20 27 -74 89
7027 89 -80 32 11 -71 74 -81 35 1 -57 68 -92 45 2 -50 76 -86 54 -7 -46 79 -84 61 -11
7050 -11 -29 80 -67 73 -14 -18 71 -78 84 -32 -11 65 -83 79 -42 -11 62 -75 80 -58 7 45 -90 72
7074 72 -54 0 35 -87 75 -63 17 42 -75 93 -61 19 28 -55 86 -61 31 32 -52 84 -74 31 13 -44 85
7099 85 -71 51 0 -46 72 -75 56 -4 -33 61 -81 48 -22 -34 51 -83 50 -30 -22 45 -82 55 -36 -22 46
7124 46 -77 66 -40 -1 42 -70 74 -49 8 45 -63 81 -43 14 24 -58 68 -59 30 19 -53 69 -60 19
7148 19 7 -54 69 -70 27 -7 -40 55 -70 30 -8 -32 51 -66 50 -25 -36 50 -67 46 -41 -18 40 -68 63
7173 63 -26 -13 35 -61 73 -27 5 31 -54 70 -49 5 23 -60 63 -58 12 13 -57 67 -48 28 6 -46 54 -68
7199 -68 32 -2 -46 59 -75 37 3 -39 53 -67 54 -20 -34 63 -68 56 -19 -7 55 -62 61 -19 2 56 -67
7224 -67 67 -32 -12 47 -61 73 -48 13 36 -70 64 -55 10 27 -69 68 -62 11 20 -46 68 -61 25 11 -54
7249 -54 76 -75 47 9 -49 73 -66 43 2 -39 73 -70 50 -11 -34 69 -71 69 -11 -22 59 -72 55
7272 55 -21 -37 63 -79 58 -42 -26 49 -80 52 -44 -9 38 -78 76 -39 10 41 -67 74 -45 9 32 -67
7296 -67 80 -50 15 33 -61 76 -48 17 28 -51 85 -44 29 25 -54 72 -58 35 8 -46 60 -57 31 4 -37 65
7322 65 -62 33 -5 -64 51 -59 41 -11 -33 53 -67 40 -9 -29 54 -56 51 -25 -16 48 -59 55 -24 -15 49 -48
7348 -48 54 -9 -7 35 -44 60 -28 -3 28 -55 43 -35 1 27 -49 42 -44 -4 20 -59 38 -32 -1 8 -33 37 -37 20 10 -37
7378 -37 30 -29 3 10 -21 28 -26 17 1 -24 29 -24 27 -3 -18 30 -29 10 3 -18 22 -29 13 -8 -12 13 -18 7 -3 -28 7 -19
7410 -19 1 -5 -8 11 -6 5 -22 -11 8 -8 2 -7 -4 10 -1 15 0 -2 3 5 -2 -14 8 -10 -1 -7 3 0 -9 8 -10 0 6 -11 11 -12 -1
7447 -1 -4 -8 16 -21 10 -7 -13 14 -27 7 -3 -12 10 -24 14 -7 -4 31 -20 18 -8 -9 22 -23 35 -8 5 16 -23 28 -20 -3 25 -22
7481 -22 24 -28 4 15 -44 34 -38 2 9 -47 36 -26 0 5 -42 44 -33 10 7 -42 36 -45 16 4 -43 49 -42 26 2 -38 39 -39
7513 -39 36 -7 -33 49 -42 33 -3 -31 53 -52 39 -12 -26 55 -57 35 -19 -20 52 -67 40 -29 -26 48 -62 51 -30 -21 34
7542 34 -67 56 -30 -17 35 -68 54 -41 1 31 -75 71 -42 -5 29 -55 64 -50 14 26 -52 74 -33 20 26
7567 26 -60 67 -51 31 7 -49 51 -67 30 -1 -43 62 -76 39 -12 -40 55 -66 42 -5 -35 62 -71 45 -20
7592 -20 -29 53 -63 62 -10 -13 51 -63 57 -24 -8 57 -70 60 -34 -4 29 -66 64 -43 7 37 -75 68 -56 5
7618 5 28 -63 63 -62 15 14 -60 73 -52 20 10 -54 68 -74 39 8 -55 72 -65 37 -3 -39 70 -69 49
7643 49 -11 -37 60 -73 52 -28 -32 60 -78 55 -22 -20 48 -67 61 -31 -4 45 -78 66 -44 -14 34 -80 66 -43
7669 -43 14 25 -75 62 -60 17 28 -63 62 -53 30 24 -49 89 -67 44 21 -58 72 -68 48 9 -46 75 -75
7694 -75 58 -7 -52 69 -90 52 -24 -40 70 -86 60 -24 -25 59 -90 69 -40 -29 50 -81 73 -54 -10 57
7718 57 -79 76 -50 6 59 -88 88 -57 10 36 -72 98 -64 17 39 -79 96 -70 25 18 -81 87 -83 31
7742 31 12 -65 81 -92 43 -10 -68 85 -87 47 -7 -71 91 -95 68 -17 -47 85 -100 68 -25 -29 74 -92
7766 -92 79 -40 -14 83 -102 84 -34 -18 76 -98 93 -36 -14 65 -102 84 -55 -9 51 -108 85 -71 -3
7789 -3 46 -102 90 -79 12 40 -86 113 -68 9 30 -86 88 -84 26 41 -75 90 -76 42 19 -71 97
7812 97 -73 43 23 -68 91 -90 42 4 -75 95 -100 53 -14 -56 79 -90 62 -8 -51 73 -93 54 -18
7835 -18 -55 73 -88 60 -25 -31 67 -85 72 -32 -13 67 -74 76 -38 -15 69 -80 74 -39 -13 67 -79 75
7859 75 -43 -7 41 -88 64 -53 -6 30 -83 65 -55 0 30 -81 66 -68 15 17 -70 76 -62 17 26 -62 69
7884 69 -49 26 18 -46 71 -55 25 20 -35 70 -57 26 15 -41 57 -57 39 2 -28 62 -62 35 0 -45 51 -55 41
7911 41 -8 -38 45 -59 33 -8 -34 40 -52 32 -25 -18 38 -53 46 -5 -13 28 -45 34 -5 -17 37 -32 35 -22 -1 38 -38 33 -14
7942 -14 -3 31 -32 31 -23 -7 16 -30 31 -19 -9 14 -31 14 -16 -2 21 -32 14 -28 -3 16 -11 24 -12 -16 23 -15 22 -7 1
7973 1 16 -20 18 -10 -2 8 -11 16 -9 1 10 -16 14 -17 -5 16 -18 8 -5 -3 12 -15 -1 3 -6 17 -15 -5 -3 -25 21 -12 6 5
8007 5 -12 7 -20 1 -6 -9 9 -18 19 7 -11 17 -10 14 2 -12 17 -15 7 6 -15 17 0 13 7 -6 21 -20 25 8 -23 19 -24
8040 -24 5 -4 -21 14 -30 12 -7 -22 20 -28 16 -9 -8 19 -35 27 -7 -19 29 -16 13 -9 -6 28 -17 26 1 6 37 -46 16 -10
8072 -10 -7 27 -46 24 -19 -11 26 -41 13 -24 -15 26 -39 32 -30 -4 6 -37 30 -34 7 7 -31 44 -37 16 17 -31 44 -29 15 16 -23
8105 -23 51 -32 27 17 -25 48 -42 21 5 -28 40 -46 36 -8 -28 37 -52 26 -5 -31 32 -59 25 -31 -14 28 -58 35 -36 -13
8135 -13 36 -50 40 -30 -9 35 -46 63 -26 3 41 -44 53 -29 5 34 -49 58 -37 16 15 -60 54 -57 11 16 -44 49 -53
8164 -53 18 1 -44 53 -56 26 0 -49 69 -61 36 7 -43 59 -58 44 -6 -14 60 -63 53 -17 -27 67 -63 57
8190 57 -17
8191a7
$$ Imaginary data points
##PAGE= N=2
##DATA TABLE= (X++(I..I)), XYDATA
0 0 0 0 0 0 0 0 0 0 0 0 0 0 0 0 -4 8 -8 8 -8 8 -11 16 -16 16 -19 22 -24 28 -32 36 -38 44 -45 52 -57 60 -68 74
38 74 -81 89 -96 106 -115 125 -137 148 -163 177 -193 213 -233 257 -284 318 -354 403 -456 527 -613
59 -613 725 -872 1071 -1344 1742 -2346 3327 -5081 8687 -18451 85952 233141 -120024 74056
73 74056 -161908 43081 121096 -175074 199373 -109088 -26224 54402 -109865 196817 -153615
84 -153615 29265 96499 -163953 117913 -101394 113684 43034 -195861 142501 -92102
94 -92102 80654 39021 -127034 124120 -147722 97954 57592 -128602 112168 -111725 92227
105 92227 -16184 -100796 177650 -121704 32790 -15783 -38420 141312 -155762 88109 3632
116 3632 -90824 101587 -85448 118735 -70124 -89494 152123 -90745 58762 -54401 -8099
127 -8099 110641 -155878 90677 -1646 -25769 55285 -115837 119214 -50591 -32003 92325
138 92325 -97214 71377 -62338 17845 78932 -120846 82908 -41004 4247 45421 -86309
149 -86309 99436 -69043 1157 56238 -78365 77384 -59949 27464 26949 -89328 97458
160 97458 -45972 8667 9046 -54150 94619 -77240 19899 32785 -56059 59053 -65032
171 -65032 51963 8397 -69479 76039 -48921 29335 -10706 -31988 79487 -77380 27298
182 27298 10025 -23829 48949 -70561 51898 -4842 -36460 54154 -50683 40816 -22372
193 -22372 -16625 54935 -60577 38479 -12387 -10648 34326 -53685 50644 -20251 -14188 34285
205 34285 -43117 41568 -26388 560 29474 -48352 41096 -19470 2094 16103 -38210 45970
217 45970 -28773 778 19723 -29532 35008 -32614 12979 15637 -33322 34168 -25427 12956
229 12956 3967 -24861 37807 -30254 10584 4983 -17209 29421 -31869 18265 2450 -18576
241 -18576 25940 -25913 19182 -4686 -13389 25412 -26269 17760 -4996 -7976 19358 -25336
253 -25336 20419 -6752 -6727 16168 -21228 19344 -10005 -2746 14147 -19835 17767 -10175 264
266 264 10027 -17300 17954 -11416 1351 7782 -14033 16255 -12544 3658 5708 -12268 14741
279 14741 -12071 5208 2942 -10009 13677 -12061 6153 1154 -7861 11905 -11643 7170 -437
292 -437 -6012 10201 -10825 7542 -1759 -4049 8292 -9891 7767 -2793 -2494 6592 -8502 7407
306 7407 -3652 -976 5053 -7189 6618 -3888 232 3274 -5672 5966 -4052 950 1972 -4027
320 -4027 4864 -3954 1596 907 -2807 3644 -3291 1875 -181 -1488 2575 -2589 1802 -812 -240 1252
336 1252 -1820 1655 -1120 579 -36 -592 1146 -1354 1399 -1151 634 212 -1238 2169 -2374 1752
352 1752 -668 -740 2394 -3485 3279 -1787 -307 2409 -4093 4659 -3486 622 2634 -4982 5644
367 5644 -4672 2025 1927 -5744 7298 -5961 2773 1132 -5308 8352 -8291 4483 1035 -5734
381 -5734 8564 -9217 6819 -906 -6057 10328 -10321 7318 -2471 -4111 10692 -13251 9738
394 9738 -2689 -4155 9671 -13413 12931 -6157 -4048 11669 -14082 12669 -8318 -240 11023
407 11023 -17578 15660 -8121 -167 8264 -16229 19435 -13196 320 10725 -16040 17534
419 17534 -15413 6203 8708 -20029 20787 -14030 5773 4023 -16382 24682 -20534 6328
431 6328 7269 -15183 20401 -22261 14170 3836 -19822 23909 -19310 12711 -2581 -13767 27777
444 27777 -27206 13208 1707 -11816 21115 -28275 22964 -3170 -17181 25140 -23739 20215
456 20215 -11184 -8572 28896 -33142 20601 -5450 -5893 19280 -33035 32373 -11937 -12234 23855
469 23855 -26120 27470 -21453 -670 27335 -36801 26845 -13430 2624 14249 -34951 39890
481 39890 -20680 -4994 18989 -25354 32536 -30848 8445 22116 -36380 30691 -20868 11712
493 11712 6946 -32789 43729 -28555 3661 12135 -22017 34273 -38200 18673 14107 -33690 32734
506 32734 -26444 20669 -2911 -27529 46273 -35976 11835 4200 -15294 33338 -45613 29903
518 29903 5649 -29320 31340 -30136 31027 -14836 -21291 46746 -40044 19074 -6577 -5771 31123
531 31123 -50650 37836 -3320 -20171 26208 -32918 39463 -24137 -12963 40513 -39881 26559
543 26559 -17006 2417 25525 -48130 42129 -14376 -9434 21137 -31793 41134 -31715 -456
555 -456 31670 -39575 30686 -22190 11334 14244 -43273 47495 -23157 -2477 13540 -24253 41626
568 41626 -42287 10980 25727 -35971 28545 -27813 24776 3369 -40991 48980 -26132 6550
580 6550 72 -17037 44521 -48308 16997 15641 -24821 26735 -36194 33572 -2759 -32408 41324
593 41324 -29580 19386 -9581 -13172 39439 -44439 24482 287 -15961 26710 -35732 33554
605 33554 -12533 -17034 35176 -34120 23538 -12597 -3033 26550 -42748 33674 -7330 -11732 18375
618 18375 -27552 37287 -25457 -8410 32338 -29624 20956 -21198 11224 20000 -43586 33584
630 33584 -9526 -152 5390 -25673 42974 -28800 -3716 20308 -19918 24949 -31445 16113
642 16113 15849 -33373 27823 -18613 13351 869 -24238 36260 -26740 8618 5531 -17093 27403
655 27403 -29040 17098 2506 -19719 27743 -25011 14901 -2235 -11954 25800 -30276 18258
667 18258 1266 -13359 17898 -23460 24552 -8992 -15005 25290 -19504 14639 -12869 -689
679 -689 23191 -30619 16856 -2815 -1152 9162 -25004 28495 -10517 -8754 13693 -14766 21159
692 21159 -19828 1696 17527 -21349 16237 -13391 7588 7654 -21974 22559 -13192 3922 4776
705 4776 -15311 21655 -17550 6335 4923 -13922 19148 -17223 8371 2196 -11235 17903 -18572
718 -18572 10224 2002 -10208 14094 -16535 13921 -2409 -10800 15657 -13428 11072 -6714
730 -6714 -4507 16193 -17458 10048 -3590 -1204 9659 -17639 15485 -4756 -4034 8056 -12353
743 -12353 15410 -10353 -1403 10142 -12354 12253 -10573 3404 7300 -13842 13333 -9459
755 -9459 4153 3746 -11801 14533 -10847 4481 2373 -9347 13796 -12274 5850 1463 -7685
768 -7685 12309 -12891 7735 369 -6943 10786 -12036 9263 -1979 -6093 10608 -11122 9024
781 9024 -3995 -3656 10114 -11754 8973 -4249 -1739 8072 -11729 10209 -4906 -1165 6557
794 6557 -10457 10758 -6518 -133 5962 -9580 10436 -7618 1530 5084 -9284 10198 -7987
807 -7987 2962 3626 -8773 10323 -8221 3743 2140 -7634 10327 -8881 4366 1268 -6400
820 -6400 9615 -9324 5358 442 -5682 8783 -9041 6072 -762 -4768 8263 -8749 6295
833 6295 -1711 -3609 7518 -8579 6505 -2306 -2661 6627 -8155 6673 -2870 -1803 5765 -7621
847 -7621 6714 -3391 -1023 4978 -7066 6663 -3828 -320 4259 -6517 6452 -4103 332
860 332 3505 -5951 6202 -4257 875 2746 -5329 5915 -4344 1272 2089 -4656 5495 -4327
874 -4327 1576 1571 -4005 4890 -4084 1860 991 -3399 4388 -3702 1842 501 -2646 3839 -3485 1755
890 1755 422 -2110 2977 -2915 1835 83 -1844 2546 -2139 1275 -224 -1050 2090 -2022 898
905 898 275 -802 1041 -1276 970 89 -1092 970 -237 -97 -34 -258 765 -471 -652 1140 -388
922 -388 -456 444 -352 992 -1301 96 1670 -1987 998 -294 183 846 -2586 2939 -911 -1280 1887
939 1887 -1876 2548 -2498 58 3147 -4026 2549 -1172 452 1521 -4466 5141 -2237 -1274 2645
954 2645 -3155 4352 -4398 866 3947 -5722 4196 -2647 1616 1336 -5905 7508 -4166 -409 2592
969 2592 -3844 6214 -6934 2693 3848 -6910 5895 -4605 3748 114 -6608 9840 -6641
982 -6641 1376 1559 -3745 7730 -9857 5433 2686 -7302 7140 -6682 6464 -2123 -6310 11477
996 11477 -9039 3560 -372 -2660 8373 -12332 8303 755 -6585 7420 -8158 9129 -4841
1009 -4841 -5023 11984 -10613 5674 -2748 -686 8031 -13931 10940 -1605 -4975 6784 -8930
1022 -8930 11574 -7926 -2856 11554 -11601 7643 -5495 2092 6677 -14899 13536 -4506 -2561
1035 -2561 5234 -9034 13794 -11494 209 10104 -11858 9338 -8527 5577 4293 -14788 15462
1048 15462 -7515 584 2706 -8097 15066 -14498 3686 7484 -10762 10083 -10870 8892
1060 8892 1244 -13159 15897 -9634 3618 -261 -6054 14796 -16298 6791 4416 -8749 9496
1073 9496 -12015 11698 -2225 -10690 15292 -10790 6007 -3510 -3063 13561 -17467 9534 1218
1086 1218 -5936 7941 -12628 14426 -5817 -7628 13673 -11172 8501 -7176 258 11671 -17439
1099 -17439 11696 -2599 -2147 5933 -12613 15994 -8927 -3528 10624 -10848 10427 -9882 3453
1112 3453 8278 -15614 13014 -5986 1097 3328 -10573 15714 -11572 568 7543 -9426 10023
1125 10023 -11134 6888 4236 -13458 13026 -7227 3576 -372 -7454 15144 -13216 3093
1137 3093 4484 -6240 8610 -12551 9897 1297 -10702 11059 -7844 6996 -4045 -5162 13695
1150 13695 -12766 5510 -245 -2738 8023 -13069 10846 -1964 -5728 8487 -9279 9417
1162 9417 -5898 -2083 9534 -11623 8668 -4067 -672 5834 -10458 11222 -6280 -1505 6874
1175 6874 -8383 8511 -7623 2675 5746 -10993 9175 -4685 2091 1260 -7859 12096 -8036
1188 -8036 172 3704 -4622 7780 -10185 5290 3875 -8136 6702 -6018 6222 -1532 -6794
1201 -6794 10326 -7046 3238 -1409 -2474 8349 -10032 5485 -77 -3019 5733 -8499 7607
1214 7607 -2429 -3027 6081 -7595 7343 -3837 -1546 5527 -7309 7483 -5052 -358 5379
1227 5379 -6998 6519 -5481 2108 4002 -8145 7175 -4133 2168 983 -6399 9202 -5915
1240 -5915 814 1612 -3545 7174 -8333 3524 2607 -4846 5070 -6469 5893 -449 -5567 6851
1254 6851 -5329 4493 -2522 -2791 7503 -7255 4131 -1750 -990 5468 -8218 6108 -1733 -1349
1268 -1349 4017 -7076 7550 -3540 -1453 4243 -5835 7119 -5457 181 4718 -6232 6109
1281 6109 -5496 2354 3324 -7206 6836 -4687 2541 1148 -6097 8175 -5747 1897 970 -4171
1295 -4171 7430 -7387 3176 1472 -4150 5969 -7091 4971 241 -4679 6152 -6099 5098
1308 5098 -1586 -3656 6865 -6498 4557 -2025 -1956 6262 -7560 5206 -1722 -1430 4850 -7406
1322 -7406 6568 -2522 -1689 4459 -6377 6809 -4087 -872 4803 -6297 6191 -4594 662
1335 662 4133 -6835 6399 -4337 1253 2786 -6416 7104 -4748 1246 2188 -5358 7005 -5612
1349 -5612 1795 2118 -4855 6332 -5828 2767 1584 -4811 6017 -5457 3255 570 -4360 6136
1363 6136 -5425 3212 -74 -3445 5903 -5806 3450 -240 -2845 5211 -5837 4010 -672 -2600
1377 -2600 4736 -5477 4323 -1387 -2138 4571 -5261 4284 -1873 -1404 4194 -5253 4311 -2038 -847
1392 -847 3557 -5010 4499 -2290 -524 3063 -4538 4435 -2637 -91 2687 -4172 4211 -2741 312
1407 312 2183 -3808 4028 -2787 568 1771 -3348 3709 -2809 893 1352 -3072 3458 -2628 1011
1422 1011 852 -2547 3304 -2667 1005 723 -1989 2693 -2603 1400 461 -1935 2385 -2061 1370 -154
1438 -154 -1397 2392 -2121 1022 5 -765 1576 -2041 1467 -70 -1002 1238 -1185 1198 -749 -442
1454 -442 1412 -1292 543 -231 165 401 -1195 1056 -113 -443 128 -26 551 -842 116 577 -260 -355
1472 -355 46 703 -561 -252 335 364 -335 -684 1183 -334 -484 223 114 670 -1475 783 765 -1192 548
1491 548 -513 1175 -768 -1067 2179 -1373 191 -145 86 1293 -2653 1837 334 -1392 1054 -1328
1507 -1328 2223 -1617 -978 2819 -2285 1037 -872 519 1564 -3621 2961 -389 -1116 1178 -1896
1522 -1896 3272 -2638 -486 3028 -2861 1811 -1762 1260 1422 -4186 3898 -1257 -515 904 -2112
1537 -2112 4091 -3749 312 2794 -3135 2401 -2718 2270 782 -4387 4688 -2254 386 187 -1931
1552 -1931 4670 -4938 1491 2091 -2971 2781 -3638 3573 -267 -4031 5133 -3141 1549 -903 -1274
1567 -1274 4871 -5844 2710 1042 -2306 2755 -4281 4734 -1439 -3271 5000 -3635 2482 -2046 -373
1582 -373 4520 -6250 3595 -52 -1419 2269 -4426 5485 -2574 -2280 4465 -3736 3100 -3060 740
1597 740 3756 -6197 4278 -1105 -332 1493 -4175 6010 -3700 -983 3592 -3475 3568 -4043 2048
1612 2048 2644 -5700 4695 -2193 998 355 -3552 6151 -4652 452 2251 -2797 3619 -4788 3277
1627 3277 1226 -4713 4537 -2927 2168 -920 -2520 5659 -5058 1603 909 -1784 3127 -4904 4096
1642 4096 -95 -3463 3927 -3036 2854 -1980 -1284 4760 -4934 2351 -231 -641 2333 -4602 4536
1657 4536 -1228 -2069 2987 -2848 3316 -2904 -58 3545 -4414 2851 -1436 592 1335 -3967 4574
1672 4574 -2305 -478 1742 -2384 3428 -3561 1286 1947 -3477 3007 -2271 1679 38 -2777 4213
1687 4213 -3034 831 495 -1361 2870 -3787 2403 530 -2340 2437 -2345 2522 -1264 -1526 3465
1702 3465 -2964 1508 -756 -120 2115 -3633 2780 -540 -905 1428 -2308 3034 -2039 -408 2126
1717 2126 -2393 2196 -1959 787 1255 -2792 2771 -1821 686 601 -2004 2838 -2537 1213 525 -1910
1733 -1910 2563 -2427 1723 -323 -1525 2883 -2774 1619 -432 -697 2222 -3250 2544 -544 -1014
1748 -1014 1717 -2482 2951 -1802 -690 2328 -2478 2260 -2042 581 1850 -3223 2648 -1565 688
1763 688 785 -2792 3456 -2185 432 767 -2025 3244 -2984 1069 932 -2019 2792 -3094 1933 452
1779 452 -2264 2844 -2860 2336 -429 -2054 3299 -2971 2167 -998 -1194 3359 -3726 2334 -802
1794 -802 -641 2570 -4035 3317 -1010 -980 2179 -3385 3773 -2091 -798 2643 -3158 3280 -2638 280
1810 280 2572 -3769 3224 -2296 872 1635 -3887 3975 -2306 598 1056 -3113 4336 -3151 619 1336
1826 1336 -2593 3738 -3738 1562 1369 -2976 3349 -3376 2292 436 -3157 3886 -3141 2046 -365
1841 -365 -2308 4235 -3847 1958 -209 -1592 3584 -4381 2776 -156 -1759 3015 -3961 3474 -976
1856 -976 -1853 3274 -3524 3253 -1750 -1085 3481 -3878 2983 -1677 -305 2862 -4254 3440 -1485 -315
1872 -315 2122 -3798 3944 -2033 -459 2123 -3196 3677 -2695 121 2263 -3286 3245 -2632 846
1887 846 1731 -3490 3446 -2369 934 1010 -3053 3775 -2680 833 854 -2421 3539 -3173 1265 896 -2291
1904 -2291 3080 -3113 1847 452 -2325 3034 -2819 1970 -198 -1924 3123 -2904 1851 -424 -1350
1919 -1350 2856 -3117 2000 -432 -1076 2372 -2993 2296 -650 -996 2076 -2628 2396 -1061 -789 2046
1935 2046 -2408 2165 -1293 -274 1860 -2481 2047 -1138 53 1304 -2326 2297 -1223 -7 1028
1950 1028 -1818 2199 -1615 263 1040 -1689 1826 -1520 678 594 -1642 1886 -1429 637 239 -1170
1966 -1170 1752 -1654 825 202 -1012 1388 -1458 1075 -203 -848 1446 -1344 886 -376 -285 1120
1982 1120 -1531 1134 -274 -313 651 -1070 1321 -810 -205 886 -883 817 -846 493 481 -1189
1998 -1189 1047 -524 304 -125 -556 1249 -1113 288 231 -307 525 -1079 1038 -197 -674 732 -561
2015 -561 732 -832 105 910 -1185 659 -330 357 58 -1004 1444 -758 -81 297 -337 949 -1412
2032 -1412 803 456 -996 786 -738 1007 -541 -735 1586 -1168 421 -250 44 917 -1797 1365
2048 1365 -57 -701 674 -955 1509 -1169 -347 1501 -1393 801 -767 535 667 -1935 1809 -570
2064 -570 -235 389 -918 1847 -1745 232 1194 -1344 1069 -1228 1148 232 -1834 2044 -1026 322
2080 322 -95 -684 1995 -2196 790 728 -1097 1100 -1593 1672 -315 -1551 2050 -1323 756 -607
2096 -607 -347 1896 -2457 1217 233 -764 970 -1728 2049 -783 -1161 1915 -1429 1064 -984 84
2112 84 1673 -2482 1539 -177 -355 726 -1672 2281 -1227 -667 1604 -1382 1267 -1378 553 1247
2128 1247 -2317 1699 -608 125 297 -1469 2325 -1598 -149 1098 -1140 1299 -1675 1011 734 -1965
2144 -1965 1660 -863 558 -131 -1089 2175 -1734 288 647 -790 1165 -1698 1296 299 -1518 1482
2160 1482 -911 785 -447 -693 1866 -1683 536 267 -456 894 -1578 1392 -87 -1082 1185 -877
2176 -877 873 -729 -311 1438 -1518 667 -87 -97 553 -1329 1381 -403 -598 771 -672 879 -891
2193 -891 101 942 -1145 660 -285 261 156 -923 1171 -522 -184 373 -349 658 -852 353 472
2210 472 -733 453 -291 383 -155 -506 813 -463 -6 41 -47 353 -662 395 137 -337 160 -183 383
2229 383 -317 -116 411 -259 76 -156 227 24 -338 349 -95 57 -140 60 273 -403 249 -24 44 7 -242
2250 -242 490 -373 56 144 -201 313 -495 412 -15 -382 461 -444 418 -281 -172 611 -713 468 -218 -55
2270 -55 442 -801 771 -352 -132 460 -716 847 -582 31 551 -819 872 -644 180 465 -893
2287 -893 993 -756 274 395 -920 1087 -869 373 280 -930 1223 -1003 425 204 -838 1260
2303 1260 -1243 597 200 -850 1206 -1289 873 21 -917 1309 -1297 942 -226 -750 1461 -1461
2319 -1461 973 -264 -540 1378 -1657 1192 -286 -507 1232 -1645 1443 -501 -540 1235 -1548 1481
2335 1481 -794 -385 1348 -1627 1390 -883 -72 1215 -1810 1531 -820 4 927 -1766 1815 -997
2351 -997 -72 879 -1524 1828 -1350 133 971 -1517 1651 -1430 530 803 -1681 1733 -1321 665
2367 665 437 -1564 1992 -1444 589 288 -1234 1991 -1771 728 364 -1113 1693 -1864 1116 229
2383 229 -1260 1624 -1660 1280 -192 -1172 1823 -1644 1098 -392 -759 1792 -1916 1141 -257 -561
2399 -561 1448 -1966 1498 -322 -664 1260 -1674 1637 -706 -581 1417 -1554 1447 -915 -195 1370
2415 1370 -1740 1381 -819 75 995 -1792 1633 -823 13 714 -1483 1772 -1150 37 761 -1239
2431 -1239 1549 -1374 389 748 -1314 1368 -1243 698 385 -1340 1503 -1103 650 60 -1019 1625
2447 1625 -1312 570 96 -671 1363 -1519 857 151 -732 1081 -1298 1096 -190 -752 1160 -1120
2463 -1120 955 -484 -407 1182 -1280 902 -434 -174 861 -1295 1076 -474 -143 675 -1116 1135
2479 1135 -664 -25 585 -986 1124 -796 124 499 -850 1038 -920 354 417 -844 922 -828
2495 -828 587 90 -816 1075 -777 465 -131 -429 1060 -1108 552 26 -327 667 -1059 934 -223
2512 -223 -481 727 -786 816 -588 -127 813 -995 723 -436 89 450 -986 1040 -575 -5 426
2529 426 -697 929 -851 324 416 -829 883 -697 468 39 -697 1116 -895 362 75 -401 840
2546 840 -1116 765 42 -632 767 -826 825 -456 -434 1069 -1048 610 -331 -36 712 -1278 1071
2563 1071 -290 -318 586 -870 1138 -818 -105 909 -1041 850 -663 312 515 -1254 1268 -602
2579 -602 49 357 -792 1280 -1117 269 639 -944 952 -941 666 186 -1095 1326 -871 345
2595 345 0 -595 1270 -1360 592 283 -727 877 -1111 997 -198 -857 1279 -1005 652 -334
2611 -334 -302 1174 -1474 900 -20 -453 790 -1160 1250 -492 -575 1167 -1050 864 -596 -35 1020
2628 1020 -1481 1065 -313 -207 604 -1143 1364 -774 -285 945 -1031 949 -847 228 753 -1390
2644 -1390 1143 -542 78 348 -999 1394 -967 20 662 -848 968 -987 510 469 -1159 1137
2660 1137 -681 342 95 -776 1328 -1055 271 394 -662 903 -1049 686 206 -945 1031 -743
2676 -743 477 -97 -597 1164 -1078 407 183 -505 778 -1030 776 8 -733 911 -742 565 -235
2693 -235 -406 999 -1013 493 22 -313 644 -923 792 -122 -502 744 -656 586 -332 -203 775
2710 775 -863 512 -104 -156 455 -773 730 -232 -307 553 -549 513 -362 -88 561 -717 452 -162
2728 -162 -81 332 -610 611 -250 -216 412 -449 435 -317 -45 450 -567 402 -132 -54 280 -488 499 -190
2748 -190 -162 359 -352 343 -225 -47 366 -451 305 -68 -80 239 -394 358 -108 -191 300 -310 228 -118 -120 319
2770 319 -379 204 -9 -167 249 -324 243 -13 -237 340 -282 190 2 -185 373 -341 186 83 -227 347
2790 347 -325 223 55 -295 424 -337 179 68 -287 440 -390 192 97 -325 431 -398 201 79 -355 489
2810 489 -435 202 78 -358 497 -470 240 86 -384 528 -482 276 53 -379 577 -533 312 52 -361
2829 -361 609 -574 359 39 -363 614 -599 401 -12 -366 623 -636 453 -53 -358 625 -676 479
2847 479 -110 -330 647 -719 511 -149 -295 629 -754 570 -182 -281 603 -745 630 -237 -248 622 -746
2866 -746 650 -293 -165 612 -786 686 -322 -109 565 -788 742 -360 -84 512 -758 787 -459
2883 -459 -47 490 -734 772 -543 42 447 -757 760 -573 142 362 -766 816 -589 178 264
2900 264 -696 857 -660 210 238 -609 810 -719 323 222 -611 777 -717 429 127 -586 790
2917 790 -689 447 6 -495 821 -749 440 -30 -389 750 -818 519 -58 -344 644 -797 628
2934 628 -155 -349 619 -729 639 -303 -241 641 -728 593 -346 -83 563 -783 644 -311 -13 405
2952 405 -736 756 -382 -27 352 -593 749 -548 77 387 -554 643 -568 258 278 -636 641 -512
2970 -512 289 89 -545 733 -581 254 30 -394 667 -682 346 36 -350 569 -685 485 -49 -344
2988 -344 522 -621 531 -190 -260 542 -585 527 -298 -116 544 -645 507 -299 35 394 -688 622
3006 622 -283 23 228 -553 735 -486 13 292 -451 588 -631 248 280 -577 543 -516 367 16
3024 16 -538 721 -545 276 -42 -323 680 -719 398 4 -319 568 -686 546 -144 -290 599 -669
3042 -669 560 -213 -174 541 -705 658 -298 -170 508 -645 640 -443 -19 524 -732 611 -389
3059 -389 115 291 -751 820 -455 9 257 -533 795 -720 174 381 -625 642 -632 418 136
3076 136 -691 841 -594 313 29 -456 862 -823 408 133 -458 705 -791 601 -56 -519 810
3093 810 -752 523 -179 -310 783 -927 622 -113 -345 625 -836 757 -343 -323 745 -816 627
3110 627 -380 -74 641 -972 787 -293 -119 469 -778 931 -537 -101 606 -730 737 -585 180
3127 180 500 -902 845 -465 114 286 -736 977 -684 97 415 -672 791 -750 345 314 -809
3144 -809 874 -629 294 120 -653 949 -817 293 228 -575 775 -818 512 122 -670 845 -688
3161 -688 442 -53 -460 902 -858 445 64 -391 705 -832 645 -66 -482 742 -701 555 -233
3178 -233 -287 767 -849 527 -133 -233 562 -819 694 -243 -321 604 -685 604 -363 -139 619 -807
3196 -807 598 -264 -96 453 -743 730 -333 -153 493 -619 648 -437 14 509 -712 620 -338
3213 -338 44 341 -653 723 -408 -21 360 -544 618 -484 102 338 -610 567 -402 113 206 -543 643
3232 643 -447 63 222 -446 547 -489 177 214 -479 525 -393 196 118 -415 569 -423 164 154 -342 497
3252 497 -449 229 140 -376 473 -377 224 60 -328 500 -407 175 74 -286 419 -427 230 71 -314 390
3272 390 -361 212 3 -281 407 -374 178 26 -234 360 -363 217 29 -249 348 -309 210 7 -198 355
3292 355 -304 189 36 -184 321 -310 202 23 -192 316 -282 184 2 -180 306 -292 159 20 -185 268
3312 268 -286 171 3 -197 279 -274 159 5 -179 280 -287 155 8 -174 274 -271 175 16 -169 283
3332 283 -261 168 23 -148 292 -259 176 19 -159 292 -243 177 12 -168 277 -263 171 5 -160 273
3352 273 -278 171 -18 -170 259 -276 173 -26 -169 265 -286 180 -31 -155 270 -292 214 -32 -140 270
3372 270 -286 217 -33 -121 282 -292 232 -43 -101 260 -301 236 -78 -114 261 -310 248 -102 -82 241 -305
3393 -305 252 -121 -77 224 -324 261 -132 -63 222 -316 270 -154 -46 209 -319 289 -170 -18 191 -292 306
3414 306 -179 29 184 -285 314 -193 53 155 -269 322 -210 69 124 -255 313 -245 89 96 -250 312 -261
3435 -261 107 58 -241 291 -284 123 33 -225 282 -292 167 3 -199 280 -291 181 -17 -143 285 -285 206
3456 206 -39 -115 261 -299 249 -59 -92 243 -281 272 -115 -75 223 -273 259 -144 -19 204 -296 276 -171
3477 -171 1 147 -291 290 -199 18 114 -264 297 -242 52 104 -253 292 -258 116 80 -240 293 -270 150
3498 150 41 -209 301 -271 192 -5 -176 309 -297 199 -37 -116 295 -332 230 -39 -105 243 -342 300 -94
3519 -94 -132 236 -299 286 -201 -67 264 -339 256 -193 24 196 -378 339 -186 18 142 -307 373 -268 36
3540 36 167 -290 344 -298 127 140 -298 385 -301 171 86 -281 386 -347 193 55 -270 389 -354 222 -23
3561 -23 -244 407 -407 214 -22 -181 354 -477 310 -25 -226 313 -401 369 -158 -204 409 -386 312 -188 -48
3582 -48 366 -495 372 -124 -58 262 -442 479 -207 -79 306 -387 428 -308 20 311 -445 440 -279 50 220
3603 220 -435 482 -339 59 216 -420 453 -361 131 161 -447 504 -375 123 113 -362 523 -460 169 169 -337
3624 -337 449 -447 297 84 -392 515 -377 256 -14 -269 546 -488 245 42 -228 419 -514 367 -25 -303
3644 -303 432 -445 350 -136 -217 473 -504 330 -109 -172 380 -520 417 -143 -190 394 -489 409 -206 -100 409
3665 409 -528 421 -179 -76 329 -487 501 -247 -86 363 -423 451 -294 22 334 -495 441 -250 36 231
3685 231 -471 528 -302 0 228 -393 441 -376 96 235 -446 429 -326 130 134 -410 485 -352 105 141 -332
3706 -332 455 -393 180 147 -350 434 -342 200 73 -311 465 -373 190 74 -250 421 -408 251 44 -281
3726 -281 400 -365 251 -26 -237 418 -416 228 -25 -199 351 -421 276 -37 -229 343 -364 281 -93 -164
3746 -164 346 -380 265 -86 -123 300 -362 302 -82 -123 278 -310 305 -124 -76 290 -329 281 -124 -54 243
3767 243 -338 302 -138 -54 198 -307 286 -178 -40 204 -313 253 -182 -12 156 -294 281 -173 -12 154
3787 154 -266 278 -186 30 151 -251 268 -174 45 126 -224 277 -175 44 129 -207 260 -172 64 111 -197
3808 -197 233 -175 58 78 -190 222 -170 52 67 -179 197 -186 69 45 -176 188 -178 82 34 -147 202
3829 202 -170 73 37 -126 194 -157 87 45 -120 190 -144 92 46 -100 181 -131 91 25 -92 173 -144
3850 -144 89 17 -97 158 -138 80 0 -102 138 -135 74 -9 -82 123 -144 73 -11 -86 121 -130 72 -4
3872 -4 -57 119 -115 84 4 -50 124 -113 92 -5 -41 124 -99 105 5 -35 111 -99 84 -11 -38 103 -109
3895 -109 89 -29 -37 86 -108 74 -26 -43 79 -109 67 -42 -34 80 -107 78 -27 -33 78 -104 75 -38
3917 -38 -16 86 -89 105 -32 -1 72 -77 98 -33 -1 84 -83 114 -34 -6 72 -83 93 -51 10 56 -90
3940 -90 85 -71 11 30 -108 92 -69 11 29 -100 81 -77 16 26 -71 89 -82 32 27 -68 106 -86 39 27
3964 27 -52 112 -78 59 23 -52 99 -85 72 -4 -43 92 -86 72 -13 -51 88 -97 66 -26 -36 65 -110
3987 -110 79 -43 -34 62 -113 87 -51 -23 71 -101 103 -56 -1 65 -111 114 -56 7 69 -86 131 -74 36
4010 36 72 -100 131 -91 47 39 -96 137 -104 47 38 -88 132 -130 66 24 -100 119 -135 77 -11 -103 123
4033 123 -132 68 -22 -68 137 -161 105 -22 -70 122 -150 134 -33 -56 144 -144 128 -49 -27 142 -153 142
4055 142 -51 -22 124 -152 162 -87 -21 128 -164 160 -95 -5 104 -185 186 -113 -16 91 -168 194 -150
4076 -150 13 101 -174 165 -155 64 80 -192 209 -132 61 54 -143 235 -162 72 83 -125 196 -191 123 61
4098 61 -161 211 -161 120 10 -126 234 -204 107 22 -119 209 -236 130 -9 -137 211 -217 152 -42 -110
4119 -110 208 -245 166 -28 -83 203 -234 216 -59 -99 223 -217 193 -95 -30 244 -257 207 -55 -35 166
4140 166 -244 268 -92 -45 189 -219 235 -146 -11 193 -253 212 -136 12 132 -266 249 -154 -7 115
4160 115 -230 266 -176 34 144 -244 252 -176 61 106 -213 280 -190 60 114 -188 271 -201 108 98 -207
4181 -207 273 -192 112 50 -185 283 -237 98 68 -161 254 -258 148 57 -197 238 -223 144 -14 -172 276
4202 276 -241 120 -3 -130 230 -268 174 3 -132 222 -231 190 -26 -105 236 -231 192 -35 -79 226 -229
4223 -229 206 -51 -65 216 -228 205 -78 -58 199 -249 200 -73 -42 167 -241 220 -101 -50 150 -224 216
4244 216 -137 -22 161 -233 199 -133 15 127 -228 246 -129 13 126 -184 239 -147 34 130 -177 212
4264 212 -144 66 111 -174 217 -148 60 83 -171 206 -164 56 71 -163 185 -157 65 43 -149 190 -168
4285 -168 61 32 -132 181 -184 82 33 -138 185 -157 115 9 -104 192 -161 110 6 -77 172 -157 120
4306 120 9 -83 159 -157 126 -27 -65 158 -144 112 -25 -55 129 -159 118 -46 -47 118 -154 117 -56 -49
4328 -49 113 -145 117 -51 -31 91 -143 126 -66 -8 93 -124 136 -66 2 94 -110 124 -50 12 79 -101
4350 -101 130 -53 28 69 -84 125 -76 22 55 -89 110 -79 18 32 -85 103 -89 17 30 -82 92 -82
4372 -82 34 24 -69 95 -79 28 12 -56 86 -69 48 23 -37 94 -52 47 19 -33 83 -48 60 11 -32 68
4396 68 -63 55 5 -13 60 -72 48 -16 -26 51 -58 42 -21 -22 39 -75 41 -27 -27 38 -68 41 -22 -10 36 -48
4422 -48 52 -15 1 47 -30 58 -19 8 31 -36 56 -14 19 31 -31 53 -17 6 20 -38 43 -20 4 4 -36 23 -49 11 10 -33 37
4453 37 -44 -1 -9 -38 27 -37 20 3 -21 38 -19 25 12 -15 38 -26 31 3 -3 49 -29 38 13 -6 47 -20 41 4 -5 30 -19 35
4485 35 -7 -6 14 -43 25 -21 -20 14 -43 17 -9 -26 6 -44 30 -22 -18 18 -32 23 -16 1 27 -31 36 -4 -2 36 -27 49 -14 14
4517 14 35 -26 47 -6 8 32 -30 52 -19 9 20 -43 37 -39 -8 12 -49 26 -46 -12 26 -59 28 -46 3 14 -50 54 -33 13
4547 13 26 -45 47 -34 20 30 -46 67 -31 23 19 -36 64 -41 36 37 -36 52 -44 33 13 -43 62 -50 22 1 -44 63
4575 63 -75 7 3 -57 54 -74 28 -3 -50 59 -67 31 -10 -45 77 -71 36 3 -52 77 -74 54 1 -41 86
4600 86 -68 57 -4 -31 95 -96 64 -13 -32 75 -97 82 -25 -53 76 -101 69 -36 -41 70 -106 57 -32
4623 -32 -46 58 -116 76 -48 -35 70 -90 93 -46 -8 91 -103 94 -33 7 81 -104 132 -50 7 82 -90
4646 -90 118 -67 16 86 -119 108 -78 23 51 -120 123 -86 12 41 -110 108 -113 21 51 -117 106 -105
4668 -105 46 29 -104 129 -110 31 43 -99 129 -111 58 36 -88 131 -102 66 20 -73 145 -105 70 23
4690 23 -63 123 -130 86 11 -96 121 -130 75 -19 -86 128 -153 70 -22 -73 113 -161 89 -22 -74 98 -146
4713 -146 108 -33 -59 132 -147 116 -37 -18 130 -142 130 -29 -25 115 -125 139 -53 -14 108 -132 136 -64
4735 -64 -23 85 -144 128 -78 -13 87 -140 119 -98 -5 64 -144 117 -89 5 58 -139 133 -92 3 54 -106
4758 -106 141 -112 34 73 -113 135 -102 73 47 -102 148 -97 67 44 -92 142 -112 49 40 -78 149 -122
4780 -122 68 15 -93 118 -127 61 3 -88 108 -143 76 -12 -91 115 -128 76 -17 -59 109 -127 82 -28
4802 -28 -40 106 -113 100 -6 -27 104 -111 112 -30 -31 101 -103 104 -47 -13 93 -121 105 -48 -20 66 -120
4825 -120 103 -66 -24 60 -104 92 -75 -15 47 -109 83 -86 13 40 -106 91 -81 15 28 -76 102 -67 30
4848 30 43 -74 99 -72 41 21 -65 93 -76 47 25 -55 92 -79 45 -1 -69 88 -90 41 -18 -62 57
4871 57 -99 32 -12 -57 53 -92 41 -25 -42 63 -78 55 -22 -34 49 -74 59 -21 -15 63 -57 72 -2 2 50
4896 50 -65 72 -27 11 51 -53 61 -31 -6 34 -61 64 -48 6 14 -64 52 -52 0 6 -54 50 -62 10 0 -46
4922 -46 43 -63 18 8 -47 60 -41 39 8 -21 62 -37 33 -2 -13 50 -29 51 1 -6 42 -46 47 -13 -14 32 -49 34 -24 -19
4952 -19 28 -50 27 -37 -13 12 -51 29 -33 -16 14 -37 26 -33 -1 10 -34 45 -33 19 23 -22 38 -30 25 12 -14 48 -27 27 12
4983 12 -8 44 -26 33 0 -21 31 -24 23 -14 -26 15 -34 22 -8 -17 19 -40 2 -6 -26 29 -49 18 -12 -7 24 -26 28 -2 10 35
5015 35 -23 31 -3 9 35 -19 37 -3 6 15 -19 30 -2 9 17 -14 32 -15 7 18 -27 18 -19 -17 8 -32 9 -24 -14 -4 -30 12
5047 12 -15 -1 11 -16 27 -8 1 15 -7 30 -1 21 28 -13 22 5 15 18 -6 29 10 2 20 -17 17 2 -4 10 -17 5 -9 -12 1
5080 1 -39 7 -24 -26 6 -26 7 -21 -25 26 -30 12 -6 -2 22 -27 25 4 -9 30 -17 35 7 -4 44 -19 45 8 -1 40 -35 35 -5
5113 -5 -18 35 -30 29 -15 -12 39 -53 34 -21 -22 19 -52 34 -21 -40 23 -61 43 -22 -17 55 -47 39 -22 5 38 -54 64 -15 -8
5144 -8 51 -34 55 -28 7 64 -57 73 -23 21 41 -63 71 -45 1 38 -67 77 -65 4 41 -73 65 -69 16
5169 16 13 -70 69 -59 5 23 -64 75 -67 33 37 -59 94 -55 46 19 -49 94 -62 55 28 -45 102 -70 54
5194 54 30 -52 97 -85 55 2 -53 91 -97 50 -8 -55 64 -111 59 -26 -55 73 -109 70 -46 -48 58 -111
5218 -111 70 -42 -28 85 -104 92 -39 -20 85 -92 104 -39 -11 82 -90 102 -47 10 82 -99 115 -58
5240 -58 7 63 -108 103 -74 2 49 -110 95 -89 5 35 -113 98 -102 8 32 -103 105 -103 31 32 -89
5263 -89 96 -95 53 23 -78 126 -94 65 14 -66 124 -97 59 18 -56 109 -101 78 -6 -63 97 -114 77
5286 77 -25 -57 88 -125 73 -35 -49 71 -134 74 -46 -39 87 -129 88 -50 -25 76 -116 101 -46 -12
5308 -12 72 -95 98 -48 -10 84 -88 108 -54 15 62 -102 110 -66 19 50 -85 106 -86 14 36 -100 87
5331 87 -91 16 14 -91 94 -98 40 18 -75 88 -102 34 5 -65 85 -96 44 -1 -50 103 -90 65 0
5354 0 -45 99 -84 88 -2 -27 95 -69 76 -19 -26 77 -88 73 -29 -9 69 -87 65 -49 -20 45 -97 78
5378 78 -57 -24 34 -80 81 -60 8 35 -77 70 -65 14 31 -58 80 -63 30 37 -54 84 -58 35 17 -54 82
5403 82 -54 41 13 -54 71 -75 43 -1 -51 64 -84 49 -28 -48 58 -89 43 -41 -39 43 -76 45 -38 -32 44
5428 44 -78 57 -35 -12 39 -60 74 -41 10 48 -50 78 -31 2 38 -49 63 -39 25 30 -52 74 -54 18 17 -53
5454 -53 57 -64 21 -6 -59 56 -72 15 -12 -56 48 -82 17 -16 -46 53 -64 27 -10 -28 55 -54 51 -5 -20 63
5480 63 -44 53 -7 4 67 -53 52 -8 -2 52 -49 48 -25 -6 31 -54 50 -33 -1 18 -58 39 -37 -10 8 -59 40 -50
5508 -50 0 11 -58 40 -50 3 17 -38 52 -33 14 16 -34 50 -31 27 24 -29 43 -38 27 11 -23 60 -31 34 6 -19 31 -37 15
5539 15 -11 -30 24 -42 15 -16 -24 15 -54 16 -12 -32 19 -47 19 -8 -15 17 -32 17 -5 -7 34 -23 27 -3 -3 44 -16 30 1 14
5571 14 31 -26 26 -4 -3 17 -21 9 -5 -17 6 -25 12 -18 -18 8 -31 -10 -17 -22 0 -25 3 -15 -23 16 -27 6 -3 -16 19 -14 16
5604 16 14 -2 26 -6 20 7 -9 29 0 14 18 -3 28 -6 1 15 -20 30 -22 -4 7 -25 14 -31 -1 -5 -40 9 -46 -10 4 -48
5636 -48 23 -37 7 4 -34 48 -11 9 12 -30 56 -26 19 24 -33 55 -26 20 27 -29 55 -22 16 19 -32 44 -36 18 13 -46 47 -45 17
5669 17 1 -49 49 -64 15 -9 -45 47 -66 28 -5 -60 52 -76 34 -5 -33 58 -57 54 2 -18 68 -63 67 4
5695 4 -24 68 -63 75 -12 -25 67 -73 58 -23 -20 58 -93 76 -42 -23 49 -92 52 -60 -26 40 -86 69 -55
5720 -55 -18 34 -91 67 -57 -3 46 -77 97 -62 17 67 -70 100 -44 38 56 -73 106 -58 39 35 -64 100
5744 100 -77 51 24 -78 82 -88 30 2 -75 87 -97 36 -9 -72 90 -106 51 -11 -69 81 -107 65
5766 65 -14 -53 83 -101 85 -10 -37 100 -96 86 -17 -16 90 -85 98 -27 -23 83 -88 88 -42 -20 76 -111
5790 -111 86 -57 -17 56 -105 95 -74 -3 45 -111 93 -88 -4 46 -101 103 -77 0 36 -84 91 -83 15
5813 15 39 -88 104 -74 45 34 -66 114 -75 57 28 -66 110 -92 68 -4 -52 96 -108 71 -19 -57 77
5836 77 -102 70 -24 -58 58 -126 63 -40 -41 71 -108 78 -49 -19 68 -96 88 -45 -9 71 -86 103 -44
5859 -44 2 70 -82 94 -51 22 60 -73 105 -70 25 40 -80 107 -73 22 23 -73 78 -99 23 -1 -69 76
5883 76 -92 33 -2 -71 75 -97 33 -19 -53 72 -102 59 -18 -46 87 -85 72 -13 -28 85 -79 93 -22
5906 -22 -14 63 -81 80 -33 -19 61 -84 81 -45 -2 41 -85 75 -73 2 31 -89 80 -89 2 21 -83 80
5930 80 -77 23 20 -79 87 -85 23 18 -62 76 -77 54 6 -43 94 -65 62 13 -31 91 -72 77 -5 -23
5954 -23 82 -84 76 -24 -32 72 -95 59 -37 -34 56 -102 60 -49 -31 41 -96 68 -45 -5 40 -92 82 -62
5978 -62 6 44 -78 84 -60 12 37 -70 95 -56 27 31 -63 89 -65 30 28 -67 77 -73 39 15 -62 78 -79
6003 -79 20 -19 -65 60 -84 29 -26 -61 61 -100 39 -13 -42 60 -85 49 -26 -39 72 -64 58 -16 -16 67 -67
6028 -67 67 -14 -8 71 -61 69 -32 -7 67 -64 70 -41 7 42 -61 57 -43 1 34 -64 54 -58 -9 20 -68
6053 -68 50 -58 7 13 -55 49 -50 -2 16 -42 64 -37 35 14 -29 64 -36 39 26 -21 44 -23 32 27 -25 54 -33 36
6081 36 5 -21 40 -43 29 -19 -25 25 -47 11 -25 -31 33 -42 20 -14 -25 23 -49 19 -18 -16 20 -39 29 -20 1 28 -19 34 -3 1
6113 1 31 -10 32 -4 15 26 -6 30 0 1 5 -16 7 -8 -5 -8 -11 0 -14 -8 -12 -17 -2 -16 -18 -1 -12 -2 -2 -16 -5 -17 2 4 -5 15 14
6150 14 -2 17 -4 21 18 -5 23 -2 21 13 6 35 -9 7 13 -4 24 -14 13 -1 -18 14 -39 -1 -13 -24 16 -55 0 -25 -30 6 -35
6183 -35 2 -7 -18 26 -30 15 -12 -23 36 -35 43 0 -4 37 -16 51 3 -1 40 -37 43 -18 -2 39 -47 49 -25 -11 32 -58 37 -41
6215 -41 -10 16 -70 32 -47 -17 19 -61 48 -48 -4 28 -63 52 -43 11 16 -53 70 -36 29 27 -36 79 -39 28 23 -39
6243 -39 77 -50 28 15 -45 68 -53 38 5 -49 70 -72 39 -7 -52 61 -88 41 -24 -50 52 -88 40 -19
6267 -19 -39 53 -92 53 -22 -24 56 -73 73 -30 -15 69 -61 80 -14 -8 59 -70 74 -25 10 55 -64 78 -51
6292 -51 7 44 -69 78 -58 7 25 -74 71 -66 10 13 -85 69 -77 16 8 -55 75 -80 23 9 -49 73 -65
6317 -65 37 3 -44 77 -58 56 3 -21 85 -68 58 -1 -21 77 -73 56 -19 -25 61 -86 62 -33 -22 34 -90
6342 -90 54 -47 -20 34 -76 60 -61 -9 26 -93 67 -67 2 32 -60 73 -60 31 40 -43 91 -51 36 31 -35
6367 -35 90 -49 48 23 -29 83 -56 55 7 -33 85 -84 52 -12 -38 52 -89 55 -40 -37 49 -82 53 -42 -27
6392 -27 43 -86 57 -47 -10 36 -67 76 -42 7 44 -55 79 -54 21 39 -57 95 -50 20 29 -64 86 -63 28
6417 28 26 -61 86 -69 44 7 -66 74 -90 46 -16 -56 60 -106 48 -16 -51 60 -86 54 -25 -36 58 -84
6441 -84 71 -28 -16 81 -79 76 -30 -5 70 -64 92 -35 7 56 -72 104 -59 16 51 -80 88 -59 15 35
6465 35 -76 83 -72 26 16 -77 78 -88 30 9 -80 81 -94 29 -4 -64 84 -83 61 7 -46 100 -83
6488 -83 65 5 -41 92 -85 72 -1 -30 86 -77 84 -22 -21 75 -95 74 -34 -19 63 -93 75 -49 -21 57
6512 57 -101 74 -61 -12 37 -99 74 -72 -8 28 -86 81 -74 14 45 -69 96 -64 33 43 -50 104 -65
6535 -65 50 32 -56 96 -73 41 22 -48 94 -76 59 6 -50 96 -96 51 -8 -54 71 -83 52 -23 -47 62
6559 62 -103 55 -28 -38 65 -96 58 -27 -19 61 -72 77 -38 -3 64 -63 80 -21 5 55 -60 82 -28 10
6583 10 57 -49 78 -42 20 29 -62 63 -51 18 25 -65 53 -57 25 16 -41 53 -65 18 11 -59 49 -60 23 7 -40
6610 -40 62 -55 35 6 -15 61 -49 57 -5 -14 56 -40 46 -9 -6 42 -36 48 -21 -7 21 -40 40 -32 0 25 -52 32 -30
6639 -30 -3 8 -52 29 -47 -6 0 -40 25 -36 16 9 -26 24 -34 33 8 -8 43 -21 22 -4 -12 33 -13 40 1 0 21 -20 36 -13
6671 -13 2 15 -29 13 -33 -6 1 -41 15 -51 -10 -26 -41 21 -42 12 -16 -21 16 -22 5 -17 -17 27 -33 32 -1 8 23 -34 45 -6
6703 -6 6 33 -30 45 -13 13 24 -17 56 -20 21 5 -34 39 -21 7 -3 -37 34 -51 15 -8 -34 30 -53 23 -18 -31 20 -49 32
6734 32 -22 -18 38 -43 46 -17 -10 40 -27 50 -9 10 53 -28 57 -11 9 35 -35 57 -33 8 21 -38 46 -35 10 10 -50 42 -56 4
6766 4 5 -53 36 -52 14 5 -41 39 -57 16 -5 -36 61 -43 36 12 -20 50 -38 59 4 -5 65 -36 49 0 -11 38 -44 50 -14
6797 -14 0 34 -51 30 -36 -10 32 -69 28 -35 -15 6 -58 35 -43 -13 6 -53 39 -48 -1 13 -44 52 -42 10 16 -34 52 -34
6827 -34 36 15 -14 42 -39 31 14 -12 57 -29 41 3 -27 35 -48 30 -14 -19 27 -49 16 -33 -27 18 -56 19 -29 -15 10 -51 20
6858 20 -29 -4 4 -33 40 -24 16 20 -23 46 -24 28 15 -7 40 -25 35 13 -13 39 -28 32 1 -14 36 -38 19 -16 -19 11 -49 15
6890 15 -34 -15 6 -54 12 -47 -11 2 -46 22 -35 1 6 -36 40 -41 27 5 -19 51 -32 39 9 -20 38 -33 41 -2 -16 39 -52
6921 -52 47 -11 -14 33 -45 36 -21 -17 24 -55 27 -45 -9 6 -61 29 -53 -12 11 -58 53 -58 -3 27 -65 56 -55 24 19 -44
6951 -44 56 -44 27 17 -34 63 -44 43 9 -29 76 -60 48 -1 -34 65 -74 35 -27 -39 58 -84 41 -36 -35 53
6977 53 -80 49 -54 -27 42 -94 49 -43 -17 50 -79 81 -42 -8 40 -69 81 -41 15 52 -70 87 -49
7000 -49 31 40 -60 95 -48 26 33 -74 86 -82 27 14 -70 68 -89 31 -10 -77 65 -88 31 -17 -67 71
7024 71 -85 48 -21 -53 74 -91 52 -10 -32 81 -82 72 -17 -12 83 -77 76 -20 -17 74 -66 89 -32 -4 67
7049 67 -75 81 -42 -4 60 -88 75 -56 1 40 -84 75 -68 2 20 -90 78 -67 6 16 -77 78 -68
7072 -68 39 21 -58 87 -73 48 23 -53 91 -79 50 28 -38 91 -67 64 11 -33 74 -81 64 -8 -45 59
7096 59 -85 58 -30 -34 60 -93 38 -39 -28 55 -92 50 -50 -23 40 -88 67 -54 3 43 -70 67 -47 8
7120 8 45 -54 75 -39 20 44 -36 80 -55 35 32 -47 86 -51 35 19 -42 69 -68 33 -14 -43 65 -78 28
7145 28 -20 -44 52 -87 28 -33 -31 55 -80 54 -32 -22 53 -58 55 -25 0 51 -48 77 -23 15 51 -59 67 -45
7171 -45 24 32 -58 75 -50 29 17 -44 67 -52 22 1 -44 52 -63 23 -14 -54 50 -75 29 -2 -47 52 -63 43
7197 43 -22 -15 51 -65 55 -26 -8 44 -56 67 -17 13 63 -54 74 -26 2 52 -51 69 -36 6 32 -65 62
7222 62 -57 9 18 -62 54 -65 17 2 -63 50 -85 15 -7 -57 59 -85 24 -12 -34 68 -73 48 4 -36 68
7247 68 -66 60 -6 -25 70 -66 73 -17 -17 64 -60 68 -31 -22 59 -78 58 -43 -6 39 -89 54 -61 -22 24
7272 24 -87 52 -62 -7 17 -84 75 -59 4 21 -68 70 -67 9 34 -58 74 -62 34 28 -43 79 -54 38 15
7297 15 -45 68 -55 43 16 -39 71 -70 37 -1 -40 62 -73 41 -8 -39 46 -73 37 -21 -38 58 -76 43
7321 43 -21 -24 47 -73 49 -32 -14 61 -63 60 -22 2 50 -55 73 -27 8 53 -57 64 -32 10 43 -50 65 -34
7347 -34 2 31 -50 48 -46 4 10 -65 34 -56 -15 3 -53 34 -54 -3 5 -48 32 -36 12 3 -22 38 -32 30 8 -20 51 -31 48 18
7379 18 -10 36 -24 16 -7 -14 31 -26 21 4 -3 23 -26 11 -15 -19 8 -37 2 -22 -15 -5 -32 8 -14 -2 3 -35 12 -10 1 8 -4
7412 -4 23 -7 3 8 5 12 4 17 16 13 4 10 3 13 13 3 5 10 3 8 -8 4 9 -9 -7 -27 -9 -22 -24 1 -24 4 -18 -22 -6 -22 0 -8 -2 1 -8 13
7454 13 -5 -5 20 -18 32 1 9 24 -10 26 -5 11 27 -12 26 -18 6 16 -24 35 -27 -6 3 -32 26 -35 -13 -11 -42 10 -41 -2
7486 -2 -13 -39 33 -39 9 -3 -35 40 -32 15 10 -21 46 -38 32 2 -19 61 -29 52 13 -9 51 -36 51 -15 -2 43 -45 47 -21
7517 -21 -22 31 -64 38 -36 -22 32 -68 47 -44 -17 26 -72 43 -43 -4 29 -63 50 -38 14 29 -43 56 -36 20 32 -40
7545 -40 73 -36 36 39 -38 67 -50 28 24 -42 72 -52 39 1 -54 61 -77 34 -10 -42 50 -75 21 -19 -50 48
7571 48 -81 38 -25 -33 53 -65 55 -12 -16 49 -61 58 -21 3 69 -61 82 -17 2 56 -56 65 -19 5 47 -58
7597 -58 77 -43 11 41 -64 57 -59 1 21 -74 55 -72 13 20 -67 65 -77 17 4 -56 62 -66 42 -4 -42
7622 -42 63 -59 51 6 -18 74 -60 60 2 -15 62 -62 63 -13 -13 57 -56 64 -30 -18 50 -71 62 -43 -19
7647 -19 24 -80 61 -53 -13 30 -80 68 -63 -6 25 -75 80 -66 13 23 -56 77 -60 35 31 -58 96 -65
7671 -65 43 28 -44 78 -69 49 20 -45 74 -69 53 -8 -40 67 -82 57 -30 -32 50 -82 51 -48 -35 40 -94
7696 -94 55 -52 -19 54 -94 68 -41 -9 51 -80 81 -46 16 65 -71 85 -53 25 46 -73 93 -52 43
7719 43 34 -69 96 -69 49 21 -64 92 -94 47 5 -79 83 -95 37 -15 -62 64 -96 40 -17 -62 82 -94
7743 -94 74 -20 -57 83 -84 82 -16 -14 93 -84 87 -9 -10 82 -70 86 -35 -2 76 -91 83 -42 3 68 -92
7768 -92 86 -64 -5 41 -103 76 -79 1 37 -100 85 -83 9 31 -86 91 -93 18 14 -81 99 -85 44
7791 44 20 -72 108 -70 50 29 -60 102 -84 61 12 -46 107 -87 62 10 -52 92 -85 58 -12 -53 90 -96
7815 -96 56 -21 -50 72 -102 58 -40 -39 60 -107 58 -45 -28 61 -93 78 -39 -9 68 -91 90 -45 2 71
7839 71 -76 105 -35 12 65 -68 89 -53 8 45 -75 94 -50 9 34 -81 79 -69 1 16 -79 70 -85
7862 -85 7 5 -87 72 -84 9 -2 -76 71 -68 25 15 -58 75 -65 36 6 -41 77 -57 58 3 -34 82 -58
7887 -58 51 3 -31 63 -58 40 -11 -24 54 -67 34 -17 -28 42 -74 33 -30 -30 28 -74 37 -35 -21 33 -55 45
7913 45 -25 -17 34 -47 49 -5 2 36 -37 54 -17 3 33 -35 55 -17 17 33 -32 46 -19 6 21 -33 32 -27 -5 16 -46 30 -38
7944 -38 -8 7 -42 19 -41 1 0 -42 24 -24 -1 5 -35 13 -20 22 17 -16 31 -7 17 20 -9 38 -16 14 16 0 34 -7 15 4 -19
7977 -19 22 -13 -3 1 -16 3 -26 -16 -6 -30 -1 -20 -18 -13 -25 -7 -32 -12 -2 -21 0 -12 -8 6 -13 18 3 -1 22 0 18 4 16
8010 16 32 -2 23 13 5 15 -3 25 8 -7 13 -16 22 -11 -10 22 -21 11 -22 -18 6 -36 4 -16 -17 10 -32 7 -16 -6 17 -35
8042 -35 29 4 4 26 -18 38 9 9 32 -18 33 15 11 31 -23 40 4 13 27 -21 37 -13 5 20 -26 25 -29 -6 12 -29 34 -34
8074 -34 -11 9 -33 41 -47 2 12 -34 32 -26 6 19 -34 40 -19 35 27 -16 56 -24 30 10 -12 53 -27 38 11 -23 38 -38 34
8105 34 6 -29 31 -45 37 -16 -19 25 -55 29 -26 -28 27 -58 32 -32 -13 25 -46 42 -23 7 39 -37 59 -24 13 50 -38 57 -17
8136 -17 22 40 -33 60 -27 17 33 -35 60 -44 18 15 -37 55 -55 23 -4 -58 40 -63 18 -5 -53 50 -64 18 -18 -41
8164 -41 41 -63 36 -13 -26 48 -52 67 -8 -14 61 -58 78 -13 -11 59 -52 70 -22 12 52 -66 72 -41 -5 35
8190 35 -72
8191g2
##END NTUPLES=NMR FID
##END=
