##TITLE=1H_Ser EtOH
 
 8 sc, 
 24.10.2023
##JCAMPDX= 6.0         $$ Bruker NMR JCAMP-DX V2.0
##DATA TYPE= NMR FID
##DATA CLASS= NTUPLES
##ORIGIN= UXNMR, Bruker Analytische Messtechnik GmbH
##OWNER= root
$$ XWIN-NMR		Version 3.5
$$ Tue Oct 24 13:50:42 2023 Russian Standard Time (UT+4h)  she@DPX200
##.OBSERVE FREQUENCY= 200.13135
##.OBSERVE NUCLEUS= ^1H
##.DELAY= (6, 6)
##.ACQUISITION MODE= SIMULTANEOUS
##.ACQUISITION SCHEME= undefined
##.AVERAGES= 8
##.DIGITISER RES= 18
##SPECTROMETER/DATA SYSTEM= spect
##.PULSE SEQUENCE= zg30
##.SOLVENT NAME= D2O
##.SHIFT REFERENCE= (INTERNAL, D2O, 0, 15.7039)
##AUDIT TRAIL= $$ (NUMBER, WHEN, WHO, WHERE, WHAT)
$$ ##TITLE= Audit trail, XWIN-NMR		Version 3.5
$$ ##JCAMPDX= 5.01
$$ ##ORIGIN= Bruker BioSpin GmbH
$$ ##OWNER= she
$$ F:/spectra/data/she/nmr/H-F/1/audita.txt
$$ ##AUDIT TRAIL=  $$ (NUMBER, WHEN, WHO, WHERE, WHAT)
(   1,<2023-10-24 13:48:57.42 +0400>,<she>,<DPX200>,
      <created by zg, POWCHK disabled, PULCHK disabled
       configuration hash MD5:
       00 E9 B6 7A A2 85 ED C7 34 08 36 98 17 FE 4E 26
       data hash MD5: 16K
       90 64 26 BE A1 EC 5D A0 6E A9 3D 61 E6 3A 39 90>)
$$ ##END=
$$ 
$$ hash MD5
$$ FA 0E B5 C0 2F 01 83 A6 F1 BB 4E BF 1F EA 25 1A
##$RELAX= 
##$RELAX= 
##$RELAX= 
##$RELAX= 
##$RELAX= 
##$RELAX= 
$$ Bruker specific parameters
$$ --------------------------
##$DU= <F:/spectra>
##$EXPNO= 1
##$NAME= <H-F>
##$PROCNO= 1
##$TYPE= <nmr>
##$USER= <she>
##$AMP= (0..31)
100 100 100 100 100 100 100 100 100 100 100 100 100 100 100 100 100 100 
100 100 100 100 100 100 100 100 100 100 100 100 100 100 
##$AQSEQ= 0
##$AQ_mod= 1
##$AUNM= <au_zg>
##$AUTOPOS= <>
##$BF1= 200.13
##$BF2= 200.13
##$BF3= 200.13
##$BF4= 200.13
##$BF5= 200.13
##$BF6= 200.13
##$BF7= 200.13
##$BF8= 200.13
##$BYTORDA= 1
##$CFDGTYP= 0
##$CFRGTYP= 5
##$CHEMSTR= <none>
##$CNST= (0..31)
1 1 145 1 1 1 1 1 1 1 1 1 1 1 1 1 1 1 1 1 1 1 1 1 1 1 1 1 1 1 1 1 
##$CPDPRG= <>
##$CPDPRG1= <>
##$CPDPRG2= <>
##$CPDPRG3= <>
##$CPDPRG4= <mlev>
##$CPDPRG5= <mlev>
##$CPDPRG6= <mlev>
##$CPDPRG7= <mlev>
##$CPDPRG8= <mlev>
##$CPDPRGB= <>
##$CPDPRGT= <>
##$D= (0..31)
0 1.2 0 0 0 0 0 0 0 0.06 0 0.03 0 0 0 0 0.0002 0 0 0 0 0 0 0 0 0 0 0 0 
0 0 0 
##$DATE= 1698140937
##$DBL= (0..7)
120 120 120 120 120 120 120 120 
##$DBP= (0..7)
150 150 150 150 150 150 150 150 
##$DBP07= 0
##$DBPNAM0= <>
##$DBPNAM1= <>
##$DBPNAM2= <>
##$DBPNAM3= <>
##$DBPNAM4= <>
##$DBPNAM5= <>
##$DBPNAM6= <>
##$DBPNAM7= <>
##$DBPOAL= (0..7)
0.5 0.5 0.5 0.5 0.5 0.5 0.5 0.5 
##$DBPOFFS= (0..7)
0 0 0 0 0 0 0 0 
##$DE= 6
##$DECBNUC= <off>
##$DECIM= 32
##$DECNUC= <off>
##$DECSTAT= 4
##$DIGMOD= 1
##$DIGTYP= 9
##$DL= (0..7)
0 120 120 120 120 120 120 120 
##$DP= (0..7)
150 150 150 150 150 150 150 150 
##$DP07= 0
##$DPNAME0= <>
##$DPNAME1= <>
##$DPNAME2= <>
##$DPNAME3= <>
##$DPNAME4= <>
##$DPNAME5= <>
##$DPNAME6= <>
##$DPNAME7= <>
##$DPOAL= (0..7)
0.5 0.5 0.5 0.5 0.5 0.5 0.5 0.5 
##$DPOFFS= (0..7)
0 0 0 0 0 0 0 0 
##$DQDMODE= 0
##$DR= 18
##$DS= 0
##$DSLIST= <SSSSSSSSSSSSSSS>
##$DSPFIRM= 0
$$ [...]
##$SUBNAM2= <"">
##$SUBNAM3= <"">
##$SUBNAM4= <"">
##$SUBNAM5= <"">
##$SUBNAM6= <"">
##$SUBNAM7= <"">
##$SUBNAM8= <"">
##$SUBNAM9= <"">
##$SW= 18.05172834244
##$SWIBOX= (0..15)
0 0 2 0 0 0 0 0 0 0 0 0 0 0 0 0 
##$SW_h= 3612.71676300578
##$TD= 16384
##$TD0= 1
##$TE= 0
##$TE2= 300
##$TE3= 300
##$TEG= 300
##$TL= (0..7)
0 120 120 120 120 120 120 120 
##$TP= (0..7)
150 150 150 150 150 150 150 150 
##$TP07= 0
##$TPNAME0= <>
##$TPNAME1= <>
##$TPNAME2= <>
##$TPNAME3= <>
##$TPNAME4= <>
##$TPNAME5= <>
##$TPNAME6= <>
##$TPNAME7= <>
##$TPOAL= (0..7)
0.5 0.5 0.5 0.5 0.5 0.5 0.5 0.5 
##$TPOFFS= (0..7)
0 0 0 0 0 0 0 0 
##$TUNHIN= 0
##$TUNHOUT= 0
##$TUNXOUT= 0
##$USERA1= <user>
##$USERA2= <user>
##$USERA3= <user>
##$USERA4= <user>
##$USERA5= <user>
##$V9= 5
##$VALIST= <valist>
##$VCLIST= <CCCCCCCCCCCCCCC>
##$VD= 0
##$VDLIST= <DDDDDDDDDDDDDDD>
##$VPLIST= <PPPPPPPPPPPPPPP>
##$VTLIST= <TTTTTTTTTTTTTTT>
##$WBST= 1024
##$WBSW= 4
##$XGAIN= (0..3)
0 0 0 0 
##$XL= 0
##$YL= 0
##$YMAX_a= 594182
##$YMIN_a= -620373
##$ZGOPTNS= <>
##$ZL1= 120
##$ZL2= 120
##$ZL3= 120
##$ZL4= 120
##$ABSF1= 10
##$ABSF2= 0
##$ABSG= 5
##$ABSL= 3
##$ALPHA= 0
##$AQORDER= 0
##$ASSFAC= 0
##$ASSFACI= 0
##$ASSFACX= 0
##$ASSWID= 0
##$AUNMP= <proc_1d>
##$AZFE= 0.1
##$AZFW= 0.1
##$BCFW= 1
##$BC_mod= 2
##$BYTORDP= 1
##$COROFFS= 0
##$CY= 11.3945322036743
##$DATMOD= 1
##$DC= 2
##$DFILT= <>
##$DTYPP= 0
##$F1P= 15.7292609196834
##$F2P= 12.9074282941183
##$FCOR= 0.5
##$FTSIZE= 0
##$FT_mod= 4
##$GAMMA= 1
##$GB= 0.15
##$INTBC= 1
##$INTSCL= 1
##$ISEN= 128
##$LB= 0.24
##$LEV0= 0
##$LPBIN= 0
##$MAXI= 10000
##$MC2= 0
##$MEAN= 0
##$ME_mod= 0
##$MI= 1.114404
##$NCOEF= 0
##$NC_proc= 0
##$NLEV= 6
##$NOISF1= 3.799351
##$NOISF2= 2.8
##$NSP= 1
##$NTH_PI= 0
##$NZP= 0
##$OFFSET= 15.70392
##$PC= 1
##$PHC0= -23055.05
##$PHC1= 5.252699
##$PH_mod= 1
##$PKNL= yes
##$PPARMOD= 0
##$PSCAL= 0
##$PSIGN= 0
##$REVERSE= no
##$SF= 200.130013532006
##$SI= 16384
##$SIGF1= 3
##$SIGF2= 2
##$SINO= 400
##$SIOLD= 16384
##$SREGLST= <1H.CDCl3>
##$SSB= 0
##$STSI= 0
##$STSR= 0
##$SW_p= 3612.71676300578
##$SYMM= 0
##$S_DEV= 0
##$TDeff= 0
##$TDoff= 0
##$TI= <>
##$TILT= no
##$TM1= 0
##$TM2= 0
##$TOPLEV= 0
##$USERP1= <user>
##$USERP2= <user>
##$USERP3= <user>
##$USERP4= <user>
##$USERP5= <user>
##$WDW= 1
##$XDIM= 8192
##$YMAX_p= 0
##$YMIN_p= 0
$$ End of Bruker specific parameters
$$ ---------------------------------
##NTUPLES= NMR FID
##VAR_NAME=  TIME,          FID/REAL,        FID/IMAG
##SYMBOL=    X,             R,               I
##VAR_TYPE=  INDEPENDENT,   DEPENDENT,       DEPENDENT
##VAR_FORM=  AFFN,          ASDF,            ASDF
##VAR_DIM=   8192,          8192,            8192
##UNITS=     SECONDS,       ARBITRARY UNITS, ARBITRARY UNITS
##FACTOR=    0.0002768,     1,               1
##FIRST=     0,             0,               0
##LAST=      2.2672688,     0,               0
##MIN=       0,             -620373,         0
##MAX=       2.2672688,     594182,          0
$$ Real data points
##PAGE= N=1
##DATA TABLE= (X++(R..R)), XYDATA
0@%%%%%%%Qj6J6k4M0m8N6p2R5j19J44j82K23k72L28l88M60n43O37p41Q62j000
$$ 0 0 0 0 0 0 0 0 8 -8 8 -16 24 -24 32 -40 55 -64 80 -102 121 -151 177 -211 249 -294 343 -398 464 -536
29e36J151j320J512j725J957k213K496k808L153l532L947m401M900n444O035o680
$$ -536 615 -705 807 -918 1039 -1174 1322 -1486 1667 -1865 2082 -2319 2581 -2863 3172 -3508
45c508P385q156Q995r915J0926j2033J3249j4593J6082j7738J9594k1685K4060
$$ -3508 3877 -4279 4716 -5199 5727 -6306 6943 -7650 8432 -9306 10288 -11397 12663
58A2663k6787K9957l3689L8158m3632N0510n9446P1605q9264J17695j73744M59029
$$ 12663 -14124 15833 -17856 20302 -23330 27180 -32266 39339 -49925 67770 -105974 353055
70C53055o37181Q4868K21337k12485P84588j106874P84776k47156m06851P68987
$$ 353055 -284126 -199258 22079 -190406 594182 -512692 272084 24928 -381923 387064
80C87064o75411O07637m04400k00304P61113r70799P11928j54723j03586L14832
$$ 387064 -288347 319290 -85110 -285414 475699 -495100 216828 62105 -41481 273351
90B73351q93724R37680k24191j90679L77847p68124P62199l73987R2997L62171
$$ 273351 -620373 317307 93116 -97563 280284 -487840 274359 -99628 -6631 355540
100C55540q44772P39622l27503M6734K34746n81377Q20751o29823o28M07059m26660
$$ 355540 -489232 250390 -77113 -30379 204367 -377010 443741 -186082 -186710 220349 -206311
111b06311N88646o71139K49614K62317n80090P05423m59025J43407k5714l54267
$$ -206311 382335 -288804 -39190 223127 -356963 348460 -110565 32842 7128 -347139
121c47139Q35555o55270R8795J47386k52648N07122o81159M44147J14824m63914
$$ -347139 488416 -166854 -68059 79327 -173321 333801 -347358 96789 211613 -252301
131b52301M46806m55444M44159j06866l09323N35709n75005L39467j0409j43216
$$ -252301 194505 -260939 183220 76354 -232969 302740 -272265 67202 56793 -86423
141h6423L50558o11021M72693n1565k06242L38572m50015M20906k19360r5893
$$ -86423 264135 -346886 125807 74242 -132000 206572 -243443 177463 -41897 -137790
151a37790L82488m69594L79296j90605n3329K46743l94672M78940k73562j07274
$$ -137790 244698 -224896 154400 -36205 -89534 157209 -237463 241477 -32085 -139359
161a39359K62037k80921L88216l47083M4958K45023l73687L55776k33530R6045
$$ -139359 122678 -158243 229973 -117110 -72152 172871 -200816 154960 -78570 17475
171A7475Q2883l26912M35212k88645M9659J15875k11643L16249l68523J81980
$$ 17475 100358 -226554 208658 -79987 -30328 85547 -126096 190153 -178370 3610
181C610J37678k67584K49008k78093K23342Q728k24128L10506k86538J59724o193
$$ 3610 141288 -126296 122712 -155381 67961 76689 -147439 163067 -123471 36253 30060
192C0060j22038K52983l13835K10346j6606j36667K10407k37683K23062j00294
$$ 30060 -91978 161005 -152830 57516 40910 -95757 114650 -123033 100029 -265
202b65j02749K23897k27507J93029j00857m8359J62129k23640K25115j08145n1506
$$ -265 -103014 120883 -106624 86405 -14452 -62811 99318 -124322 100793 -7352 -58858
213e8858J32811j73372K05555j50318J342J34142j83958J69293j29931M9062Q0210
$$ -58858 73953 -99419 106136 -44182 -42840 91302 -92656 76637 -53294 -4232 75978
224G5978j77582J86002j33066M1775O0082j27026J64266j63228P1865N7598j20116
$$ 75978 -101604 84398 -48668 -6893 53189 -73837 90429 -72799 -934 56664 -63452
235f3452J35528j44210R6911J2718j07588J43715j32308Q6753j2736p1399J27809
$$ -63452 72076 -72134 24777 37495 -70093 73622 -58686 28067 15331 -56068 71741
246G1741j34457R7322k3212n8581J03389j14995J05747m7178m2458R4163j03694
$$ 71741 -62716 34606 11394 -47187 56202 -58793 46954 -224 -42682 51481 -52213
257e2213R7077n5379j7074P3840r8301R5206n7806k591N4940q3648Q8707o6404
$$ -52213 44864 -10515 -27589 46251 -52050 43156 -14650 -17241 37699 -45949 42758 -23646
269b3646J3947M4526p4406P7489o6636K8333K9277o4700P1589o5298L4452J5424
$$ -23646 -9699 34827 -39579 37910 -28726 -393 28884 -35816 35773 -29525 4927 20351
281B0351n0594O4385o4694M0684L550m0055N7497o0010M3935q102l0079N0684
$$ 20351 -30243 34142 -30552 10132 13682 -26373 31124 -28886 15049 6947 -23132 27552
293B7552n3930M4408j6678k0027M1685m6757M4077k3668j0707L3408m0458M0891
$$ 27552 -26378 18030 1352 -18675 23010 -23747 20330 -3338 -14045 19363 -21095 19796
305A9796k6677j928K4638l4396L6345k6492M602J6111k6572K9911k6155J0603
$$ 19796 -6881 -8809 15829 -18567 17778 -8714 -4112 11999 -14573 15338 -10817 -214
317b14R358k0136K2920k3393J4346L306j4187J7033j8921J4165j422p284J0397
$$ -214 9144 -10992 11928 -11465 2881 6187 -8000 9033 -9888 4277 2855 -4429 5968
330E968j4096J3152m956j816M447q110J0980p596J944N3j675O090p817N333n016
$$ 5968 -8128 5024 68 -1748 2699 -5411 5569 -2027 -83 -30 -1705 4385 -3432 1901 -3115
345c115M837N24n841P609j0365J1503n048l178Q068j3490J7413j2761J844P934
$$ -3115 1722 2246 -3595 4014 -6351 5152 104 -3074 4994 -8496 8917 -3844 -2000 5934
359E934j5915K2082k0792R675N601j8977K7839k7522J5852J050j7996L2480l6175
$$ 5934 -9981 12101 -8691 984 6585 -12392 15447 -12075 3777 4827 -13169 19311 -16864
372a6864K3308k664j6197L2990m2574L4823j1117j6066L6846m6506M1363k1188
$$ -16864 6444 3780 -12417 20573 -22001 12822 1705 -14361 22485 -24021 17342 -3846
384c846r015L8922n5144M9348k6013l285L2895n7720O2922l9193N6L4217n7320
$$ -3846 -12861 26061 -29083 20265 -5748 -9033 23862 -33858 29064 -10129 -10073 24144 -33176
397c3176O6642n3254J5095L2524o6560P3719n6553K4144J8788o3648Q7853p3115
$$ -33176 33466 -19788 -4693 27831 -38729 34990 -21563 2581 21369 -42279 45574 -27541
409b7541K9130J8166n6628Q4846q8697N2164J1330o5568Q9550q6624O1370j1208
$$ -27541 1589 19755 -36873 47973 -40724 11440 22770 -42798 46752 -39872 21498 10290
421A0290n4488J02988j04459O4351j1569l9749Q9272j17258R3358k3198m8703
$$ 10290 -44198 58790 -45669 18682 7113 -32636 56636 -60622 32736 9538 -39165
432c9165R0652j06388R9029n3174k8547J02511j25151R8074m9967p729P7152j33341
$$ -39165 51487 -54901 44128 -9046 -37593 64918 -60233 37841 -12126 -19855 57297 -76044
444g6044J31291o5335j7106P5999j13668J31569j01213J2564Q5840j34302J26825
$$ -76044 55247 -10088 -27194 48805 -64863 66706 -34507 -21943 63897 -70405 56420
455E6420r2599L7457M8609j36241J63557j11121K6011M5671j05504J54774j51077
$$ 56420 -36179 1278 49887 -86354 77203 -33918 -7907 37764 -67740 87034 -64043
466f4043O5552N2912j27707J43913j32433R1854K656j21094J81866j50165P3604
$$ -64043 1509 54421 -73286 70627 -61806 30048 32704 -88390 93476 -56689 16915
477A6915j24p7283J59768j89286J18770O172r9756J40645j58171J41822n1700
$$ 16915 16791 -60492 99276 -90010 28760 34932 -64824 75821 -82350 59472 7772
488G772q5481J76170j72551J16296n1112l4703J42365k05636J62588m6638n7343
$$ 7772 -77709 98461 -74090 42206 -8906 -43609 98756 -106880 55708 9070 -48273
499d8273J20208j65288J78378j07847l4473J53185j81446J48486r9538J9064J06391
$$ -48273 71935 -93353 85025 -22822 -57295 95890 -85556 62930 -36608 -17544 88847
510H8847k08092K00191r7898r014Q3342j54211K07343j67107K3499J18932j73043
$$ 88847 -119245 80946 -16952 -25966 57376 -96835 110508 -56599 -33100 85832 -87211
521h7211J66665j48183Q4164N7884j97166K21495j40160M8069K7793j27437K22020
$$ -87211 79454 -68729 15435 73319 -123847 97648 -42512 5557 33350 -94087 127933
532A27933k11531P9809O4552j38339J69144j87019J40448K594j56474K11950j71011
$$ 127933 -83598 -3789 60763 -77576 91568 -95451 44997 47591 -108883 103067 -67944
543f7944J04780k8238q6528K02516k26379J33075j565r3280J53595j94544J76333
$$ -67944 36836 8598 -77930 124586 -101793 31282 29717 -63563 90032 -104512 71821
554G1821o1949r4632J89015j86658J38202p5928k5734J58675k32011J78429n3190
$$ 71821 9872 -84760 104255 -82403 55799 -20129 -45863 112812 -119199 59230 6040
565F040m6528J11263j79339K11740j28255l9450J58560j74223J54601j32743M4666
$$ 6040 -40488 70775 -108564 103176 -25079 -64529 94031 -80192 74409 -58334 -13668
576a3668J17105k27550J96238r4186J8891N2929j64036K35556j68352J3440R7779
$$ -13668 103437 -124113 72125 -22061 -3170 49759 -114277 121279 -47073 -33633 64146
587F4146j39448J71410j80727R3305O8750j82288J87439j39115Q2384Q101j32604
$$ 64146 -75302 96108 -84619 8686 77436 -104852 82587 -56528 25856 33957 -98647
598i8647K12117j82811P7881K8547j07942J65449j82796J25776k743j20284J77354
$$ -98647 113470 -69341 8540 37087 -70855 94594 -88202 37574 34831 -85453 91901
609I1901j61033J07270l3864o7182J69134j98746J24778j1457o7496J18799j68259
$$ 91901 -69132 38138 4274 -62908 106226 -92520 32258 20801 -46695 72104 -96155
620i6155J68301o5560p9077J51757j42277J22907r5003l746J42015j96409J33846
$$ -96155 72146 6586 -72491 79266 -63011 59896 -35107 -38853 103162 -93247 40599
631D0599n0669N19O9483j66923J91425r4697k9142R0031j17674J51925j38530
$$ 40599 -10070 -9551 59932 -106991 84434 -10263 -39405 50626 -67048 84877 -53653
642e3653L1611R6922j50491J35015j05127N5793L9619j38256J66390j17331M1167
$$ -53653 -22042 74880 -75611 59404 -45723 10070 49689 -88567 77823 -39508 1659
653A659L2606j01846J46879j36149O8407K3693j01638J37955j23854P2541k984
$$ 1659 34265 -67581 79298 -56851 11556 35249 -66389 71566 -52288 20253 17269
664A7269p3579J34900j40859P9725L425o2241J00981j29101J11414k5806p1584
$$ 17269 -56310 78590 -62269 17456 20881 -41360 59621 -69480 41934 16128 -55456
675e5456J11162j02823R0477n8709k5489J15782j32810Q3086l4335l089O6201
$$ -55456 55706 -47117 43360 -15349 -40838 74944 -57866 25220 -9115 -12204 53997
686E3997j30510J23918m6878k5004N9549q9914J15846q7118J527P3200r6160R2461
$$ 53997 -76513 47405 527 -24477 35072 -54842 61004 -26114 -24587 48613 -47547 44914
698D4914p9435L3907M3396j01644J05911p4410L1676K2240p8865J06316q7551
$$ 44914 -34521 -614 42782 -58862 47049 -27361 4315 26555 -52310 54006 -33545
709c3545L9488J5713o6214R6079q8800M9208K177n1922Q9053r3309N6651k532
$$ -33545 5943 21656 -44558 51521 -37279 11929 14106 -37816 51237 -42072 14579 12047
721A2047m1530P2019q8259P1850j7844m0335O9357p3858O7377l8570j8376P0099
$$ 12047 -29483 42536 -45723 26127 8283 -32052 37305 -36553 30824 -7746 -26122 43977
733D3977q1404O1165l4941R88M7384q3624P6529l7189j845L3564o4842P9685n6296
$$ 43977 -37427 23738 -11203 -10215 37169 -46455 30074 -7115 -8960 24604 -40238 39447 -16849
746a6849P252L4557n7807O8998o1974K6304K3590n8644O8274n9465L4008P830
$$ -16849 -9597 24960 -32847 36151 -25823 481 24071 -34573 33701 -25764 8244 16074
758A6074m9761O9538o2310L7613k161l7527O5153o6053M3107r191k7120N7367
$$ 16074 -33687 35851 -26459 11154 8993 -28534 36619 -29434 13673 4482 -22638 34729
770C4729o7380M9840j5159k0349M8344o3069N5392k4534j4130M3290n7201N4984
$$ 34729 -32651 17189 2030 -18319 30025 -33044 22348 -2186 -16316 26974 -30227 24757
782B4757l3507l214L8359n6081N3941l6346O281K8840n3529N6210l9045J1198
$$ 24757 -8750 -11964 26395 -29686 24255 -12091 -5810 23030 -30499 25711 -13334 -2136
794b136K0135m6636N6683m4556J6965J4305m0518N4268m8699K4232Q404l6206
$$ -2136 17999 -28637 28046 -16510 455 14760 -25758 28510 -20189 4043 12447 -23759
806b3759N1342m9825L0462Q97l1287M9001m9749L4412o834k4251M6253n0566L7307
$$ -23759 27583 -22242 8220 9117 -22170 26831 -22918 11494 4660 -19591 26662 -23904 13403
819A3403j2175j7227M1320n0309M0376j6468j1885L5579m7193M2048k1502o221
$$ 13403 1228 -15999 25321 -24988 15388 -1080 -12965 22614 -24579 17469 -4033 -10254
831a0254L0615m3807M1965k5409k66K5470m0817M1359k7583M352K0105l6864M0040
$$ -10254 20361 -23446 18519 -6890 -7156 18314 -22503 18856 -8727 -4375 15730 -21134 18906
844A8906k9088Q372J4871l2502L8256l0348J1979J0145k8381L6291l1071J4836
$$ 18906 -10182 -1810 13061 -19441 18815 -11533 446 10591 -17790 18501 -12570 2266
856B266O209k4424L3603l0738J7022K393k0348L0572k9878J8758j245j6339K7639
$$ 2266 8475 -15949 17654 -13084 3938 6331 -14017 16555 -13323 5435 4190 -12149 15490
869A5490k8748J9679l963j2717K4416k6926J9626n709r430K0544k4131J9127p402
$$ 15490 -13258 6421 2458 -10259 14157 -12769 6857 1148 -8282 12262 -11869 7258 -144
882a44o467J7151k1085J7637q363l661J4050j8589J5719p593k118J0345j4836
$$ -144 -6611 10540 -10545 7092 -1271 -4932 9118 -9471 6248 -1345 -3463 6882 -7954
895g954J3804p316j389Q151j0980J0312o695M16O181r396P824l752j19L441o061
$$ -7954 5850 -1466 -2855 5296 -5684 4628 -2067 -1651 4530 -4866 2958 -794 -913 2528 -3533
910c533O132k556k005L754k644J376p18j017L300k835r46M157l645J394j00j511
$$ -3533 2599 43 -1962 1792 -852 524 -194 -1211 2089 -746 -1692 2465 -1180 214 114 -1397
926a397N154p765M830K114p049P741p108N923p66q234J4159j1775M572J557o901
$$ -1397 3757 -4008 822 2936 -4113 3628 -3480 2443 1677 -6557 7602 -4173 399 1956 -4945
941d945J3574j7285J1295K040j2720J6103j5856J3417m130j1666K3308k2097J2116
$$ -4945 8629 -8656 2639 4679 -8041 8062 -7794 5623 1493 -10173 13135 -8962 3154
954C154j924q017K0108k7904K1495l139j3652K1668k4732K4025j2699r690K8992
$$ 3154 1230 -6787 13321 -14583 6912 3773 -9879 11789 -12943 11082 -1617 -11307 17685
967A7685l2187K2601j0436l628K2635l7738L4458j3397r133K3008l1947L6410
$$ 17685 -14502 8099 -2337 -5965 16670 -21068 13390 -7 -9140 13868 -18079 18331
979A8331k6241j444K9707m0278L4468k3239O857J9288m4334M8015k7575J059J8594
$$ 18331 -7910 -9354 20353 -19925 14543 -8696 -1839 17449 -26885 21130 -6445 -5386 13208
992A3208l4811M7409m2042J2128K3946m3020M3706l6946K1547R609m4476N7400
$$ 13208 -21603 25806 -16236 -4108 19838 -23182 20524 -16422 5125 14734 -29742 27658
1004B7658m1400J4624Q471l1348N3253n5728K7701J2673l8986M7428m7996L7285
$$ 27658 -13742 882 9353 -21995 31258 -24470 3231 15904 -23082 24346 -23650 13635
1016A3635m837l7870O0914n2532K9305n892k1897N3396o6412M4252k857k9269
$$ 13635 8798 -29072 31842 -20690 8615 2723 -19174 34222 -32190 12062 9205 -20064
1028b0064M5811n5842N3513k3589k4959N8918o0807M4527k4062o427M7409p3310
$$ -20064 25747 -30095 23418 -171 -25130 33788 -27019 17508 -6554 -12981 34428 -38882
1040c8882O0808k1977j3753L8002n8835O7749m4215o409M9460o2790N6629m2757
$$ -38882 21926 -51 -13804 24198 -34637 33112 -11103 -17512 31948 -30842 25787 -16970
1052a6970J3048L4404p2110P1563l9987N076K4039n4068P4408o0594J3560L3651
$$ -16970 -3922 30482 -41628 29935 -10052 -4976 19063 -35005 39403 -21191 -7631 26020
1064B6020n6385O0820n6122L1950J6480o2659P4197n2535K2513O765m2193P3251
$$ 26020 -30365 30455 -25667 6283 22763 -39896 34301 -18234 4279 11044 -31149 42102
1076D2102p1646L1959J5569m4261N7890o4331M9738m000m8247P0943o0501L9072
$$ 42102 -29544 2415 17984 -26277 31613 -32718 17020 13020 -35227 35716 -24785 14287
1088A4287j3546k5499O7187p8585M8920n354k6561M9800o8940O5454k5562k8100
$$ 14287 741 -24758 42429 -36156 12764 7410 -19151 30649 -38291 27163 1601 -26499
1100b6499O0041o3571N4360l4493n531N3598p6961O1778k7426n366L6204o4805
$$ -26499 33542 -30029 24331 -10162 -15693 37905 -39056 22722 -4704 -10070 26134 -38671
1112c8671P2627m4614l994M2473n8715O0396m8941J5737L2409o6676O6609m2025
$$ -38671 33956 -10658 -14652 27821 -30894 29502 -19439 -3702 28707 -37969 28640 -13385
1124a3385J2922J7158n0519P1369n7906J5978K4025m5295N5654n7410L5385J1354
$$ -13385 -463 16695 -33824 37545 -20361 -4383 19642 -25653 30001 -27409 7976 19330
1136A9330n2658O2127m8044K9713m578l4082O6011o3176L0591K782k6145M8247
$$ 19330 -33328 28799 -19245 10468 5890 -28192 37819 -25357 5234 8016 -18129 30118
1148C0118o3028M9135p535l2144M9811n2140M6039k3075j7117N1833n9906M4574
$$ 30118 -32910 16225 8690 -23454 26357 -25783 20256 -2819 -19936 31897 -28009 16565
1160A6565k0348p661L7760n8059N4500k7789p027L5299n0558N0975l5205M866
$$ 16565 -3783 -11444 26316 -31743 22757 -5032 -12059 23240 -27318 23657 -11548 -6682
1172f682K9999n2623N1996l2862P710J8085m2877N5538m2579R956J9926l6043
$$ -6682 23317 -29306 22690 -10172 -2462 15623 -27254 28284 -14295 -4339 15587 -20456
1184b0456M4617m5053K4939J2491m1229M5308l6108K4763l356k9567N1308m4186
$$ -20456 24161 -20892 4047 16538 -24691 20617 -15491 9272 5916 -23651 27657 -16529
1196a6529K1075j407j6941L9300n0256L4119l084k0113L2579m1323L9375j6913
$$ -16529 4546 3139 -13802 25498 -24758 9361 6277 -13836 18743 -22580 16795 -118
1208a18j4952L5384l9932L5734k2296l160K9899m2369L8305k4223K846K2403l9934
$$ -118 -15070 20314 -19618 16116 -6180 -9340 20559 -21810 16495 -7728 -4882 17521 -22413
1221b2413M0592k7684Q101J5405l6357M2516l0595J0805Q880k8406M2114l7600
$$ -22413 18179 -9505 -1404 14001 -22356 20160 -10435 370 9250 -19156 22958 -14642
1233a4642J5367Q313k3780L4626l8921K5729K341k5557L3229l2774K7655r683
$$ -14642 725 9038 -14742 19884 -19037 6692 9033 -16524 16705 -16069 11586 1903
1245A903j8415L6889l5424K4386j1931p192L0635m1020L0329j1091n490K2018
$$ 1903 -16512 20377 -15047 9339 -2592 -9784 20851 -20169 10160 -931 -6421 15597
1257A5597l6969L7182j8582m685K0768l1440L6401k6850K969K0108l1620L4215
$$ 15597 -21372 15810 -2772 -7457 13311 -18129 18272 -8578 -5609 14499 -17121 17094
1269A7094k9159J1631J4213l2741L5826k8922J5706N669k8838L9148l2132J6770
$$ 17094 -12065 -434 13779 -18962 16864 -12058 3648 9317 -19521 19627 -12505 4265
1281D265R10k1296L7859l8083K1314r0j7672L2196l8814K8692n089j7205L0009
$$ 4265 5175 -16121 21738 -16345 4969 4879 -12793 19403 -19411 9281 4192 -13013 16996
1294A6996l5115L1179j3395j2261L0712l5217L0014j7158m488K7312l7689L1996
$$ 16996 -18119 13060 -335 -12596 18116 -17101 12913 -4245 -8733 18579 -19110 12886
1306A2886j7607l79K0776l6163L6153k1117J203J6933l1645L7219k7077N389J5776
$$ 12886 -4721 -5100 15676 -20487 15666 -5451 -4248 12685 -18960 18259 -8818 -3429 12347
1319A2347k9523L5216l0117J1941J2139k9569L4829l0062J6215N590k6929L6545
$$ 12347 -17176 18040 -12077 -136 12003 -17566 17263 -12799 3416 9006 -17923 18622
1331A8622l1732J7784J117k1641L5768l5189K0797q97j8056L2210l5912K5130
$$ 18622 -13110 4674 5791 -15850 19918 -15271 5526 4629 -13427 18783 -17129 8001
1343H001m455j6016K9682l4216K7475r474j2573K8492l3422K7728j2835p831K6083
$$ 8001 3546 -12470 17212 -17004 10471 997 -11576 16916 -16506 11222 -1613 -9444 16639
1356A6639l3458K8251j4283m073K1949l2211K9709j6308j642J8397k9502L0310
$$ 16639 -16819 11432 -2851 -6924 15025 -17186 12523 -3785 -5427 12970 -16532 13778
1368A3778j9292J175J6222k7270K9373k1281M846J3347k5751K8572k2025P974
$$ 13778 -5514 -4339 11883 -15387 13986 -7295 -2449 10898 -14853 13719 -8306 -332
1380c32R426k3479K8402k2980J0106O055k0422K7510k4152J2078L579j7520K5435
$$ -332 9094 -14385 14017 -8963 1143 7198 -13224 14286 -9866 2212 5791 -11729 13706
1393A3706k4359J4249Q44j4926K3339k3643J5717k123j2093K1474k2898J6277
$$ 13706 -10653 3596 4440 -10486 12853 -10790 4927 2804 -9289 12185 -10713 5564
1405E564m125r277J9061k1680J6521n702o808J6483j9947J6280p159m266J4004
$$ 5564 1439 -7838 11223 -10457 6064 362 -6446 10037 -9910 6370 -789 -5055 8949
1418H949j8440J5937p841k421J1418j6354J5416q678j044R554j4047J3815r158
$$ 8949 -9491 6446 -1395 -3816 7602 -8752 6664 -2014 -3058 6496 -7551 6264 -2894
1431b894J133P422j2686J2720q512K183M751j0382J2115q771K322L801p841R577
$$ -2894 -1761 5661 -7025 5695 -2817 -634 4117 -6265 5850 -2921 -599 3202 -4639 4938
1445D938q442L907K361o890P907o449L861q5m474P235o261K824K30k165M011n159
$$ 4938 -3504 403 2764 -4126 3781 -2668 1193 1108 -3366 3869 -2392 432 662 -1503 2508 -2651
1461b651L776k86k213K282j899K399k228J07J945j617K31m71J841j559k71R17
$$ -2651 1125 839 -1374 908 -991 1408 -820 -713 1232 -385 -154 -625 1216 -343 -614 303
1477C03k4L25k635L746j590j375K261k234L580m487J828L074n663M806l561K899
$$ 303 279 604 -2031 1715 125 -1250 1011 -1223 2357 -2130 -302 2772 -2891 1915 -1646 1253
1493A253o7n455Q942o939K154J342l989P798j0141O646J229p236Q698q546P846
$$ 1253 1186 -4269 4673 -2266 -112 1230 -2759 5039 -5102 1544 2773 -4463 4235 -4311 3535
1508C535l312n536J2524j2293P205k118k989R989j5225J2547k953o050J0446j2608
$$ 3535 223 -5313 7211 -5082 2123 5 -2984 7005 -8220 4327 1374 -4676 5770 -6838
1522f838J3270q249l174J3659j6133J2216o961K71R733j8448J7960q286k593R705
$$ -6838 6432 -1817 -4991 8668 -7465 4751 -2210 -1939 7794 -10654 7306 -980 -3573 6132
1536F132j4791J8022j4086J331J2308j8129J6528j2442N494O745j9283K2459j4448
$$ 6132 -8659 9363 -4723 -3392 8916 -9213 7315 -5127 367 7112 -12171 10288 -4160
1549d160L008O203j4537K1604k0586Q166P883j7459J9483j8185J2526R33j7134
$$ -4160 -1152 5051 -9486 12118 -8468 -302 7581 -9878 9605 -8580 3946 4879 -12255
1562a2255K4873k0280J0140l3j1208K2589k5843J5634J104j3616J9633k2180J9248
$$ -12255 12618 -7662 2478 2445 -8763 13826 -12017 3617 4721 -8895 10738 -11442 7806
1575G806o293j2128K3918k3492J6170o987n514K0224k7898K1360n944p787J6748
$$ 7806 1513 -10615 13303 -10189 5981 -1006 -6520 13704 -14194 7166 1222 -6565 10183
1588A0183k3094K3832j3160n574K0225k3819K0084j3239J265J5359k7101K5088
$$ 10183 -12911 10921 -2239 -7813 12412 -11407 8677 -4562 -3297 12062 -15039 10049
1600A0049j2544p90J1612k1429K6545j9615K157J4291k1802K2380j9054Q981Q341
$$ 10049 -2495 -3285 8327 -13102 13443 -6172 -4015 10276 -11526 10854 -8200 781 9122
1613I122k3582K6644j8498P189M314j7160K6805k4702J0324O248j6787K1911k3011
$$ 9122 -14460 12184 -6314 875 5189 -11971 14834 -9868 456 6704 -10083 11828 -11183
1626a1183J6150J22j7263K4739k1600J3806l553j0411K3461k6212J6279j674r899
$$ -11183 4967 5089 -12174 12565 -9035 4771 1218 -9193 14268 -11944 4335 2661 -7238
1639g238J8066k3180K0511p192r755J9975k1088J7299r887k996J7613k4424J9300
$$ -7238 10828 -12352 8159 967 -8788 11187 -9901 7398 -2489 -5485 12128 -12296 7004
1652G004q080k594J2236k0633K2324j3080j951J3382j8156J8784j5089M421J0247
$$ 7004 -1076 -3670 8566 -12067 10257 -2823 -4774 8608 -9548 9236 -5853 -1432 8815
1665H815k0055K0070j3617N144M971j5838K1667j7509O181N110j2960J7807j8261
$$ 8815 -11240 8830 -4787 357 5328 -10510 11157 -6352 -171 4939 -8021 9786 -8475
1678h475J1328J476j3088J7925j6487J1417k961q364J7627j8937J2215k696n796
$$ -8475 2853 4329 -8759 9166 -7321 4096 1135 -7229 10398 -8539 3676 980 -4816
1691d816J3075j7718J5677o061n446J2634j4968J4299r506o05J1568j6498J4094
$$ -4816 8259 -9459 6218 157 -5289 7345 -7623 6676 -2830 -3435 8133 -8365 5729
1704E729q382J680O745j4677J6484j0581J704N597j1191J4857j3402N529M429
$$ 5729 -2653 -973 5772 -8905 7579 -3002 -1298 4299 -6892 7965 -5437 92 4521
1717D521j1179J3679j2840Q095N11r454J4265j3631Q949j739o398J2750j4652
$$ 4521 -6658 7021 -5819 2276 2787 -6667 7598 -6033 2916 1177 -5221 7529 -7123
1730g123J1384m157m540J1573j4443J2599o933j427J0083j4980J3796q119Q37
$$ -7123 4261 104 -4436 7137 -7306 5293 -1640 -3067 7016 -7964 5832 -2287 -1450
1743a450O908j3689J5811j0996K240N712j1526J5089j3834N973M542j1714J4181
$$ -1450 5458 -8231 7580 -3416 -1176 4536 -6990 8099 -5735 238 4780 -6934 7247
1756G247j3497Q865N69j0705J5484j3997R268k191p318J5258j6407J0928k960
$$ 7247 -6250 2615 3184 -7521 7963 -6034 3234 1043 -6275 8983 -7424 3504 544
1769E44n280J3112j7162J3841m934m413J1681j6306J5790q339k578J1353j5866
$$ 544 -4736 8376 -8786 5055 121 -4292 7389 -8917 6873 -1466 -4044 7309 -8557
1782h557J6309j1310P17J0553j6646J6667j2467M000P701j6938J8535j3486N418
$$ -8557 7752 -3558 -2841 7712 -8934 7733 -4734 -734 6967 -9971 8564 -4922 496
1795D96M553j4884K0191j6541O817L571j2663J9214j9084J0216K467j2401J7868
$$ 496 5049 -9835 10356 -6185 632 4203 -8460 10754 -8330 1886 4353 -8048 9820
1808I820j8925J3322j038j1728J8478j8660J4071m384q816J8838k0252J4500n385
$$ 9820 -9105 4217 3179 -8549 9929 -8731 5340 956 -7860 10978 -9274 5226 -159
1821a59n802J6795k1599J6813o251m696J4260k0587J9316r294l805J3723j9087
$$ -159 -5961 10834 -10765 6048 -203 -4899 9361 -11226 8090 -1204 -5009 8714 -10373
1834a0373J9496j2558p61J3433j9522J9052j3581K858J0694k0028K0498j4140
$$ -10373 9123 -3435 -4196 9237 -10285 8767 -4814 -1956 8738 -11290 9208 -4932
1846d932M466P284j8197K2203j6610N517N897j5709K1511j9093Q317M896j4790
$$ -4932 -466 6818 -11379 10824 -5786 -269 5628 -10081 11430 -7663 654 5550 -9240
1859i240J9923j9452J1501J996j4177J9805j8947J2748j357j1848K0111j9749
$$ -9240 10683 -8769 2732 4728 -9449 10356 -8591 4157 2800 -9048 11063 -8686
1871h686J2927k850q778J8468k0833J4434l615p167J5961k0197J6509n776o293
$$ -8686 4241 1391 -7387 11081 -9752 4682 1067 -6100 9861 -10336 6173 397 -5896
1884e896J4905j8745J6921q417m073J4341j8381J6447r647j141J2349j8455J7049
$$ -5896 9009 -9736 7185 -1232 -5305 9036 -9345 7102 -2545 -3686 8663 -9792 7257
1897G257j0193O59R640j7256J8085j1634J674P989j5283J7802j3389L622O759
$$ 7257 -2936 -2277 7363 -9893 8192 -3442 -1768 6221 -9062 8740 -4649 -1027 5732
1910E732j3946J6635j4035N987M656j3026J6117j3957P378K248j1403J5838j4127
$$ 5732 -8214 8421 -5614 373 5029 -7997 8120 -5837 1541 3789 -7614 8224 -5903
1923e903P908N80r181J4719j4460Q754n81p297J2969j4270R943j902o128J1551
$$ -5903 2005 2585 -6596 8123 -6337 2417 1836 -5461 7508 -6762 3181 1279 -4849 6702
1937F702j3271J0542l612m705J0624j2356J0203m854k513R175j2001J0210n295
$$ 6702 -6569 3973 361 -4344 6280 -6076 4127 -727 -3240 5935 -6066 4144 -1151
1950a151r46P077j1036J0720o246n9N737r420J0128p208J526M461q410R343p318
$$ -1151 -2097 4980 -6056 4664 -1582 -1641 4096 -5324 4804 -2404 -878 3583 -4827 4516 -2802
1965b802K946K525p142R045p602L614J263n508P949p715M684M5m455O922p056
$$ -2802 144 2669 -4473 4572 -3030 584 1847 -3661 4288 -3427 1257 1302 -3153 3769 -3287
1980c287N178j642k767O226p032N254k224j162M525o626O053k985o46L313n044
$$ -3287 1891 249 -2518 3708 -3324 1930 -294 -1456 3069 -3557 2496 -489 -1135 2178 -2866
1995b866N724m428J026K686m684M958m328K598O33m067N494m512K545n31j948
$$ -2866 2858 -1570 -544 2142 -2542 2416 -1912 686 1319 -2748 2746 -1766 779 248 -1700
2010a700M572n535L896j013j384L176m760N171l137n14L407m515M596l996J774
$$ -1700 2872 -2663 1233 220 -1164 2012 -2748 2423 -714 -1228 2179 -2336 2260 -1736 38
2025C8K023n105N573m069K134K61l581O297o092L066M41l003N081o429N281j174
$$ 38 2061 -3044 2529 -1540 594 855 -2726 3571 -2521 545 986 -2017 3064 -3365 1916 742
2041G42l356N705n922N170l023j254N849p664N947k734n13M083p398P932m470
$$ 742 -2614 3091 -2831 2339 -684 -1938 3911 -3753 2194 -540 -1053 3030 -4368 3564 -906
2056i06o85M464o427P276o160J835M041p721P743n677K673J733o803R415p451
$$ -906 -1591 2873 -3554 3722 -2438 -603 3438 -4283 3460 -2217 456 2189 -4614 4801 -2650
2071b650K643J919n397Q167q773N267J069o279Q224p863N952j534m827R470r414
$$ -2650 -7 1912 -3485 4682 -4091 1176 2245 -4034 4190 -3673 2279 745 -4082 5388 -4026
2086d026N755j272l202P697j0226Q109k089l933P416q817Q323m583k176Q267j0073
$$ -4026 1729 457 -2745 4952 -5274 2835 746 -3187 4229 -4588 3735 -848 -3024 5243 -4830
2101d830P879m073n88O183j0389R897m788j351N787q562R550o991O19O177r491
$$ -4830 3049 -1024 -1612 4571 -5818 4079 -709 -2060 3727 -4835 4715 -2276 -1657 4520 -4971
2116d971Q954o373K173L799r308J0684p101J569L262p189R813q922L628L182p644
$$ -4971 3983 -2390 -217 3582 -5726 4958 -2143 -574 2688 -4501 5312 -3610 18 3200 -4444
2131d444Q869q024N046O27o974J0075q489M368J26m742Q805r755O043M0m952P508
$$ -4444 4425 -3599 1447 2074 -4900 5175 -3314 1054 1180 -3562 5243 -4512 1531 1571 -3381 4127
2147D127q354O950k269m067Q323q507N975k408k089O827r166P147k248k417N592
$$ 4127 -4227 2723 454 -3613 4710 -3797 2178 -230 -2319 4508 -4658 2489 241 -2176 3416
2162C416p518P453m102j509O071p451O356l965J95M524p727P226l772j46L352
$$ 3416 -4102 3351 -751 -2260 3811 -3640 2716 -1249 -1054 3470 -4257 2969 -803 -949 2403
2177B403n943P058n192P99L474n623N829m851K263J861n470O310m507J843Q31
$$ 2403 -3540 3518 -1674 -875 2599 -3024 2805 -2046 217 2078 -3392 2918 -1589 254 1085
2192A085l626N696n353K501Q66l102M251m595L459n16k748M341l959K733j096
$$ 1085 -2541 3155 -2198 303 1169 -1933 2318 -2277 1182 666 -2082 2259 -1700 1033 -63
2207f3j188L484m212K905q04q56K095l135L214j716n47K031k404K315j861N75
$$ -63 -1251 2233 -1979 926 122 -734 1361 -1774 1440 -276 -823 1208 -1196 1119 -742 -167
2223a67J248k378K192j387O89J03j231K081j898R34p8m85J145j767J679q11j59
$$ -167 1081 -1297 895 -492 197 300 -931 1150 -748 186 108 -377 768 -999 680 -131 -290
2240b90P54j168J615j668R51K20j189J680j875J728q53o42J996k491K173j386
$$ -290 464 -704 911 -757 194 414 -775 905 -970 758 -95 -737 1259 -1232 941 -445
2256d45J43J503k892L158k177N72J127k712L689l283J385J016k884L857l775K328
$$ -445 -302 1201 -1691 1467 -710 -138 989 -1723 1966 -1317 68 1084 -1800 2057 -1718 610
2272F10K55k889M361m315K943m81k436M643n087L652r79k115M673n628M452j620
$$ 610 865 -2024 2337 -1978 965 484 -1952 2691 -2396 1256 277 -1838 2835 -2793 1659 39
2288C9j769M625n996N202k415j254M499o294N977l352p02M471o570O479m192J75
$$ 39 -1730 2895 -3101 2101 -314 -1568 2931 -3363 2614 -738 -1440 3031 -3539 2940 -1252 -1077
2304a077M170o936P072m835J033L412o967P883n751J703K805o621Q345o856K614
$$ -1077 3093 -3843 3229 -1606 -573 2839 -4128 3755 -1996 -293 2512 -4109 4236 -2620 -6
2319fK437o434Q368p569L800J616o284Q538p973M764M83n861Q905q525N326l92
$$ -6 2431 -4003 4365 -3204 596 2212 -4072 4466 -3507 1257 1740 -4121 4784 -3741 1585 1193
2335A193n023Q886r241O013r13m288Q350r673P145j772l910P974r589P981l074
$$ 1193 -3830 5056 -4185 1828 915 -3373 4977 -4696 2449 677 -3233 4741 -4848 3133 59
2350E9l203P970r623Q185m049j969P541j0019Q672m659q10O466j0069R641n515
$$ 59 -3144 4826 -4797 3388 -661 -2630 4911 -5108 3564 -1095 -1905 4561 -5508 4133 -1382
2365a382j88N603r483J0204o792O93N178q966J0050p745K160M410q849R968q045
$$ -1382 -1570 4033 -5450 4754 -2038 -1345 3833 -5133 4917 -2828 -668 3742 -5107 4861 -3184
2380c184L412K996q517J0421q412L933J797p431J0514r234M488J263o360R746
$$ -3184 228 3224 -5293 5128 -3284 649 2446 -4985 5529 -3705 783 2046 -4314 5432
2394E432r804N736N29o003R175r608O687q38n394R100r400O884k017m087Q768
$$ 5432 -4372 1364 1893 -4110 5065 -4543 2144 1306 -4088 5012 -4388 2496 479 -3608 5160
2409E160r730P146k601k758P687r921Q025l227k101O628r327Q701m423j379O084
$$ 5160 -4570 2576 -25 -2783 4904 -5017 3008 -219 -2320 4308 -5019 3682 -741 -2120 3964
2424C964q577Q556n518J2N437q370Q345n927J406M110q096Q643o154K032K780
$$ 3964 -4613 3943 -1575 -1563 3874 -4496 3849 -2078 -672 3438 -4658 3985 -2169 -137 2643
2439B643p098Q792o825K580K003n919Q197p469L594J405n337P459p423M651K36
$$ 2643 -4455 4337 -2488 92 2095 -3824 4373 -3096 498 1903 -3434 4025 -3398 1253 1489
2454A489m868P217p079M931j026l668O944p252N084j631k391N992p374N734k154
$$ 1489 -3379 3838 -3241 1690 664 -3004 3940 -3312 1772 141 -2250 3742 -3632 2102 -52
2469e2j740N038o865O208l082r94M360o244O177l929J25L607n837O098m451J164
$$ -52 -1792 3246 -3619 2589 -493 -1487 2873 -3371 2806 -1123 -998 2609 -3228 2870 -1581 -417
2485d17K670n383O030m765K043J543m711N991n036K642M52l645N769n591L262
$$ -417 2253 -3130 2900 -1865 178 1721 -2990 3001 -2035 607 1059 -2586 3183 -2408 854
2500H54j47k760N008n780M244r39k406M530n290M637k218j358M318n343M661k786
$$ 854 707 -2053 2955 -2825 1419 480 -1926 2604 -2686 1951 -267 -1625 2693 -2650 2011 -775
2516g75j53L410n466N281l199L33K521m786N529m152J201J992m312N256m600K305
$$ -775 -928 2482 -2984 2297 -902 -569 1952 -2834 2695 -1457 -256 1736 -2576 2680 -1920 385
2532C85R70l955N436m920K809Q6l056N212n522L688n37k560M664n439M537j771
$$ 385 1355 -2600 2836 -2084 725 811 -2245 2967 -2555 1133 596 -1964 2700 -2739 1798 27
2548B7j880M701n625M743k539o81M094o033N419k884k54L264n564O091m103L92
$$ 27 -1853 2848 -2777 1966 -573 -1254 2840 -3193 2226 -658 -912 2352 -3212 2879 -1224 -832
2564h32L185n363N916m746J687K419n592O362m882K050J450m845O704n864K692
$$ -832 2353 -3010 2906 -1840 -153 2266 -3326 3036 -1846 204 1654 -3191 3513 -2351 341
2579C41J169m331O185o211L896K34m240O363o176M178q37l163O280o850M699j143
$$ 341 1510 -2821 3364 -2847 1049 1283 -2957 3406 -2770 1408 571 -2592 3688 -3162 1537 394
2595C94k487N457o891N767k161k217N405o598N838l163j013N104p075O169l308
$$ 394 -2093 3364 -3527 2240 79 -2138 3267 -3331 2507 -656 -1669 3435 -3640 2529 -779
2610g79l57M056o732O947m230o3L911o256O739n002J092L516o550O892m951J589
$$ -779 -1136 2920 -3812 3135 -1095 -1158 2753 -3503 3236 -1766 -674 2842 -3708 3184 -1767 -178
2626a78K440o001P361n667J898K197n353O922o218K978J620n363O837o005L370
$$ -178 2262 -3739 3622 -2045 -147 2050 -3303 3619 -2599 379 1999 -3364 3473 -2532 838
2641H38N42m621P006o473L569K13l760O282o738M501m05l611N977o315M738j413
$$ 838 1380 -3241 3765 -2708 861 1074 -2686 3596 -3142 1359 954 -2657 3320 -2995 1743 330
2657C30k769N911o548M717j570j921N017o519N411k063j825M694n951N373k821
$$ 330 -2439 3472 -3076 1641 71 -1850 3167 -3352 2059 -4 -1829 2865 -3086 2287 -534
2672e34j057M583o083N222k760m58L718n848N646l119l78L412n234N449l677K68
$$ -534 -1591 2992 -3091 2131 -629 -1087 2631 -3217 2429 -690 -1068 2344 -2890 2559 -1118 -850
2688h50L245n250N190l474P13K444m872N339l652P58K081m152M959l974J330J817
$$ -850 2395 -2855 2335 -1139 -426 2018 -2854 2485 -1167 -409 1672 -2480 2479 -1495 -165 1652
2704A652m025M600l678J607J120l556M560l693J559Q59k882M025l729J907O54
$$ 1652 -2373 2227 -1451 156 1276 -2280 2280 -1413 146 1005 -1877 2148 -1581 326 980
2719I80k732L631l340J962K02k395L605l243J731J62j936L114l140J877J24j898
$$ 980 -1752 1879 -1461 501 703 -1692 1913 -1330 401 563 -1373 1741 -1399 478 602 -1296
2735a296K809k765J810j51j680K800k673J543j6j439K412k490J525K4j441K191
$$ -1296 1513 -1252 558 407 -1273 1527 -1146 397 381 -1058 1354 -1136 389 413 -1028 1163
2751A163k130J372q4j287K117k021J125Q9j188J885j862J022K39j291J736j511
$$ 1163 -967 405 321 -966 1151 -870 255 344 -844 1041 -821 201 440 -851 885 -626
2767f26P85K74j282J756j444N44N13j350J698j389M48P29j573J763j277K88Q49
$$ -626 159 433 -849 907 -537 7 520 -830 868 -521 -73 656 -917 846 -431 -143 706
2784G06j692J867j275J46R99j793J985j393J96J127k055K145j404J19J272k221
$$ 706 -986 881 -394 -248 751 -1042 943 -450 -254 873 -1182 963 -441 -322 950 -1271
2800a271K342j549J28J382k363K491j676K02J405k535K717j855K74J441k674K964
$$ -1271 1071 -478 -350 1032 -1331 1160 -516 -314 1091 -1444 1273 -582 -308 1133 -1541 1423
2816A423k113M01J480k808L116k281N55J413k924L391k596Q18J280k987L628k892
$$ 1423 -690 -289 1191 -1617 1499 -782 -227 1186 -1738 1653 -943 -125 1155 -1832 1796 -1096
2832a096J065J166l004L788l188J365R80k971L914l458J737O77k892M050l745
$$ -1096 -31 1135 -1869 1919 -1269 96 1076 -1895 2019 -1439 298 975 -1917 2133 -1612
2847a612K069M04k779M177m023K380J16k578M190m255K723k12k383M139m437L124
$$ -1612 457 861 -1918 2259 -1764 616 732 -1846 2344 -1911 812 600 -1783 2356 -2081 1043
2863A043n90k191M141m600L432r93j861M036m737L715j381j459L847m864M051
$$ 1043 453 -1738 2403 -2197 1235 242 -1619 2417 -2320 1395 14 -1445 2402 -2462 1589
2878A589j793j074L605m899M380k235p11L373m812M593k692k44L061m723M732
$$ 1589 -204 -1278 2327 -2572 1808 -427 -1138 2235 -2577 2016 -676 -920 2141 -2582 2150
2893B150l125L58K650m653M912l447Q19K165m437N066l796J200J730m086N058
$$ 2150 -975 -617 2033 -2620 2292 -1155 -336 1829 -2608 2458 -1338 -138 1592 -2494 2564
2908B564m166J680J334l757M910m428K260Q11l526M860m504K650K31l139M820
$$ 2564 -1602 78 1412 -2345 2565 -1863 397 1208 -2318 2542 -1962 688 919 -2220 2600
2923B600m662K925k79k543M584m881L324o92k059M185m910L758j171j695L844
$$ 2600 -2062 863 584 -1959 2625 -2256 1068 376 -1683 2502 -2408 1350 179 -1516 2328
2938B328m739M060j831j139L570m598M116k310m17L087m538M289k630J60K481
$$ 2328 -2411 1649 -182 -1321 2249 -2349 1767 -543 -960 2127 -2411 1878 -752 -592 1889
2953A889m355M519k987N47J933l861M543l484J087J520l476M351l814J780J007
$$ 1889 -2466 2053 -934 -387 1546 -2315 2228 -1256 -169 1351 -2125 2226 -1588 192 1199
2968A199l270M241l847K227L14k848M204l981K501k54k172L951m197K905p13j643
$$ 1199 -2071 2170 -1677 550 864 -1984 2220 -1761 740 486 -1686 2265 -1932 973 260 -1383
2984a383L555m275L344j190j242L141m061L645j817o93K785l876L776k398RK422
$$ -1383 2172 -2103 1241 51 -1191 1950 -2111 1534 -283 -976 1809 -2067 1709 -689 -680 1742
3000A742l816L839k720O76J798l660M031k996J154J060l137M148l505J611O36
$$ 1742 -2074 1765 -955 -279 1519 -2141 1890 -1106 48 1108 -2029 2119 -1386 225 861
3015H61k643L952l925K316J97k412L698l945K898o02j977L705m060L165j251j284
$$ 861 -1782 2170 -1755 561 758 -1654 2044 -1901 997 395 -1582 2123 -1937 1228 -23 -1307
3031a307L484m329L573j658p81L057m319L960k187l20K689m172M243k749K78K234
$$ -1307 2177 -2152 1421 -237 -1018 2039 -2280 1680 -507 -827 1862 -2310 1933 -816 -538 1696
3047A696m011M453l269Q39J815l759M475l712J529J318l601M494l914K117N59
$$ 1696 -2315 2138 -1131 -292 1523 -2236 2239 -1473 56 1374 -2227 2267 -1647 470 1029
3062A029l228M669m278K468L6k625M517m763L094l27k340M199m810L728j081k006
$$ 1029 -2199 2470 -1808 660 696 -1929 2588 -2175 919 592 -1748 2451 -2359 1369 288 -1718
3078a718M204m865L966j726j336M036n184M371k074q70L566n127M821k678m41
$$ -1718 2486 -2379 1587 -139 -1475 2561 -2623 1748 -326 -1196 2370 -2757 2064 -614 -1055
3093a055L322n006M971l199K33K914n005N256l604O99K397m711N435m122J240
$$ -1055 2267 -2739 2232 -967 -734 2180 -2825 2431 -1173 -474 1923 -2788 2647 -1475 -235
3108b35K030m442N291m411J958J358m211N418m632K337P38l676N412n092K791
$$ -235 1795 -2647 2644 -1767 191 1549 -2662 2756 -1876 461 1199 -2477 2935 -2157 634
3123F34L78l263N050n202L424k39l013N011n216L726r14k414M940n552M037j177
$$ 634 1012 -2251 2799 -2403 1021 782 -2231 2780 -2436 1290 376 -2038 2902 -2650 1387 210
3139B10j984M539n555M507j723j672M356n428M677k265j056M068n539M886k521
$$ 210 -1774 2765 -2790 1717 -6 -1678 2678 -2750 1927 -338 -1394 2674 -2865 2021 -500
3154e00o37L586n335N144k976k75L281n044N093l383L66K850m948N153l556Q04
$$ -500 -1137 2449 -2886 2258 -718 -993 2288 -2756 2337 -1046 -680 2170 -2778 2375 -1181 -377
3170c77K254m618N277l898J107J923m178N030m129J646J458l962M937m153J993
$$ -377 1877 -2741 2536 -1362 -255 1668 -2510 2520 -1609 37 1495 -2467 2470 -1683 310
3185C10R09l585M943m377K232O11l168M642m477K599K83k975M478m394K818k05
$$ 310 1219 -2366 2577 -1800 432 1043 -2125 2517 -1960 639 922 -2053 2425 -1969 849 644
3201F44k540M362m501K938m20k165M038m486L226p37j940L796m296L314j142j488
$$ 644 -1896 2466 -2035 903 483 -1682 2356 -2130 1096 359 -1581 2215 -2081 1233 91 -1397
3217a397L539m225L342j325j104L161m079L457j542q71K862l784L387j792m81
$$ -1397 2142 -2083 1259 -66 -1170 1991 -2088 1369 -173 -1044 1818 -1966 1421 -371 -852
3232h52K573l627L328j891j78K197l422L358k015k4J979l158L200k101K01J752
$$ -852 1721 -1906 1422 -469 -647 1550 -1872 1486 -529 -553 1426 -1732 1468 -633 -432 1320
3248A320k995L112k102L88J460k805L068k160M91J292k580K917k201O41J142k448
$$ 1320 -1675 1437 -665 -277 1183 -1622 1446 -714 -223 1069 -1511 1406 -795 -154 988 -1460
3264a460K778k105P11R44k239K696k118P69Q25k054K537k069Q00P13j901K345
$$ -1460 1318 -787 -76 868 -1371 1325 -793 -24 801 -1253 1284 -785 15 728 -1173 1172
3280A172j925Q49N43j723K223j879Q45M82j581K099j842Q56M31j513J977j695
$$ 1172 -753 96 639 -1084 1139 -740 105 587 -994 1105 -737 119 550 -963 1014 -681
3296f81Q24L48j405J880j655Q00L39j306J790j624Q32K81j276J770j556P62K91
$$ -681 143 491 -914 966 -689 111 450 -856 934 -690 142 423 -853 917 -639 123 414
3313D14j226J704j505P15L00j198J666j483P44K95j225J674j487P37L03j198J658
$$ 414 -812 892 -613 102 402 -796 870 -613 131 426 -799 875 -612 125 428 -770 888
3330H88j486P08L11j188J614j453P53K77j202J645j479P52K36j168J689j541P90
$$ 888 -598 110 421 -767 847 -606 147 424 -778 867 -612 140 376 -792 897 -644 146
3347A46K30j175J676j551Q35J93j160J713j623R23J27j141J742j666J004N9j132
$$ 146 376 -799 877 -674 161 354 -806 907 -716 207 334 -807 935 -731 273 332 -800
3364h00J767j755J099rj096J782j808J204j39r80J735j868J306k55r16J761j963
$$ -800 967 -788 311 302 -794 988 -820 384 245 -735 1000 -868 438 183 -733 1028 -935
3381i35J443l78q30J744k008J530m92p44J672k008J641o56n72J597k067J762q05
$$ -935 508 130 -700 1044 -964 566 74 -670 1002 -1006 635 -21 -593 1004 -1063 699 -106
3398a06m48J538k068J850r61k83J433k040J939j139r2J285k002K011j321J50J109
$$ -106 -554 984 -1084 766 -195 -478 955 -1085 854 -285 -377 908 -1094 917 -404 -254 855
3415H55j961K088j463L08R53j869K117j612N14P45j732K135j769P44N35j629K150
$$ 855 -1106 982 -481 -173 780 -1089 1028 -584 -70 675 -1057 1078 -691 53 588 -1041 1109
3432A109j884R34L27j480K109j970J135J05j294K001k044J347j33j109J967k120
$$ 1109 -775 159 486 -994 1115 -855 280 385 -909 1092 -952 395 262 -847 1120 -1000
3448a000J495l24r17J839k128J659n82o93J705k102J791q52m31J549k090J905
$$ -1000 495 171 -746 1093 -1035 624 42 -651 1054 -1048 743 -109 -540 1009 -1081 824
3464H24j082j33J312k034K003j256R5J076j919K093j479L56Q64j789K121j718
$$ 824 -258 -391 921 -1113 890 -366 -271 805 -1114 979 -500 -144 720 -1069 1052 -666
3480f66O72O00j632K101j857R38L30j467K093j994J190L6j255K064k119J422k54
$$ -666 6 606 -1026 1075 -782 156 486 -981 1112 -882 308 344 -911 1153 -966 456 202
3497B02r99J957k224J664n23p67J811k250J868q23m99J650k234K060j156k12J492
$$ 202 -797 1160 -1064 600 77 -690 1121 -1129 739 -84 -583 1067 -1167 893 -263 -475 1017
3514A017k209K175j414J09J277k204K303j617M43R23k062K436j883O98P08j885
$$ 1017 -1192 983 -431 -322 955 -1249 1054 -563 -120 803 -1259 1177 -706 -8 700 -1185
3530a185K466k171J028M85j767K463k359J390J42j604K463k472J648k30j329K444
$$ -1185 1281 -890 138 623 -1144 1319 -1040 350 492 -1112 1351 -1121 527 297 -1032 1412
3546A412k680J949n28j109K398k820K216q31q42K244k877K461j145n80K064k885
$$ 1412 -1268 681 153 -956 1442 -1378 838 7 -835 1409 -1468 993 -152 -732 1332 -1553
3562a553K727j520k77J911k843K835j838R9J739k882K945k050M63J362k777L149
$$ -1553 1174 -346 -623 1288 -1555 1280 -558 -459 1280 -1602 1343 -707 -244 1118 -1659 1490
3578A490k311P36J059k553L209k654J082Q51k413L176k883J509M84k295L220l015
$$ 1490 -821 -85 974 -1579 1630 -1024 58 909 -1504 1672 -1211 298 782 -1513 1707 -1308
3594a308J799R7k037L240l233K058j86j803L168l407K394m96j556L080l523K679
$$ -1308 491 588 -1449 1791 -1442 616 430 -1373 1795 -1612 782 286 -1270 1810 -1713 966
3610I66q50j255K924l611K963j206r69K758l585L184j597o42K661l619L285j850
$$ 966 116 -1139 1785 -1826 1137 -69 -1038 1720 -1865 1319 -278 -920 1741 -1878 1407 -443
3626d43k40K337l607L474k092M4K011l438L652k451L29J819l261L596k691P51
$$ -443 -683 1654 -1953 1521 -571 -527 1484 -1954 1698 -753 -424 1395 -1866 1730 -961 -210
3642b10J506l181L650k844J069J132k983L727l082J333Q68k766L679l279J659
$$ -210 1296 -1885 1765 -1079 -10 1122 -1861 1866 -1216 117 985 -1781 1898 -1381 278
3657B78N86k582L660l424J956K06k307L597l579K230n2k093L469l626K493l87
$$ 278 864 -1718 1942 -1482 474 680 -1627 1970 -1609 621 569 -1524 1945 -1681 812 425
3673D25j842L359l659K652p43j451L189l726K859j016j160K916l665L071j311
$$ 425 -1417 1942 -1717 935 192 -1259 1930 -1796 1063 47 -1113 1803 -1862 1209 -102
3688a02q97K703l524L104j606n14K454l451L183j794k09K143l324L298k029M4
$$ -102 -999 1704 -1820 1284 -322 -836 1618 -1833 1350 -444 -653 1490 -1834 1464 -565 -521
3704e21J878l118L261k208L49J665l032L277k364O07J365k856L293k502Q18J136
$$ -521 1357 -1761 1500 -708 -359 1306 -1726 1551 -813 -206 1159 -1697 1596 -906 -88 1048
3720A048k666L252k660J093Q72k469L127k694J290N70k238L097k769J415L97k030
$$ 1048 -1618 1634 -1026 67 939 -1530 1597 -1097 193 763 -1475 1622 -1147 268 665 -1365
3736a365K899k755J635J30j811K759k707J711j12j544K619k709J828l27j250K402
$$ -1365 1534 -1221 414 544 -1267 1492 -1215 496 384 -1160 1459 -1250 578 251 -999 1403
3752A403k663J957n30j094K246k572K014p02q55K058k500K015q34o19J837k386
$$ 1403 -1260 697 167 -927 1319 -1253 761 59 -796 1262 -1238 777 -57 -676 1161 -1225
3768a225K063r76m50J668k275K048j078k80J502k180K046j153r0J289k044K014
$$ -1225 838 -138 -588 1080 -1195 853 -225 -505 997 -1183 863 -290 -380 909 -1135 879
3784H79j244M1J161j887J947j315J80J002j780J894j316K84Q41j634J836j351
$$ 879 -365 -324 837 -1050 897 -418 -238 764 -1016 878 -438 -154 687 -947 889 -462
3800d62M10O57j482J740j363M92N36j347J612j292N35M33j213J521j285N70L21
$$ -462 -52 605 -877 863 -500 -8 528 -819 793 -499 36 469 -744 777 -508 62 383
3817C83j089J438j254O03K31r60J323j187O35J61q77J240j136O36R1p87J172j110
$$ 383 -706 732 -522 81 312 -648 675 -512 123 284 -593 647 -489 147 238 -549 623 -487
3835d87O69J8o95J103j092O85j9o32J041j045O66n9n53R42r93O34n9m98Q72r29
$$ -487 182 200 -495 608 -484 201 182 -450 591 -454 212 153 -400 542 -451 183 124 -374 498 -431
3855d31O46j08m70Q45r13O34j32m14P83q41N93j35l44P11q04N64j30l48O94p82
$$ -431 215 107 -363 482 -431 203 71 -343 440 -401 192 57 -287 424 -380 184 54 -294 400 -382
3875c82N84j76k98O68p57N78j78k97O26p16N57j77k62O01p21N78k21k31O04p48
$$ -382 202 26 -272 396 -361 217 39 -258 368 -348 209 32 -230 371 -350 228 7 -224 380 -368
3895c68N91k17k11N79p37O00k53j86N41o90N88k79j44N01o86O09l15r5M73o73
$$ -368 223 6 -205 374 -363 237 -16 -202 339 -351 237 -42 -186 315 -371 238 -77 -172 301 -372
3915c72O36l47n1M54o90O40l71k3M28o72O69m27L6L80o55O79m61P3L58o50O94
$$ -372 264 -83 -134 320 -370 270 -101 -124 304 -368 301 -126 -90 290 -365 314 -147 -74 284 -366 328
3936C28m80J10K96o17P23n72K20K21n98P41o14K71J67n50P34o53L46Q6m98P08
$$ 328 -152 -42 254 -363 360 -212 8 229 -369 372 -242 29 196 -354 380 -273 73 159 -339 369
3956C69o77M07J5m49P28p38M91p3l67O87p65N75j63k87O52p86O29k58k04O06q00
$$ 369 -308 99 114 -335 393 -345 146 73 -294 393 -372 203 40 -247 405 -381 248 -10 -214 392 -408
3977d08P02l69j12N68q10P77m39l8M95q02Q10n40O2M22p53Q36o34J85L25p40R09
$$ -408 294 -75 -187 381 -429 348 -91 -129 366 -436 374 -166 -104 318 -435 401 -233 -48 277 -463 446
3998D46p31K97K54p14R24q28M28J46o57R38r08N63L4o17R66r79O76j14n03R59
$$ 446 -285 12 266 -448 476 -352 76 222 -435 503 -405 158 192 -425 541 -438 238 124 -379 580
4018E80j103Q18k40l99R08j130R40l89k99Q81j169J037n44j69Q32j203J121o34
$$ 580 -523 295 55 -344 564 -566 374 -15 -314 567 -602 435 -109 -278 554 -649 472 -162
4036a62p7P69j210J225p85P3O84j201J304r49K27N72j153J349j070L76M77j164
$$ -162 -239 530 -680 545 -240 -167 517 -684 620 -329 -102 470 -683 666 -404 -28 449 -715
4054g15J432j193N35L40j086J473j333P07J77j013J510j452Q72J7r41J524j567
$$ -715 717 -476 59 399 -687 786 -547 160 337 -676 834 -618 254 271 -670 854 -713
4071g13J042j63q15J518j669J217l17p39J505j726J368n06n64J449j785J466o53
$$ -713 329 166 -649 869 -800 417 100 -639 866 -860 508 2 -562 887 -898 568 -85
4088h5m06J363j833J619q02k57J234j804J740j020r9J183j789J780j162J01J019
$$ -85 -491 872 -961 658 -144 -401 833 -971 769 -251 -350 833 -956 824 -338 -237 782
4105G82j774J873j308K71Q68j729J973j480M43P64j705K041j657O41N96j631K087
$$ 782 -992 881 -427 -156 712 -1017 956 -524 -81 683 -1022 1019 -638 3 599 -1032 1055
4122A055j786Q20M31j516K106j938J036K65j452K108j996J196M6j324K109k106
$$ 1055 -731 89 520 -996 1110 -828 208 473 -979 1129 -867 329 375 -949 1160 -946
4138i46J370j40j152K061k230J524k77r91J934k235J705n03q73J874k228J783
$$ -946 424 284 -868 1193 -1037 487 210 -781 1153 -1082 623 120 -753 1121 -1107 676
4154F76p11o23J774k254J899q80m44J605k203J991j055k57J489k218K103j220
$$ 676 -35 -658 1116 -1138 761 -119 -563 1042 -1161 830 -225 -482 1007 -1211 892 -328
4170c28p3J359k152K173j401J32J183k079K251j603L33J045k004K258j701N50
$$ -328 -401 958 -1194 979 -422 -290 893 -1186 1065 -538 -205 840 -1164 1094 -607 -57
4186e7Q31j958K332j815O87O70j823K312j945Q64M98j661K224k016J071L02j542
$$ -57 774 -1184 1148 -667 20 690 -1133 1179 -766 98 596 -1065 1159 -857 214 516 -1026
4203a026K198k067J202R5j366K116k097J316o3j204K035k139J456k68j012J934
$$ -1026 1172 -895 307 402 -964 1152 -945 371 308 -896 1139 -1000 456 188 -824 1110
4219A110k115J555m40q39J800k101J644n86o72J672k057J728p62m86J560k081
$$ 1110 -1005 550 110 -729 1071 -1030 614 28 -644 1028 -1029 699 -63 -549 1011 -1070
4235a070J815r04l24J434k011J826j007j42J247j927J908j166qJ131j822J886
$$ -1070 745 -159 -483 951 -1060 766 -241 -383 864 -1063 845 -321 -329 802 -1020 866
4251H66j282J89R77j762J876j330L25P96j627J853j393M50O42j482J780j447N97
$$ 866 -416 -227 750 -1012 864 -466 -141 655 -972 881 -512 -62 580 -902 878 -569 28
4268B8M72j334J716j482P15L20j204J643j487P86J81j067J570j495Q86J6r34J489
$$ 28 500 -834 882 -600 115 435 -769 874 -613 173 354 -713 857 -638 248 264 -670 819
4286H19j484R47r0q05J395j477J015j94o88J318j451J074l42n27J205j410J094
$$ 819 -665 282 192 -613 782 -695 320 126 -562 756 -695 379 37 -490 715 -695 399
4303C99m14m07J092j367J126m85l03R86j277J101n41j94Q55j221J129o26o6P14
$$ 399 -15 -422 670 -697 429 -56 -359 627 -650 451 -90 -284 571 -650 479 -147 -213 501
4321E01j111J115o93J9O42j058J071p01R0N14r21J014p25J77M08q66R90p64K62
$$ 501 -610 505 -188 -169 473 -585 486 -215 -125 389 -532 482 -243 -66 342 -524 466 -298 -36
4340c6L31p75R34p55L16K31o86Q66p50L88J53o18Q46p57M11P6n28P75p49M44J8
$$ -36 295 -480 454 -301 15 246 -440 426 -324 64 217 -401 445 -312 99 175 -353 422 -327 117 135
4361A35m37P13p26M69o8l46O20o75M87j27k75N69o40M76j61k30N09n99M68j80
$$ 135 -302 411 -315 154 86 -260 360 -315 172 45 -230 339 -301 175 14 -216 293 -306 162 -18
4381a8j75M60n54M56k13p9L48m93M48k45j7L02m74M57k58j8K74m40M32k76L3K18
$$ -18 -193 267 -287 169 -44 -123 225 -268 180 -65 -82 220 -254 203 -55 -73 201 -239 193 -83 -50 168
4403A68l85M21k79N5J77l62L86k81R2J43l11L59k79J01Q5k62L43k92J31P9k43
$$ 168 -217 204 -75 -20 157 -205 181 -100 -8 135 -176 183 -96 5 90 -172 171 -121 10 89 -154
4424a54L03k72J40M9k32L23k85J44L3j83K69k49J62j9j32K48k53J71j3j32K36
$$ -154 149 -123 17 66 -166 157 -128 16 49 -134 135 -114 48 29 -103 145 -108 63 50 -82 154
4445A54k51J62k5j31K32k41J79o8r6K01k36J94o8p8J91k38K09j01q0J93k37K10
$$ 154 -97 65 40 -91 141 -100 79 11 -85 116 -120 74 6 -72 119 -119 90 -11 -91 102 -135 75
4467G5j07k8J73k44K34j42k2J66k51K50j43lJ60k67K51j48oJ67k36K56j86K3J49
$$ 75 -32 -60 113 -131 103 -39 -61 105 -146 104 -39 -42 118 -149 102 -46 -52 115 -121 135 -51 -28 121
4490A21k48K61j95N1J42k77K79k09O7R6k46L14k50P3J16k62L17k58J03R0k65L42
$$ 121 -127 134 -61 -10 132 -145 134 -75 -8 88 -158 156 -94 -21 95 -167 150 -108 -5 85 -180 162
4512A62l02J48Q6k81L65l43K01L7k48L76l77K43pk43M08m20K97m2k31M09m30L04
$$ 162 -140 8 94 -187 178 -165 36 73 -175 201 -176 67 60 -183 225 -195 102 60 -171 238 -192 112
4534A12o0k16M28n02L69j07k00M45n23M18j63j55M20n46M55j92j46M42n86N02
$$ 112 52 -164 264 -238 131 24 -176 269 -254 164 1 -154 266 -280 175 -17 -163 279 -307 195
4554A95k44r0M03n92N41k94m5L94n97O16l93J9L60o18O57m52Q4L32o34O98m90
$$ 195 -49 -139 264 -328 213 -81 -126 268 -329 287 -106 -87 273 -345 312 -140 -56 276 -358 340 -150
4575a50R8L25o40P42n67J92K62o63P81o08K50J97o05Q02p01L27J76o21Q32p40
$$ -150 -52 273 -367 375 -192 0 262 -401 380 -228 22 219 -386 416 -285 42 218 -403 429 -311
4595c11L86J07n93Q67q20M69O4n47Q51q82N48j6n06Q60q80N96q3m68Q56r30O90
$$ -311 75 182 -411 456 -364 105 169 -378 473 -409 139 123 -383 477 -403 193 110 -358 498 -432 258
4616B58j92m12Q50r68P56k65l28P95r83Q22l69k55P89j009Q51m11j95P45j034
$$ 258 66 -346 504 -464 292 27 -301 494 -489 333 -36 -291 498 -511 340 -71 -266 479 -555
4635e55R56n26j14P17j059J010n90k2O24j026J061o97P2N98j046J122p85J52N26
$$ -555 401 -125 -239 478 -581 429 -161 -183 441 -585 476 -221 -149 449 -597 525 -260 -108 418
4654D18j021J151q51K47M59r72J147r09L44L49r28J163r76M31K71q82J164j032
$$ 418 -603 548 -303 -56 403 -569 578 -331 13 362 -566 597 -379 52 323 -559 605 -427
4672d27N14J77q18J155j066O19O2p45J136j133O95J1o96J128j130P62j17n91J060
$$ -427 87 264 -554 601 -465 154 216 -529 607 -526 169 180 -516 612 -518 244 127 -464 596
4691E96j147Q48k28n08J059j196R25l09m26J001j211J005m17l44R53j219J060
$$ 596 -551 297 69 -439 620 -576 349 40 -386 615 -596 409 -8 -352 601 -618 442
4708D42n02k37Q89j218J098o02j29Q04j180J132o77k7P03j154J166p39P2O31j112
$$ 442 -60 -297 592 -626 472 -130 -259 545 -635 497 -180 -207 496 -658 508 -231 -159 472 -640
4727f40J163p94J55N27j020J165q77K56M52r83J180r38L57L64r41J172r66M25
$$ -640 523 -271 -116 411 -609 556 -321 -65 387 -596 584 -354 3 367 -574 598 -368 57
4745E7K57q48J119r75M77J78p77J104j045N91R6p11J059j061O60k4o09J037j090
$$ 57 314 -534 585 -390 87 265 -512 592 -453 138 234 -477 582 -479 181 157 -452 585 -505
4764e05P31j21n26R77j080P82k02m44R43j084Q29k96l44Q46j026Q75l74k53P56
$$ -505 226 105 -421 556 -524 258 56 -388 555 -529 300 4 -340 506 -520 355 -19 -272 484
4783D84j006Q93m49j49O95r70R02n21o6O13r29R04n62K8N20q80Q92n96J03M32
$$ 484 -522 371 -78 -227 468 -502 400 -121 -187 426 -503 401 -161 -133 387 -493 399 -197 -94 338
4803C38q03Q87o45J51L81p85Q90o87K63K75o86Q37p09L08J99o47Q73p37L52J33
$$ 338 -465 422 -223 -72 309 -476 414 -273 -10 265 -421 416 -293 15 214 -433 440 -297 55 188
4823A88n62P99p43M08N6m79P46p26M85o5m08O91p29N11r3l47O47p00N02j66k48
$$ 188 -374 425 -318 90 146 -333 413 -313 172 107 -301 390 -339 172 79 -268 379 -321 181 15 -233
4844b33N90p06N64k42j74N10o54N56k72j05M55o26N70l18m5L73n69N69l55K9L19
$$ -233 357 -349 215 -27 -201 309 -345 211 -61 -166 289 -337 233 -85 -130 243 -326 243 -112 -83 236
4865B36n31N47l97R7K47m89N57m07J22K02m34N12m14J68J34l73M80m38K25P5l26
$$ 236 -295 252 -145 -48 199 -290 267 -140 -18 184 -250 262 -152 16 150 -223 257 -181 44 119 -207
4886b07M54m38K37K9k84M32m29K73l6k01L83m26L03p2j59L28l99L16j29r1L01
$$ -207 247 -191 46 75 -209 223 -206 67 31 -170 213 -213 90 18 -141 187 -212 104 -25 -116 185
4907A85m17L63j67n3K64l58L22j84j5K12l44L39k11M8J40k92L29k38N8J43k74
$$ 185 -232 131 -36 -89 175 -183 139 -45 -60 152 -192 147 -64 -16 124 -168 161 -77 -19 124 -150
4928a50K96k34Q6Q6k37L02k62J35L4k29L13k72J63kj71K77k87J97l7j33K72k77
$$ -150 146 -88 -2 84 -153 149 -113 22 56 -173 140 -132 31 29 -142 135 -152 45 8 -125 147 -130
4950a30J74l7j00K17k52K04o9r4K03k55K36j14m0J79k55K46j34k0J51k47K41j50
$$ -130 44 7 -93 124 -128 76 7 -87 116 -139 97 -17 -57 122 -133 113 -21 -41 110 -137 104 -46
4972d6J6J21k24K30j57L0J10k13K51j92L6R9k15K67j80M7P6j74K28j96J01K5j54
$$ -46 -30 91 -133 97 -60 -30 80 -133 118 -74 -38 61 -154 113 -67 -20 56 -118 110 -86 15 40 -114
4995a14K23k01J01N0j77K51k11J16J6j47K09k19J41Lj42K19k01J22Mj31K02k10
$$ -114 109 -92 9 59 -118 133 -78 38 54 -93 116 -103 38 41 -101 118 -83 39 43 -88 114 -96
5017i6J46m8r5J97k04J52n7r4K10k13J40j1j10K01k13J32m5p3J72j98J56l3j05
$$ -96 50 2 -93 104 -100 52 -5 -99 111 -102 38 27 -83 118 -95 37 -8 -81 91 -107 49 16 -89
5040h9K08k17J55l7p5J90k33J63m5j02K07k52K00o7q6K00k40J69l6r0J92k20J86
$$ -89 119 -98 57 20 -55 135 -98 65 20 -82 125 -127 73 6 -80 120 -120 49 13 -77 115 -105 81
5063H1j02p7K16k53J92n5r5K00k50K01p9o5K00k44J92p6p6K17k66K36j02o4K02
$$ 81 -21 -98 118 -135 57 2 -93 107 -143 58 -21 -86 114 -130 62 -14 -90 127 -139 97 -5 -69 133
5086A33k69K41j27n5K22k94K83j30o3K19l18K89j69l0K21l21L06j77m5K35l61
$$ 133 -136 105 -22 -77 145 -149 134 4 -59 160 -158 131 -38 -68 153 -168 138 -39 -84 151 -210
5107b10L50k00jJ91l43L76k51J3K22l52L74k61N1K08m09M38k86M6K04l84M28l09
$$ -210 140 -60 -61 130 -213 163 -88 -75 147 -205 169 -92 -41 167 -242 196 -90 -44 160 -224 204 -105
5129a05R1J60l61M40l42J15J57l66M50l69J50J28l72M69m10J79J16l60M89m32
$$ -105 -14 146 -215 225 -117 -2 155 -211 239 -130 20 148 -224 245 -165 14 130 -230 259 -173
5149a73J94J00l64N11m80K54M9l44N30n09K86K0l21N30n37L43pl06N26n68L98
$$ -173 21 121 -243 268 -212 42 91 -253 277 -232 54 74 -247 283 -254 89 82 -224 302 -266 132
5170A32j04k40N39o09M47j24k27N03o23M72j56j83M85o27N28k18j64M79o31N40
$$ 132 28 -212 327 -282 165 41 -186 317 -306 166 10 -173 312 -315 213 -5 -169 310 -321 219
5190B19k65j07M46o35N74l11p4M31o21O11l79oL83o23O20m05M2L52o10O50m46
$$ 219 -46 -153 293 -342 232 -79 -153 278 -343 268 -111 -117 266 -357 263 -142 -100 252 -358 292 -154
5211a54J11K86n99P00n17J63K40n87P16n73K37J86n62P32o05K48J60n21P06o29
$$ -154 -43 243 -356 344 -173 -10 230 -357 359 -214 23 209 -353 379 -226 22 182 -339 367 -262
5231b62L21J03m95P11o78L99J3m36P01o93M21j1l92O55o84M78p4l63O48p28N32
$$ -262 59 162 -333 378 -300 99 112 -324 377 -316 105 94 -298 357 -327 151 77 -286 362 -366 166
5252A66j34k84O10o91N08j56k33N76p08N84k59j58N23o84N98l00j14M64o54O29
$$ 166 32 -252 358 -333 175 19 -214 362 -346 238 -21 -179 344 -340 258 -42 -156 308 -346 283
5272B83l75m3M28o74O60l98QL63o31O73m52Q2L33o18O84m94J20K77n77O70n25
$$ 283 -92 -135 293 -381 279 -119 -111 252 -379 294 -158 -76 257 -361 323 -171 -51 226 -351 319 -206
5293b06K11J92n36O67n65K70J37m85O56n84L07Q4m19O12n75L22L1l88O02n99L79
$$ -206 5 197 -339 328 -237 33 170 -315 341 -243 64 148 -271 341 -234 88 119 -269 333 -266 113
5314A13m6k92N44n95M20r9k83N41o04M65j61j98M88n91M80k11j33M39n93N14k52
$$ 113 67 -225 319 -276 144 45 -238 303 -301 164 3 -195 293 -298 182 -29 -162 277 -316 198 -54
5335e4p0L74n54N30k88l5L45n23N15l29K0K93m97N19l63Q7K28m56N21m16J42J86
$$ -54 -124 250 -304 226 -62 -97 248 -275 240 -89 -69 224 -273 246 -117 -30 198 -258 263 -153 -11 175
5357A75m29N12m15J74J32l88M70m08K23M5l17M58m38K60Lk65M42m38K83l1k32
$$ 175 -254 258 -157 17 149 -239 231 -177 46 91 -226 232 -206 54 57 -208 234 -204 79 48 -184
5378a84M24m57L32r6j58L49m21L52j52j06L52m45L50j69n1K70m14L76k06rK29
$$ -184 240 -217 115 19 -139 210 -211 141 -11 -117 235 -210 140 -29 -80 190 -224 152 -54 -63 166
5399A66l80L88k46L7J81l52L93l12J10J34l12L73l13J24R9k79L76l36J86K6k32
$$ 166 -214 174 -72 -35 146 -206 187 -125 -15 119 -193 180 -133 -9 90 -189 187 -149 37 63 -169
5420a69L60l52K06n9j41L24l04J85j0j95L11l00K55r1j14K73l38K70j13q7K50
$$ -169 191 -161 45 -14 -155 169 -135 50 40 -155 156 -144 111 20 -94 179 -159 111 -2 -89 161
5441A61l21K84j53l3K09l20L04k02J5J89l10L15k22N7J22k77L55k86J11J69l54
$$ 161 -160 124 -29 -62 147 -173 131 -71 -56 133 -177 138 -84 -27 95 -182 173 -113 -2 167 -187
5462a87M07l27Q8P4j76K27k27J35Pk08L35k32J58K6k55L03k43J82n4j36K55k71
$$ -187 220 -107 -19 55 -121 106 -121 14 21 -187 148 -84 74 100 -155 148 -95 87 33 -103 152 -119
5484a19J95o9j00K41k88K33r3r4K27k97K58j09o3J97k90K71j49j1J85k68K50j46
$$ -119 76 7 -93 148 -140 93 0 -94 133 -164 94 -15 -78 119 -171 100 -49 -60 125 -143 107 -39
5506c9j6J58k55K67k04N3J20k24K75k14R8P4k24L28l39J84M6k68L23k36O1J65
$$ -39 -55 103 -152 115 -89 -36 84 -140 135 -79 19 93 -131 197 -142 42 88 -180 143 -93 -32 133
5528A33k26J68j83J40O5k55K24j77J17O6j44J23n8O5m1r9J81j43J02k7j42K12
$$ 133 -93 75 -108 32 97 -158 66 -111 6 72 -72 51 -7 58 17 -82 99 -44 58 31 -111 101
5550A01k94K68p2j15J95j79J93p8o6J32j96J72n8o1J58j85J41n7m5J50j92J39
$$ 101 -193 75 3 -112 83 -96 97 19 -47 85 -111 61 3 -58 100 -85 56 -1 -46 104 -88 51
5572E1m2o9J51j70J28n4o6J39j58J38m4q0J41j49J22o9l7J40j54J32p3k4J14j36
$$ 51 9 -60 91 -79 49 -5 -71 68 -90 48 4 -76 65 -84 38 -31 -68 72 -82 50 -23 -47 67 -69
5596f9J13m1o4J21j18J01k7p2J40j47J16k1p3J13j28Q4l1n5J30j50J05kj02J58
$$ -69 44 3 -61 60 -58 43 16 -56 84 -63 53 32 -41 72 -56 28 -3 -58 72 -78 27 25 -77 81
5620H1j62J14k5r4J61j65J20j2q0J55j94J28rj22K00k16J35Nj10K10k22J34j4
$$ 81 -81 33 8 -86 75 -90 30 18 -62 93 -101 27 18 -104 96 -120 15 20 -90 120 -102 32 18
5643A8j07K06k23J60k1j25K29k37J80o9q4K15k68J78m9j07K32k73K26q3j00K36
$$ 18 -89 117 -106 54 33 -92 137 -100 80 11 -73 142 -126 52 3 -104 128 -145 81 -2 -102 134
5665A34l01K50r5r5K40l00K70j37o3K46l25K84j51n0K27l26L26j92k0K13l31L47
$$ 134 -167 83 -12 -107 133 -167 103 -34 -97 149 -176 108 -43 -93 134 -192 134 -58 -78 135 -196 151
5687A51k17K2K08l72L83k43J5K11l51L81l01R2J68l65M11l12J07J68l79M28l49
$$ 151 -66 -44 164 -208 175 -68 -53 158 -193 188 -113 -21 147 -218 193 -119 -12 156 -223 205 -144
5708a44J43J19l35M28l81J59R5l00M42l92J81P4l05M41l96K09M6k93M51m29K73
$$ -144 -1 118 -217 211 -170 -11 84 -216 226 -166 15 89 -216 225 -171 38 84 -209 242 -187 86
5729H6j0k69M55m71L20n0k29M13m76L44r3j86M01m93M08j47j39L91n08M12j80
$$ 86 76 -193 262 -209 111 61 -168 245 -231 113 20 -166 235 -258 150 3 -136 255 -253 159 -21
5750b1j23L82n13M69k50p7L42m88M57k68k2L13m89N00l07K4K73m69M82l31O6K57
$$ -21 -144 238 -275 194 -56 -133 209 -279 178 -90 -112 201 -288 212 -95 -71 202 -267 215 -116 -50 207
5772B07m73N22l92J30J90m56N37m36J78J49m23N32m27J99Q3l73N17m71K55N8l42
$$ 207 -266 256 -136 -6 184 -272 265 -171 7 156 -267 265 -162 37 120 -253 264 -207 48 106 -236
5793b36M97n01L16Jl07M78m87L35l6k80M75n09L61r4k00M39n12M00j45j38L88
$$ -236 261 -240 76 77 -230 248 -239 96 60 -220 255 -254 107 13 -187 252 -260 140 -5 -143 245
5814B45n14M50j90j10L63n08M53k45l8L26m88M61k74j6K78m55M62l02M4K30m08
$$ 245 -269 181 -9 -119 244 -264 189 -56 -94 232 -256 205 -69 -85 193 -262 200 -102 -58 172 -236
5835b36M47l35Q8J98m18M86l89J62J14l63M63l98K02Q0l22M46m21K34K5k68M45
$$ -236 211 -124 -36 162 -256 230 -159 3 117 -246 217 -181 21 101 -221 225 -196 38 63 -205 240
5856B40m39K82l4k16L90m30L14o4k01M03m51L56j45j31L45m40L75j95p4K96l91
$$ 240 -199 83 49 -167 223 -207 107 43 -158 245 -206 150 5 -126 219 -221 154 -41 -115 181 -210
5877b10L65k18l0K65l95L96k72K1K28l82M19l02Q5J51l45M18l29J31J07l00L73
$$ -210 155 -63 -93 172 -223 173 -99 -78 150 -232 187 -115 -30 121 -224 194 -135 -4 103 -197 176
5898A76l21J54Q0k84L89l52K02K6k26L57l59K36k9j62L23l97K68o8j41L27l90
$$ 176 -145 9 89 -195 194 -158 44 70 -156 201 -158 78 49 -113 210 -187 81 13 -128 199 -191
5919a91L24j40j02K72l64L34j82m8K65l89L65k20oK14l48L66k31K5J72l18L57
$$ -191 133 -7 -109 163 -201 133 -49 -97 168 -221 144 -76 -82 132 -216 150 -81 -56 116 -202 155
5940A55k68J00J52l00L41k93J23Q1k73L74l16J74L7k37L40l44K27j0k17L46l53
$$ 155 -113 -13 139 -161 180 -113 10 91 -182 192 -124 50 87 -150 190 -154 73 63 -154 192 -161
5961a61K46n7j53K96l58K89j04j30K97l55K93j37o0K65l82L44j92k9K50l48L29
$$ -161 85 28 -125 171 -187 102 -2 -132 165 -190 103 -34 -94 171 -211 133 -59 -88 162 -186 143
5982A43k04J3J80l31L58k42N7J60k96L41k87J13J19l03L51k85J40O7k61L36l14
$$ 143 -61 -48 132 -199 159 -83 -26 134 -162 179 -108 5 124 -179 172 -113 27 94 -167 169 -145
6003a45J80L9k48L33l05J98jk16L29l34K26j3j85L20l54K67q3j39K91l24K64j00
$$ -145 35 74 -174 159 -146 52 51 -165 164 -170 56 43 -142 178 -176 91 8 -131 160 -164 100 0
6025@r1K45l48K99j40n1K54l33K96j58l2K10l26L02j70kJ84l05K96j96K3J49k70
$$ 0 -91 154 -194 105 -35 -86 168 -165 131 -27 -59 151 -175 127 -43 -45 139 -166 130 -66 -43 106 -164
6048a64K85k14P1R8k34K90k35J04O3k07K67k31J15N6k04K69k31J19M7j66K35k43
$$ -164 121 -93 -22 76 -158 132 -103 1 64 -143 124 -107 8 64 -140 129 -102 17 64 -102 133 -110
6070a10J38J8j56K26k10J26nj15K29k31J56l1r6J89k20J37l6r0J73j90J48m5p0
$$ -110 28 46 -110 116 -94 32 27 -88 141 -90 66 35 -61 128 -92 45 9 -81 92 -98 50 5 -65
6093f5J41j94J61m6n6J28j79J52o5k0J18j80J56p0j0Q9j17J08p0lP6j17J20o0
$$ -65 76 -118 43 -3 -59 69 -110 42 -23 -43 75 -105 51 -19 -29 60 -57 51 -19 -22 54 -63 57 -3
6117cj1M6r1J31o3j5N6q0P0o1J3O1r5P4m5%K3m5N7k0k0L9l6J5j3j6L5n9M8Pl3
$$ -3 -14 32 -59 72 9 -6 50 -30 40 -21 -8 53 -42 32 -13 -13 10 -35 22 2 -18 21 -15 0 -13 -29 6 -53 -5 2 -31
6148c1M4l0J1J2l9N1l8kL7l2M2k2k3L6l5M6k7pM9o4P8o7JM1r0J27r5J0O3j24J21
$$ -31 13 -17 -6 6 -33 18 -20 -22 15 -17 25 3 -20 16 -19 27 0 -7 42 -22 56 -11 -10 31 -59 68 -27 -17 46 -78 43
6179D3p4J1N7j17J35q3QM6j03J24r2J3O9j27J57j24N3N1j58J95j40M8P4j57K17
$$ 43 -31 -20 37 -80 55 -28 -20 26 -77 47 -45 -32 37 -90 67 -57 -4 47 -111 84 -56 -8 66 -91 126
6204A26k02J00L5j50J97j67Q5J0j33K10j98J17J3j49K27k20J33J0j50K16k25J65
$$ 126 -76 24 59 -91 106 -61 24 34 -99 111 -87 30 43 -106 121 -99 34 44 -106 110 -115 50
6226E0l5j11K08k46J88m7j06K31k73K04o1j02K37k88K27q9o9K28k94K48j16m7
$$ 50 15 -96 112 -134 54 7 -99 132 -141 63 2 -100 137 -151 76 -13 -82 146 -148 100 -16 -63
6248f3K22k99K74j66qJ74k83K99j96L7J27k77L07k19L8J30k78L20k40Q4J05k50
$$ -63 159 -140 134 -32 -40 134 -149 150 -46 -9 118 -159 148 -71 -33 97 -181 139 -101 -17 88 -162
6270a62L19k80J01R9k52L29l05J65O2k32L25k91J69J9k11L06k99K00k5j75L19
$$ -162 157 -123 -22 77 -175 154 -151 14 76 -156 169 -122 47 66 -145 161 -138 62 37 -138 181
6291A81l21K13m8j43K99l32K39o9j19K67l36K67j09r0K49l29K92j55l4K24l30
$$ 181 -140 73 25 -118 181 -151 88 19 -100 167 -169 98 -11 -101 148 -181 111 -44 -78 146 -184
6312a84L05j81j3J89l02L19k30M6J61l04L48k58Q8J35k79L20k85J25J01k51L18
$$ -184 121 -60 -73 116 -186 133 -97 -51 110 -194 154 -104 -16 119 -160 160 -125 0 101 -150 168
6333A68k89J65K7k19L09k83J62K4j90K97l17J98j5j80L05l13K36q5j11K68l32
$$ 168 -121 44 71 -148 161 -122 40 64 -126 171 -146 52 37 -143 162 -151 85 0 -111 157 -175
6354a75K67j03q7K34l14K55j16o0K29l09K99j68mJ76l00L13j99L3J40k66L04k19
$$ -175 92 -11 -98 136 -178 77 -39 -99 130 -179 120 -48 -52 124 -176 137 -62 -29 111 -155 149 -70
6376g0P4Q7k37K94k44J28M5k28L19k89J61J9j80K78k95J82j3j55K86l04K13o6
$$ -70 4 91 -146 148 -96 32 77 -151 168 -121 40 59 -121 157 -138 44 31 -124 162 -142 71 5
6398Ej13K56k99K47j09q8K34l02K71j50l3J99k85K81j75K1J53k73K97k16O0J26
$$ 5 -108 148 -151 96 -13 -101 133 -169 102 -48 -81 118 -167 114 -61 -40 113 -160 137 -79 -19 107
6420A07k51L00k35J02P8k47L12k74J29L2j80K92l06J84jj86L10l32K20k9j62K99
$$ 107 -144 156 -79 23 101 -146 166 -108 21 53 -127 165 -141 43 42 -144 166 -166 54 25 -137 162
6442A62l11K20p1j28K77l32K69j21n7K27k99L01j84l9K05k93L29k13K6J48k71
$$ 162 -149 71 0 -128 149 -183 86 -35 -92 135 -164 137 -47 -86 119 -174 155 -58 -32 116 -155
6463a55L00k29P5J33k92L28k58R0J31k85L32k84J17Q8k57L51l26J71K9k08L06
$$ -155 145 -84 -9 124 -168 160 -98 -8 123 -162 170 -114 3 91 -166 185 -141 30 59 -149 157
6484A57l15J99k9j67L22l38K46p2j52L17l45K68q7j11K81l60L00j37o6K62l50
$$ 157 -158 41 12 -155 167 -171 75 3 -149 168 -177 91 4 -107 174 -186 114 -23 -89 173 -177
6505a77L33k00k4K33l59L51j97j2J95l18L52k47L3J65l08L46k69Q4J35l12L48
$$ -177 156 -44 -68 165 -194 157 -40 -52 143 -175 177 -70 -37 128 -180 166 -103 -19 116 -196 152
6526A52k76J07J09k81L67l17J35O6k20L30l30K00J1k03L13l26K37k3j80L17l48
$$ 152 -124 -17 92 -189 178 -139 -4 62 -158 172 -158 42 53 -150 163 -163 74 51 -129 188 -160
6547a60K57o8j61K97l16K52j01j14K90l37K75j43m8K24l14K87j61m4K09l09L19
$$ -160 97 29 -132 165 -151 101 0 -114 176 -161 114 -29 -77 147 -167 120 -41 -85 124 -185 134
6568A34j95J1J60l07L24k03M1J09k42L07k36N5J16k52L16k41J02Q1k14K70k33
$$ 134 -61 -50 110 -197 127 -76 -35 74 -168 139 -97 -42 74 -178 138 -103 -1 80 -134 136 -97
6589i7J35K3k08L12k72J58rj51K57k63J62k2j20K30k59J89p1j02K22k42J83p5
$$ -97 38 61 -147 165 -107 51 42 -109 148 -115 47 25 -95 135 -124 65 -6 -108 114 -128 55 -20
6611b0m2J61k27K11j10l0J43k35K21j24J0J15j85J81j19K3Q3j67J96j24M1O6j41
$$ -20 -62 99 -128 83 -27 -57 86 -149 72 -52 -42 73 -112 69 -50 -27 56 -111 85 -39 2 68 -73
6634g3J69j40N2K5r0J52j50Q8Kr3J63j70J00j5q2J38j31P5j9n9J04j34J11n4l
$$ -73 96 -44 8 33 -57 95 -55 33 35 -58 105 -65 35 20 -62 76 -55 20 1 -58 46 -88 23 -31 -34
6659c4O1j06J13p9K6N2r4J08q8K3N0p7Q3n3L0Rn3R0r7P3l0l9J02j04Q1l4k4O1
$$ -34 27 -79 34 -45 -19 33 -61 47 -41 -18 32 -45 38 -15 15 24 -29 61 -36 37 7 -32 70 -34 47 13 -11 50
6687E0r9R5p3L4K2q8J14r4L0K2p5J10r4M8j1m6R4j11R3k1n1R3j21J19n7k1J10
$$ 50 -49 46 -27 7 29 -59 55 -39 -9 13 -62 48 -46 2 -9 -55 39 -72 21 0 -51 42 -79 40 -17 -38 72
6714G2j38J20o8j0P3j19J39p9J7M7j23J45j10M7L0j27J73j35N7K1j07J64j58R5
$$ 72 -66 54 -14 -24 49 -70 69 -10 7 54 -69 76 -34 13 43 -84 89 -46 11 32 -75 89 -69 26
6738B6j3r5J60j64J21k8r5J64j75J43m9o2J58j89J45o2m6J40j98J87q2k8J35j96
$$ 26 13 -82 78 -86 35 7 -88 76 -99 44 -5 -67 91 -98 47 -15 -61 79 -119 68 -14 -42 93 -103
6762a03J93j03m3J52k11K10j45J9J14j73J89j64N0Q7k00K40j92O6N6j64K14j77
$$ -103 90 -13 -56 96 -115 95 -50 -31 83 -90 99 -65 -15 72 -128 112 -80 -14 42 -122 92 -85
6784h5R8J4j29K05k09J33j5j16K00k15J47j8r2K04k17J30k3r7J88k04J64n9o4
$$ -85 13 27 -102 103 -106 27 12 -104 96 -119 28 10 -82 122 -95 35 12 -85 103 -101 63 4 -60
6807f0J77k24J97r9l2J57k15J90j28J3J18j99K06j28j2J21k06K20j76N4Q2j71
$$ -60 117 -107 90 -9 -41 116 -99 91 -37 -24 94 -105 101 -27 -39 82 -124 96 -80 -26 56 -115
6829a15K08j74N3O9j44J90j56O5M2j33J84j73R4L0j21J73j85J32k6p0J62j89J53
$$ -115 93 -81 -28 41 -103 87 -69 -4 38 -95 89 -84 10 40 -81 92 -93 39 13 -57 105 -84 69
6852F9o3m2J18j70J45p7j5R6j37J39j03%J01j57J58j09J9O7j28J53j28N6L0j27
$$ 69 6 -36 82 -88 57 -20 -35 61 -76 63 -40 -40 61 -96 62 -47 -28 39 -89 64 -64 -8 22 -105
6876a05J79j37Q0j5r5J61j13P6k6n6J31j69J30m5l1J09j54J27l8m9J25j67J59
$$ -105 74 -63 17 2 -93 68 -45 31 5 -51 80 -89 41 -4 -35 74 -80 47 9 -40 85 -82 77
6899G7r4K2N8j47J87j60N6M7j34J56j39O8L6j25J79j82J07%r1J50j67J35l6q6
$$ 77 -17 5 63 -84 103 -57 -1 46 -88 68 -71 -3 33 -92 87 -95 12 12 -79 71 -96 39 3 -83
6923h3J70j98J80p3m1J29j91J80r1j0J20j97J99j23jJ05j76J92j55O4Q6j99K20
$$ -83 87 -111 69 -4 -45 84 -107 73 -18 -28 92 -105 94 -29 -30 75 -101 91 -64 0 86 -113 107
6946A07j68O6M4j61K41k23J19J5j66K36k36J67k7j28K28k56K02n9j06K31k55J92
$$ 107 -61 5 49 -112 129 -94 25 40 -126 110 -126 41 14 -114 114 -142 60 1 -105 126 -129 63
6968F3p8o9K08k66K20r0n8J98k86K84j68k3K08k97K77j98L3J63k73K99k25O1J29
$$ 63 -15 -84 124 -142 78 -12 -70 128 -158 126 -42 -65 143 -154 123 -75 -42 121 -152 147 -78 -17 112
6991A12k68L00k48J04Q9k41L09k79J22N9k16L19k96J55K4k01L14l15K15k8j85
$$ 112 -156 144 -104 0 89 -152 157 -122 0 59 -157 162 -134 21 45 -156 158 -157 58 30 -155
7012a55L12l31K34m2j57L26l53K69p7j33K83l45K97j16r1K37l43L08j73pK27l61
$$ -155 157 -174 60 18 -139 187 -166 103 26 -107 176 -169 128 12 -79 158 -185 123 -50 -57 170 -191
7034a91L33j95pJ94l40L56k40N5J53l17L63k80Q1J50l01L46k81J06J01k73L51
$$ -191 142 -53 -60 134 -206 150 -90 -35 118 -199 164 -116 -35 115 -186 160 -121 -15 86 -187 164
7055A64k89J54N0k51L52l27K00K0k13L14l20K31m2j77L22l54K56o4j46K89l27
$$ 164 -125 29 79 -172 180 -147 53 73 -140 174 -146 85 43 -134 188 -166 90 26 -120 169 -158
7076a58K51r2j12K79l53K91j32q0K47l26L01j61m4K16l06L17k27L1J66l03L50
$$ -158 93 1 -111 168 -185 106 -26 -106 141 -185 116 -45 -89 127 -179 138 -89 -58 108 -195 155
7097A55k28M4J36k88L31k61J01J12k66L43k83J34N9k28L02k91J65K9k16L17k90
$$ 155 -73 -29 107 -181 150 -111 -10 102 -164 179 -104 30 89 -139 163 -128 37 66 -150 167 -123
7118a23J73k1j46K70l18K40m4j37K57l08K25r5p9K18k85K61j43k1J91k83K97j69
$$ -123 50 29 -117 153 -165 75 31 -106 151 -157 68 -27 -106 112 -173 88 -55 -76 115 -168 129 -40
7140d0rJ60k60K75k06M6J29k55L10k13O1Q6j97K54k38J11O1j85K59k52J39nj37
$$ -40 -49 111 -149 126 -80 -34 95 -160 150 -63 -2 84 -113 141 -97 14 75 -110 149 -103 36 31 -106
7163a06K35k47J83n0j26K39k68K03q3q3K13k49K17j30j3J68k43K31j43mJ55k50
$$ -106 129 -118 65 15 -111 128 -140 63 -20 -103 110 -139 78 -52 -65 103 -140 91 -52 -56 99 -151
7185a51K48j60M8J27k38K59j96P7M8j81K48k15J21K7j74K51k57J48J4j51K43k58
$$ -151 97 -63 -15 112 -126 133 -63 14 62 -119 129 -86 35 62 -112 139 -118 30 44 -107 136 -122
7207a22J76m1j17K32k71K11q3p3K11k76K42j15l8J88k78K59j51j7J77k87L02j84
$$ -122 54 13 -104 128 -143 68 -15 -88 123 -153 89 -26 -64 124 -154 105 -46 -63 114 -173 129 -55
7229e5J1J66k75L02k35Q0R5k14K89k31P6P8k04K59k47J31K2j88K94k92J85%j72
$$ -55 -44 122 -153 149 -86 -6 89 -125 164 -67 9 87 -117 142 -105 26 48 -140 154 -138 47 47 -125
7252a25K67k90K02m1j39K79l15K16n7j08K43l14K53q8o7K10l02K54j12l7J99k85
$$ -125 142 -148 54 13 -126 153 -162 54 -3 -111 132 -182 71 -17 -84 126 -176 78 -34 -71 128 -157
7274a57K77j57j4J76k85K93j88L2J45k77L10k06M3J25k80K94k14Q6Q7k24K86k54
$$ -157 120 -37 -51 125 -160 133 -55 -23 122 -155 155 -51 -8 117 -163 131 -83 3 90 -134 152 -102
7296a02J07O8k39L12k80J56K2j99K80k69J86j7j60K65k66J89m0j14K42k88K20
$$ -102 5 73 -166 146 -134 22 44 -155 125 -144 42 25 -135 130 -136 53 13 -101 141 -147 73
7317G3o3j04K48l03K35q8p1J99k68K38j35k3J92k74K49j29l3J65k46K43j53OJ24
$$ 73 10 -94 154 -149 86 -2 -73 126 -142 96 -39 -62 130 -144 105 -24 -57 108 -138 105 -48 -42 82
7340H2k22K32j60L5J12k12K24j75P0P4j82K21j84P4O4j70K25j95J15Lj31K00j78
$$ 82 -140 92 -68 -33 79 -133 91 -84 -14 60 -122 99 -85 -11 53 -117 108 -87 28 31 -100 100 -78
7363g8J05K2j44K06j81J06jj10J78j80J34l6q2J45j64J26m1n6J17j47J29n2o0
$$ -78 27 49 -95 111 -70 36 35 -75 103 -77 57 21 -61 84 -80 46 5 -51 66 -81 48 -4 -64
7386f4J12j32J21n4k0R4j23J08p1J1N8r5R0o2QP0j00R9p5K4L5p3P4m8J7K4m8O2
$$ -64 48 -84 37 -17 -37 57 -66 42 -29 -18 40 -55 35 -27 -19 51 -49 50 -25 -1 34 -39 35 -13 4 28 -20 42
7414D2o0L7Jm0L7m6K7j3mK2k8K9pk0JNJ0j7J6j2%K3l3L2m5L5Rk3L1l6M2l4J0K7
$$ 42 -18 19 20 -20 17 -29 -2 -15 -19 3 -25 4 -3 -23 -22 -17 -7 -24 -8 -20 -20 3 -30 2 -43 -8 1 -22 9 -27 15 -19 -9 18
7448A8n3P4m5J3J4o1Q1m6jM5p2Q9p3K6K4r4J14q9M2J7r2J04j03P8kq1J24j14P2
$$ 18 -35 39 -6 7 21 -40 41 -5 -6 39 -33 56 -17 9 33 -61 53 -36 6 23 -69 35 -68 10 8 -73 51 -63 9
7477Iqo8J28j36J20l9n4J27j63J32m4l9J15j65J36m7m5J36j88J72r5k0J20k00
$$ 9 1 -67 61 -75 45 6 -48 79 -84 48 4 -35 80 -85 51 4 -41 95 -93 79 -16 -36 84 -116
7501a16K06j23j7J37j96J96j49M4P8j86K27j54L7Q1j96K34j94N6Q8j75K30k14
$$ -116 90 -33 -50 87 -109 87 -62 -18 60 -126 101 -53 -16 65 -131 103 -91 -35 53 -122 108 -106
7523a06R8N4j59K32k27J36K2j68K43k42J72l0j35K48k52J79m4j00K31k77J94n6
$$ -106 -8 46 -113 119 -108 28 50 -118 125 -117 55 25 -110 138 -114 65 21 -79 152 -125 69 13
7545A3j03K16k82K51j11o3K12k73K18j06l7J72k64K58j55MJ51k77K95k00M7J34
$$ 13 -90 126 -156 95 -16 -79 133 -140 78 -28 -65 107 -157 101 -54 -50 101 -176 119 -81 -34 100
7567A00k59K90k09M8J22k48K85k30R5R2k28L04k61J34L7k02K98k95J67Pj70K64
$$ 100 -159 131 -78 -30 92 -156 129 -101 -6 86 -142 162 -99 35 72 -130 168 -127 40 47 -123 141
7589A41k79J83rj63K80l09K13l6j30K35k79K15p0r5K43l27K75j21o0K21l03K68
$$ 141 -138 45 36 -127 153 -156 57 21 -109 126 -153 62 -8 -103 140 -187 88 -33 -93 128 -175 93
7611I3j63J0J75k80K99k14M7J42k62K99k24O3J11k41K99k57J16Q5k44L10k83J58
$$ 93 -70 -60 115 -165 134 -80 -33 109 -153 146 -78 -15 96 -145 154 -103 13 98 -146 164 -119 39
7633C9M0k15L04l05J76%j70K77k99K16n2j29K67l04K42r0j25K75l21K69j29n4
$$ 39 79 -136 168 -137 39 39 -131 146 -153 63 11 -118 149 -155 87 -3 -128 147 -174 95 -34 -88
7655h8K30l11K84j50k6J91l01L08k08M3J49k95L28k33P6J20k83L33k65J06Q6k51
$$ -88 142 -169 115 -35 -61 130 -171 137 -71 -28 121 -174 154 -79 -3 117 -166 167 -98 8 94 -157
7677a57L32l23J73M8k43L35l29J96Lk00L28l35K38o0j44L02l37K64q9j20K82l54
$$ -157 175 -148 25 73 -170 165 -164 32 35 -165 163 -172 66 6 -138 164 -173 91 2 -118 164 -190
7699a90L06j30o7K42l34L13j84l7K39l48L36k00NK05l53L78k58P2J33l19L71k95
$$ -190 116 -14 -81 161 -173 140 -44 -81 158 -190 146 -54 -49 156 -197 181 -77 -5 128 -191 180 -115
7721a15R8J35l34L89l19J56P1k69L72l54K06K1k46L73l66K52k9k07L63l94K67
$$ -115 -17 118 -216 173 -146 10 81 -188 184 -170 36 57 -189 184 -182 70 41 -166 197 -197 70
7742G0l7j78L44l95L18j15j37L39m19L34j41q9L14m15L65j74m9K62m12L91k35
$$ 70 33 -145 199 -196 122 7 -130 209 -210 124 -17 -106 208 -207 158 -16 -65 197 -215 176 -59
7763e9JK19l91M08k83N3K16l92M32l25Q1J70l69M51l60J32J10l12M33l69J71R5
$$ -59 -58 161 -230 178 -105 -52 164 -228 204 -121 -40 130 -239 212 -148 -16 94 -218 215 -154 17 112
7785A12l28M51m08K27L1k76M13l98K42Kk42M12m17K67j5k26L68m25L27q5j83L62
$$ 112 -216 235 -173 54 85 -191 222 -176 66 68 -174 238 -179 88 73 -153 215 -210 117 32 -151 211
7807B11m18L44j47j23L36m42L56j63p7L05m20L87k09l5K66m06L97k43RK21l72
$$ 211 -207 137 -10 -133 203 -239 117 -46 -123 182 -238 149 -60 -95 171 -235 162 -81 -72 149 -223
7828b23M00k57M2K02l90M22l04Q1J74l48M18l27J31R0l15M17l45J56R7l07L88
$$ -223 177 -80 -38 164 -226 196 -108 -27 147 -201 217 -110 21 111 -204 213 -132 24 121 -186 202
7849B02l54K06K8k62L71l58K13Ok23L58l63K35l7j57L15l57K53n5j56K96l35K73
$$ 202 -152 54 82 -180 191 -167 46 52 -171 187 -176 59 22 -135 180 -177 76 21 -135 161 -174 99
7871I9q5j29K92l73L00r2r3K30l01K74j43m8K27l23K87j56j6J95l03K92j82J2
$$ 99 14 -115 177 -196 104 12 -81 149 -152 122 -21 -69 158 -165 122 -34 -50 145 -158 134 -48 -36
7893c6J56k75K83j96L2J32k59K86j91L7J21k34K62k04P2R0k01K66k25P7O0j84
$$ -36 120 -155 128 -68 -36 96 -163 123 -68 -31 90 -144 118 -86 -14 76 -125 141 -84 -7 53 -131
7915a31K45j93R2N3j88K33j90J03L0j50J96j63J04J2j30J94k11J42k4r3J71j78
$$ -131 114 -79 13 66 -122 111 -79 24 54 -96 100 -63 41 53 -77 117 -94 48 24 -69 102 -76
7937g6J14k3p7J38j59J29m9m3J15j50J17o2m0J14j23J05l2l1R7j44J31n0l6R1
$$ -76 38 15 -62 76 -83 46 -3 -46 69 -81 36 -26 -66 48 -75 30 -2 -33 64 -80 51 1 -35 56
7961E6j13R6l5k7Q6j08P3j5k3O3j02Q4l2%L7p3N5j3k4N2o8N3j1l4L0l7L6ml0N9
$$ 56 -57 39 4 -23 63 -45 28 13 -10 53 -49 35 3 3 40 -33 22 9 -15 37 -31 22 11 -23 7 -30 6 2 -28 31
7991C1p6N9j8l2M6l3J5J3m0O2n1J2L6n7P6p3M6Qo4Q8n5K6Rm8P3p3K9L3o7O8n5
$$ 31 -45 14 -4 -36 10 -23 -8 5 -35 27 -24 -12 24 -33 43 -30 16 24 -40 48 -7 19 28 -20 53 -20 9 42 -25 43 -12
8022a2KL6q0R8r5M7J6q1J34j11N2J8q3J03r5N8J8q1R8r0N9K0p5J09j28Q5j0o3
$$ -12 -10 26 -54 44 -51 -4 12 -69 65 -46 6 24 -59 44 -51 7 25 -56 42 -48 11 31 -44 65 -63 22 12 -51
8050e1J28j43J02qp1J23j49J16l0m3R6j38J20m5o2J24j38J31q4l2J27j54J24q7
$$ -51 77 -66 36 28 -43 80 -69 47 17 -26 70 -68 52 7 -55 69 -69 62 -22 -54 73 -81 43 -44
8074d4NJ06j66J51q0j5J04j74J93j36M3P7j64J95j49N7M2j37J94j50P6L7j61K16
$$ -44 -39 67 -99 52 -28 -43 61 -113 80 -56 -13 64 -100 95 -54 3 45 -92 102 -48 28 65 -96 120
8098A20j95Q4L3j28J99j86J06Qj25J91j94J26j3j11K07k38J74o3q9J91k17J84
$$ 120 -75 9 42 -86 113 -73 33 41 -84 107 -87 39 26 -85 122 -116 58 -5 -94 97 -120 64
8120F4q0o2J83k36K17j21k3J48k22K18j26k1J59k10K38j79J5J32k24K55j94N5
$$ 64 -16 -78 105 -131 86 -35 -58 90 -132 86 -40 -61 98 -112 126 -53 -38 94 -130 125 -69 -14
8142a4J03k02K51k16Q7Q0k20K74k43J44J7j90K55k35J53Mj70K71k92K19m7j54
$$ -14 89 -113 138 -78 9 89 -131 143 -100 44 61 -129 126 -109 44 48 -122 149 -143 76 29 -125
8164a25K72k93K19p0j20K47k93K51r5p1K30l19K97j57l8K07l00K92j75rJ89l04
$$ -125 147 -146 73 3 -117 130 -163 88 -7 -78 152 -167 130 -27 -65 142 -158 134 -41 -50 139 -165
8186a65L19k07M3J64l11
$$ -165 154 -53 -10 154 -157
8191a57
$$ Imaginary data points
##PAGE= N=2
##DATA TABLE= (X++(I..I)), XYDATA
0@%%%%%%%%Qj6J6j6J6k1K9l6M4n6O9p7Q8j04J20j40J62j86K16k48K81l17L58m00
$$ 0 0 0 0 0 0 0 0 0 8 -8 8 -8 8 -13 16 -20 24 -32 37 -40 48 -56 64 -76 86 -100 116 -132 149 -168 190 -210
32b10M45m98N56o20O89p65Q48r37J033j138J253j374J506j655J818j997K195k412
$$ -210 235 -263 293 -327 362 -403 445 -492 541 -597 656 -718 788 -867 951 -1046 1149 -1263
50a263K652k919L220l562L953m403M925n547O297p212Q353r813J1735j4356J8104
$$ -1263 1389 -1530 1690 -1872 2081 -2322 2603 -2944 3353 -3859 4494 -5319 6416 -7940 10164
65A0164k3793L3181n0820R2980l31340l07010R18201n40772O50230o45800n1280
$$ 10164 -13629 19552 -31268 61712 -269628 -576638 341563 -199209 451021 -194779 -246059
76b46059O72425r57417Q70895l37220r3344L44682p58885R41242o11899J4267
$$ -246059 426366 -531051 339844 2624 -90720 253962 -504923 436319 -175580 -161313
86a61313N84780p37879N71760o38905L85291M85342q64531O26947n53058K90003
$$ -161313 423467 -314412 257348 -381557 3734 489076 -375455 251492 -301566 -11563
96a1563L14133n95484O85052p44900L03437L40100n75924N91624n91174M27246
$$ -11563 302570 -292914 392138 -352762 -49325 290775 -285149 306475 -284699 142547
106A42547J6159o14570Q18762m84629K45105j16909l49008P48260o83154L98908
$$ 142547 158706 -455864 362898 -121731 123374 6465 -342543 405717 -277437 121471
116A21471L9520m35562M72433n14096O26236j94014m93106O32674m38504L83504
$$ 121471 160991 -274571 197862 -316234 310002 115988 -377118 255556 -182948 200556
126B00556k77564j21031O05488p11615L72237p8909n9106L59011o20642N26872
$$ 200556 -77008 -198039 407449 -304166 68071 -10838 -69944 289067 -331575 195297
136A95297k37414j29032M45502m66359L83467l55392N2986M17230n44476L96831
$$ 195297 -42117 -171149 274353 -192006 191461 -163931 -110945 306285 -238191 158640
146A58640k54238N1579K24763m43095N00186l26296K7152K23150l83526M10818
$$ 158640 -95598 -44019 180744 -262351 237835 -88461 -61309 161841 -221685 189133
156A89133l13330J64048J20212m44224M50294k31650J27797N937l03988M66910
$$ 189133 -124197 39851 160063 -284161 166133 -65517 62280 68217 -235771 231139
166B31139l57887J34408R1828k42375L15993l62052K66363K3356k84989L48161
$$ 231139 -126748 7660 99488 -142887 173106 -188946 77417 100773 -184216 163945
176A63945k79932J97276r1640j38367L86195l70018J58122l4394o5593K61641
$$ 163945 -115987 81289 -10351 -148718 237477 -132541 25581 -8813 -74406 187235
186A87235l61022K57679p4470j11912K42682k68033K38044j49670m2195K33830
$$ 187235 -173787 83892 9422 -102490 140192 -127841 110203 -39467 -81662 152168
196A52168k90369K21700j11273l11J36691k68781K67818j28410r076J16441k15416
$$ 152168 -138201 83499 -27774 -28085 108606 -160175 107643 -20767 -29843 86598 -128818
207a28818K31918j57338M9521R7373k21711K14672j33145O3831L8806j73326K30160
$$ -128818 103100 -54238 -4717 92656 -129055 85617 -47528 16303 55109 -118217 111943
218A11943j66893N2458M3272j19487J86276j88051R3844K7811j20337J70884j57576
$$ 111943 -54950 -2492 40780 -78707 107569 -80482 13362 41173 -79164 91720 -65856
229f5856R7791k2682q3541J77084j66575Q8500k5394m6642J36415j68896J17798
$$ -65856 31935 9253 -74288 102796 -63779 24721 -673 -47315 89100 -79796 38002
240C8002l2946m6450J08561j40569J23410n7787k4031R4834j33717J15638n8555
$$ 38002 5056 -41394 67167 -73402 50008 -7779 -31810 63024 -70693 44945 -13610
251a3610O33O3998j23356J20786o3780P863M6083r9291J11141p5393K2713L4661
$$ -13610 -12977 51021 -72335 48451 -15329 -7466 38617 -60674 50467 -24926 -2213 32448
263C2448q3917R8789p5782L3173J6327o5368R3649p9064L5863N800m6214Q1674
$$ 32448 -51469 47320 -28462 4711 21038 -44330 49319 -29745 6118 11918 -34296 47378
275D7378q0083M2653l413l4320O9422p4000M7443j4402k2249N8397o9408N0672
$$ 47378 -32705 9948 6535 -27785 41637 -32363 15080 678 -21571 36826 -32582 18090
287A8090k0640j2518M5460o3113N3002k4930m650L3426n4912N1700k7839L400
$$ 18090 -2550 -15068 30392 -32721 20281 -4649 -9299 24127 -30785 20915 -6924 -3524
299c524K1745m6375M9220l0052Q919J3033l6490M3881l1169J2962O662k6945L6423
$$ -3524 18221 -28154 21066 -8986 -67 12966 -23524 20357 -10812 2150 8812 -18133 18290
312A8290k9525J5114m6j6885K9632k7674J5386m115q161K2051k4450J4985o273
$$ 18290 -11235 3879 3833 -13052 16580 -11094 4292 177 -7984 14067 -10383 4602 -1671
325a671k576J4265j8300J2915q037K489P041j2292J0227p835N945R4o612P367
$$ -1671 -4247 10018 -8282 4633 -3404 -915 6126 -6166 4061 -3774 2171 2265 -4347 3020
339C020n833O607n524L70K446k891O722r736P152m016J152O320j3146J2734r873
$$ 3020 -2813 3794 -1730 -1360 1086 -1805 4917 -4819 2333 -1683 -531 5789 -7357 5377 -4496
354d496O211L034j4259J8817j6707J1551j548j2756K3650k5357J8843n666j2033
$$ -4496 1715 4749 -9510 9307 -7400 4151 2603 -10153 13497 -11860 6983 1317 -10716
367a0716K6198l0843K6891j3358r324K9428l6195L2512k0845j781K8463m4137
$$ -10716 15482 -15361 11530 -1828 -11152 18276 -17919 14593 -6252 -8033 20430 -23707
379b3707M2263k6567K118K4858m5616N1806l8310Q168K5500m7849N4328m6661
$$ -23707 18556 -8011 -5893 18965 -26651 25155 -13155 -4987 20513 -27336 26992 -19669
391a9669K1773J8227n3636O4574n2469K7274Q360m7935P3475o9082L6242Q072
$$ -19669 2104 20331 -33305 31269 -21200 6074 14434 -33501 39974 -29108 7134 15206
403A5206m6152P0259p6435N5265n720m9138P9732p9473N9386k1762l3723Q4965
$$ 15206 -30946 39313 -37122 18143 12423 -36715 43017 -36456 22930 1168 -32555 52410
415E2410r9220P0395k1294k8306P2502j01276R3545m1177k9679Q0228r7592R1713
$$ 52410 -46810 23585 2291 -26015 46487 -54789 38756 -2421 -32100 48128 -49464 42249
427D2249o0852l640P9074j18353J02694n6597L597N5993j11966J27777q1881K615
$$ 42249 -18603 -22243 56831 -61522 41172 -15425 -11828 44165 -67801 59976 -21905 -19290
439a9290O3684j01116J16992j02363L8135N6049j22013J27355r3605M5316K3465
$$ -19290 44394 -56722 60270 -42093 -3958 52091 -69922 57433 -36172 9144 32609
450C2609j06047J53110j24653M4708L2750q9042J32113j43738Q9029J8245j10239
$$ 32609 -73438 79672 -44981 -273 32477 -56565 75548 -68190 20839 39084 -71155
461g1155J41239j27731R3482k4189q2069J65434j63392R1476j0886n8503J30046
$$ -71155 70084 -57647 35835 11646 -70423 95011 -68381 23095 12209 -46294 83752
472H3752j76965J42668l0709q0974J35567j48349J39237q0122m0770J55495j83875
$$ 83752 -93213 49455 18746 -62228 73339 -75010 64227 -15895 -56665 98830 -85045
483h5045J31870o0644j2669J06902j88797J83473q2157l6227J09709j49860J70061
$$ -85045 46825 -13819 -26488 80414 -108383 75090 -7067 -43294 66415 -83445 86616
494H6616j31328J1522J23366j83366J60007j06265L8187O6559j78059K10170j32244
$$ 86616 -44712 -33190 90176 -93190 66817 -39448 -1261 65298 -112761 97409 -34835
505c4835J4304P2468j33477J84662j78869P1891P9847j70340J73862j43667R5378
$$ -34835 -20531 51937 -81540 103122 -75747 -3856 75991 -94349 79513 -64154 31224
516C1224J0363j53477K27353j74929O5233K1187r7320J86795k22141J31463K8782
$$ 31224 41587 -111890 115463 -59466 5767 26954 -70366 116429 -105712 25751 54533
527E4533j36844J66029j72597J54443n1003j14112K17557j96358J16026m1870
$$ 54533 -82311 83718 -88879 65564 14561 -99551 118006 -78352 37674 -4196
537d196m9285J69945k36867J74360l3084q0613J41250j83425J89750j04103n3159
$$ -4196 -53481 116464 -120403 53957 20873 -59740 81510 -101915 87835 -16268 -69427
548f9427J76673j99817J55446r2043J593J23891k20163K06533r4233k7060J05989
$$ -69427 107246 -92571 62875 -29168 -27575 96316 -123847 82686 -11547 -38607 67382
559F7382j63484K00662j58304J6810J33093j90786J67074j27631O5893O1342k00078
$$ 67382 -96102 104560 -53744 -36934 96159 -94627 72447 -55184 10709 72051 -128027
570a28027K29631j34291K1766M8436j24296K11305k08500P1801Q6090j52453J58803
$$ -128027 101604 -32687 -10921 37515 -86781 124524 -83976 -12175 73915 -78538 80265
581H0265j67910J31680Q178j68452K16618j55948Q4016j9023q8781K04788k19316
$$ 80265 -87645 44035 52213 -116239 100379 -55569 28447 9424 -79357 125431 -93885
592i3885J12947J4942r4628J48931j89159J60886m0107j01152J76001j73824J31048
$$ -93885 19062 34004 -60624 88307 -100852 60034 19927 -81225 94776 -79048 52000
603E2000n9720m5487J54247k02474J55882m9162n2955J21238j63877J69673j01047
$$ 52000 -7720 -53207 101040 -101434 54448 5286 -47669 73569 -90308 79365 -21682
614b1682l2261J44975j69808J34761r1351K2572R5765j94201J79661p7693r243
$$ -21682 -53943 91032 -78776 55985 -35366 -12794 82971 -111230 68431 -9262 -18505
625a8505O0817j29514J90084j47618Q642J02873j28284J31267j39319Q1264N8300
$$ -18505 42312 -87202 102882 -44736 -36094 66779 -61505 69762 -69557 11707 70007
636G0007j66787J62656j03188N7874L809j10281J85787j52625N2219K9268q3026
$$ 70007 -96780 65876 -37312 20562 24371 -85910 99877 -52748 -529 28739 -54287
647e4287J36877j59710J02067R329r9015J35384j34092R9815k5212o8211J35207
$$ -54287 82590 -77120 24947 34276 -64739 70645 -63447 36368 11156 -57055 78152
658G8152j46579J02959k5292n4534J09971j32486J17110n3555m2555J16041j27744
$$ 78152 -68427 34532 9240 -45294 64677 -67809 49301 -4254 -46809 69232 -58512
669e8512R8178n8208l062Q9667j45308J18680m4547j2446N4006j08208J37818
$$ -58512 39666 -18542 -21604 68063 -77245 41435 -3112 -15558 38448 -69760 68058
680F8058q6635j2413P5300q9528J00525j00162L8769O1771j16898J02787p1622
$$ 68058 -18577 -30990 44310 -45218 55307 -44855 -6086 55685 -61213 41574 -30048
691c0048M3395J5118r4773J28200r0246K9950J5908o1696J07067j10545N6156
$$ -30048 13347 28465 -66308 61892 -28354 1596 17504 -44192 62875 -47670 8486
702H486J5135o4112R0912r8278P0467q504n4630R0394r5260P1315k0505l8896
$$ 8486 23621 -40491 50421 -47857 22610 14106 -40524 49870 -45390 25925 5420 -33476
714c3476P9786r1466P6529l4488k6138P5079q7804P1401m1074m722O0160r2239
$$ -33476 46310 -45156 31373 -3115 -29253 45826 -41978 29423 -11651 -16373 43787 -48452
726d8452P8085l7612p38L7738p6043Q8798n5215L67L8647o0089P5132o8357K3725
$$ -48452 29633 -7979 -8717 29021 -47022 41776 -13439 -13072 25575 -34514 40618 -27739 -4014
739d014L3971o5859O8457n9420L6194J0333n9177P7144o1913L4058o32m0393P2668
$$ -4014 29957 -35902 32555 -26865 9329 19662 -39515 37629 -24284 9774 9142 -31251 41417
752D1417p2739M2441l431l2058O1152p2279N3553j3495k6568N4658o7389N8276
$$ 41417 -31322 11119 7688 -24370 36782 -35497 18056 4561 -22007 32651 -34738 23538
764B3538k5246j7331M9656o3715N9215l4365o035M3833o1871N8168l8223N070
$$ 23538 -1708 -19039 30617 -33098 26117 -8248 -14283 29550 -32321 25847 -12376 -7306
776g306L3341n9307O0226m0426J0845K2261n1117O1749m6945J5880J6871m3291
$$ -7306 26035 -33272 26954 -13472 -2627 19634 -31483 30266 -16679 -799 16072 -27219
788b7219N7534n1550K4492J0960l9273N3391n1330L1483J567l3831N1860n1709
$$ -27219 30315 -21235 3257 14217 -25056 28335 -22995 8488 10055 -23776 28084 -23625
800b3625L5404o613k6191M9424n3398L8786j2199j8776M4370n3773M2766j7252
$$ -23625 11779 5166 -21025 28399 -24999 13787 1588 -17188 27182 -26591 16175 -1077
812a077j2705L8290n1558M6336k3604o955L3611m8420M7085k8965k24K8788m5751
$$ -1077 -13782 24508 -27050 19286 -4318 -11273 22338 -26082 21003 -7962 -8186 20602 -25149
825b5149M6380l1579N955K2101m1899M5965l3799J0594J5880l6830M4483l5889
$$ -25149 21231 -10348 -4393 17708 -24191 21774 -12025 -1431 14449 -22381 22102 -13787
837a3787J4702J0926l2136M1757l6388J8145O037k7333L8543l6135K1043J263
$$ -13787 915 11841 -20295 21462 -14926 3219 9256 -18077 20466 -15669 5374 6637
849F637k2586L5401l5590K3283k863j8251L2349l4513K4483o138j3974K8677l2811
$$ 6637 -15949 19452 -16138 7145 4282 -13969 18380 -16133 8350 2212 -11762 16915 -15896
862a5896K5175q976r840K4790l0704K5598j1467o317K1265k8261K5054j2998l347
$$ -15896 9279 303 -9537 15253 -15451 10147 -1320 -7637 13628 -14633 10421 -2577 -5924
875e924J7813k5217K3364j3545n13J3983k1960K1613j3548J335J0510j8310J9458
$$ -5924 11889 -13328 10036 -3509 -4022 9961 -11999 9614 -3934 -2599 7911 -10399 9059
888I059j3360K463Q457j5082J5933j1628L592N681j2330J3358r257K924L304q398
$$ 9059 -4301 -1838 6619 -8463 7470 -4158 -566 5115 -7215 6143 -3114 -190 3114 -5284
902e284J0704q404K403L499o342O586n385K378K238n585M845j484q94J426j954
$$ -5284 5420 -2984 -581 2918 -3424 3162 -2223 155 2393 -3192 1653 169 -725 701 -1253
917a253K500p94k782M292j683j918L175l262M028l336j568P694r061N031k52l046
$$ -1253 1247 453 -2329 1963 280 -1638 1537 -1725 2303 -1033 -2601 5093 -3968 1063 811 -2235
933b235P151j1562J0727k365p408J1743j1593J0508o443l928J5779j9350J2897
$$ -2235 4916 -6646 4081 1716 -5692 6051 -5542 4966 -1477 -5405 10374 -8976 3921
946C921l641m112J2758k1263K1052q331q121J7588j9967J9840j4340j249K0261
$$ 3921 280 -3832 8926 -12337 8715 384 -7737 9851 -10116 9724 -4616 -5865 14396
959A4396k8720K2821j1357M5J3996k9077L2961j8732l295J8797k6224L0259k6375
$$ 14396 -14324 8497 -2860 -2815 11181 -17896 15065 -3667 -6962 11835 -14389 15870 -10505
972a0505P207J9654l5609L3518k2671R666R543l3222M4870l2754P194J4241k8256
$$ -10505 -3298 16356 -19253 14265 -8406 1260 10803 -22419 22451 -10303 -3109 11132 -17124
985a7124L9461m1012K1258J2757l7813M2353l5272K3500r63l1408N3131m6797
$$ -17124 22337 -18675 2583 15340 -22473 19880 -15392 8108 7145 -24263 28868 -17929
997a7929K1181L900k4021M3799n3833L7404M44l3253M5554m5028L7966j5513k3157
$$ -17929 3252 7152 -16869 26930 -26903 10501 10945 -22308 23246 -21782 16184 671 -22486
1010b2486N4702n6584L4932r991j3788M1585o1793N2501j5115k2774M2654n0485
$$ -22486 32216 -24368 10564 573 -13215 28370 -33423 19078 3963 -18811 23843 -26642
1022b6642N1187l2601r389N0205o2222M7692k6156J451L3196o5025O6521l3497
$$ -26642 24545 -8056 -17445 32760 -29462 18230 -7926 -6475 26721 -38304 28217 -5280
1034e280p052L3860n1178O2560n1736R684L9210o2576N8011m3286K0853J8444
$$ -5280 -12332 21528 -29650 32910 -18826 -9142 30068 -32508 25503 -17783 3070 21514
1046B1514o1496P5832n1291J2453J8626m4902O7987o7712L0271K2080n4768O1308
$$ 21514 -39982 35850 -15441 -2988 15638 -29264 38723 -28989 1282 23362 -31406 29902
1058B9902n6149L9493r4n0011P6085o2804L0254O02l1890O4492p6070M7725K905
$$ 29902 -26247 13246 13152 -36859 39226 -23578 6676 7278 -24612 39880 -36190 11535 14440
1071A4440m1112N6778o1595N4167j9713l3465O9560o7825M3963j7767j4190N4576
$$ 14440 -26672 30106 -31489 22678 2965 -30500 39060 -28765 15198 -2569 -16759 37817
1083C7817p9018O2241j6666k3353M6165o2187O6832m0039j3522N7306o7281N5421
$$ 37817 -41201 21040 4374 -18979 27186 -35001 31831 -8208 -21730 35576 -31705 23716
1095B3716l7488O762L9856p5603P1906l6664p58L0006n7463P3817n7113R425L7348
$$ 23716 -13772 -7010 32846 -42757 29149 -7515 -8273 21733 -35730 38087 -19026 -9601 27747
1108B7747n9441O1669n2983K6670J9467o2102P3118n2100K0126J1147m3674O9403
$$ 27747 -31694 29975 -23008 3662 23129 -38973 34145 -17955 2171 13318 -30356 39047
1120C9047o7014L0726J5640m5657N7046n8009M2906l411m3874O7074n7235L3441
$$ 39047 -27967 2759 18399 -27258 29788 -28221 14685 11274 -32600 34474 -22761 10680
1132A0680q570k3498N8823p0742M4762k882k6866M4315n8337N6211k2535k5476
$$ 10680 2110 -21388 37435 -33307 11455 8573 -18293 26022 -32315 23896 1361 -24115
1144b4115N3595n4388M4957k9065m246M6053o5992N2040k3126l537L0308n5837
$$ -24115 29480 -24908 20049 -9016 -13262 32791 -33201 18839 -4287 -7824 22484 -33353
1156c3353O1561l6824k269L2802m8815N3383m2597J2750K5232n1644N5699m0636
$$ -33353 28208 -8616 -10885 21917 -26898 26485 -16112 -3362 21870 -29774 25925 -14711
1168a4711J4902J4749m1660N6071m8724K0427J4158l8384M7799m5781L0246J576
$$ -14711 191 14940 -26720 29351 -19373 1054 15212 -23172 24627 -21154 9092 10668
1180A0668l6490N2173m3687K5524n664k0961M8129n3709L1032j027j8810L3873
$$ 10668 -25822 26351 -17336 8188 2524 -18437 29692 -24017 7015 5988 -12822 21051
1192B1051m7420M3225j3265k1085L6997l8707L7261k4885n851L7142m6131L5596
$$ 21051 -26369 16856 3591 -17494 19503 -19204 18057 -6828 -12679 24463 -21668 13928
1204A3928k0968K822K3417m5053M4463k4835K293J7583l5967M4621l3724R022
$$ 13928 -7040 -4218 19199 -25854 18609 -6226 -3933 13650 -22317 22304 -11420 -2398
1216b398J5194l2584M1673l6877J6381R502k9087L9303l8677K3008L643k6447
$$ -2398 12796 -19788 21885 -14992 1389 10891 -18196 21107 -17570 5438 9081 -17366
1228a7366L6421l6544K7930o400k1627L8282l6591K5917j1686j0314L4388m2388
$$ -17366 19055 -17489 10441 4041 -17586 20696 -15895 10022 -1664 -11978 22410 -19978
1240a9978K9290r783o352K3536l9205L7961j6598p530K1914l1256L6605k6723
$$ -19978 9312 -471 -6823 16713 -22492 15469 -1129 -8659 13255 -18001 18604 -8119
1252h119P37K3277l2471L2255k7105J0657J5485l4406L5585k6189J3067O479k8887
$$ -8119 -7382 15895 -16576 15679 -11426 -769 14716 -19690 15895 -10294 2773 9252 -19635
1265a9635L9414l1446J4465L205k1995L7360l7351K0163J648j9015L2349l8187
$$ -19635 19779 -11667 2798 6003 -15992 21368 -15983 4180 5828 -13187 19162 -19025
1277a9025K7975m208j8205L0631l5315L1227j3146j3201L1887l5793L0083j7279
$$ -19025 8950 4742 -13463 17168 -18147 13080 -66 -13267 18620 -17173 12910 -4369
1289d369m602K8284l8880L2365j7452j95K0616l6985L7406k1509Q29J7082l1657
$$ -4369 -8971 19313 -19567 12798 -4654 -4849 15767 -21218 16188 -5321 -4492 12590 -19067
1302a9067L7893k7959N399J6343k9606L4916l0352J2502J2026k9698L4657k9903
$$ -19067 18826 -9133 -3734 12609 -16997 17919 -12433 69 12095 -17603 17054 -12849
1314a2849J6679M990k6874L6792l1768J7894N58k1227L6059l5708K0993j208j7385
$$ -12849 3830 8820 -18054 18738 -13030 4864 5422 -15805 20254 -15454 5539 4331 -13054
1327a3054L2077l6936K6537n249j5767K9801l5297K9565j1344j2198K9432l4875
$$ -13054 19023 -17913 8624 3375 -12392 17409 -17888 11677 333 -11865 17567 -17308
1339a7308K9668j5048o563K6730l5560L0724j6615k400K1938l4381L2983j9076
$$ -17308 12360 -2688 -9251 17479 -18081 12643 -3972 -6372 15566 -18815 14168 -4908
1351d908j11J8411l1307L3514k2343K751J6260k8686L1940k4278O894J3146k7127
$$ -4908 -5019 13392 -17915 15599 -6744 -3993 12267 -16419 15521 -8757 -1863 11283 -15844
1364a5844L0903k4734J0225Q842k4903L0915k5469J1929N387k1478K9933k6812
$$ -15844 15059 -9675 550 9392 -15511 15404 -10065 1864 7251 -14227 15706 -11106
$$ [...]
8191B6
##END NTUPLES=NMR FID
##END=
