##TITLE=1H_Ser EtOH-6

 8 sc, 
 2.11.2023
##JCAMPDX= 6.0         $$ Bruker NMR JCAMP-DX V2.0
##DATA TYPE= NMR FID
##DATA CLASS= NTUPLES
##ORIGIN= UXNMR, Bruker Analytische Messtechnik GmbH
##OWNER= root
$$ XWIN-NMR		Version 3.5
$$ Thu Nov  2 17:28:40 2023 Russian Standard Time (UT+4h)  she@DPX200
##.OBSERVE FREQUENCY= 200.1305
##.OBSERVE NUCLEUS= ^1H
##.DELAY= (6, 6)
##.ACQUISITION MODE= SIMULTANEOUS
##.ACQUISITION SCHEME= undefined
##.AVERAGES= 8
##.DIGITISER RES= 18
##SPECTROMETER/DATA SYSTEM= spect
##.PULSE SEQUENCE= zg30
##.SOLVENT NAME= CDCl3
##.SHIFT REFERENCE= (INTERNAL, CDCl3, 0, 15.7039)
##AUDIT TRAIL= $$ (NUMBER, WHEN, WHO, WHERE, WHAT)
$$ ##TITLE= Audit trail, XWIN-NMR		Version 3.5
$$ ##JCAMPDX= 5.01
$$ ##ORIGIN= Bruker BioSpin GmbH
$$ ##OWNER= she
$$ F:/spectra/data/she/nmr/H-F/1/audita.txt
$$ ##AUDIT TRAIL=  $$ (NUMBER, WHEN, WHO, WHERE, WHAT)
(   1,<2023-11-02 17:27:31.09 +0400>,<she>,<DPX200>,
      <created by zg, POWCHK disabled, PULCHK disabled
       configuration hash MD5:
       00 E9 B6 7A A2 85 ED C7 34 08 36 98 17 FE 4E 26
       data hash MD5: 16K
       34 CA 95 2E E3 99 BF 7C 23 DB B8 8E DE 5B 4F 55>)
$$ ##END=
$$ 
$$ hash MD5
$$ 51 BE AB 83 10 84 E1 2E F0 63 43 3C 6C 2E 5B 50
##$RELAX= 
##$RELAX= 
##$RELAX= 
##$RELAX= 
##$RELAX= 
##$RELAX= 
$$ Bruker specific parameters
$$ --------------------------
##$DU= <F:/spectra>
##$EXPNO= 1
##$NAME= <H-F>
##$PROCNO= 1
##$TYPE= <nmr>
##$USER= <she>
##$AMP= (0..31)
100 100 100 100 100 100 100 100 100 100 100 100 100 100 100 100 100 100 
100 100 100 100 100 100 100 100 100 100 100 100 100 100 
##$AQSEQ= 0
##$AQ_mod= 1
##$AUNM= <au_zg>
##$AUTOPOS= <>
##$BF1= 200.13
##$BF2= 200.13
##$BF3= 200.13
##$BF4= 200.13
##$BF5= 200.13
##$BF6= 200.13
##$BF7= 200.13
##$BF8= 200.13
##$BYTORDA= 1
##$CFDGTYP= 0
##$CFRGTYP= 5
##$CHEMSTR= <none>
##$CNST= (0..31)
1 1 145 1 1 1 1 1 1 1 1 1 1 1 1 1 1 1 1 1 1 1 1 1 1 1 1 1 1 1 1 1 
##$CPDPRG= <>
##$CPDPRG1= <>
##$CPDPRG2= <>
##$CPDPRG3= <>
##$CPDPRG4= <mlev>
##$CPDPRG5= <mlev>
##$CPDPRG6= <mlev>
##$CPDPRG7= <mlev>
##$CPDPRG8= <mlev>
##$CPDPRGB= <>
##$CPDPRGT= <>
##$D= (0..31)
0 1.2 0 0 0 0 0 0 0 0.06 0 0.03 0 0 0 0 0.0002 0 0 0 0 0 0 0 0 0 0 0 0 
0 0 0 
##$DATE= 1698931650
##$DBL= (0..7)
120 120 120 120 120 120 120 120 
##$DBP= (0..7)
150 150 150 150 150 150 150 150 
##$DBP07= 0
##$DBPNAM0= <>
##$DBPNAM1= <>
##$DBPNAM2= <>
##$DBPNAM3= <>
##$DBPNAM4= <>
##$DBPNAM5= <>
##$DBPNAM6= <>
##$DBPNAM7= <>
##$DBPOAL= (0..7)
0.5 0.5 0.5 0.5 0.5 0.5 0.5 0.5 
##$DBPOFFS= (0..7)
0 0 0 0 0 0 0 0 
##$DE= 6
##$DECBNUC= <off>
##$DECIM= 32
##$DECNUC= <off>
##$DECSTAT= 4
##$DIGMOD= 1
##$DIGTYP= 9
##$DL= (0..7)
0 120 120 120 120 120 120 120 
##$DP= (0..7)
150 150 150 150 150 150 150 150 
##$DP07= 0
##$DPNAME0= <>
##$DPNAME1= <>
##$DPNAME2= <>
##$DPNAME3= <>
##$DPNAME4= <>
##$DPNAME5= <>
##$DPNAME6= <>
##$DPNAME7= <>
##$DPOAL= (0..7)
0.5 0.5 0.5 0.5 0.5 0.5 0.5 0.5 
##$DPOFFS= (0..7)
0 0 0 0 0 0 0 0 
##$DQDMODE= 0
##$DR= 18
##$DS= 0
##$DSLIST= <SSSSSSSSSSSSSSS>
##$DSPFIRM= 0
$$ [...]
##$SUBNAM2= <"">
##$SUBNAM3= <"">
##$SUBNAM4= <"">
##$SUBNAM5= <"">
##$SUBNAM6= <"">
##$SUBNAM7= <"">
##$SUBNAM8= <"">
##$SUBNAM9= <"">
##$SW= 18.0518050122584
##$SWIBOX= (0..15)
0 0 2 0 0 0 0 0 0 0 0 0 0 0 0 0 
##$SW_h= 3612.71676300578
##$TD= 16384
##$TD0= 1
##$TE= 0
##$TE2= 300
##$TE3= 300
##$TEG= 300
##$TL= (0..7)
0 120 120 120 120 120 120 120 
##$TP= (0..7)
150 150 150 150 150 150 150 150 
##$TP07= 0
##$TPNAME0= <>
##$TPNAME1= <>
##$TPNAME2= <>
##$TPNAME3= <>
##$TPNAME4= <>
##$TPNAME5= <>
##$TPNAME6= <>
##$TPNAME7= <>
##$TPOAL= (0..7)
0.5 0.5 0.5 0.5 0.5 0.5 0.5 0.5 
##$TPOFFS= (0..7)
0 0 0 0 0 0 0 0 
##$TUNHIN= 0
##$TUNHOUT= 0
##$TUNXOUT= 0
##$USERA1= <user>
##$USERA2= <user>
##$USERA3= <user>
##$USERA4= <user>
##$USERA5= <user>
##$V9= 5
##$VALIST= <valist>
##$VCLIST= <CCCCCCCCCCCCCCC>
##$VD= 0
##$VDLIST= <DDDDDDDDDDDDDDD>
##$VPLIST= <PPPPPPPPPPPPPPP>
##$VTLIST= <TTTTTTTTTTTTTTT>
##$WBST= 1024
##$WBSW= 4
##$XGAIN= (0..3)
0 0 0 0 
##$XL= 0
##$YL= 0
##$YMAX_a= 306954
##$YMIN_a= -284192
##$ZGOPTNS= <>
##$ZL1= 120
##$ZL2= 120
##$ZL3= 120
##$ZL4= 120
##$ABSF1= 10
##$ABSF2= 0
##$ABSG= 5
##$ABSL= 3
##$ALPHA= 0
##$AQORDER= 0
##$ASSFAC= 0
##$ASSFACI= 0
##$ASSFACX= 0
##$ASSWID= 0
##$AUNMP= <proc_1d>
##$AZFE= 0.1
##$AZFW= 0.1
##$BCFW= 1
##$BC_mod= 2
##$BYTORDP= 1
##$COROFFS= 0
##$CY= 11.3945322036743
##$DATMOD= 1
##$DC= 2
##$DFILT= <>
##$DTYPP= 0
##$F1P= 15.7292609196834
##$F2P= 12.9074282941183
##$FCOR= 0.5
##$FTSIZE= 0
##$FT_mod= 4
##$GAMMA= 1
##$GB= 0.15
##$INTBC= 1
##$INTSCL= 1
##$ISEN= 128
##$LB= 0.24
##$LEV0= 0
##$LPBIN= 0
##$MAXI= 10000
##$MC2= 0
##$MEAN= 0
##$ME_mod= 0
##$MI= 1.114404
##$NCOEF= 0
##$NC_proc= 0
##$NLEV= 6
##$NOISF1= 3.799351
##$NOISF2= 2.8
##$NSP= 1
##$NTH_PI= 0
##$NZP= 0
##$OFFSET= 15.70392
##$PC= 1
##$PHC0= -23949.89
##$PHC1= -0.9473038
##$PH_mod= 1
##$PKNL= yes
##$PPARMOD= 0
##$PSCAL= 0
##$PSIGN= 0
##$REVERSE= no
##$SF= 200.130013532006
##$SI= 16384
##$SIGF1= 3
##$SIGF2= 2
##$SINO= 400
##$SIOLD= 16384
##$SREGLST= <1H.CDCl3>
##$SSB= 0
##$STSI= 0
##$STSR= 0
##$SW_p= 3612.71676300578
##$SYMM= 0
##$S_DEV= 0
##$TDeff= 0
##$TDoff= 0
##$TI= <>
##$TILT= no
##$TM1= 0
##$TM2= 0
##$TOPLEV= 0
##$USERP1= <user>
##$USERP2= <user>
##$USERP3= <user>
##$USERP4= <user>
##$USERP5= <user>
##$WDW= 1
##$XDIM= 8192
##$YMAX_p= 0
##$YMIN_p= 0
$$ End of Bruker specific parameters
$$ ---------------------------------
##NTUPLES= NMR FID
##VAR_NAME=  TIME,          FID/REAL,        FID/IMAG
##SYMBOL=    X,             R,               I
##VAR_TYPE=  INDEPENDENT,   DEPENDENT,       DEPENDENT
##VAR_FORM=  AFFN,          ASDF,            ASDF
##VAR_DIM=   8192,          8192,            8192
##UNITS=     SECONDS,       ARBITRARY UNITS, ARBITRARY UNITS
##FACTOR=    0.0002768,     1,               1
##FIRST=     0,             0,               0
##LAST=      2.2672688,     0,               0
##MIN=       0,             -284192,         0
##MAX=       2.2672688,     306954,          0
$$ Real data points
##PAGE= N=1
##DATA TABLE= (X++(R..R)), XYDATA
$$ [...]
800a846K498K347J419k62j626k326k648j896j85J459K444K751J909L84j113k092
816A217k531k083r37N14J828K606K515J350l88j926k653k393j148M36J572J982
832c9J905J296L08p06j631k371k142q21Q70K251K749J879K92j029j798j940j589
849b516r14N4J236K195K384J506j44j696k298j960j097Q0R69J309J741J889Q78
866C616n38j562k424k245n14J025J472J915J758L79m69o93j700k122q05J46O13
883b148J961K229O77lk24j820k334q75m77n3K127K545P80N24J66j999k174n52
901a650r91p33J859K119O77J347P69k004j773k27j544j171J669J304L76K372J452
918C851k033j569n69k374q13K432Q79j77K356J065j726Qp1l389j423J845Q1M91
$$ y = [-1846, 652, 2999, 4418, 4156, 2530, 204, -2444, -4340, -4525, -3066, -622, 2129, 4038, 4422, 3309, 1217, -1314, -3397, -4334, -3820, -1992, 614, 3129, 4479, 4091, 2165, -488, -2881, -4029, -3593, -2021, -39, 1866, 3162, 3470, 2764, 1133, -1238, -3380, -4201, -3331, -1080, 1669, 3548, 3840, 2811, 1013, -927, -2516, -3430, -3376, -2140, 55, 2439, 3945, 3801, 2105, -193, -2153, -3250, -3170, -2201, -892, 849, 2738, 3616, 3078, 1516, -908, -3153, -3667, -2642, -1170, 745, 2503, 2882, 2413, 1720, 20, -2102, -2907, -2761, -2148, -187, 2042, 2719, 2716, 2492, 672, -1662, -2537, -3014, -3067, -940, 1605, 2385, 2909, 3075, 1076, -1098, -1650, -2641, -3374, -1515, 604, 1281, 2628, 3397, 1393, -380, -607, -2151, -3322, -1653, -349, 27, 2399, 3851, 1818, 249, -320, -2694, -3507, -1075, -196, -373, 1983, 3048, 1322, 1330, 1259, -2130, -3553, -1708, -1627, -1136]
936a136L488P40k010P59L1l492r32J181j453N79M316P26j618J176p89l583N37
953a480J441k519KL519K1q6K989j318m527L10P70k289J682L312j770k19L768r77
971B629l245Q96j365l744K667L921j688M30K918k486j782L169j636m720J635J811
987e90j599L388L887l842k411K607j922k490L330l19l868L341M194k345J1J714
1003C086m941k684M669L33k835L116J201l371K862L628m913l204K189k065p02
1018c631O270R34m753J696K123l673Q91K783n248k731N477J223j435L947o66o381
1034c174J518L927l619q26L390l000j187O844Q21n383P04Rm731K763N490l728
1050a82k317M455q10j982M625r86p373R40L900k103K008M634m309l446N032K14
$$ y = [-1136, 2352, 3092, 1082, 1841, 1872, -1620, -2552, -1371, -2824, -2245, 2071, 2797, 1179, 2355, 1566, -2017, -1480, -39, -2558, -2556, 963, 984, 898, 3887, 2569, -1958, -1648, -878, -3167, -1485, 1827, 57, -162, 3606, 2629, -616, 280, -1085, -4829, -2162, 1759, 71, 501, 3419, 933, -849, 2320, 684, -4036, -2401, -590, -2189, 1199, 5086, 1244, -1167, 1440, -482, -2972, 358, 39, -3829, -488, 3706, 1361, 1372, 3086, -1855, -4539, 130, 463, -2372, 744, 1945, -1426, 1436, 5064, 151, -3053, -864, -2929, -3631, 2639, 3573, -1180, 516, 2639, -1034, -143, 2640, -2608, -5339, 138, 1361, -74, 3873, 3207, -3174, -1656, 2271, -1348, -2174, 1216, -1784, -2971, 3873, 4694, -689, 15, 24, -4707, -1944, 3546, -182, -2499, 1956, 1146, -836, 3789, 2803, -4570, -3630, 270, -1833, 175, 4809, 500, -2946, 2086, 2300]
1066B300m211K107q6n232L109O398k563j901K741l489l103N433P71n540J589K996
1082A319k749K408M783n057m648L471k60k254M803R90n710J845M884k909j071
1097a55K594m677l529O021K301l341K340J114n084J503M876l939l457L133j067
1112a367j540O063J551n902M4K401l324O94M264l640l368M881J699k364K618k05
1128B505o362M42M835j668q17L424k299k693M909J485m817p9R12l574J831N613
1144C647j997k962K708o87k643L402P03n313K86L744j186P41L598l128m020L009
1160i8J018k727J901J195l731J166M636j564k219J580k162k773L685K058l006
1175a041P47K167k251K58L039k586l372K101O40j372K860J533l369q1K543j756
$$ y = [2300, -1911, 196, 110, -5122, -2013, 4385, 1822, -79, 2662, -827, -3930, 1503, 2274, -3266, -1677, 1319, -1430, 978, 5761, 704, -3944, -473, -733, -2987, 1816, 2806, -2904, -1059, 3825, 916, -155, 2439, -2238, -5767, 254, 2555, -786, 1554, 2668, -2416, -913, 3963, 24, -3433, -300, -1367, -2907, 3156, 4707, -1195, -1151, 1250, -2074, -1380, 2884, -756, -4124, 757, 2456, 92, 2710, 2505, -3857, -3415, 1420, -248, -1065, 2359, 60, -2633, 2276, 3761, -1056, -1135, -223, -3797, -1966, 3647, 1650, -1312, 1396, 709, -1934, 1468, 2171, -3142, -2856, 888, -298, 443, 4041, 913, -3107, -98, 920, -1807, 94, 1289, -2442, -1276, 3360, 1796, -423, 1157, -1005, -3778, -93, 1965, -1041, -294, 1873, -378, -120, 2919, 333, -3039, -938, -298, -1670, 1190, 2723, -646, -727, 1816, 60]
1191F0j261J896j537k056L148J881j949O60Q11k940k96K571j271j569K155K69
1207E72j269K185Q70l058m84J363j450j19K415o66j385K088P16j870L70K34k418
1224a906M5K381l04m69J619m71j570J168M08j992k8J082p94L92K010m82j314P19
1242D94k37j422N88O96j084M23J632k92m42O69q76j433O32N07o80O03R52n34O9
1261B65R41o73j065J99k76o35Q96R25l08K21N31p28o29K71m23n00O55N28j39M31
1281D87L94n92l73J15m92m11M30K94Q4O09L67m07l11j79n60k82L10K23J99N42
1301D47K81j95j69k11m75k50R2L6J44M16L57J08L0k35n18m19j04J12L14M31K86
1322D78K5p8j56k94k96j91l4J19L27M16K42J7j52l17l55k29n9L6K19M00L13J69
$$ y = [60, -1201, 695, -842, -2898, 250, 2131, 182, 842, 1653, -1287, -1583, 988, -283, -1852, 303, 572, -697, 1488, 2358, -700, -1184, 179, -1271, -1390, 1025, 359, -1026, 1062, 1778, -92, 278, 512, -1906, -1861, 520, 216, -253, 1366, 895, -675, 493, 901, -1091, -1119, -37, -831, -439, 1571, 1089, -225, 494, 257, -1165, -577, 119, -965, -542, 1090, 798, 356, 1025, 149, -1284, -652, -145, -825, -222, 730, 196, 265, 1206, 533, -532, -333, -609, -1244, -348, 577, 269, 490, 1021, 293, -336, -65, -488, -988, -333, 195, 56, 487, 881, 289, -84, 31, -461, -872, -442, -148, -64, 545, 912, 505, 194, 15, -545, -827, -517, -294, -95, 447, 728, 533, 364, 153, -322, -572, -480, -444, -300, 116, 473, 581, 611, 376, -142, -561, -665, -553, -239, 192, 478, 503, 425, 269, -25, -321, -512, -546, -427, -100, 316, 558, 575, 423, 106, -249, -478, -537, -501, -282, 118, 431, 600]
1344F00jk78m50l25j06P7K46L01K02J14O2r4k02k74k84j41Q9K81L76K99O9j50
1366D11k37l33k89n3P1J72L49L28O0k8j27l74k96k3p7QL68L15Q3K05K0m76l15
1389b38n2k27l8N10K11J8L71N1n59k00J0l91K4N63mj19N15P9m21J37o8q21j09
1412g58N84j6K05P89k24p07K84K7p27J71L87n82J85J076j28m47M27m17r47N48
1432b70M80p76K28Q64m60OR88o82j216N15J71o59R15Q03j102q9J096n81o17Q42
1452D56o28j259J177R89q38M14P27j390l56J429o06j161R88J37r28J365J068j694
1470a10m60J022r75l85J688m92j550J334R58j170N90P15k152n39K013k85q33J476
1488H45k97j737J486J260j964l42J088j403r7K676l95j987J107L21j665J283J272
$$ y = [600, 599, 321, -129, -454, -560, -483, -237, 64, 266, 380, 442, 348, 146, -128, -412, -553, -464, -183, 193, 492, 561, 411, 174, -159, -448, -501, -430, -258, 91, 419, 479, 451, 324, -50, -346, -369, -446, -438, -70, 245, 328, 533, 553, 77, -238, -290, -517, -555, -45, 166, 184, 555, 606, 47, -153, -143, -534, -510, 53, 49, -70, 445, 524, 103, 240, 172, -649, -758, -174, -190, 15, 804, 580, -127, 157, 184, -543, -372, 15, -567, -382, 694, 566, 119, 546, 129, -818, -270, 210, -566, -338, 526, 66, 72, 1060, 378, -838, -323, -152, -811, 104, 907, -195, -284, 812, 231, -386, 456, -172, -1431, -254, 735, -103, 311, 1038, -352, -708, 721, 115, -1046, -58, 79, -849, 516, 1584, -110, -570, 452, -523, -908, 780, 288, -1262, 72, 1030, -140, 450, 1165, -987, -1526, 487, 202, -631, 845, 548, -1189, 297, 1557, -407, -749, 339, -1064, -1161, 1515, 1120, -867, 240, 561, -1104, 179, 1451]
1505A451k460o07K218l95m81K031r12k734J369J476j602M97J310k204m03L044
1521A598k49j944J044m60k215J977K221k159o41J687j268m86K784p77l090J118
1537h60J247j357J529J823k906j260K598l65j255J897p09k909J971K581j755j74
1553I6J246k561r41L434kk458J243L78k066J999K430k914j563J924r36o23L121
1570A807l36l335J269J880j714O84J599l082j407L346M23j573J666l93l078J644
1586f00K713k144r67J611j664o74L651J93l176O60P74k026J462K483k662j605
1602a971K542j05j017K323n10l621J060K439j424K37J764k433j361L279L74k323
1618g47R52mk541J749L018j945j352J589j223j018K950R1l163P01J575j369J034
$$ y = [1451, -1009, -1616, 602, 207, -274, 1757, 845, -1889, -520, 956, -646, -149, 1161, -1043, -1446, 1598, 1349, -595, 449, -11, -2226, -249, 1972, -187, -828, 859, -409, -895, 1889, 1112, -1978, -860, 387, -970, 559, 2382, -524, -1784, 814, 449, -806, 1091, 382, -2527, -556, 2025, 270, 96, 1342, -1219, -2160, 1274, 1272, -1186, 57, 435, -1631, 368, 2798, -116, -1679, 245, -691, -1314, 1807, 1471, -1864, -595, 1285, -429, 255, 1854, -1228, -2635, 711, 1134, -439, 1227, 834, -2244, -600, 2113, -31, -998, 613, -1051, -1725, 1926, 2119, -1057, -397, 377, -1649, -187, 2296, -366, -1971, 571, 466, -551, 1772, 1262, -2359, -1299, 1140, -284, -47, 1717, -716, -2077, 1202, 1576, -747, 205, 201, -2340, -591, 2427, 482, -870, 719, -504, -1522, 1428, 1519, -1644, -943, 632, -737, 297]
1635B97K107k531j913K277J92j316J780M3k820J096K561j366o47J265j865j330
1651b170K868P52k096O87O13j925R66K335j866j619J522l44q44K358L83k688L49
1668g19J509j273J67J625j703j414K230O05j319R94J33k306N67K084j108p68J307
1685F11q06r47K092M98k059J58P24j296N44J864j159j202J340M4r95J174K27j956
1703a144K67J511o44j50J186r57j158J377M22j267M31M73j192M20J596p17q75
1720d21P61m39q56J184M70j257K14Q71o93O6J019q05r89Q27J94o67O92M38j007
1739c98J30R43n75m68O06m01o25R36M59p19J59L77p32l1P57m07n44N64Q2l98N81
1760B96L22p49j05L95m04j53N99j40l71N11K13m68R9J77n21n1M83j55j90M06r
$$ y = [297, 2404, -127, -2040, 237, 429, -887, 893, 936, -1884, -788, 1773, 407, -240, 1025, -840, -2170, 698, 1450, -646, 41, 654, -1271, -305, 2030, 164, -1455, 67, -277, -1121, 1237, 1620, -1068, -719, 790, -483, -316, 1309, -394, -1808, 422, 1027, -292, 702, 835, -1471, -904, 1180, 72, -696, 611, -195, -1142, 950, 1448, -611, -453, 271, -1025, -481, 1383, 224, -978, 362, 406, -589, 585, 812, -1144, -877, 634, -10, -160, 1026, 69, -1089, 288, 710, -557, -126, 347, -845, -425, 1171, 454, -421, 340, -99, -955, 229, 699, -558, -344, 527, -166, -100, 919, 114, -875, -48, 146, -521, 171, 609, -398, -268, 675, 100, -368, 238, -163, -788, 148, 607, -112, 47, 424, -308, -339, 418, 11, -533, 31, 113, -285, 296, 618, -131, -236, 159, -245, -398, 201, 61, -310, 201, 414, -54, 45, 222, -299, -350, 133, -22, -212, 194, 185]
1781A85k94K44J38m56n3K26j83K5M19l2k29J44k2l31P5J48j74M4K80l8q7J77p3
1804A33k29OL2j49N4K04J4K8J24q1j70k5j8q9N6J16kM4Q8j4r8l4n0p1J8O8M7L7
1832C9P6K2m7p5p4j05j8P8R8Q2P0J6p8n1l6q1m6J4L8N2J00O2k8l0m2q8o9J0PM5
1862e9J11O4ml2p2r4rL4mL9M7K5L6L5p2o4p0m2LR9N2KQ1K2o1mn8j71j4J17K1O2
1894B0J46o0j18Q0Kj56K3L3j62J04K51l8r4Q7j40j99J82R3k10J08J80j52L2K54
1918B66k23k61J99j4k07K99J63l23N4L28k33j53K80k59l32L96K09l02K00K09m53
1939a57j5M80k80l33L74p4l34N25K65n90nL45m44k8O26k90m94N54J53m65L80K25
1961D18q34m4P10k70k12O36k87o39O89L66p43R7L36p35P7J029k95o55N57q2o60
$$ y = [185, -109, 135, 273, -183, -236, -10, -193, -168, 251, 219, -10, 134, 112, -219, -144, 4, -170, -126, 154, 116, 29, 206, 133, -96, -90, -58, -207, -153, 51, 65, 93, 217, 136, -34, -59, -77, -166, -110, 6, 4, 48, 136, 122, 24, -10, -60, -131, -113, -45, 2, 39, 115, 137, 90, 15, -59, -164, -182, -104, -6, 76, 146, 162, 84, 33, -3, -84, -130, -116, -78, -26, 74, 136, 108, 78, 36, -52, -121, -111, -104, -59, 52, 116, 112, 80, 8, -86, -95, -61, -65, -26, 21, 46, 82, 117, 45, -19, -89, -131, -128, -29, 23, 25, 106, 128, 67, 63, 5, -166, -180, -63, -42, 20, 166, 106, -12, 68, 70, -86, -63, -30, -192, -88, 163, 125, 31, 118, -22, -221, -39, 54, -156, -48, 132, -20, 12, 266, 43, -218, -19, -33, -240, 59, 222, -101, -47, 281, 48, -105, 175, -84, -416, -20, 189, -113, 87, 296, -157, -172, 308, 28, -305, 69, -5, -339, 186, 451, -139, -144, 201, -243, -271, 355, 65, -429, 125, 278, -187, 193, 418, -416, -460, 250, -20, -232, 404, 117, -522, 167, 533, -210, -113, 223, -512, -435, 594, 299, -356, 201, 119, -541]
1982e41P27M75j046j17P66m21o0R76m87j046O80M33p06M67M92j124p6J234k82
2001C44o12O67m11j011J016Q32j008k3O39q69m0J409m71j217O52J86p46R81P74
2020A092j470l36J130m38l10J117n66j415J054Q96q95K83N70j437k39J704k33
2037E07j010P62j72j098J224J100j463m60Q60p67j20J712m02j629P46O36q82P66
2055C10Q25j757n73J594j08n74J129m87j682J100J255j129p9P32j312k59K038
2072A023j22j461N98M6j174J192J294j628o58J189m71k71J624m79j956P36J020
2089E02q66N43R44j698o38J839J6r77Q34l01j610J142J545j180m58Q31j025l85
2107i42J957p7j745M97N17r67R56J281j638r51J288j44n04J378k76j872P50J306
$$ y = [-541, 186, 661, -385, -502, 264, -157, -217, 759, 272, -774, -94, 339, -367, 100, 592, -532, -608, 626, 344, -268, 399, -12, -1023, -7, 825, -183, -206, 433, -436, -476, 933, 462, -755, -103, 83, -663, 318, 1092, -378, -714, 416, -22, -332, 785, 219, -1196, -142, 754, -141, 142, 712, -725, -964, 740, 507, -503, 259, 87, -1011, 213, 1313, -150, -610, 250, -517, -637, 1075, 673, -956, -210, 426, -456, 310, 1135, -622, -1195, 399, 291, -283, 846, 359, -1323, -223, 1032, -97, -176, 556, -756, -1015, 1023, 901, -560, 38, 84, -1090, 102, 1396, -232, -890, 299, -172, -443, 1181, 702, -1254, -518, 502, -364, 179, 1123, -575, -1213, 626, 642, -335, 499, 198, -1412, -270, 1275, 95, -363, 468, -557, -942, 1015, 938, -807, -310, 207, -760, 196, 1477, -161, -1112, 176, 32, -472, 906, 630, -1242, -492, 814]
2125H14q48R5Q03j461o80J835K02j138O37Qj345R48J451j251p40Q97o13l78J700
2144I36kj706L75P48q26N20J080j388q74J357J46o58R39j22j602N59J303p36k68
2163b19P84r19o07J550K68j241K98K71j003O11J271r58p75Q59k02m77J138M3j450
2182g58K68Q66n65J68Q59r60p64J113K04p31N25J01j092M23J105o18m25O03n10
2201a88n14J080K31j022K11M41o03L00Q56p25p07O87K5m28O94J71r91J54P44m17
2221aj34N63n23n46P86K70n95K38K27o83J63P44m40m19M61j31l46O27J98p19M4
2242b16M01l71L8N40l65m42M93J33l69K89J40n77N4M83k19j67L76j79l21M03J45
2263B69m17O3K13l14N2M17j93k82K58kk38K42J12l51PK92j30o2K43j32k56K11
$$ y = [814, -34, 61, 864, -597, -1277, 558, 760, -378, 259, 267, -1078, -130, 1321, 70, -670, 227, -386, -764, 936, 934, -772, -397, 351, -475, 45, 1125, -263, -1137, 220, 366, -292, 647, 525, -1077, -518, 785, 49, -219, 565, -354, -961, 589, 857, -384, -86, 185, -818, -207, 1064, 106, -669, 190, -12, -489, 649, 692, -758, -490, 376, -189, -21, 838, -122, -886, 227, 431, -300, 225, 326, -766, -343, 762, 144, -281, 322, -188, -702, 378, 609, -413, -202, 239, -364, -64, 792, 67, -640, 47, 72, -356, 338, 509, -482, -328, 416, -1, -135, 428, -95, -641, 145, 415, -180, 58, 285, -398, -235, 509, 69, -350, 111, -20, -366, 261, 459, -260, -216, 185, -186, -148, 392, 27, -415, 78, 211, -158, 131, 271, -306, -252, 231, 12, -155, 221, 42, -279, 124, 269, -148, -85, 128, -186, -134, 283, 90, -192, 66, 64, -174, 68, 180, -171, -164, 128, -2, -64, 179, 47, -209, 2]
2285BQ5j97Q3J38k00J0K26r0j53J29j8j48J20J16j62K1J48q7n6J28o1j47P8P0
2309C5p6N5Q3j02k8R0n2o9N9Ln8M3Q2o4pM3n1m7M4J4m3M1M6l3MK9l7l1QJ0k7K2
2341a4L7pjJ5ql4OPk9J4K4j0J5L1k2k4k6Mj9K3M1j2mK3j3l2Pj6j9J5L0nJ9J3r
2376B0k9J8k5j6J6JPK8J1k9K9j1m3PL3l6NL5j1qL6k1m6K0%l9M8L9n5PN9m6l7P3
2410D0n2p0Q4K5q1O8P1j19LR0p7o1J06k2r7J40N7j47K1Q1j18j3J79r8j18J49K6
2437F7j35J23O2k31QJ95j18n9K31j13k03K15J04k35Q4J12k56J5L28j46j82K19
2459H5o1k24K84J50l74PK43k10ML88k08l55K75J00k64K47J73m59j4M29j63j56
2481a03L31k18m00M31K36l92P8K42m30J2N64k18m04L13j7l36M50K81n91p8M16
$$ y = [2, 87, -110, -27, 111, -89, -79, 147, 57, -96, 33, 15, -133, -13, 103, -59, -38, 110, 23, -33, 95, 34, -113, -35, 35, -41, 14, 97, -5, -33, 57, 5, -64, -5, -2, -60, -17, 65, 1, -6, 37, -14, -61, -17, -3, -46, -5, 41, 8, 12, 41, 4, -27, -19, -9, -36, -14, 23, 16, 15, 30, 22, -12, -6, 1, -28, -14, 10, 0, 15, 46, 24, 0, -26, -22, -41, -18, 23, 11, 7, 30, 17, -15, -8, -24, -43, -28, 2, -3, 16, 29, 20, -9, 9, -16, -32, -16, -15, -8, 20, 31, 2, 31, 20, -23, -16, 17, -19, -14, 21, 10, 2, 38, 17, -29, -9, -9, -48, 0, 39, -16, -9, 50, 4, -33, 40, -12, -82, 2, 27, -54, 14, 85, -34, -31, 59, -18, -79, 27, 5, -92, 48, 105, -42, -21, 60, -58, -71, 108, 10, -108, 41, 67, -68, 55, 117, -114, -106, 89, -29, -88, 143, 30, -173, 42, 146, -89, -5, 107, -149, -134, 194, 48, -134, 85, 24, -200, 84, 234, -140, -133, 110, -100, -96, 292, 84, -271, 4, 104, -160, 87, 260, -199, -213, 216, 53, -103, 228, 10, -390, 41, 277, -115, -37, 205, -225, -213, 351, 133, -271, 42, 25, -311, 139, 420, -171, -249, 167]
2502A67k59o7N39k71n80M32K88l75K31K62o90p3O96j57l35M15j74n53N80M42o16
2523i8o0L49m94nQ06k28o82M05J18m36N00L84q44j80O71j90j60O33l36p93N55
2544h5M75n01J44L34p53r1R41j37n68L92j12o31O67N87p86k00N02l91o7R03k73
2565C50r16L97L55m63M45M59r27l02Q67j00l40N89k72q99O28P09o14k1L88p32
2585c99j37J066j05p78L69N4n98O47O64q90l75O32k72j59Q81k53j005M39N49m72
2605a42K63M52r29l35R83J9m99M94j70q56N91P99o49k46M61n49j78J038l6r09
2625c98K67K64n45M69O61q57m55P26o2k75P09j88r89L99O73m51O0M43p37l42R66
2646C38Q1o33L27ko98N04P58o39l62M79l28k08Q64m9q94K30M10m13K98N52p40
$$ y = [167, -92, -159, 380, 109, -471, -39, 249, -126, 105, 367, -323, -396, 300, 143, -192, 223, 49, -504, 76, 518, -98, -158, 191, -303, -308, 498, 270, -412, -7, 111, -325, 175, 559, -285, -465, 206, 16, -144, 489, 153, -640, -85, 390, -111, 33, 367, -386, -477, 464, 327, -241, 151, 39, -592, 75, 662, -124, -324, 178, -213, -280, 623, 350, -566, -169, 186, -277, 168, 627, -300, -602, 265, 165, -175, 414, 142, -757, -129, 580, -34, -55, 333, -399, -536, 530, 425, -353, 16, 70, -528, 119, 783, -107, -482, 150, -122, -281, 600, 347, -658, -219, 330, -142, 121, 573, -356, -691, 292, 311, -188, 306, 136, -720, -129, 670, 21, -225, 236, -313, -491, 547, 511, -398, -131, 133, -412, 57, 718, -139, -594, 132, 70, -205, 504, 316, -673, -274, 399, -52, 8, 451, -286, -628, 338, 419, -214, 113, 111, -587, -83, 675, 36, -326, 153, -175, -383, 481, 432, -462, -232, 178, -235, 63, 615, -125]
2667a25m64O99P0l46M74o3q11L30P00m06j45L83n01l15Q08J32o45J88J64n14L20
2688f7O23n24m16M56j02k34N99K2p47J62M44l09P2M20n18l67O07J37l87K82K3
2709A76n80K16N57l23k15L28k44k46N72R6n41R8K24l18J44M32l67l30L78L1k47
2730a59L33M8n12R6L95k06o0K98k76k77M08J22l34J31J04l25J05L85k15k13K13
2751F1o4j98L18Q6l64O1K11j60RK60k07k19K34O3j85J56O2k62L6K58j31j03J69
2774I1r3j55K03R3j98K7J07j67J8K01j08j38J50Mj05J09P8j87jJ37p1m2J09m2
2798B0j06J05N6j02K5N4r7oJ18l6p1P6j1q1P4L7r3KO2l3j4P3k7o3L2L2n5J9L1
2827B1m7%O0j0l5K3ol0K3J8k8lK5kj3K8kk6rK3j5PJ3j0pPKj1jJ1j4pK6j7kJ6R
$$ y = [-125, -589, 110, 180, -166, 308, 245, -566, -236, 464, 58, -87, 296, -205, -520, 288, 420, -225, -37, 127, -387, -67, 556, 32, -384, 72, -30, -264, 335, 357, -390, -228, 216, -93, -21, 399, -119, -486, 121, 258, -129, 153, 176, -404, -188, 369, 46, -169, 159, -85, -331, 241, 337, -204, -106, 118, -200, -56, 376, 9, -321, 57, 88, -159, 174, 222, -290, -194, 201, -5, -65, 233, -43, -320, 88, 210, -124, 7, 111, -214, -109, 276, 61, -152, 61, -3, -201, 117, 203, -161, -100, 111, -49, -40, 220, 13, -206, 28, 91, -94, 62, 124, -138, -102, 156, 25, -78, 91, -2, -157, 46, 139, -59, -32, 75, -92, -74, 127, 19, -119, 31, 35, -70, 39, 117, -70, -71, 66, -5, -47, 62, 20, -86, 19, 75, -27, -2, 52, -45, -51, 67, 31, -40, 36, 25, -56, 18, 55, -38, -36, 26, -7, -21, 52, 25, -38, -6, 26, -29, -10, 21, -26, -26, 34, 24, -11, 12, 6, -24, -1, 17, -11, -14, 11, 9, -4, 24, 22, -4, -13, 10, -5, 2, 15, 5, -2, 5, 7, -4, -5, 6, -8, -15, 11, -6, -8, 8, 17]
2864A7k0JJrmJ4LqJ4Jj2%Lj3OK6j1nJ8j7JM%k1J2Kj1RK2j4rJ5j5j8K9%k4J7Rl7
2904b4K2K4l1nK4k4JL5j3l7M9Om6K2Rm3J1M1j3j4N1k6n8N5J6p0M0L0o3PP8m8m2
2937c6O8l5o1R2K4j11M4P1r5J2J13q4q3R5Oq3J02M5j67L2J19p5l5J22r2j18J66
2964C6M0j15N6O0j69J5J96j00j01J35n2j24J77Q6k24J6J47j46KK25j40j85J83
2987A8M5j50J41P2k96L7K48j06o7J91j39k10K69J11k44N5J26k51M7L20j44k13
3009a40J89m0j92K80J25l50oK39j62LK94j98l18K69J35k21J58J10l70oL98j23
3031G4j85K52j72k74L58K27l56J4J68k83M8M29j95l47K46M6k33L26J75m98m3L66
3053A43j47o7L26k19m03L67K45l12J16J38m55J4N29j33k84K32r8l13M02K79m69
$$ y = [17, -3, -2, -1, -10, -14, 0, 3, -5, 9, 10, -2, -2, 1, -12, -6, 20, 9, 4, 22, 5, 6, 10, 10, -11, 1, 3, -8, 1, 23, 9, 0, 15, 0, -18, 11, 11, -13, 4, 13, -24, -2, 22, -9, -14, 10, -14, -13, 22, 9, -28, 21, 27, -19, 3, 12, -31, -20, 21, 8, -6, 45, 19, -39, 16, 32, -38, 2, 32, -31, -24, 54, 6, -36, 32, -3, -64, 28, 52, -59, -15, 56, -39, -27, 86, 2, -81, 14, 20, -63, 39, 84, -83, -51, 68, -7, -42, 80, -12, -130, 36, 76, -39, 17, 77, -92, -77, 119, 19, -82, 53, 1, -123, 54, 140, -84, -68, 79, -67, -65, 160, 20, -165, 18, 63, -87, 54, 126, -170, -133, 115, 9, -58, 133, -6, -216, 53, 164, -80, -25, 101, -150, -103, 217, 73, -140, 49, 9, -183, 97, 222, -128, -134, 105, -57, -54, 240, 42, -276, -7, 128, -93, 65, 175, -195, -201, 197, 74, -111, 141, -31, -305, 53, 280, -76, -62, 106, -177, -129, 300, 105, -242, 4, 50, -183, 143, 318, -180, -223, 143, -4, -71, 255, 36, -367, 0, 245, -67, 49, 187, -268, -254, 275, 142, -142, 90, -8, -321, 81, 360, -109]
3074a09o6K74k44RN01k23m78K93J56k72K74K11n59r0N01r6j68L29k03m53M05L28
3096C20l66J3K10m15j9N98j23m22K24nl09L86L04n13j35L62j83m8M62k29n01K99
3118i0K65k69J89J94n34r1N39m4k75K81j51m07L98L77l98r3K40l28m1N61r6m81
3140b54K06J13k77L07K89n15j77M10q8j19L87j69m88K81L40k87N9J86m30r0N43
3161B27k2l38K09m4l57L37L53m04j43K73k03o4M76j01m63J86J81k42K12K29m35
3182a33j45L98k2j80K66r9m15K56L26k54l1J85k95r4M48j5l38J42M3k66K31K96
3204C04l22j74K66r0j08L18m0l80J49K19j87P3J77k98j36L29J4j94J64j0k98J89
3226c5K53k00r1J56j60q1K98Ok78R2J07j73J03J96k27j27K14k7j09J87j2k52J01
$$ y = [-109, -175, 99, -145, -136, 365, 142, -336, -43, 113, -159, 115, 326, -233, -323, 178, 82, -86, 243, 40, -413, -8, 320, -46, -33, 177, -238, -257, 341, 218, -204, 20, 15, -294, 92, 396, -117, -252, 110, -73, -121, 341, 112, -389, -90, 175, -94, 95, 289, -245, -336, 203, 159, -116, 165, 14, -393, 5, 382, -16, -109, 131, -197, -238, 323, 227, -254, -48, 65, -212, 95, 384, -131, -308, 102, 14, -105, 282, 113, -375, -94, 246, -41, 18, 204, -226, -316, 227, 205, -133, 76, 32, -325, 12, 365, -39, -182, 91, -112, -176, 300, 199, -264, -78, 103, -139, 73, 302, -133, -278, 120, 98, -82, 184, 85, -330, -74, 252, -2, -33, 152, -143, -237, 211, 196, -142, 0, 43, -223, 8, 304, -18, -192, 74, -16, -124, 194, 154, -226, -77, 142, -45, 28, 205, -93, -229, 100, 114, -80, 84, 74, -224, -35, 218, 18, -73, 83, -77, -158, 140, 146, -132, -40, 67, -106, -3, 193, -34, -161, 53, 26, -83, 104, 92, -160, -59]
3249e9J75j37j9J40j50r1K33J9j85R6L2j72Q5J80j59q1J46n6p3J60K0j97M7J00
3273E4j00J4J43j28q8J33%q5Q0Qj13L9J21q2l3R8o9o4J13K3j12L5N7q4L2P9n7
3300A4n4O6j1n3N8L0j02L7O4n0k2N5k4o0O7Pn5K5M3o6J7M7l7l5L5J0l7N1Mm2L
3331a5L7k7j3M6j9k6K0Rj3PK5l4lK1j4jLJ2k0NK2k7rJ0Mj4K3%j1NRj6j2J3mj7
3367b4K5Pj9J4Oj0JKJrJ4oLJ0Ok4LOj2%Pm%J2qj3J7Pk2NRj0jJ1nmPpj2K1%k0R
3410gJ1pPJ3nj2k%nK2lk3QJ1k2NK6k9JK2j2j4L3Rm5QK7l7MM7m1j9M7Jl4K9nn5
3448d6K1N3m7j6N2k5l4P1J4p6L1L1n4K7N0n3l1O9k9n1P5Qr6L8Q3p9J1O4q1m5R3
3479B8J0p7N4K0j08N2J05p8n1P8n6o9J53J6j49N6O1j00M4J14j23r4J42J5q7J18
$$ y = [-59, 116, -21, -40, 100, -50, -141, 92, 111, -74, 22, 54, -118, -33, 147, -12, -93, 53, -3, -76, 84, 104, -93, -46, 54, -46, -32, 111, -17, -105, 28, 28, -57, 23, 31, -82, -43, 78, -4, -37, 61, -8, -72, 41, 64, -48, -13, 44, -40, -8, 71, 14, -40, 26, 15, -38, 20, 50, -52, -15, 49, -1, -23, 32, 8, -52, 15, 22, -33, -8, 35, -31, -14, 33, -4, -39, -4, 6, -31, 20, 24, -18, -15, 22, -5, -18, 28, 9, -17, 3, 12, -1, 6, 31, -3, -6, 15, 1, 0, 3, 15, -5, 0, 22, -5, -14, -4, 0, -14, 9, 9, -2, 3, 12, -4, -16, -3, -7, -24, 1, 8, -11, 3, 9, -1, 0, 2, 3, -6, 8, 2, 5, 15, 21, -3, 0, 6, -6, -6, 1, -3, -3, 9, 1, -12, 5, 12, -10, -5, 4, -6, -7, 4, -1, -5, 2, -5, -17, 4, 4, -16, -7, 4, -3, 4, 17, 12, 0, -2, -2, -7, 15, 12, -11, -3, 8, -14, -9, 17, -12, -11, 11, -1, -15, 18, 27, -18, -10, 17, -20, -16, 31, -10, -29, 18, 19, -15, 14, 9, -46, -25, 28, -19, -35, 17, -8, -42, 29, 43, -33, -2, 29, -25, 2, 52, -1, -32, 37, 8, -43, 32, 40, -56, -18, 65, -14, -3, 61, -20, -65, 28, 38, -39, 15, 35, -73, -21, 84, 6, -45, 33, -23, -92, 61, 77, -72, -16, 45, -55, -11, 103, -20, -114, 28, 43, -44, 74]
3505G4qj64N7J31q3l1J01j12r2J91L1j39N9K5j52P4J73j35r9J38o2p0J91J6k30
3530a16M6J29j17M0J63j71j29K05J5j06J21mk29P0K26j22p1J31j27j12K54M8k30
3553h6N6Q1j69Q6K41j83j73J78j3j26K19K7k96M5K08j27RJ79k07j62K57O9j68
3576e5J13J8k59R4K86j45j43J53j08j22K85Q1l01L2J46j74O8K62k17k29K35M5
3598F5j42J96K9l28L9K76j16n5J76j91j81L01J08k36N9O1k45R3L18j65k06J72
3620B8o7j22K86Q2l43PJ97j38O2K27k04k37K40Q5j53J37L9l24L9L25j08j16J61
3643A03j46j87L02J32k77K1J20k09P3L00j62k45J79J3j46K20R6l32JK42j02l7
3665d1K16j77k38K50J33j88R1O6k76M0K97r2j62J38p7j53K60J09k60j8J42j48
$$ y = [74, 66, -98, -41, 90, 7, -24, 77, -35, -127, 64, 95, -44, 15, 40, -112, -38, 135, 0, -99, 39, -23, -93, 98, 114, -116, -70, 59, -58, -18, 145, -26, -155, 50, 65, -41, 80, 76, -153, -83, 143, 21, -50, 81, -46, -158, 96, 144, -86, -30, 51, -118, -32, 209, 26, -147, 31, 18, -108, 111, 138, -158, -113, 95, -32, -23, 156, -51, -213, 44, 113, -55, 58, 76, -183, -89, 197, 52, -91, 62, -46, -168, 117, 198, -103, -71, 75, -99, -31, 231, 14, -215, 20, 65, -77, 119, 148, -180, -141, 135, 19, -36, 140, -51, -232, 69, 177, -59, 0, 61, -184, -91, 227, 62, -144, 28, -39, -161, 125, 207, -136, -129, 68, -70, -8, 219, 15, -222, 18, 103, -50, 87, 126, -198, -159, 166, 58, -58, 103, -43, -230, 72, 204, -73, -52, 68, -141, -68, 232, 70, -175, 4, 17, -129, 91, 187, -145, -144, 98, -4, -41, 175, -2, -240, 10, 143, -45, 46, 112, -164, -124, 173, 81, -81, 57, -20, -173, 87, 196, -64, -82, 60, -88]
3687h8K9K51j56k14J59Q1j35J49P1k78mK30o0q1J62j10k02K11J26j73QJ03j93
3710a14K0K48p9j67J21j9j27J72J06k31k1J53q7j5J70r7j88J39R8j25P4O1j85
3733i3k3K19n8r3R7m9j44J58R4j40j5Q7j06mJ89p0j38Q7L3j12R9Q3j49l5J37m2
3759A2m6J05m7j25R2Q4r8K3P0j21k5J42m0p1O7j8p0P5P8j06k8P6m9k4Q9j9r6O3
3787gL6n6K9M8q0k3R2j7m8N6kp9N3N1n9j1M4l5rN8po2L4J6l9J2L8m0l0N1%l3L9
3820B0om3L1J8l5MJ6j4nL4jk8RK2l4J8J8k6j2L5j4k2L0oj5J1J3j3nJ3j4mK0j2
3854Cj4RKkrK4oj3J0kmlJ3j4OJ4j7PkMpoJ7j9J0J2oj7K2lj6J5j0JQrJkJ5rj4J0
3896aqpJ6Rj6nJ5j4QJ7j7kOokJ3pmnKpJ3MoJ0MppNQj7KK1j2qK2qoPJk0%RrjK6
$$ y = [-88, -59, 192, 36, -178, -19, 62, -73, 76, 147, -131, -135, 95, 35, -46, 116, 6, -196, 15, 141, -32, -24, 79, -114, -94, 154, 75, -92, 29, 10, -117, 55, 161, -70, -91, 62, -25, -40, 130, 33, -155, -16, 82, -43, 31, 92, -93, -116, 103, 45, -48, 49, 0, -144, 14, 108, -32, -47, 40, -66, -70, 119, 49, -89, -2, 31, -81, 18, 101, -48, -83, 54, 12, -34, 71, 24, -101, -9, 75, -23, 0, 70, -51, -76, 66, 26, -45, 22, 4, -66, 9, 87, -19, -47, 29, -20, -44, 45, 26, -70, -7, 29, -27, 2, 50, -30, -53, 39, 22, -26, 30, 28, -51, 2, 53, -6, -17, 27, -8, -17, 41, 34, -28, 6, 22, -17, -5, 33, -7, -37, 14, 14, -19, 20, 14, -29, 2, 20, -15, -11, 5, -9, -14, 20, 19, -9, 0, 22, -12, 6, 24, -2, -14, 21, 7, -15, 15, 9, -6, 5, 18, 5, 0, 13, -1, -5, 15, 3, -11, -2, 0, -2, -11, 13, 7, -6, 4, 2, -2, -5, 8, -6, 0, 14, -3, 4, 2, 6, -1, -7, 10, -9, 1, 13, 7, -10, 12, 9, -7, 8, -2, -1, 7, -2, -1, -3, 12, 3, -11, -1, -9, -16, 0, 9, -7, -12, 3, -11, -3, 14, -3, -5, 1, -5, -7, 6, -1, -5, -10, -8, -15, -2, 2, -4, 6, 10, 3, -4, 1, 9, -8, -6, 15, 3, -5, 17, 9, 3, 10, 11, -9, -9, 0, -9, -10, 16]
3942A6k3j7K6jk4L7j9k6K4J8k0kL5l9j1L9j0k0M2rn5M6K8m3NK1l2qN9k0n1M2J4
3975B2l9L1K6o5rN5j9j8L3jo9N3K6n7K9L7o5%P3k4m7L8Kp0O2O1p8j0O3n8qQ5k2
4008C7q8N4K6o3M4N8r6j8R0j9n0P7l6r8Q0P2q1KN7j01j1J29k2q8O2oq7P9R2j14
4038a9l5Q0m2m1J39l7j28P1O2q4M9P8j39m7J45j2o7Q2k4j41J09J15j27j7Q3j10
4064e7j9J72j8j55O9K7j00R3J12j60o5J32m3l3J45l5j77Q3J00r2M1Q4j72n5J90
4089F7Nj07R3l6j48J13J56j36o4J05q6m9J97j2j92P3N9j15R7J26j82r3J68j4p1
4114d6J32l2k04J00J52j07j0J06j63o7K25J2j54O6K2j49J05J73j73p9J20o0n0
4137h1J93j3k14O5J07j01O1J12j80r3J79J2r0J10k1j90R7J69j10n2J02j29m4K05
$$ y = [16, -7, -24, 2, 1, -23, 14, -5, -31, -7, 11, -9, -11, 24, -15, -26, 13, 3, -17, 25, 16, -39, 7, 35, -8, -3, 18, -14, -22, 37, 17, -34, 8, 22, -17, 14, 40, -25, -34, 21, 2, -16, 17, 16, -53, 0, 26, -31, -2, 35, -30, -30, 43, 19, -28, 10, 12, -58, 4, 65, -13, -23, 40, -18, -26, 59, 37, -51, 3, 29, -34, 10, 68, -28, -46, 44, 25, -25, 52, 16, -82, -2, 70, -11, -9, 48, -53, -64, 65, 43, -45, 17, 11, -76, 3, 95, -19, -54, 26, -16, -57, 82, 45, -83, -12, 50, -34, 15, 93, -46, -93, 52, 40, -27, 55, 31, -110, -1, 114, -13, -30, 53, -57, -76, 96, 78, -77, -8, 19, -81, 12, 124, -36, -101, 31, -12, -45, 100, 65, -112, -29, 71, -21, 20, 104, -68, -123, 67, 72, -35, 58, 22, -126, -13, 143, 7, -57, 48, -38, -87, 110, 98, -94, -21, 38, -77, 20, 146, -36, -129, 39, 25, -46, 86, 54, -150, -50, 102, -5, -15, 91, -72, -139, 86, 98, -56, 10, 32, -117, -12, 161, -12, -91, 29, -31, -81, 112, 99, -115, -50, 57, -44, 17, 129, -51, -144, 35, 47, -43, 67, 46, -144, -47, 122, 12, -40, 62, -67, -111, 94]
4161I4Oj69N8M8j29Q4J56j40j12J23pp5J54ok11P0J37r2J3J09j39r6J78K4j17
4186c9P9J0j78Q6J68j07p9Q9o2o4J73K2j70L2P6r2M3J40j33r9J22Mo0J05jj56
4212i1M5J32q0k4Q7q5r2J41N0j19M4L4j15O0J16q0j00R0k7o3J32K5j45J0R4o5
4238b6J5R3r3q5J09K5p3N1L5j25J8J38o3n2P2m5o7J11M3j09J5L8o3K5R0p5n2O5
4266A5Qo1O3K1r4PP4l7j6O6m8n7O2L1o1K5K8o1JQ8m2n1M1J0n5M8L7p0LM8m0PN2
4299D2l1n0M3J4l4K6K6o2rO5k3j7L7k0l8K8L5m1jJ5k6QM3l2l7M2Jj3J5J3k7pK8
4332A3j0j2J6nrQJ8j7mJ7j8j1K8oj4Rjj3J6J4k3pK0j5NJ4rj0nJ2j1NK%oJ0lj1
4370a3QOj5J8JpkJ2q%KlljJ4j7LJ4j0mKMojPj5J3Rj1qNKj5QPj1J3lPj1J2j6kJ8
$$ y = [94, 100, -69, -11, 37, -92, -8, 148, 8, -104, 19, 12, -63, 91, 85, -126, -56, 81, -11, 2, 111, -28, -124, 54, 78, -39, 40, 50, -128, -42, 126, 19, -60, 29, -33, -97, 76, 98, -72, -40, 36, -56, -13, 127, -6, -105, 17, 21, -39, 66, 65, -91, -46, 86, 6, -18, 69, -16, -108, 33, 83, -36, 8, 42, -73, -13, 103, 23, -77, 13, -14, -77, 55, 80, -65, -55, 39, -26, -11, 82, -11, -96, 13, 38, -35, 16, 51, -74, -56, 82, 19, -33, 39, -6, -73, 38, 81, -28, -13, 25, -38, -13, 77, 2, -50, 15, 23, -38, 25, 46, -48, -41, 33, -4, -20, 46, -2, -59, 3, 34, -27, -2, 26, -35, -34, 54, 12, -39, 2, 12, -43, 5, 42, -28, -25, 23, -17, -10, 42, 11, -39, 4, 18, -16, 10, 36, -26, -35, 30, 7, -10, 27, 7, -31, -3, 32, -9, -10, 5, -21, -13, 30, -2, -39, 3, 4, -9, 6, 19, -8, -15, 13, 3, -9, 7, 2, -7, 1, 19, 2, -2, 15, -3, -14, 14, 8, -6, 3, 2, -11, 5, 19, -4, -11, 9, -6, -1, 13, 4, -6, -11, 1, -10, -5, -3, -3, -9, 1, -2, -13, -5, 1, -14, 4, 5, -2, -4, 8, 0, 0, 2, -1, -4, -5, 9, -8, -5, 9, -1, -5, -3, 1, -5, -6, 1, -14, -1, 8, -3, -11, -6, -4, -19, -11, -4, -15, -2, -5, 2, -9, 3, -13, -15, 3]
4414C%j8J7nlPJ3k4%K1k5K7qMk7J9kj0QJj0%J7j8NOokLQj3j4K0oj3K3Lj5J9j7
4454a2oJ2Rj8MK0j8OJ5lk8K6Pk4J3%k0J0L2l1j7K6lk8L5J1l4oK7k3lM2k3m0L2
4489a0Rk6L4km2J5L1j2rL8l7k2M5J0k9J2J0n5K1N2k0m2M9om9N5J8o1%L5l8K2M1
4522C7l1m9L5K1m5M9J3o6jO7l2j6M7k9n6O1L4n9K0K1n1LQ6m5n5N0j6m3O8L3q9
4553c8MO2m3jQ5o4p6O4K7n2M6K2q7lR7l4m1O0l5p2R1N2q7NM5q0PJ10l3q3N8J1
4585A7o8P7N7j18j7Q3l9j0R1n9r3P8N0p4L8M4j16qJ20k2o6O0k6r3J11P0j06j8
4613c7N4o3J2J17n5q9N0K5p6Q1N1j19k2J12k2m7R3m2j16Q9Q3r8J3N2r5j6J35j6
4641E4j01N3Nq7R5P3j12k6O9o0rJ21m8j16O9M4n1M3O0j13l7J10j1n1O7k8j01Q2
$$ y = [3, 3, -15, 2, -3, -6, 1, 14, -10, -10, 11, -14, 13, 5, 9, -18, 1, -1, -11, -3, -2, -12, -12, 5, -13, -8, -2, -8, -10, -7, 1, -12, -26, -6, -12, -25, -2, 1, -14, 5, -12, -18, -6, 3, -15, -11, 9, -9, -3, 12, 9, -19, 7, 14, -10, 3, 3, -17, -7, 25, -6, -23, 3, 0, -28, 7, 18, -16, -22, 5, -18, -21, 21, -2, -42, -10, -1, -27, 7, 5, -37, -22, 9, -3, -12, 26, -11, -33, 12, 22, -7, 5, 15, -40, -19, 33, 13, -29, 20, 14, -35, 20, 38, -23, -23, 12, -26, -4, 37, 6, -43, -8, 13, -32, 17, 30, -36, -37, 30, -2, -18, 29, 0, -56, 5, 39, -20, 0, 21, -30, -27, 59, 14, -41, 9, -7, -50, 18, 51, -38, -34, 28, -15, -16, 69, 5, -71, -7, 20, -32, 14, 36, -51, -54, 43, 9, -32, 28, -7, -79, 12, 64, -23, -18, 27, -53, -46, 64, 31, -52, 6, 17, -51, 26, 83, -35, -52, 31, -8, -18, 73, 14, -79, -1, 49, -25, 13, 57, -59, -67, 53, 31, -35, 25, -1, -94, 17, 87, -19, -37, 17, -46, -34, 83, 28, -61, -11, 14, -62, 19, 70, -49, -71, 41, 19, -28, 65, 23, -93, -4, 79, -19, -6, 46, -49, -65, 70, 54, -47, 6, 11, -76, 19, 92, -20, -46, 23, -37, -46, 75, 27, -89, -20, 24, -27, 16, 76, -37, -74, 36, 25, -26, 41, 13, -88, -6]
4669fQ4p8j3M7q2j2J14Kj05M3J2o4P4P0j10m9J00m2j5R1l1j18O2P2o8K0N3r7l5
4698h1J18Nq0O4k4q9O9Q3q6j4N7m3k7J08k1q5K3N2m8K5N6q4k9P6j6k9O7l0r1L7
4728c7P7m6j1M5n7l2P8Ro4M6lo5L3P6o3k5N0k9j8P8j0q5M3L1l4K3M6o2m4O6J0
4759B6l9K9mo4M2N2n0j2L6l9k9O9Po0J6L5m2K2L6m0l0N2nl6L3J7n5J6L4k3oL3
4791B1l1k9M7J0k5QJ2m3J5M4l4j3K7qj7K2Nl7J4K3k1MJ8k2k4L8Lj9%J2l3LM0k8
4825a8OK1j6j6K2J4j6kNlj4L1j2j4K1nkJ2j0k1J1LKj0K0rj7J4J4k7QPmqJ8Lk8
4862b0J6Kj8K2Lj2kPLj3J7kj3NRLnLroK3j4rQJkMlj4J1l%mJ4okjJ1j2J1jj5Rj
4906elJj1OjM%MMJj0OOpnJ5j3jRkj4J3J0mMqJ0lj4J0prJ4Jk5J9Jj2J2Ok0J0KJ
$$ y = [-6, 78, 0, -13, 34, -48, -60, 54, 56, -49, -6, 6, -58, 16, 86, -24, -73, 27, -15, -30, 61, 30, -88, -26, 46, -22, -2, 51, -46, -81, 37, 42, -38, 26, 2, -87, -18, 65, -21, -35, 22, -21, -48, 60, 39, -46, -23, 29, -19, 6, 62, -22, -51, 25, 9, -20, 47, 17, -74, -37, 40, -6, -17, 28, -29, -61, 17, 26, -38, 8, 5, -60, -27, 49, -14, -39, 11, -18, -36, 42, 32, -53, -10, 21, -13, 10, 56, -6, -50, 16, 26, -13, 16, 12, -52, -10, 42, -8, -20, 16, -23, -52, 17, 24, -36, -20, 15, -27, -5, 31, -9, -39, 13, 8, -28, 5, 22, -33, -17, 17, -6, -12, 21, -10, -39, 8, 18, -7, 1, 13, -30, -15, 29, -5, -18, 9, 1, -16, 6, 11, -26, -12, 11, -10, -6, 12, -10, -34, 4, 7, -12, -12, 0, -33, -30, 10, -18, -12, 9, -7, -23, -1, 13, -3, -5, 0, -3, -17, 14, 2, -12, 9, 4, 2, 14, 4, -17, -6, -3, -1, -11, 9, 0, -17, -3, 11, -16, -8, -1, -5, -13, 5, 8, -20, -4, -2, -20, 2, 5, -7, -9, -2, 1, -12, 5, 3, -10, -5, 4, 7, 2, 5, -4, -10, 13, -1, -10, -2, -1, -3, 1, -2, -16, -5, -8, -8, -12, 2, -4, -6, -7, 4, -8, 3, 2, -13, -4, -5, -8, -7, -18, -12, -13, -9, -9, -5, -1, 0, -10, -4, 2, -5, -10, 5, -8, -9, 0, -2, -16, -3, 7, 3, 7, -1, 9, 6, -8, 2, -5, -14, 0, 1, -24, -5, -4, -16, -4, 2, -18, -8, -6, -5]
4950eoJPj7J5Lj1J4Oj9QMlKJ5j7pJ2pMM%j5jJ0pJ1Nj3j4J3J5j6Mkj8J0K2k2mK1
4991Bj4JJ1%r%J4j6J1J8j6k2J7J1j6J2Ok8J0K6k4oK7k4k3L9Nk7J0J3m4K5K3j3
5025ak0J8nj8L4J3m1lK2j7J3K8k1l9K8J1l2M4Jm6PL6j2j8M2k3l8M2Ql0QJ7l4J5
5059a1L5j0l8L2j8j8M9j1l5mL7k3nM2k9m3M5J0k7M2Lo6K1N0k7j9M2l7l1N6L7o7
5091a8RJ4l5J0O4l2n9M4Ok9N2Oo5jM9l2OL9m7m1M9J2k9L5J2p4QQ2k9j6K6k1n0
5124e5O9L6p5PL3m7K1O2l2o5L7K0m5N8K2q4NM6k0nM9l9n7N1M0n4J5K4o7J0Q1k7
5156A4o0M5pm8O9L6p5kL8k2nO0k8q0M9L3m2L7L6p6j6P3j9j1K0k5n2N7L5n1rL8
5188A2m3OP0j8n4K5J1n3M6M0o7j8N2j7lM1j6o1L5M7n0K3K0o3mO7nm6L7ql9M1L6
$$ y = [-5, -11, -10, -3, -20, -5, -2, -13, 1, 7, -12, -4, 0, -3, -1, 14, -3, -10, 2, -5, -1, 3, 3, -12, -13, -3, -10, 1, 6, -7, -21, -8, 7, -9, -5, -7, -25, -15, 7, -15, -19, 2, -12, -11, 0, 0, -9, -9, 5, -11, 0, 18, 2, -20, -3, 8, -8, 4, 10, -18, -8, 18, -6, -12, 15, -9, -32, 7, 12, -15, -5, 8, -36, -11, 12, -1, -21, -3, -8, -26, 8, 21, -20, -23, -1, -18, -5, 23, 2, -37, -9, 2, -30, 14, 15, -31, -24, 12, 0, -18, 24, 1, -37, 5, 13, -17, -9, 8, -26, -11, 24, 14, -24, 8, -10, -28, 21, 10, -25, -29, 8, -15, -20, 22, -7, -50, -5, 5, -22, 20, 23, -43, -22, 28, 1, -18, 24, -13, -44, 12, 49, -18, -9, 5, -30, -20, 44, 12, -47, -3, 3, -26, 26, 32, -33, -34, 15, -17, -11, 28, -19, -60, -11, 1, -28, 7, 19, -55, -47, 35, 6, -10, 16, -5, -55, 14, 50, -25, -18, 15, -32, -11, 51, 19, -46, -9, 11, -34, 24, 46, -38, -33, 13, -7, -12, 37, -2, -59, -8, 32, -22, -7, 17, -50, -40, 41, 14, -46, -1, -8, -56, 13, 49, -26, -28, 10, -12, -17, 43, 15, -65, -16, 17, -25, 12, 48, -28, -44, 29, 10, -1, 19, -6, -58, -1, 34, -17, -26, 12, -31, -25, 45, 27, -27, -2, 9, -44, 2, 42, -25, -43, 9, -8, -11, 30, 14, -47, -12, 35, -15, 8, 28, -35, -39, 28, 23, -23, 14, 6, -33, 8, 44]
5221D4n1pK2k8pO5k1o4L6K3m7L9K5n2j2M0j8LJ8Jn3L2M0l9LK6m6jO2qm4J9Om8
5255d2M5L7o1j2M6j0j7L9j1l9J0L8l1%L3m5j4L4Kk3K5pl0K7J5k3mK5k3j4L5J8
5287B3l5LJ7k5J5L3l6j6L5mk2L1ql0RL5l1JK4k6nK1jk7K7%l0J8K0j9k2J7Kj5J7
5322dJ2l5K1J3j8J0J4k5j7L4oqJ1RlrK0j3k0K0j2PJJ0k1QRj4JJ1Jk5J6Jj7J7%
5359aj2pJ0RjLNk3RPlNMj1QJ2oj9RL%OKpnJ0j1NlkojK0rj6J9mjmkKRoqMJ4oj3
5407a2J3Qj6rJ8pkOOj3J9roPMj2J2j1LQKj4mPpLLMj1K4j5lKmpKOrJ3mNj8NNjN
5453dJjM%kjKJ4j3OOj1mJ4j1QpOj6OJ1k0QOol%J2j4J%jJ2lk1JK6kk0K0pj7K2k
5497@%Lnj4MJ8Kj2J1pj5K6oj2KJ0j1J6mj2j0K0Om3M3jj8kJ6kj2J0j0j2K0Rj9M
$$ y = [44, -7, -14, 8, -20, -27, 38, 17, -47, -11, 12, -35, 4, 29, -23, -35, 5, -13, -10, 8, 9, -44, -12, 28, -11, -8, 18, -28, -29, 33, 25, -19, 0, 6, -42, 3, 40, -21, -33, 13, 3, -14, 25, 14, -25, -15, 23, -8, -8, 25, -20, -34, 0, 2, -21, 4, -3, -33, -6, 9, -14, -18, 7, -16, -30, 5, 23, -12, -9, 8, -17, -2, 31, -5, -21, 14, 10, -12, 19, 11, -19, -10, 25, -6, -5, 19, -7, -12, 9, 8, -19, 8, 8, -22, -4, 16, -3, -25, -8, -6, -21, -4, 8, -27, -6, 7, -11, -1, 13, -12, -29, 5, -1, -9, 2, 11, 8, -1, 19, 6, -14, 6, -6, 1, 2, 12, -9, -1, 8, -6, -5, 6, 7, -18, -2, -1, -18, -1, -1, -13, -20, -10, -1, -2, 1, 6, -17, -8, -1, -4, 1, 5, -6, 2, 14, 8, -11, -2, 1, 1, 7, 9, 2, -3, 7, -4, 1, -2, -4, -10, -11, 9, 0, -16, 3, -1, -2, -6, -8, -6, 3, -3, -11, -7, 7, 1, -12, 1, 9, -7, -16, 2, -5, -7, -1, 5, -8, 11, 2, -4, 3, 7, -5, 7, -4, -1, 7, 9, -5, -9, -2, -9, -6, -3, 1, -10, 14, -1, -4, -2, -6, -13, -11, -5, -14, -1, -5, 0, -18, -13, -8, -9, -4, -3, -4, 0, 0, -2, -3, -1, 13, 0, 6, 12, 1, -3, 11, 0, 8, 1, 7, -9, -3, 8, -12, -4, 2, -4, -7, -7, 5, -9, -8, -8, -9, 3, 0, -21, -20, 6, 4, -16, 4, -3, -20, 2, 0, 0, 3, -2, -16, -12, 6, 8, -4, 7, 0, -15, 11, 5, -7, -5, 5, -6, 10, 6, -6, -16, 4, 10, -33, 10, 9, -9, -11, 5, 3, -9, 1, -9, -21, -1, 8, -11, -7]
5535gOj8%L8k0pQKj8J9Rk5J6Oj2PJ5j5k1K5Nk6J5J2l7J0J9j6nK7j8k3L1J3k4l
5571a2K2l9PN1k9k2K5j9mM1Ol2JK1k8MM1l2k6L3jj6J8J6m8jL8qk4L2l2k5M6K1
5605B5l8J1Ml3PM8j0n3L7Kl3L7L0o2oM6k1j4N2j9m9N2Rk0MJ8m4lO6k8l3K5Lm7
5639c7M7K8n9kL7l4MM7k1o5M3K2k6J8K1n5j3O0j1k2M4k8m3M4K7m4J4K1m9MO0j6
5671A6m2L4Nm3L9L7o0j6L7j7lN0k4n4L1K8m0J2K7n8mN3Pl4J8%m4L9L8m2j5L2l8
5704c1LM6mn1K3J5k3K4L2m7k4L7kj1M0jo4L0J9r%K3m0rL8Km3L1mm2K3M0l7j7L3
5739@j7j3M7J0n7J2K6j7KK9l0j7L5Oj5J0Nm7L4K5k6j1K7l4j9M7J0m1J3J1k8J7
5771fL8l9j0J5Nk5L2j4k6J8J4j1MJ6k6k0M5Jl2K1Kk7J6L2k6kK5j5k1L5Ql5J0N
$$ y = [-7, -1, -19, -19, 19, -1, -8, 0, 2, -16, 3, 12, -13, 3, 9, -3, 4, 19, 4, -17, 8, 13, -13, 2, 14, -23, -13, 6, -10, -15, 12, -6, -29, 2, 15, -9, -12, 10, -29, -22, 29, 0, -22, 3, -16, -20, 21, 27, -5, -4, 17, -11, -7, 34, 2, -24, 9, 8, -8, 10, 26, -22, -23, 15, 7, -17, 15, -17, -42, 4, 25, -13, -2, 2, -31, -24, 24, 14, -39, -2, 0, -33, 4, 34, -28, -34, 12, -9, -23, 29, 10, -39, 13, 22, 2, 6, 24, -20, -23, 43, 15, -18, 7, 10, -37, 10, 38, -21, -23, 14, -20, -16, 31, 10, -55, -12, 10, -16, 2, 23, -32, -45, 15, 4, -18, 26, -2, -45, -1, 26, -18, -4, 17, -32, -28, 32, 16, -26, 8, 13, -30, 9, 46, -14, -30, 7, -10, -13, 37, 13, -41, -10, 18, -22, -10, 17, -41, -45, 8, 15, -19, -1, -1, -45, -6, 32, -10, -25, 7, -31, -28, 18, 14, -37, -14, 1, -22, 2, 34, -13, -37, 0, -2, -13, 27, 26, -38, -8, 11, 2, 2, 25, -15, -24, 14, 16, -27, 4, 0, -42, -19, 21, -16, -33, 0, -17, -30, 17, 27, -30, -18, 8, -9, -7, 22, -8, -25, 10, 16, 1, 11, 16, -31, 3, 28, 2, -9, 18, -16, -35, 12, 22, -19, -6, 5, -23, -6, 32, -7, -17, -2, 3, -22, 10, -4, -30, -12, 2, -9, -5, 11, -15, -35, 10, 11, -21, 0, 2, -25, -9, 23, -3, -5, 20, 5, -16, 19, 27, -8, 2, 7]
5805Gj3rK6j7j6K4Kj8J9J0m1J2J9j0j2K4k2nK0Nk3J9Kk5J6J8nj0ONj3J4Lj5kN
5841@j3J6Mj4JkNj7K0j1%J0ProJpKJ3%j3j0J8mlJ4Pj8MJ4j2rRrJ3KmrJOj3J1K
5884cNpJ7j1mKkj1KOpQJ3j3j0J2Kjojm%KNNoKkJ5rnLRjrN%oPMNk1MJkQj1MQno
5935iJJj2QjJLJ2j7kJ6j1oJ0Rk2MJ7j5J1lMjNRk1J3Nj4nPl%PoL%Mj1M%mlR%j1
5981a4J6Kj4mJ3j3J1Jj4QOqLjOj4J8lj3J1Oj6LJ1qkJ2kj9J7Nj5NJ1j6LJ0j6jN
6021a0PpJ3%j0%Qj8LJ7kqONk4K1Qj9oK8Nk2K2k2j1J7J7k0%J7k9%K5j5j1OPj3K3
6060HPk4qJ3j8NJ1pk0K8mj0J6J2l4kM7j6k0K6lm3M3Qk6J4%j6J7K1rl1RJ4k3J9
6096DK1m5kL3k2OK1qm5L5J0j1j1K4l8kM1j9j3K1Kl3L0J9k9oK2k5MM4k1k4J1J9
$$ y = [7, -6, -15, 11, -6, -22, 2, 4, -14, 5, 15, -26, -14, 5, -5, -17, 7, -15, -20, 0, 5, -18, 1, 3, -22, -6, 12, 7, -3, 3, 8, -5, 9, 12, -3, -5, 0, -13, 3, 7, -7, -6, -8, -3, -20, 0, -11, -11, -1, 6, -3, -9, -8, -15, -13, 0, 0, -13, -23, -5, -9, -12, 2, 9, -9, -5, 9, -3, -12, -3, -12, 1, 3, -1, -10, -9, -3, -16, -5, -3, 2, -5, 12, 1, -3, -1, -3, -14, -12, -6, -13, -5, 8, -5, -15, -3, -1, -2, -8, -9, -13, -13, -11, -6, -1, -7, -5, -7, 8, -1, -6, -3, 6, 5, -4, 1, 1, -5, 2, 6, 11, -10, -6, -5, -7, 1, -10, -6, 2, -3, -9, -8, -7, -19, -11, -12, -11, -8, 4, -13, -15, 1, -10, -16, -6, 3, -19, -15, 2, -13, -2, -5, -1, -2, 3, 12, -9, 4, 9, -5, -10, -3, -6, -6, 1, -5, -2, -2, 2, -9, -5, -5, -9, -12, -3, -3, -14, 2, 4, -10, -14, -1, -14, -3, -2, -16, -8, -2, -10, -7, -8, -2, -16, 2, -1, -14, -3, 3, -13, -10, 1, -7, -9, 3, 1, -18, -1, 4, -11, -6, 5, -11, -8, 2, -14, -15, -10, -3, -10, 3, 3, -7, -7, 1, -17, -14, 3, 1, -7, -1, 4, -20, 1, 9, -10, -16, 12, 17, -5, 17, -5, -16, 1, 18, -2, -2, 15, -14, -14, 11, -4, -15, -9, -2, -15, 8, 15, -9, -17, -4, -22, -17, -6, -13, -33, -5, -9, -19, -3, 9, -25, -27, 20, 4, -16, 10, 7, -36, 7, 15, -11, 3, 3, -13, 4, 25, 16, -15, -6, 8, -15, 4, 25, -20, -22, 11, -11, -5, 16, 8, -37, -2, 8, -3, -14, 10, -28, -30, 11, -8, -21, 0, 2, -31, -1, 18, -11, -17, 5, -20, -16, 28, 7, -17, -6, 13]
6130A3k8K9K4n4j1M3j6j0L0j7m6L8J7k0kJ6l3rM0Ml3J7%k5K9L9m4j6L5k3mM3o
6163B0n4K2K4k6PL5l6j2L4lk1K5nm1K9K0k1oK6l7oM6Kn0K6lk7L0M6n2l4L3jj4
6197b4L8%n2K2K2j0kK9l3k4N1ll0K1Nl7K2L0k7j5M2l5j3M4km0J1J5k6J6K6l4k2
6230c5L8mj5K1ml7PM8k6jJ8j4l4L9J4k3J9j4k4J8L2k5qK0j1j2L1Ll8LK3k0PL3
6264B9l0l6M2Kk4J5J6m0LL6j4j5K0j7j2K8Rk7nK4k8RL6k0k2K3Qk4K6Nl6kK9j2
6298d%J3k1j8L9jqJ4nk2JJ5pj2J8k4%J6J3j6LJ6k8QJ7kk6J7J5k2J5Qj8rK3orJ7
6336A0kk6K3Mk4NK5j9qJ8j2qJ0j0J1Ljj5QPqMmkrQkKlJ3j4jJ8Mmlrj4K7MkpOm
6380apJ1mkkOn%LomJ1Jl%%j3rK6rlkRklmmJ8j5kPJKj2NJ0rlK0qjK0j7%Mj0j0J4
$$ y = [13, -15, 14, 38, -16, -27, 16, 0, -10, 20, 3, -43, -5, 12, -8, -10, 6, -27, -36, 4, 8, -25, -8, -8, -33, -4, 35, -9, -25, 10, -13, -17, 26, 20, -34, -12, 12, -14, -7, 28, -8, -20, 14, 11, -10, 15, 10, -31, -2, 18, -3, -9, 17, -20, -26, 20, 22, -28, -2, -5, -32, -2, 44, -8, -42, -9, -10, -24, 14, 14, -38, -16, 6, -4, -6, 23, -10, -34, 17, 14, -16, 5, 10, -27, -5, 25, -2, -17, 25, -10, -23, 21, 19, -21, -10, 5, -21, -5, 21, -13, -35, 3, -1, -16, 5, 1, -36, -29, 19, -7, -8, 10, -4, -38, 1, 15, -8, 11, -3, -27, -9, 23, -2, -10, 10, -1, -13, 18, 21, -17, -14, 9, -11, -4, 29, -1, -37, 5, 7, -17, -2, 14, -26, -23, 13, -1, -16, 4, -13, -25, 3, 12, -15, -20, 4, -24, -15, 21, 1, -21, 2, 10, -14, 12, 17, -19, -21, 8, -4, -4, 9, -12, -30, 9, 8, 0, 14, 9, -13, -12, 3, -4, -16, 2, -22, -22, -6, 7, -9, -6, 10, -18, -10, 7, 5, -21, -4, 11, -11, 4, 12, -6, -15, 8, 2, -7, 10, 8, -18, 5, 9, -15, -10, 15, -4, -12, 6, -6, -14, -4, -14, -3, 0, -1, -16, -8, -1, -9, -5, -9, -11, -20, -12, -14, -12, -15, -2, -16, -17, 1, 5, 1, -2, -11, -25, 2, 6, 4, -3, 3, -1, -8, 3, -1, -3, -5, 1, -4, -4, -1, -7, -11, 0, 1, -2, -2, -2, -15, -24, 2, -7, -10, -12, -3, -5, -8, -12, -16, 2, -13, -15, -8, -7, -5, -17, -12, -2, -11, -14, 6, -2, -3, 17, 0, 0, 4, -6, -16, -2]
6428bmj0NPpJPkMkkqMlmkJ3j3QJPlMrmJ5mnjJ2qNkJ0omKpMRqJJ5j8POj1llolJ0
6480gJ0j3KMmmnJ1pPNj2OOj2J2J6j9j3K3qkrK4j6jPLj0J3k1RnRqjJ2j2pJ7Ok4
6522a8J7j6j3J8NoRMj0kK1j3nJ5j0rJ3J8j7pJ2mmQ%j0KJ0rKJ7l0LMnLOKj7J3l
6563fnNjpj3K8qk0K5j0j4K7J2l1nK5q%J9lk7J9QplJ3k8LK6kk3K5j2k1J3K6k6M
6601bLj0lK6j3j4J0j1j0K2K8l7qJ7oJK4j0l5K4K4l2J3K5l1j5K7J1k7K1pk6J9K8
6635B6k8jJnoK7Pn3K6Qk0J7K4l4j6L7j2j6L2j3m0K5L5l0lJ6j8j1N0kl2K2Nn1L8
6670EL0l0k2K3j9jL5%m0LK7k2J7K4m6k2N1lj6J1km2K4L3k0j0J1j3j9M9lm1J5Q
6704el2L2M6m3k0M0Jk6K5Mn4K6J7k6J9J9l3j7L3Ol0J8J2m8L2L2l5%Ok4oM8Nn9
$$ y = [-2, -6, -16, -11, -4, -11, -10, -3, -5, -1, -3, -5, -13, -9, -12, -16, -18, -5, -18, -10, -9, -2, -5, -1, -10, -14, 1, -3, -8, -9, 3, -5, 0, -2, 8, 2, -2, 0, -7, -3, 6, -2, -1, 14, -4, 3, 9, -2, -5, -8, -14, -17, -7, 3, -10, -8, -4, -8, -12, -17, -6, -13, -6, -1, -13, -7, -1, -13, -1, 15, -4, -17, 6, -2, -4, -13, 11, -5, -6, 1, 4, -6, 7, -14, -5, -10, -1, -9, -10, 2, -10, -17, 0, 6, -18, -1, -17, -30, -12, -7, -13, -4, 0, -10, -12, 9, -4, -9, 6, -4, -13, 0, 18, 1, -6, 6, 2, -2, 6, 6, -4, -2, 8, -1, 1, 18, -12, -9, -5, -10, -7, -1, 1, -16, -3, -6, -11, -6, -7, -14, -27, 1, -7, -27, -2, -12, -26, 1, 13, -18, -23, 2, -6, -6, 13, 10, -17, 2, 10, 3, 0, 13, -15, -12, 14, 12, -11, 14, 2, -19, -6, 20, -6, -2, 1, -9, -12, 14, 1, -13, -3, -14, -24, -2, 26, -11, -19, -2, -8, -7, 17, 7, -28, -4, 20, -12, 1, 26, -5, -20, 7, 18, -9, 12, 5, -21, -2, 26, -2, -3, -2, -7, -13, 14, 21, -32, -6, 2, -18, -1, 23, -11, -27, 10, -2, -18, 14, 1, -39, -14, 21, -9, -12, 4, -14, -25, 25, 23, -9, 13, 18, -33, 5, 35, 5, -17, 6, -13, -14, 21, 21, -19, -16, 11, -11, 6, 30, -16, -38, 13, 10, -6, 5, 3, -39, -15, 18, -2, -12, -1, -14, -33, 16, 13, -28, -13, -5, -37, -5, 41, -2, -22, 18, 19, -7, 18, 22, -32, -6, 11, -15, 4, 23, -10, -27, 6, 12, -18, 0, 12, -36, -4, 28, -7, -7, -1, -25, -31, 17, 22, -37]
6738c7K5J6k5J3L4k6j9J7Oj4K3lm1J6K7mj2J8k5j6M0Pl0MJ0k9J6K7k1j7L4k7m
6771a7K6Lm9J6J2qJ1J9k8j5K5JrJ3Kl1J4L5j9kJ2j8j7L2Pl0J0J8k5PJ3pj9K4j6
6806a0JJ4%j8pK4k2J1J5j4j6J9Rj4oOj4QL7j4j9MkKJ5j1lmJ5j2J3J8j8j7RJ0L
6843A2k%k2QPnKLMj8K1krj2Qk1MK8k3KJ0KoMJ2j2J%LjJ2jj5QLlMNqj2J6Pk0MN
6888Cj1kQlqJ4njJ4pj8QPqkJ2j0n%O%nJ2j2O%RojLj%RJJOj0rJ5kor%Jj0J3%qR
6937blkMmqPJ9j4NJ1k2mJ0pRJ2j3%LLj0NOj1QoQpOMj6J5Rk0KJ3j9KKMNqRj1kR
6983Aj4kJ1j2RJ%nPkMLNmlj%kJ4lj9J2Oj1LNojJ9k3nQrKjJ5j3nJ3lJKLj1PJj1
7030a4J6Nqj2K4j1NlrNJJ1pnJ5k1KK1j9j5K4j1jPKnj1J2%j7J4rrJ7OplJ6k2MJ3
$$ y = [-37, -12, 4, -21, -8, 26, 0, -19, -2, 4, -10, 13, 10, -31, -15, 12, 8, -4, 14, -11, -27, 13, 20, -10, -6, 4, -25, -9, 18, -3, -20, 14, -13, -17, 9, 12, -37, -21, -9, -17, -6, 13, -15, -30, -5, -4, -13, 0, 2, -29, -15, 20, 1, -1, 11, -7, -24, 8, 15, -15, -5, 13, -12, -5, 8, 1, -18, 6, -10, -9, 5, 5, -13, -20, 4, -18, -7, 8, -6, -22, -3, 6, -8, -14, -8, -22, -14, 23, 9, -10, -6, -8, -6, 9, -2, -5, -9, 6, -6, 7, 25, 7, -10, -1, 9, 12, 10, 10, -12, -4, 3, -2, 0, 3, 7, -11, 10, 8, -1, -13, -5, -26, -22, 6, -17, -15, -5, -3, -9, -5, 7, -5, -4, -4, -1, -2, 10, 9, -6, 2, 5, 2, 6, 11, 3, -9, 7, 14, -6, -2, 3, -8, -10, -2, -5, -13, 1, -4, -5, 9, 2, -16, -8, -1, -9, -11, 1, -9, -14, -14, -8, -8, -13, -1, -13, -7, -7, 2, -4, -5, -2, -3, -3, 6, 7, 8, 14, 4, -5, 10, 8, 2, -7, -7, -6, -16, -3, -3, -11, -2, -5, -7, -3, -7, -15, -8, 11, -3, 2, 13, -9, -13, -3, -10, -1, 11, -2, -2, 1, 4, -6, -1, 5, -6, 2, -4, 4, -3, 3, 7, -9, 6, 15, -5, -3, 10, -9, -7, -5, -1, 4, -4, 5, -6, -8, 1, -13, -15, -4, -16, -7, -6, -6, -11, -4, -6, -2, 1, 6, 2, -1, -2, -2, -4, 10, 7, -12, 0, 6, -5, -2, 3, -3, -4, 15, -8, -13, -5, -14, -12, -13, 2, -11, -16, -3, -6, -5, -3, 0, -11, -4, -3, -14, 2, 7, -1, -13, 11, 0, 5, 2, -7, -2, -1, 10, 3, -2, 13, -8, -6, 15, -4, -19, 5, -6, -7, 0, 2, -3, -14, -2, -2, -19, -5, -14, -23, -6, 0, -7, -10, 6, -16, -12, 1]
7071Aj2LOnj0MK0k0RJ3k0jL6k3j3J9qqJ6Rk7JJ0rjL0j3l1K7pj2J4Rk7KK5pj2J2
7110@rk0K3K7k6LJ9l1J1K1j9qK1j2j4K1J9l6J0J4j5RJ4j4l1J4K0l0K7%k4pK7l
7144Aj4J9j3k7L2K0l8QKjj0M1j5j8J0Nk3K6K0m7MK5nrK5J0n4K7J8j4JJ6l3pL6
7179A8j4j2J4j3j9K6K8m5NJ2k3JL2lm0K8J5k1J7J9n0nM5j1oK9k1l6K9J8j7OOj1
7213Ak3M0Lk4J9ql1K6K5m0rK1j4nL5j2l9K1J9j8QJ3l4qM9j7j3J6J1l2K9J9k2j1
7247eJjj6M1k1j9J2J3k1K2J6l2j0K1kj7L4lm2J0K8j7kJ4k2j1L2J6k7NJk0RK5j8
7282fj8K0%j6K7kk2KK7j9J1J6k1k7L9oj4J0Pk6KK8j2j0J5j9j2L9j0j4JJ4k8J7
7316gK0j6j4J4jk0L2j2j6RK4j4j2L2k1JPRk1J0OnkL%j2J6j0j9K2J1k4J1jk8J2
$$ y = [1, -11, -8, -2, -7, -17, -13, 7, -13, -4, 9, -11, -12, 24, 1, -12, 7, -1, -9, 7, 16, -11, -10, 0, -9, -10, 20, 7, -24, 3, -4, -16, -2, 7, -20, -18, 7, 0, -12, 0, -9, -29, -6, 21, -5, -2, 17, -14, -3, 18, -1, -9, 12, 0, -14, 7, 26, -10, 0, 14, -1, 8, 22, 8, -23, -9, 11, -19, 8, 8, -16, -23, 4, 1, -13, 6, -7, -34, -2, 18, -20, -12, -10, -11, -21, 20, 5, -13, -3, 2, -21, 5, 25, -22, -18, 7, 2, -7, 18, 28, -26, 1, 19, 5, 6, 22, -11, -18, 18, 4, -8, 6, -7, -26, 0, 28, -17, -12, 0, -23, -22, 10, 7, -33, -5, 10, -11, 6, 25, -25, -30, 15, 4, -2, 27, 6, -30, -1, 17, 0, 6, 12, 1, -22, 18, 21, -3, 16, 8, -23, 3, 28, -12, -21, 0, -14, -19, 16, 4, -35, -14, 5, -13, -5, 8, -26, -34, 15, -2, -15, 1, 12, -20, 9, 28, 6, -5, -4, -5, -21, 20, -1, -20, -8, 5, -16, 6, 22, -10, -20, 1, -1, -18, 16, 13, -29, -19, 9, -8, -10, 4, -18, -29, 3, 19, -8, -3, -2, -22, -13, 12, -6, -24, -4, -4, -20, 7, 5, -17, -15, 12, -7, 4, 20, -1, -28, 11, 5, -9, 1, 8, -18, -16, 12, 0, -10, 5, -14, -26, 13, 3, -11, -10, 4, -24, -7, 13, -3, -17, -3, -4, -24, 8, -4, -20, -11, 13, -1, -13, 19, -2, -1, 6, 15, -6, 4, 10, 5, 3, 6, 6, -6, 10, 0, -19, 3, 14, -10, 1, 0, -28, -16]
7352a6K3j9JJ3jj3J1Jj1JJ7k7J6PJj0QLj2NKmlK0j7j1J1JRkJpj3J9qjJ0kj5OJ
7393eqJ1Jj7NJ6kpJJlKRnj1J5rmK8k4KJ1mLPj6%pOLpmQj7J8Nj2qK3j4LL%j2J0
7438ePj7J1moRJ0nj2J6qoJ1l%j1K3pqJMkJ3Kk3KJ3nrJ6j7rJ4joJ9rj3OJ2j5%K2
7481A0j5rPKj2QJ2pMkrPQqj5J5RrnJ7j3j0K1j1lNJ0j9RrnQKlj2K1j2jJ6%j4mL
7524a3kkK0orQmJ1j2J4j8QJ4j2MRj2j2J3OoKQk0MJ0MnLj2j2K7mj6J6Koj9K8pj1
7565iOroJ5J2j1rJ5pkJ7j0j5K1KrPKk5QJ2Nj7J6j5j0J5JlmK0l5K2J2j3j8J3jp
7604a4J4Pl3QQmJ3Pj3k3K9pjJ4Lk5nL4k3J0Opj0K1Ml2J4NqJL2j9j7LMj9K0Mj8
7643a7LJ6qkRmk5K3J4k2J9lk6J0K8rj9K1j1k3K4K4l7J1L2m4K5K9l2k9K2%j4K2
$$ y = [-16, 7, -12, -11, 2, 1, -12, -1, 0, -11, -10, 7, -20, -4, 3, 4, -6, 2, 5, -7, -2, 0, -4, -7, 13, -4, -15, -4, -3, 6, 4, 5, -2, -15, 4, -4, -5, 5, 3, -12, -6, -5, -13, -2, -1, -18, -13, 3, 1, -6, -5, -4, -7, -5, 4, -1, -12, 3, -6, -10, 18, -6, -4, 7, 3, 6, 13, -3, -3, -10, -4, -1, -8, -12, -4, -21, -3, 2, -10, -18, 5, -9, -6, -3, -3, -15, -5, 2, -15, -4, -8, -14, -5, 5, 0, -12, 4, -4, -10, 1, -2, -2, -13, 10, 3, -5, -4, 0, -2, 11, 13, -10, -8, 5, 0, -9, 7, -10, -19, -5, -6, -12, 7, -2, -15, -9, 3, -12, -12, 10, -5, -14, -7, -5, -17, -9, 3, -4, 0, -2, -11, -4, 4, -4, -19, -4, 5, -4, -9, 8, -5, -15, 6, -5, -8, -3, 7, -12, -3, -12, -17, -9, -7, -10, -22, -1, -13, -14, 2, 2, -12, -16, -13, -15, -17, 3, -3, -12, -4, -8, 3, -9, 5, -13, -5, 9, -3, 1, 10, -2, -14, -1, 5, -1, 1, 9, -11, -7, 3, 7, 2, 5, -7, -19, 8, 4, -12, 4, 6, 0, -19, 9, 2, -9, -3, -12, -18, -3, 9, -2, -11, 4, -3, -5, 12, 2, -13, 8, 10, 1, 8, 10, -15, -7, 5, 10, -7, 9, -6, -16, -1, 0, -3, -7, 13, -22, 0, 12, -1, -19, -6, -7, -14, 0, 7, -26, -18, -10, -14, -1, 6, -7, -30, -1, -8, -9, 5, 8, -17, -22, 12, -11, -1, 5, -2, -12, 9, 13, -19, -5, 0, -8, -7, 25, 6, -11, -8, -4, -23, -3, 1, -17, -14, 2, -6, -8, 1, -3, -28, -5, 9, -13, 6, 3, -23, -13, 15, 6, -13, 8, -3, -26, -2, 22, -15, -4, 28, -16, 9, 38, 6, -23, -1, -1, -15, 7]
7677GJ7m4KL2k8MK0j7l0K4K9j3lJj9%L7k0j2J4qj8M0Ol3MJ9j6jK8j3l2L1Lj9J3
7713E%j2j4K6j2j6M1k6j9K5J6j8j3K7m5NM1j9j6J7Kj6J7J1l1OJ6j0KJ8j4j7J3
7746a0J9j4ROk2nK9pqNKl2L0J4k6mJ4j3JJ8nl3J2J7l0K1L2l8LK0pj5K0mk2J6J5
7783Hk0J1joj0L9ml9J5Lj2K5Ok0pJ6j2KJ6nk7J0OkPJ7l5pK3Lj5J1Kj8J1K9l6O
7821a0J9k1qJ6Pj1mJ2j1QJ1nk7L5mj6J3Nk7LK9k1NRk4MJ3lj5J5j0kNJ1j2lQro
7860b1K2Oj9pK0j4LJ5qmJ4j5NRlj2J0Jj0NJ0j3j1J1J3j9kRj4NJ7Jj7QnjLmklJ6
7901aj0mJ5j0MQQk9MJ9j2MK0j8j3J6lpOJ9k5LRm%Oj2nR%lnJ4j3j5J7jjJQplJ5
7944Dk2NQj1J0J4lj2RkJlRj0LNmj3RNj4KK2k7%J3qoJ4rj5K3j2OJjoNL%o%RjmN
$$ y = [7, 24, -20, -18, 14, -14, -10, 10, -7, -37, -13, 16, 3, 0, 1, -18, -18, 19, -1, -13, 1, -7, -25, 15, 21, -12, -8, 11, -5, -6, 22, 9, -23, 8, 11, -8, 5, 5, -7, -21, 5, -7, -23, 18, -8, -27, -2, 14, -4, -17, 10, -35, -30, 11, -8, -24, -7, -5, -21, -4, 7, -24, -18, -2, -12, -10, 8, -6, -23, -10, 9, -5, 4, 10, -12, -17, 12, 5, -3, 2, 4, -28, 2, 16, -10, -14, 0, -13, -12, 6, 1, -32, -20, -3, -33, -12, 20, -18, -15, 5, -2, -17, 3, -1, -23, -7, 8, -12, -1, -2, -8, -18, 21, 17, -22, -7, -4, -16, 9, 15, -5, -12, 4, -8, -6, 10, 5, -22, -12, -6, -8, -1, 16, -19, -26, -3, 0, -15, -4, -2, -20, -9, 20, -16, -10, 9, -12, -20, -4, 3, -8, -12, 0, -11, -3, 8, 3, -24, 11, 7, -9, 4, 9, -18, -15, 14, -7, -2, 7, -17, -13, 0, -3, -18, -3, -13, -15, -10, 1, -11, -14, -6, -15, -21, 1, 7, -12, -19, 1, -13, -10, 5, -3, -7, 7, -8, -3, 6, 3, -9, 1, 2, -8, -3, 7, -6, -17, -6, 7, -12, -14, -5, -19, -14, 3, 4, -13, -5, -10, -11, -8, -12, -14, -17, -1, -11, -15, 0, -10, -6, 2, 10, -19, -15, 4, -8, -4, 16, -2, -15, 1, -2, -9, -3, 16, -9, -6, 3, -1, -1, 5, -7, -12, -3, -3, -6, -11, 3, -10, -25, -8, -9, -10, -9, -1, -8, -11, 4, -18, -13, -5, -16, -6, 8, 5, -7, 2, 0, 1, -2, 7, -3, 0, 5, 1, -12, -3, 2, -12, -10, 12, -15, -15, -2, -10, -16, -2, -11, -26, -3, -15, -9, -8, -9, -15, -10, -7, -7, -13, -13, -4, -5, -9, -4]
7990dj1OQlJoJQKrj3J5kKLJJn%jKNOj9lJ6pKJNk4J1kk%J4k5J4Ln%J9j8PNqLKJ0
8039Fj5KN%mKoj0J3LrJ0J2k1pJ5olLnJJ0Kj6jJ5nlJ1onJ3Kj8J2Lk0J6J1j4oJ0
8081cj1J4RKk4JQNLMj4j3RJ1k1K4kk0MK0j5%J3j1j2J0K1k5J6Lj5rK1mj9K1%j9
8119a8L0jk3kK0j6J4J0j3j1J1J5k7J6Lk3NK0k0MJ0j2qJ7Rl6J1J4k1LM1k5j5J7
8153amrK2Lk5pK7j1pK8j1j1J1Ok1J3kk2J3J2lj3J7rk4K8Rk3RKplK5k4j4QJ7j1
$$ y = [-4, -15, -9, -1, -4, -3, -9, -8, 0, 2, -7, -20, -5, -7, -5, -2, -1, 0, -5, -5, -6, -4, 1, 7, -12, -15, 1, -6, -4, -3, 2, -22, -11, -13, -15, -15, -1, -26, -12, -9, -14, -14, 5, -13, -6, -1, -9, -6, -4, 6, -9, -7, -2, -2, -6, -4, -10, -20, -7, -4, -13, -3, 9, -12, -19, -4, -10, -13, -10, -15, -14, -4, -2, -18, -19, -4, -9, -12, -1, -7, -12, 1, 3, -15, -3, 0, -20, -4, 7, -7, -13, -3, -14, 0, 9, 11, -13, -12, -4, 1, 4, 8, -6, -19, -10, 1, -20, 4, 2, -18, -14, 6, -9, -9, 4, -7, -19, -9, 12, -13, 3, 6, -9, -18, 3, -1, -20, 1, 1, -18, 12, 11, -12, -14, 6, -10, 4, 14, 1, -10, 1, 16, -11, 5, 8, -15, -10, 10, -10, -6, 4, -8, -16, 1, 10, -26, -15, -1, -22, -19, 22, -3, -18, -1, -5, -14, 8, 11, -14, -21, 6, -5, -12, 16, 5, -6, 5, 11, -10, 3, 1, -21, -8, 4, 1, -12, 5, -4, -28, 0, 9, -14, -5, -3, -10, -13, 12, -12, -26, -18, -1, -12]
8191a2
$$ Imaginary data points
##PAGE= N=2
##DATA TABLE= (X++(I..I)), XYDATA
0@%%%%%%%%%%%%%%%%%%nNqJ6j6J6j6J8k2K8l2L4m1M7n2O0o8P5q3R3j03J14j28
41f8J43j57J75j93K13k35K58k86L15l46L80m19M64n13N70o33P08p97Q98j026J186
62F37j388J661k047K630l608N551j0838N3035K05508N5813l4139j08599j91069
75b6853j54570m7848k2300L7635J58351J75208J08804O7188m5272j89615j85422
86a24694r6057m7107M7447J53384J36490Q7491Q4300J281j22413j41473j23467
97a44818j11210J415J30935J37308J12454R9946K490r8447j00432j06032j21756
108a98147l4052P0887R5183J23912J35686L4762o7109q4821j13167j25677l8942
119b01485L9811N7350J06768J34075N5425k0206m9626j10263j32628n3207J0753
$$ y = [0, 0, 0, 0, 0, 0, 0, 0, 0, 0, 0, 0, 0, 0, 0, 0, 0, 0, 0, -5, 0, -8, 8, -8, 8, -8, 10, -12, 16, -16, 18, -23, 24, -28, 32, -36, 39, -44, 49, -54, 60, -68, 75, -82, 93, -100, 113, -122, 136, -150, 165, -181, 199, -220, 244, -269, 301, -332, 376, -421, 477, -549, 637, -751, 910, -1137, 1493, -2115, 3436, -7402, 45633, 251141, 306954, 272815, 164216, -26853, -181423, -229271, -251571, -213936, -55585, 119623, 228427, 295615, 250343, 60728, -124694, -220751, -267858, -220411, -67027, 69463, 156954, 241254, 242535, 120122, -21351, -144818, -256028, -254613, -123678, 13630, 126084, 226030, 228520, 130073, 29641, -76391, -198147, -232199, -161312, -66129, 57783, 193469, 228231, 161122, 76301, -36866, -162543, -201485, -161674, -104324, 2444, 136519, 191944, 171738, 122112, 11849, -120779, -173986, -163233]
130a63233L4710R6292J21847N9480J3962j4950r2450j26056o9574k4836J3086
141a51722R0930J14429O1543L2403L852p0755j00616o9833n6389j9534O8659J04043
153G010P5490N7663J4752o3607q3943n9686n9997l2713L7304O6915O8181Q2340
165A09709M5708l7217p2428p2914p7109l4349L5068N2999N3998P1671M6082j0071
177A11147l4062n7334q7371n7603O165L6914O1514Q2304M7742m339k2172m5440
189C7465p3428n3584j5582N326M4081Q0817O1188K0339o288m5325p3371n1299
201f9661k0583m466L0302O1192N2215L5243J8539k5710o3240n7486l9650j7860
213a01165K6290N6962M9606L8011K3168j5213m5252m7066m5871l2683Q860M2181
$$ y = [-163233, -128523, -32231, 89616, 149096, 163058, 148108, 55658, -70398, -139972, -164808, -151722, -60792, 53637, 115180, 147583, 151435, 80680, -19936, -89769, -146158, -165692, -97033, 7010, 82500, 140163, 154915, 91308, 7365, -52321, -112318, -145031, -107727, -40812, 27369, 109709, 155417, 118200, 45772, -27142, -104251, -138600, -103532, -50533, 3465, 75136, 121218, 111147, 77085, 19751, -67620, -125223, -119058, -82144, -20630, 61674, 109416, 105077, 82905, 37465, -35963, -89547, -105129, -99803, -55722, 25095, 86283, 106622, 100334, 55009, -18362, -69661, -90244, -94710, -64408, -3216, 48999, 84242, 102781, 77071, 13831, -43655, -83305, -101165, -74875, -17913, 31693, 69704, 92872, 77659, 32407, -14659, -60530, -93213, -84353, -42172]
225d2172M8330M8733L3760o010l5238m2479m7619l7169k172K5853L8894M9891
237C2602M1315P624k0259l6135m9036m1639j1898J3221L1139M7197M2702J6922
249G3755o962k7289m5263m2538k0573R87K2242M2029M2670K5542N466j8165m0499
262A1402m3469k8758q817J5400L6845M0418K9397J3424q516l0267l8341l3618
274d4900k0322L034K7700L9077L6003K1997j621k4435l4746l3217k2989m155J6256
287d2318K9803L4602K8730J0225j3059l0350l6399k9210j0295J1137K6226L1987
299A1079K7727J4353l300j9900l1072l2063k0608o45J9726L2405L2256J9994J507
312E1459j5937k6909k8800k1893q003Q864K3437L0369K6564J2292o998k3347l0303
$$ y = [-42172, 6158, 54891, 88651, 82641, 47403, 4924, -42695, -79864, -82036, -56183, -17289, 32602, 73917, 81541, 61282, 25147, -23889, -65528, -77426, -64205, -33066, 14131, 56833, 73755, 66793, 39504, -5759, -48297, -68870, -67883, -45641, -3612, 39058, 64600, 70066, 51901, 11402, -32067, -60825, -69642, -54242, -17397, 23021, 52418, 65842, 57326, 27059, -11282, -44900, -65222, -62188, -34488, 4589, 40592, 62589, 60968, 36533, 1787, -31430, -54419, -58574, -42318, -12515, 22087, 50817, 61042, 47983, 17633, -18766, -47976, -58271, -47134, -20908, 11079, 38806, 53159, 49859, 29959, -1113, -33176, -53784, -54429, -34703, -2298, 29958, 49952, 51459, 35522, 8613, -20187, -42080, -50083, -41219, -17782, 12587, 39151, 51443, 44445, 21098, -9205]
325i205k5906j2396M565J8835K6302K5295J5917R94j4602k5407k7227j9053l671
338d5559J2948K4431K6629J9563N825r522k0910k5017k1271r995N244J8407K5092
351E865K3550J2851l040j6757k4103k3569j3847Q70J3324K1016K2697J5728L099
364C7684q844j8767k3782j8619o054O769J8292K4287J8821O601m796j5664k2257
377f329j8358q875N56J2475K1675J9671J1606K255j1186k1330j9385j2497m644
390c4366Q754J9426J8465J4022P796o250j7815j7715j5326j0390M160J5989J6627
403C377J6505J2623k689j4530j5318j6647j3494J570J1764J2305J6330J5537J422
416B8755q243j0861j8471j8254k630P487J0769J8959J7504J924n337p385j7200
$$ y = [-9205, -35111, -47507, -42942, -24107, 2195, 27490, 43407, 44401, 29799, 4392, -22835, -41888, -45559, -32611, -8180, 18449, 38012, 43837, 34315, 13405, -11612, -32883, -42878, -37634, -19227, 5865, 29415, 42266, 39226, 22469, -1634, -25203, -39050, -38180, -24856, -3840, 18857, 34585, 37684, 28840, 10073, -13709, -32328, -38382, -31613, -13321, 10966, 29787, 36388, 31592, 15928, -6329, -24687, -33562, -33006, -20531, 1144, 20815, 32421, 34676, 23490, 2160, -17225, -29722, -34366, -25612, -6186, 12279, 26301, 34097, 27847, 10032, -7683, -23009, -33399, -29239, -13250, 3377, 19882, 32505, 29816, 15286, -32, -16679, -30173, -28603, -16839, -4534, 11796, 27333, 28755, 20512, 9651, -8820, -27074, -29704, -22217, -11448, 7511, 25015, 26939, 21602, 14217, -2983]
429b983j7331m199P78M689J8180J9092N836J002m391j8572j7729m906l074J502
443b2106J6401J6272O595P612R58j7049j7345q111q872K04J7862J4760N462R143
457B1786J985j3635j0352o489j5022o260J2900J2218J0595J7109L113j5680j0316
470A952p072j4552l241J0176L604P025J9925P951q115n291j1751k1084l698J0578
484a3593K865P598J7198L691l787M020q203k2299q063J968j117J3290K1775K403
498A7746m632L539q321j6295k230l011j0298R073K0744O348M682O495j3894j8494
512h548ok432r191Q091J2330Q27J0862J4816r832j6695m715j1186r036J4371J2494
527B150k433Q479J1273p443n322R62j6853j5900Q906R256L216J6270R128j2407
$$ y = [-2983, -20314, -24513, -23735, -19046, -866, 18226, 24062, 25064, 20673, 2101, -15628, -20534, -23608, -22106, -5705, 10567, 17162, 24774, 25732, 8683, -8662, -16773, -25645, -25441, -7579, 7181, 12643, 21786, 23771, 10136, -216, -6705, -21727, -27987, -15087, -2869, 7726, 24835, 27948, 12268, 1952, -5120, -19672, -22913, -12737, -9133, -2108, 17817, 25768, 17653, 12362, 611, -20473, -24171, -13593, -10728, -3130, 14068, 17759, 13972, 17992, 9789, -12510, -20573, -18605, -19722, -6432, 15343, 17746, 13114, 16653, 8332, -7963, -10193, -13204, -23502, -14429, 6315, 12663, 17345, 23840, 9946, -8548, -8554, -10986, -20177, -12086, 244, 1071, 11933, 26749, 16917, 222, -4493, -15679, -24715, -10344, 2150, -283, 8196, 19469, 12026, 6704, 7666, -9187, -25087, -16181, -6925, -3709, 12561, 21689, 9282]
541I282m239L289j3630j1143N060k019k37K1130J3662p485k237l130j7794n371
555a4862R521m532m199J4821Q592m40J0081p24k2548j0398L717m414M250J7403
569F268J152n258J1068K926j3838m334l753j5303K481J9988M993L42R484m927
583A1289j3270L525l48j5877j552J0141P45Q892J7725m639j5176p33m623j0929
597a4830O125P250p104M958J6490L54m158K243j2641j6774N430Q178k366P984
611A139R986n754k45Q728q668j4681m7j898l344J4766J3204n539j367L997r302
626I75o596M610o385r038J0156J0761N88P414L331j4624q249M244m677m087R007
641b570K644k344J1133P399r784o079j888j0666k006J2152K880k132Q434L284
$$ y = [9282, 5043, 8332, -5298, -16441, -11381, -13400, -13637, 7493, 21155, 13670, 11433, 8303, -9491, -14862, -5341, -9873, -14072, 749, 9341, 8901, 18982, 18258, -4290, -14688, -10971, -15385, -11135, 6268, 7420, 2162, 13230, 16156, 2318, -2016, -5769, -21072, -18591, 1397, 6390, 6732, 16216, 11289, -1981, 1544, 1196, -14681, -16233, -6092, -5347, 3545, 21270, 16631, 1455, 722, -3901, -14830, -8705, -1455, -8559, -3601, 12889, 13243, 9085, 11328, -1313, -18087, -12657, -4479, -6845, 1139, 11125, 5371, 5126, 13854, 5186, -9495, -9542, -11440, -14784, -18, 13186, 7647, 6280, 10277, 975, -5621, -1011, -7396, -16434, -6278, 4483, 5071, 12485, 15816, 1192, -7057, -2813, -7490, -11577, -2570, 74, -2270, 8863, 16262, 6478, 399, -1489, -12155, -14161, -2009, 871, -1261, 7173, 10457]
655A0457o355J375n07j3475n441P007J772L725J1722O06p981J387k63r496k100
670g567K637m350K880J3023L344l355J554m859j0405N40L263m457J903Q665J377
685D193J409O023m519j1096k010l93l374N452P851j134R43N927k535o205r93m787
701e248o622M559P703J393L596M134m682m511R32m030n936K148L226R73O565N825
717A0025l544m003j067n170l860K867J300l72N561N309q08o07j326p011m770J686
733e790R60J099N485L369p57J163m4n477m267p68j645J031N894L687M56J558p22
750E232m622k934j254k623K82M476L220J931K559p02m051k571j857k735Q0K993
766b576K339K696L372J71k821k513k956l137j94K130J962K922L346Q16j423j919
$$ y = [10457, 4102, 5477, 4970, -8505, -13946, -6939, -5167, -1442, 10280, 10886, 2905, 4292, 4029, -5467, -7567, -4930, -9280, -6400, 6623, 9967, 6612, 8166, 3307, -7098, -6558, -3295, -7752, -5849, 2816, 4193, 5602, 11625, 7106, -3990, -6000, -6393, -9767, -4315, 3536, 2402, 3345, 9272, 6737, 532, -461, -5248, -11870, -7311, 392, 1785, 5381, 9515, 4833, 322, 1254, -2776, -8712, -6564, -3338, -2365, 4200, 10025, 6481, 2478, 1411, -3759, -7619, -4752, -3452, -3824, 1737, 7046, 6238, 5631, 4305, -2706, -7476, -5790, -4830, -3731, 1754, 5123, 4366, 5529, 5485, 8, -4259, -5027, -6672, -5641, 253, 3940, 4396, 5954, 5232, 610, -2324, -3578, -6201, -5919, -1443, 1777, 3708, 6267, 5565, 1514, -1057, -2914, -5649, -5569, -2576, -237, 2459, 5831, 6002, 3181, 668, -2288, -5425, -5619, -3489, -1527, 1395, 4741, 5557, 4134, 2215]
782B215l181l307q43J047J549K712L006J289r6j037k740l399j833j69J301K921
798e65L153J605J81r96k295k750j922q39N30K099K889K341J111m58j952k683k315
815b866j270K4J384K367K538J781M80j122k433k819j934m30J151K272K439J564
831C126M52n93j463j960j851j319j53J349K506K565J455k31j833k449k014r80
847c393R0R72J654K011J803P70o70k055k667j853l80Q70J689J959J393Q13K31
864C237r37k087k131j506l62J435K503J861R81K01j187j841j305j176r14P36J801
881f91J474J541J114q64j746j215j610j448O02J477J199K089J772p20j511j041
897D22k052j713O97R42N35K222K060m39o61m79k464j921O96K55o3K334J927l53
$$ y = [2215, -966, -4273, -5116, -4069, -2520, 192, 3198, 4487, 4391, 3354, 614, -2785, -4618, -4787, -3486, -565, 2588, 4193, 4374, 3378, 1083, -1667, -3589, -4428, -3898, -1799, 1090, 3431, 4542, 4084, 2132, -551, -2866, -4136, -4112, -2728, -361, 2177, 3958, 4438, 3316, 883, -1936, -3870, -4300, -3149, -877, 1562, 3126, 3578, 2985, 1522, -438, -2289, -3608, -3761, -2412, 94, 2659, 4114, 3883, 2050, -399, -2413, -3393, -3303, -2331, -677, 1334, 3137, 3907, 3237, 1182, -1485, -3338, -3718, -2848, -1159, 800, 2193, 3006, 3237, 2300, 213, -1918, -3424, -3786, -2351, 152, 2013, 2994, 3195, 2008, 167, -1138, -2314, -3228, -2492, -691, 783, 2324, 3438, 2574, 828, -387, -1997, -3445, -2843, -1366, -167, 1922, 3694, 2974, 1463, 422, -1630, -3343, -2646, -1704, -1169, 1053, 3113, 2674, 2013, 1534, -930, -2851, -2155, -1900, -1963, 371, 2298, 1945]
915A945N11J86k995k257M41l89K48L185J500j048P99L59k700j165M45j926n35
932c396L296J461j91J997j7l364o29N45k540m78K843L30K65L419R6l466l41q4
950b54k860O48K886j210k71L621J93k045J147j222m466O90K953r01R96L391j639
967A657j965K626q75m274O55J013k120K702M613k001j849K171j959k957K631r4
983b6m095K065M044j194J041K787m237l877L042J00k616L026J515l454K238M374
999D733l232k682J650k935k309N399K034l620J693K202l531O08L303m583l894
1014e164L848J025r80M889J002o041O3L333l156q52L335l169k571O166K501l554
1030F75J219m4n919R52N481k572k333M001q81k222N250Q14o968n13K706k714J839
$$ y = [1945, 2456, 2642, -353, -2610, -2169, -2558, -2310, 875, 2375, 1327, 2126, 2485, -215, -1380, -935, -2861, -3396, -100, 1361, 1170, 3167, 3150, -214, -843, -298, -2838, -3316, -473, -143, 122, 3541, 3637, 171, -170, -254, -3114, -2466, 420, -790, -1061, 2560, 2753, 708, 1855, 633, -3833, -3143, -190, -1091, -95, 3296, 1657, -308, 2318, 1443, -2831, -2176, -1163, -3283, -581, 4032, 2031, 182, 2353, 394, -2563, 68, -26, -4121, -2056, 1988, 794, 1835, 4622, 385, -3492, -450, -350, -2966, 60, 1575, -1879, 359, 4733, 1501, -1181, 469, -2466, -4775, 624, 2658, -962, 731, 2933, -598, 10, 3313, -1270, -5164, -1316, -291, -1271, 3618, 4620, -1421, -1358, 1975, -1181, -2033, 1302, -1867, -4438, 1728, 4229, 675, 1894, 1850, -4069, -3117, 2364, -208, -2541, 1460, 579, -1643, 3607, 4421, -2547, -3060, -354, -3068, -1229]
1047a229N819l212m094M314P05l674K569J54o553J185O467j087p24L542l587m597
1063d002M694J757n079R73K338l570K136O467l033m771K425j150l166M837K221
1078C077n652O25M779k164l65L675m392n346M520K615k681K951J838n569L96N482
1094C789k754l487K664j956k985O122L471m804q9K094m191L6N151k997m406L922
1110d20J623k117L927J470o682j153M207j740p74M187k165l891M717K771l984
1125b4J64P55m976M46O234p60k816K752q35l334L707J983n456r93L089j584R14
1142g34N164j989m748K264J006k975K117J718m568j5N116n37j564K356k415m294
1158d098L164K750k869O01K230k859P4M424j630l939J396n8k202L419K837l389
$$ y = [-1229, 4590, 1378, -2716, 1598, 2303, -1371, 1198, 1352, -5201, -4016, 2451, 1364, 640, 4182, 595, -4002, 692, 2449, -2630, -1657, 681, -2889, -753, 5714, 2681, -2090, 335, -815, -3981, 856, 3077, -2575, -1950, 2829, 665, 300, 3975, -417, -5763, -1243, 1372, -1309, 1642, 3480, -2089, -1693, 3789, 1035, -2452, 212, -1744, -4729, 1393, 4864, 60, -29, 2065, -2126, -2090, 3061, 64, -4342, -420, 1203, -914, 3013, 4483, -2199, -3352, 855, -885, -1659, 2528, 363, -3528, 1189, 3960, -24, 140, 895, -4081, -3635, 2599, 1839, -977, 1775, 940, -2394, 1313, 3296, -2160, -3153, -64, -1648, -734, 4430, 2441, -2307, -43, 963, -2012, 105, 1823, -2745, -2760, 2356, 1819, 255, 2611, 196, -4098, -934, 1816, -1053, -452, 1778, -1081, -1007, 3417, 1787, -2152, -756, -814, -3016, 403, 3240, -149]
1174a49o60K651j714j193K600j704l430K616K406j543J338J524l479j055K959
1189A167j021k074J982m9j869K729K218k790q31J198k101o13L006l66k040J982
1205E28J071j811R12R31l023q60K357l80n58K261j86k004J401R59k295l78J026
1222d9j453R7K794Oj446R50j58j852P21R64j686j55J799k35k19J519n72j943M57
1241d61M57j162N40J254p28PJ505m28j284L29m02j190Q73J177n28K11R52o24n77
1260g9O36n54j202M10M99k68Q37R63o00m39K75o99p12M74J64k93P32O78l67o6
1280C89J59o98n27L10o7j87O49N09r4J90N3o94n19K4j69J7O19M27M9K21Kn40l87
1303b64j39k09NL88K98J61K94J16k30l12l36l87j31K98M31L74K53Mk77l29k45
$$ y = [-149, -809, 1842, 128, -1065, 1535, -169, -3599, -983, 1423, -120, 1218, 2742, -737, -1792, 1167, 146, -1928, 54, 5, -1864, 865, 3083, 293, -538, 660, -1441, -2054, 952, 586, -1454, 528, 1599, -212, 700, 1631, -1392, -2252, 105, -275, -833, 1428, 1242, -762, 639, 1598, -697, -1075, -49, -1502, -1405, 1389, 1395, -51, 899, 741, -1111, -390, 574, -1112, -1267, 532, 297, 78, 1597, 1025, -918, -461, -4, -1166, -626, 628, -100, -93, 1412, 984, -300, 29, -373, -1563, -690, 487, -41, 170, 1122, 498, -79, 557, 3, -1199, -789, -290, -558, 279, 1242, 642, 203, 478, -221, -933, -459, -295, -588, 144, 822, 455, 389, 548, -150, -677, -367, -434, -621, 28, 537, 443, 633, 686, -8, -527, -503, -672, -655, -36, 391, 440, 661, 663, 123, -264, -403, -612, -607, -219, 79, 240, 534, 650, 420, 108, -228, -615, -746, -448, -17, 357, 610, 614, 337, 8, -237]
1324b37j84r7Q0K49K93L00K13o5l09l59l08j78O9K39K87K74K73O8j90k96l93l24
1346e95m5K39L13L31K20pj25j52k27k36j55l1J34L25L49J98J9k34l68k87j69j9
1368e22K02L20K36K28J11k25k99k15k76j19K15K10J40L58J94j61j29j56m76k43
1388f07K14J16J12N20K15k35Pp9o05k11K79n2R1O07O1l42K59N0n96o1J26n06M7
1411e90Q66J56j47M10k98r04J77L22n27J24O73l14j4R18j79r26J87o4p71N53Q36
1432D88o18o0R16l41n14O59m54j258O40Q20n00M63Q28j083n31J102l27r75O97
1451d8K5j032J056J283j021l54P58j057o57J472j14j345R17Q00r53O60J028j748
1469c30r25J396k54o92J483Pj682J008J351j394k90Q90j511o34K317K52j457R37
$$ y = [-237, -421, -518, -438, -189, 104, 404, 617, 552, 243, -116, -424, -602, -533, -294, -7, 267, 540, 608, 418, 122, -271, -595, -640, -401, -88, 243, 463, 456, 331, 179, -48, -284, -439, -470, -336, -11, 338, 536, 555, 321, -47, -334, -503, -522, -320, 0, 236, 464, 575, 350, 51, -164, -440, -559, -344, -134, 6, 364, 558, 397, 268, 112, -364, -607, -393, -277, -165, 355, 570, 335, 342, 263, -342, -553, -274, -326, -235, 372, 433, 91, 350, 400, -196, -257, -131, -637, -590, 276, 432, 285, 695, 397, -507, -330, -8, -535, -411, 262, -52, -66, 852, 673, -253, -66, -130, -901, -348, 488, -130, -190, 726, 385, -129, 530, 76, -1182, -542, 278, -222, 241, 1069, -14, -545, 557, 230, -745, -48, -23, -1055, 1, 1284, 263, -91, 667, -390, -1047, 425, 311, -1034, -117, 683, -270, 390, 1418, -330, -1255, 141, -113, -805, 678, 685, -997, 11, 1362, -32, -322, 568, -943, -1577, 740, 992, -465, 472]
1487D72K60j753Q95J534j907q91J651m49n08K233j62k563P02J160j467M94J560
1504A261j963r57K606J89j441J204l62k628J207K311j502m99J577j420q63K793
1520A513M0k772N70P75j656J426K456k185j574K003l44j169K096k30l173J050
1536a174K435j179K00J621k474j716K914N07k041J175K91k497J542K978j983j588
1552i89J452j338j114L278N50l111O65J529j731Q84K332k740k215K569M31j210
1568g58K221J28l492Q31K763j589o84J660k025j523L545J079k606N88N11k573
1584a924J080L119k020j974J993k94j110K870M19l758J26K059j346M66K429k207
1600g2k171K800Q46j911J217J47l244Q88L356j215j146J650j479j664L049R01
$$ y = [472, 732, -1021, -126, 1408, -499, -1390, 261, -188, -696, 1537, 1375, -1188, -486, 674, -793, -299, 1261, -702, -1659, 947, 1136, -305, 899, 537, -2091, -884, 1427, -75, -574, 1003, -417, -1280, 1513, 1553, -1219, -649, 126, -1530, -104, 2352, 167, -1407, 596, 252, -917, 1179, 949, -2224, -1174, 1261, 82, 282, 1903, -571, -2287, 627, 1134, -907, 268, 559, -1938, -396, 2582, 599, -989, 463, -875, -1989, 1289, 1839, -1272, -607, 922, -809, 75, 2407, -333, -2548, 21, 452, -758, 1463, 1591, -1901, -1070, 1693, 104, -580, 1080, -945, -2468, 1077, 2156, -450, 138, 649, -1924, -844, 2275, 255, -1719, 274, -20, -1130, 1740, 2159, -1599, -1473, 586, -760, -294, 2135, -72, -2243, 557, 1403, -508, 709, 856, -2388, -1500, 1856, 641, -505, 1145, -334, -1998, 1051, 1952]
1616A952l048K33J228j760J057L034j997k430J782M8j351K251N88l273L41K586
1632A241j008k70J775k021k229K572J189j828Q53P19k434N94K887j357j785J284
1648A82o65j307K639J176k642o8J392j401K00K250j576k143J823P51j154J485
1664I42N97k763o7K192q37o81J531r98j576K172J094j897J24O75j796K72K389
1681A373q31j494J256qj157J551P07k284k43J474o96j3J724q86j670J292O47j257
1699e15N82O17j674P1J885m35q69R44n00j276J230Q33j380K5R35q27L2J493o55
1718E16j379P18K09q33R07P55j263j31J129m68m56Q74n24j090Q77O87p66L20N90
1737F72r36j74J010m09p61O10N1o05P58N99r01j86N36m99k27Q05k03o62N51L53
$$ y = [1952, -1096, -863, 365, -1395, -338, 2696, 699, -1731, 51, 99, -1252, 999, 1587, -1686, -1345, 1241, 233, -37, 1738, -283, -2512, 60, 1249, -579, 274, 993, -1441, -847, 2040, 683, -1102, 182, -483, -1790, 849, 2025, -617, -685, 707, -694, -494, 1756, 180, -1963, -140, 611, -543, 942, 1539, -1224, -1291, 901, 64, -617, 914, -84, -1660, 512, 1606, -291, -167, 508, -1288, -1016, 1373, 542, -952, 304, 296, -861, 690, 1397, -887, -1130, 344, -352, -365, 1359, 473, -1197, 95, 742, -515, 67, 684, -990, -919, 966, 531, -338, 606, 106, -1170, 60, 893, -487, -462, 473, -354, -322, 1171, 516, -863, -145, 64, -769, 138, 893, -370, -501, 628, 160, -296, 578, 54, -1036, -159, 528, -238, 82, 672, -264, -438, 572, 163, -598, 12, 63, -542, 216, 815, -86, -272, 264, -235, -462, 343, 140, -522, 29, 382]
1757C82m88K64L52p69k75N96j41k45N71M5m97L38K92n58p6K90l30r4N69k3l28
1778a25K91Q8m09J23K03l99q1L86m0p2L33m7l81N9P7k58O5K73j06j7K56l2k02
1801a5O2k4k52M8J48o0M4K21%r1M3r8j91OP6lP5J38j8l4K9n0j47j2K2j4N9R6L1
1830H9RJk7j02q1m4J8M4J42R1Kk9n7j05o5LqJ2P0R2L0N5or1q1m4m3jP2O9M1O8
1862A24Jo8r4m8l3L7O8L1K7K7kj1k1q2q1nL0M6J30L7m5K2j0j14m1j8q0L1J89N2
1892I9nO1q3j67O2M7j38J8J18p6N7K44p7k07L7l9j63J68J83j86J3K28j56r3J96
1917A41j52k96K16J69k01J78K17l16o9L27j83k71K54n6k96L76L16l67j5K50l61
1938a39j16M77j52m23L59J67l69L33L15o22j73M84k22j84N78j35n73M49L62n54
$$ y = [382, -106, 158, 510, -259, -534, 62, -79, -324, 247, 292, -205, 133, 425, -133, -209, 81, -249, -343, 226, 203, -125, 166, 254, -155, -32, 171, -228, -309, 77, 37, -35, 298, 251, -130, -71, 6, -252, -187, 86, -20, -37, 219, 187, -15, 47, 23, -229, -181, -33, -93, -49, 172, 172, 81, 124, 26, -165, -159, -83, -86, -11, 127, 109, 75, 104, 54, -93, -105, -83, -97, -38, 58, 89, 98, 99, 72, -30, -111, -155, -137, -93, 49, 140, 142, 113, 56, -49, -114, -111, -119, -107, -37, 55, 85, 140, 134, 43, -38, -82, -125, -126, -54, 15, 56, 124, 125, 57, -37, -85, -118, -81, -13, 18, 45, 72, 70, 59, 38, -44, -125, -130, -100, -54, 76, 113, 68, 90, 80, -34, -75, -93, -173, -142, 47, 99, 94, 155, 72, -95, -33, 14, -124, -106, 12, -64, -7, 237, 160, -47, -10, -49, -212, -44, 139, -47, -34, 194, 38, -55, 141, -11, -307, -91, 78, -123, 55, 272, -44, -113, 214, 31, -240, 14, -42, -338, 38, 354, -13, -28, 222, -139, -255, 222, 70, -353, 6, 173, -196, 137, 452, -170, -343, 141, -81, -265, 313, 178, -395, 54, 416, -138]
1958a38P5L45o58j39Q54r3m78M83n2o96N22N23p71j72N77m03j26R82j85r27M17
1979f0L06o50M21O07r48l20J000j37m38P35k58j108O22Q01p23L6O22q36l04J279
1999F47j18j023M66J14q76P99R99j069m75Q47m23l58J199k56j436O02P97p05M46
2018A77P97j336o20J378k4p68Q18j56j341Q99J257j021l77P43r43m19J721Oj442
2037f51N11M39r56P59J153j484q59J235j28m80J349j64j813N98J218q44O6Q63
2055H12j374p35J830K99j134O19J5j516Q63J586j173p50R61o32m86J832N4j923
2073h52L38P95r01O50J335j547j074J512J48p71J099j47j952O66J620p94k43R07
2091G89j209q38J899L72j529L96L31j269Q30J719j258j103J037l03o25J610J56
$$ y = [-138, -63, 282, -376, -515, 339, 246, -232, 251, 199, -497, 25, 548, -223, -395, 182, -221, -347, 635, 450, -477, -60, 246, -404, 17, 624, -324, -644, 356, 219, -219, 516, 258, -850, -228, 573, -150, -114, 508, -328, -632, 647, 529, -494, -28, 86, -790, 9, 1008, -61, -536, 311, -112, -470, 729, 473, -963, -361, 436, -269, 177, 974, -362, -982, 396, 372, -396, 422, 266, -1075, -176, 1081, 60, -317, 426, -517, -936, 785, 791, -651, -140, 299, -657, 102, 1255, -229, -1088, 147, 19, -461, 888, 724, -1089, -491, 727, -117, -51, 812, -562, -1297, 533, 832, -302, 317, 332, -1184, -321, 1265, 92, -658, 303, -329, -815, 1017, 1071, -852, -514, 281, -620, 30, 1365, -182, -1256, 256, 404, -367, 732, 585, -1367, -701, 919, 125, -118, 789, -420, -1258, 641, 1013, -516, -120, 211, -1058, -228, 1491, 233, -870, 167, -136, -761, 849, 1005]
2108A005j995K93J211p35K83J167j447j215J572M57r09Q08R2j745N71J699q33
2125B79o77Q33q56p62J810M90j589K01O07j054N28J486j198j194J107J22o21J239
2143G51J84j858J87J305n98r4R85j044j053J488N82j060L93K42j370L67J588o74
2161C21q24P73l58p08J321M64j517j5P91o70K23J231q58j113R70L16o98P13K64
2180F26j427J33J265m20l49P34o23q81J114N32r76J63M31q73J99J202n62q53O32
2199F7n4n76Q64M05j118k9P84m29q3P97n83q61P70M08n56L50L04r10qR31k90m79
2221b96N16k31n78P25M32p22k9M16n01lP50l17o23M75J72m27M11K71p26r1N90
2242B14k03j89M92k11n20M54K98m42O5K49m87l2O01j46l45L11j9l54L09K45m45
$$ y = [1005, -990, -697, 514, -221, 62, 1229, -218, -1433, 139, 596, -313, 495, 587, -1158, -587, 1112, 279, -398, 435, -421, -1183, 627, 1117, -472, -271, 336, -718, -190, 1296, 98, -1096, 11, 133, -488, 751, 935, -923, -736, 569, -29, -123, 862, -182, -1235, 253, 835, -225, 168, 410, -960, -593, 995, 321, -503, 270, -88, -796, 525, 989, -528, -543, 248, -422, -199, 1032, 174, -939, 31, 347, -351, 362, 626, -801, -668, 597, 177, -172, 562, -61, -942, 172, 704, -272, -109, 322, -551, -352, 850, 288, -565, 67, 13, -563, 301, 706, -412, -441, 343, -86, -169, 628, 45, -816, -46, 362, -194, 156, 460, -450, -458, 473, 183, -296, 220, -11, -589, 136, 568, -154, -183, 233, -268, -271, 479, 162, -461, 14, 186, -241, 170, 441, -285, -376, 214, 11, -178, 314, 103, -417, 37, 335, -107, -42, 207, -280, -312, 289, 143, -202, 109, 90, -264, 45, 290, -155]
2263a55n2L37j81q9L93j30l81K47J41k51J13K04l20o1L55q2j75J84m1k92J98J86
2285A48k12%J95j55q4K43o2k19J09P4j53R9J41j50n4J63n4j06J01j3j42J01J02
2308G2q6K0O8q6p3J05Kr3P3L1o3L4P2p2l9L7j7n6N8L6n3L7M0l3l1J8k0m1L6K9
2338Ek1J9K4j5k1J3j1k7OL5k5J1K9jnRk7l3jK3LJ6K8jm1K1nl9J1Kj3J7L2JrOk5
2375ij2Oj2j0K5K5qJ0J5l6oQl1KL6koL2j2j6K6k0n8K8K8k5K8M5m6k1N1k3o9O5
2409Hnp4O4N2p1J9O6r8l6J14m2q7J10J9j01Q1Q2j67j0J34r4n4J66l3j59J40P8
2436A02j53N0J04k05k1K21m9j27J75l5k15J72J47k41j5J90j90m5L25p7k76J64
2458AP9k41J80K05l45p8L39j12j23L02j20m04K55K41k75R8K18l78r1M85p3l27
$$ y = [-155, -207, 130, -51, -140, 253, 123, -258, -11, 130, -121, -8, 196, -124, -185, 170, 88, -87, 97, 56, -236, -38, 148, -64, -64, 131, -24, -108, 135, 73, -146, -37, 37, -116, -17, 124, -26, -80, 83, 29, -77, 24, 11, -131, -30, 72, -14, 6, 74, -12, -85, 20, 22, -71, 2, 33, -30, 4, 76, 4, -35, 2, -15, -71, -13, 23, -30, 7, 47, 14, -17, 1, -19, -60, -24, 5, -16, 3, 27, 12, -9, 4, -7, -34, -28, 7, -18, -7, 22, 21, 16, 25, -2, -35, -36, -13, -10, 6, 34, 33, -8, 13, 8, -31, -20, -18, -31, -14, 18, 19, 10, 16, -9, -21, -15, -27, -37, -12, 13, 5, 15, 30, -6, -12, -4, -35, -33, 3, 1, -5, 27, 15, -1, 25, 5, -53, -25, 3, -22, 6, 51, 5, -16, 35, 12, -57, 8, 3, -71, -7, 45, -26, -7, 59, -39, -75, 39, -3, -90, 20, 39, -62, 19, 101, -66, -76, 58, -36, -90, 76, 43, -116, 24, 102, -51, -1, 103, -102, -123, 98, 49, -78, 97, 62, -153, 19, 166, -75, -90, 100, -90, -135, 190, 113, -163, 1, 80, -161, 19, 224, -121, -199, 140, 28, -95, 207, 87, -317, -62, 179, -96, 2, 220, -158, -249, 236, 163, -164]
2480a64K50k7l89L35L49m09r4L24k81r5N05j24n18K85K06l31K50L26n70k00N39
2501A67p5k63M14j21n92L79M82m28k1L08m96j67P33k3n55K98P0m98M22N26o52
2522i2k71M85k01j79O96j31p95L28M35m27K01M28p34l03Q12K2m40M21j06p64M89
2543a26O78n64j79M24m85k09R33j9q17K41K44n21M28O57p74m55O89q4k93O96j32
2564C32r89L64O94m37N3M71p46m16R77J38o41L23J9p93N12Q66o47m16N07l73k73
2585d75R76K3j000K25M54m85L35O72q71n60Q28O8l91O04p4j023L86Q49m82j53
2605i4M71o55m06J042K13q06K16J67p03M11R04o79n63N65j34l36Q74M8j054J41
2625c78O31m07J27O35p44n93Q53K35n16L95K2r12L13R18m43l34M60m34m12R20
$$ y = [-164, 86, 59, -330, 5, 354, -55, -149, 175, -106, -201, 304, 180, -338, -53, 153, -178, 72, 398, -172, -372, 167, 92, -171, 243, 122, -470, -91, 391, -37, -58, 250, -246, -413, 320, 297, -258, 40, 110, -388, 34, 560, -92, -363, 122, -79, -258, 438, 307, -488, -160, 275, -152, 49, 477, -257, -560, 252, 274, -166, 255, 149, -615, -126, 552, -12, -191, 233, -252, -461, 472, 453, -364, -123, 121, -400, 28, 685, -89, -544, 145, 61, -232, 464, 332, -657, -293, 401, -36, 17, 488, -258, -674, 303, 441, -200, 123, 142, -651, -139, 727, 80, -336, 171, -202, -475, 501, 524, -476, -251, 203, -282, 53, 725, -146, -706, 122, 190, -201, 403, 329, -694, -308, 541, 59, -94, 377, -278, -684, 358, 571, -235, -19, 148, -555, -144, 760, 81, -482, 83, -51, -387, 487, 535, -519, -378, 253, -154, -27, 608, -136, -729, 124, 359, -157, 238, 260, -652, -339, 579, 136, -198, 262, -172, -584, 336]
2645C36K35q70J14L25n34K95Q09o37o04N79L7l65O42O9r48J46P05l23o3N03n75
2666a24n28P63K98n67K21J45p04K30Q31l96m61L93k04l48P28K29p83K8M23l62
2686a88R4O19m79n62N26J89l65L72J27p25O9O50k40k24L95l23m10N97K84n27O9
2707e2K00m56J11O20k92m12L26j5k95M44J75n90nM02k28k7M16k82m13L99J87l18
2729a05J59J49m65M8M78j52k56K66j15k98L66J90l64j9K41k43ML85j77l20K16
2750a2Q3k10J93J64l52l9L23j28j08K32j26k60K44J55k28O3J34k33k6K85p9j96
2772a21J53kj67J65J34k23k6J74j21n5J95o1j75J35P6j24M6Q2j63j8J45k5r8J13
2796C9qj18R3R1j27k2R6q1k8J28k2j05N8N5r7M7N8q1k8Q7j7m1O7k0o0J9N5o7M
$$ y = [336, 571, -299, -185, 140, -394, -99, 710, 73, -531, 48, 85, -280, 362, 431, -517, -371, 334, 11, -52, 451, -124, -652, 111, 409, -158, 63, 208, -496, -266, 565, 169, -292, 101, -103, -451, 277, 506, -277, -249, 174, -188, -94, 525, 46, -516, 10, 199, -166, 206, 333, -392, -323, 327, 87, -137, 258, -65, -475, 122, 406, -121, -52, 148, -308, -197, 423, 131, -281, 45, 30, -265, 179, 354, -236, -241, 161, -67, -94, 322, 40, -373, 26, 213, -105, 54, 203, -262, -214, 264, 112, -144, 122, 7, -291, 75, 265, -99, -118, 123, -120, -116, 269, 92, -228, -12, 71, -139, 54, 218, -134, -173, 150, 22, -86, 146, 20, -240, 4, 159, -69, -6, 128, -105, -131, 154, 75, -121, 32, 30, -137, 28, 162, -61, -87, 87, -34, -89, 106, 45, -130, 5, 81, -43, 3, 85, -78, -96, 49, 24, -74, 39, 31, -87, 6, 97, -30, -52, 44, -37, -65, 63, 41, -64, -6, 49, -48, -1, 57, -24, -52, 35, 18, -23, 44, 24, -36, -17, 38, -29, -25]
2825b5N3k6k7M5Jn2K9Nl8K0M1l3j0L1Ok6J2ml1J2K9j9jK6jk5LJ4k8%K7Jk1K9j3
2860Dj0JPj6qK8j9mK7Jj7J4Jj9lJ0Lj7K1pmJ4Nl2J8Lk4RJ5ljP%j3OPj5J8Rj6K
2901BJ3k3J0Rk3pK8j5qK9qk6K0Ol1PK7l4JM4j3l0M2k1n7O3K6o4PN5n3j8R6l7p7
2936f0O5J8p5N0N3q0j4R6m9m4R8n7j00J06L5q0M1O1j31rJ51n1q4J02l4j18J30
2963B0Q9j51j1J14j34j1J92n2j72J21M1j45J31J17k24m0J91q6m8J80p0k21J75
2986FJ18j73N0J16k52j1K88n6j82J48l5k09K20J72k71l8J87j60k9L20j05k93J67
3009b2Q9j92J66J85l48p3L19o0j40K25j09l30K63K42k49J3J67k99n8M29p0l18
3031a70J86K7k88K88K63l79j22K86j56o7L81j17m29K35K10k45J54K00m42j16M62
$$ y = [-25, 28, 2, -25, 20, 21, -31, -2, 3, -35, -15, 26, -7, -17, 14, 20, -6, 6, 2, -29, -17, 12, -7, -8, 18, 17, -8, -5, 9, -19, -19, 8, 9, -12, 17, 4, -6, -5, 2, -14, -22, 6, -13, -17, 10, 11, -6, 8, 9, -10, -13, -3, 0, -17, 4, -3, -7, 7, 12, -20, -2, 1, -23, -14, 1, -2, -3, 4, 4, -9, -3, 4, -11, 7, 16, 0, 2, 15, -8, 2, 11, -12, -19, 9, -6, -14, 15, 7, -19, 1, 7, -24, -17, 10, -24, -23, 21, 8, -22, 20, -1, -58, 5, 31, -33, -26, 29, -24, -42, 54, 17, -60, 5, 23, -52, -2, 51, -29, -43, 53, 4, -40, 58, 1, -99, 7, 42, -38, 3, 64, -67, -76, 75, 24, -60, 42, 8, -110, 20, 109, -42, -53, 61, -73, -84, 108, 56, -116, 5, 46, -99, 32, 149, -75, -115, 76, -10, -58, 122, 52, -169, 6, 124, -49, 1, 117, -135, -146, 142, 86, -96, 52, 17, -192, 28, 200, -71, -109, 78, -82, -111, 209, 104, -189, -22, 67, -125, 41, 226, -122, -195, 124, 64, -76, 149, 40, -290, -27, 215, -34, -21, 146, -153, -211, 218, 148, -170, 16, 43, -245, 43, 306, -73, -195, 91, -65, -132, 249, 132, -297, -62, 148, -97, 57, 257, -185, -301, 161]
3052A61m0k25K49r7l92L32L39l45p3K18k98m9N13o3m44J79J04k82K79L02m67k06
3074c05L98q3j31M09j36n41K77L38k80O2K40m54j42N64Nl42J99l6m23L56M32m22
3096a5j72L03k32j04N46q1n50J87K16k74K37L24n04k44M83l1k02L45j04n36K80
3117a28M38l00m8K40l99j57N90K9m40J67N4l57L00M46m48k59L31j10j42M83l7
3138B53n81J80L15k43R8L00m61k42N09M8k78K52l4m82K55M49l04j50K44k53j68
3159b93N43M0m62J01J55l03K13L85m04k60L40j3j69L58l0n04J40L50k16J5K56
3180B42l44k15M53P7l06J44L5l57J84M03k62k04K31j36j51L96M2m17P6K03j99
3201a05R9K99l01k66L18L4j92K37J2l78J28L06j60q6K04k24j63L45Q3k82Q3Q5
$$ y = [161, 121, -104, 145, 48, -344, -12, 327, -18, -91, 127, -171, -220, 293, 230, -214, -35, 69, -213, 66, 368, -99, -305, 93, 10, -121, 288, 152, -389, -112, 226, -54, 8, 248, -206, -348, 216, 221, -121, 78, 42, -381, -25, 407, -15, -187, 116, -116, -220, 326, 245, -305, -118, 98, -176, 61, 385, -119, -363, 120, 89, -113, 232, 128, -408, -128, 310, 10, -38, 202, -197, -354, 236, 265, -175, -8, 46, -311, -11, 435, -13, -272, 59, -51, -193, 290, 253, -328, -148, 167, -76, 22, 322, -139, -381, 128, 176, -102, 150, 116, -366, -111, 338, 34, -116, 128, -125, -293, 250, 290, -172, -71, 84, -219, -6, 379, -25, -285, 55, 42, -127, 231, 201, -303, -163, 187, -29, -14, 242, -102, -317, 136, 213, -93, 51, 86, -271, -87, 316, 54, -150, 81, -55, -206, 190, 232, -185, -109, 94, -105, -6, 293, -8, -274, 44, 78, -114, 123, 135, -243, -115, 191, 31, -55, 149, -75, -238, 107, 190, -92, -9, 76]
3223G6k34J09K87k12j90J90k2j22K49N3l32M4K05j42J2J90j85j75K42O5j71J12
3245D9M5k40N0K34j22r6J48p6j28K04P7k28L6J04j38L1J89j22j28J35K0j11J12
3268D5N1k02L5J48p3l3J13q0j12J38M2j22L9O2j20L4J25o7q0P6j3p1Q7L5j11Q
3294d6R0n7j3P9n7p6Q7L3p3M7L1q2J4O3l5l6M8j3n9O4M1o5KM9m5j4N9l7l7M4J0
3325A6m3L2K7m5k4N6l0j1L2ll3L1K1l1jJ3j6j6L8nk2J1K3k3NNj6oJ3Oj0J1Kk0
3359a3J5Rj1k2K3Nj2LJ3j7KJ6j6rJ5j2pL0oj7LPonJ6prJ4NKMlj7%NkoRJ7j6%J5
3401A5k9RQ%kJMj4J7j8KJ2mj7LJ5j8J2J7k7mL5k6j6K8kk1L5Lk2K2%l0NK2j3j6
3438a4L3j2m0O1J2n4JK6m0J2O1m6k5M4j0l3N6oo7J9O6o3pQ1n7m8P2Nn8L3L1r1
$$ y = [76, -158, -49, 238, 26, -164, 26, 4, -118, 131, 184, -148, -104, 101, -41, -29, 161, -24, -199, 43, 108, -63, 49, 94, -146, -96, 138, 16, -80, 68, -8, -136, 68, 145, -83, -47, 57, -81, -50, 139, 17, -111, 24, 44, -67, 45, 96, -106, -71, 77, 4, -29, 84, 4, -108, 30, 72, -50, -11, 51, -69, -35, 90, 23, -57, 19, 6, -65, 22, 57, -54, -46, 44, -13, -26, 53, -4, -80, 7, 40, -33, 14, 45, -37, -23, 40, 5, -31, 17, 4, -55, 9, 50, -15, -13, 36, -9, -23, 36, -1, -38, 6, 16, -27, 5, 32, -13, -37, 19, -11, -22, 10, 7, -26, 5, 26, -5, -6, 7, -9, -25, 13, 8, -14, -3, 20, -3, 2, 7, -9, -15, -2, 4, -6, 5, 7, -13, 2, 11, 0, -22, 1, 6, -6, -3, 10, -7, -5, 11, -5, -14, 1, -11, -18, 12, 6, -11, -8, -1, -7, -12, 4, -3, -12, 2, 7, 9, 13, 10, -7, -7, -2, -4, -10, -1, 16, 0, 0, 15, -14, -5, 3, 3, 1, 2, 6, -8, 9, -9, -7, 5, 1, -16, -13, 2, -16, -4, 13, -14, -18, 17, -9, -25, 3, 1, -20, 15, 18, -4, 18, 18, -12, -7, 15, 2, -14, 19, 7, -33, 28, 40, -14, -13, 13, -27, -15, 46, 0, -25, 19, 9, -24, 32, 26, -41, -22, 44, -19, -26, 55, -2, -50, 22, 27, -31, 2, 33, -58]
3470e8L0R8o1m4P3m7o7J20J2r0J6N8q0K0J08p1j01R4Pq0J14L4j47J3J02o7rJ07
3498H4r5j09J40M6r9M1L9j38L5J62p6q8J04n8j02J70N9j77J1J02j12K0J83j30
3522A2j40J33M3j14J22M3k16J3K01r0m1J47j27j58K06R0j72M2N7j88N4K46j10
3545E3j50J15j9j26J97R4k57j0J75j18J1K15j52k17J83R7j43J19O5k71J3K71j00
3568D5r6J29q9j95K56J43k34PJ13k04M0K95j34k36J52J4j45K29J09l21k9K34r5
3591a2l4K29j63k56K38J48j80O5Q4k89J5L40r2j81J71q2k05K74J53k89l6J71j68
3614i9K3K99j35k80J71Q5j58J78J08l35m3K91o3q4K03j61k48K48J83k14L0R6k54
3637a59J4L45q6k23J25k0j66K37J77l02p4J98j06j9K69j26l00J70J58j69J07J16
$$ y = [-58, -28, 70, 9, -35, 38, -9, -76, 44, 56, -34, -18, 40, -40, -20, 88, 17, -84, 10, 17, -63, 51, 85, -62, -49, 53, -14, -23, 84, -11, -120, 20, 66, -33, 8, 47, -91, -56, 106, 30, -58, 46, -12, -114, 56, 115, -62, -51, 51, -61, -41, 142, 12, -128, 5, 48, -66, 56, 99, -117, -104, 97, 7, -34, 113, -14, -172, 34, 124, -48, -6, 51, -137, -83, 163, 53, -97, 18, -1, -127, 70, 164, -93, -103, 72, -46, -35, 180, 28, -189, -6, 91, -52, 67, 132, -139, -126, 145, 45, -51, 78, -11, -206, 50, 193, -41, -34, 79, -125, -85, 210, 76, -160, -8, 6, -139, 90, 199, -122, -151, 83, -12, -46, 183, 20, -236, 2, 150, -30, 35, 119, -170, -155, 185, 93, -88, 83, 1, -204, 70, 223, -66, -102, 69, -99, -76, 223, 88, -192, -21, 64, -94, 84, 192, -143, -186, 105, 42, -42, 161, 0, -248, 0, 183, -31, -1, 95, -159, -145, 200, 114, -109, 16, -4, -170, 67, 244, -58, -132, 66, -40, -59, 210, 84, -216, -46, 112, -57, 50, 166]
3659A66l00m7K97l3j41J56q8k29K21K02k27m4J48j94pL10q0k42J21M3j46J73J40
3682A99k68q3K16o3o3K18q5k69J79J49j46L6R5k29m3K85l7j62J09k8j79J82J69
3705A82k05o7J40j03l2K31o2k32J04R9j31R8J29k27p0K04j3q3J32m6k06J29J50
3728A21j43JR9j44m0K21l2j54Q2J7j38J15J31j59o1J22o1m3J48k7j66P0R3r5N8
3753A5P3j36o4J60Kr4P8Kj33Q1J24j01l5P1p2k6J35oj31N7M9q4L9P4q8n5R2rm9
3782c1P7rj10N4P2n9qN5o5l2R2jo3K2K1o0L0P1o5j9N2k0l2N7J0p5K4M6m7MM6m2
3814ek7M9Om3K4J4m5J8M7l5j7K9j7k7L9Lk9%K1k3J6K4j5k1J9Jk4K2Pj6qK7k0M
3848bJ6pj5K4%k0JJ3orJ2qoKPj4J8Mj6MJ1op%Mk0J8mOlQj0%KRj2Pk%POj2jKKj1
$$ y = [166, -134, -181, 116, 83, -58, 98, 10, -219, 2, 204, -23, -67, 81, -113, -120, 190, 110, -132, -11, 32, -114, 59, 199, -69, -152, 64, 1, -62, 156, 71, -198, -19, 130, -16, 20, 115, -114, -157, 128, 91, -71, 38, 10, -169, 13, 182, -23, -90, 50, -53, -85, 146, 84, -148, -44, 55, -76, 22, 151, -76, -146, 58, 45, -38, 94, 48, -158, -29, 121, -22, -21, 78, -66, -106, 115, 83, -71, 11, 28, -110, 5, 136, -23, -84, 38, -23, -66, 82, 55, -111, -41, 52, -43, 15, 88, -48, -112, 48, 50, -44, 34, 36, -97, -16, 108, 7, -28, 43, -29, -55, 80, 74, -57, 0, 49, -35, 4, 78, -10, -65, 27, 18, -31, 46, 37, -73, -19, 53, -6, -14, 41, -24, -56, 36, 35, -28, -6, 15, -45, -15, 56, -9, -28, 24, 4, -28, 29, 39, -36, -12, 34, -13, -9, 37, -5, -32, 17, 23, -20, 4, 18, -27, -9, 38, 3, -14, 15, -2, -29, 10, 13, -16, -16, 5, -18, -2, 22, 7, -14, 5, 6, -18, 4, 11, -5, -13, 14, -6, -2, 14, 7, -8, 16, 16, -4, -3, 10, 4, -5, 7, -1, -7, -5, 2, -12, 6, 10, -6, -2, 9, 3, -4, -4, 0, -20, -2, -6, 0, -3, 5, -5, -5, -3, 6, -6, 1, -1, -1, 6, 12, 0, -1, 1, 3, -8]
3894hJ5kj1J0J3k2kJ8j4nJ9j4mJ8qnJkoOQmj0K%j0J9j0kMJ3j3RoMj2K5j5j1K4
3934A2j4j9QK4j9J7J1j7k1K4Jk1K2ml0J5L1k7mK9l4LJ8Ql8J5Pl2L8L0l0k8N0l7
3968a2pN1j1n5L1L8m5kN1o3nN7rl9M1nn5K7N9n7nN0m8j8O9kp6L7J3n4L5O5q0l3
4002e7O9j8l1Q5k0r8M7O6o0J2P1r4l4J05po9N6nq7N6Q9p6k9P4p3k2J14Lj19K3
4032b9N8p8N6Q2j06p9J19on7R1j8j38O3J14q0rP9r3o4J41L7j22M6K2j27Q3J39
4059A24j20p3J03l1p3J64Lj71K7J00q6M2R9j34r1J46Ro9J00oj85O6J63j00m2R4
4085E9j03q0J86M7j75M3N1j19Q2J62j40j18J24qp4J51Rk00K9J37p9J2J23j53j16
4110a50J85M6j17P1Oj75Q6J82j24p3J13q5q1J93M8k06L0R0j10N1J73j62j24J47
$$ y = [-8, 7, 5, -6, 4, 17, -5, -7, 11, -3, -8, 11, -3, -7, 11, 3, -2, -1, -3, -9, -3, 5, 1, -9, -7, -7, -17, 2, -8, -10, -6, 7, -6, 3, -3, 1, -11, 14, -1, -12, 12, -2, -21, -13, 11, -8, 9, 20, 3, -18, 6, 7, -14, 8, 4, -26, -11, 20, -7, -11, 18, -16, -13, 5, 13, -25, -10, -3, -35, 3, 33, 3, -25, 25, -12, -19, 32, 21, -34, -3, 35, -10, -12, 39, -24, -29, 28, 19, -20, 21, 16, -39, -12, 47, -10, -15, 35, -13, -31, 38, 36, -40, -3, 10, -44, -9, 56, -24, -57, 12, -6, -37, 48, 28, -70, -23, 43, -17, -5, 66, -28, -62, 43, 36, -33, 23, 18, -69, -13, 76, 0, -29, 45, -28, -50, 64, 67, -52, -29, 29, -49, 7, 89, -17, -96, 23, 17, -40, 51, 33, -105, -42, 72, -8, -17, 62, -31, -95, 46, 83, -39, 7, 29, -98, -15, 124, 4, -69, 34, 3, -70, 94, 97, -74, -47, 53, -33, 9, 108, -26, -117, 29, 38, -31, 69, 63, -122, -56, 107, 7, -35, 59, -44, -124, 62, 109, -66, -23, 28, -91, -9, 153, 13, -105, 19, 11, -63, 88, 97, -103, -74, 63, -16, -4, 119, -34, -150, 35, 81, -36, 35, 41, -134, -48, 134, 10, -63, 50, -35, -116, 77, 125, -81, -51, 39, -71, -20, 153, -9, -133, 14]
4134A4Kp0J29K3k27L7J74o9k9J17j41j10K01N4j44M6L9j60P2J87j09j13R9m7p5
4159a00J74M1k01LJ18q2J7J56j27j47J57N1j07R5L0j96K8J89o4p0J03r3j02J71
4183D4Q5j72J2O7j21M7J69r5j38J10np7J31M2j83PJ30o8JJ12r2j37J26Q1j15M2
4209CM6j47K7J74p1q6Q2l9q9J30P0j43%P6q1J4J33p2j33J04L7p8Q3L7j48OJ21
4236E6n0l7Q6m8j09J08P3j03J1M6q8NJ25n4p9O9pn8P5N1j10oP3n0JP3l4q3N9N6
4266E1o9K0M5q1pQ3k2l1L6j5o6N6N5p8MN2o2kQ1l1o7M3K4n4M0L6o5oN9j9l4M8
4298B4no4M6L3m6J1K9m8mM8lm0L2ml5K9L3m2pK4j1k6M6pl5K7Nj5MJ0k0j4L3%k1
4333a3J7nj8K3J9k5j1K2qj6K7%j5J3nojJ2j1oK1rj0J3%k5J2MNj9J6lj7J9Oj1O
$$ y = [14, 16, -54, 75, 98, -129, -92, 82, 13, -16, 101, -40, -150, 51, 105, -39, 7, 46, -114, -42, 145, 36, -77, 22, -25, -100, 74, 115, -86, -83, 35, -47, -30, 126, -1, -148, 9, 60, -47, 48, 78, -118, -90, 99, 35, -35, 68, -25, -127, 44, 129, -43, -31, 36, -85, -38, 131, 36, -102, 8, 3, -74, 57, 99, -84, -77, 53, -15, -14, 98, 6, -131, -5, 76, -39, 3, 49, -98, -71, 103, 32, -54, 28, -11, -100, 30, 100, -43, -43, 33, -48, -34, 99, 27, -106, -2, 35, -43, 40, 77, -71, -65, 56, 6, -31, 55, 7, -102, 6, 79, -24, -13, 33, -55, -50, 75, 21, -58, 11, 4, -54, 21, 72, -38, -44, 29, -21, -20, 53, 19, -64, -5, 51, -18, 2, 47, -34, -41, 42, 20, -11, 25, 10, -56, 0, 55, -23, -19, 33, -29, -31, 50, 19, -48, -5, 19, -35, 5, 41, -24, -30, 29, 10, -24, 24, 19, -45, 1, 34, -12, -1, 28, -20, -24, 24, 21, -19, 13, 9, -26, 3, 36, -6, -13, 11, 0, -26, 20, 13, -22, 5, 10, -5, -1, 9, -11, -25, 8, 8, -13, 4, -1, -19, 4, 23, -2, -13, 9, 1, -15, 12, 12, -3, 10, 5, -1, -2, 10, -1, -7, 14, 5, -5, 8, 8, -17, -5, -1, 4, -15, 1, -2, -19, 0, 6, -5, 1]
4370AoJrJ3jj7J9rKJJ0k1KJ2JmMQj2PLKKlj5NK3j6mKLrLMrkQJRj6Pj3J3J0j7l
4416a0J6mkJkj0K2j2nQMj5J6pkpK1j5j0K1Jk1J7pJJ2Ok1qJ8qj0K0nk7K9%j3jM
4456eonK3qoRjj9RK1j9OJ0j8LL4j6j6MJ0k8L1K1l8j6K9k2PM1k3m8K9J6k1QK5m8
4493b7NM2j1l1M0k7l1M9K1l7j1J8j8%M1j0m9L6J7n2L9L7o0%N0l2mM0j9o1M2L4
4525C1m3K8J0m9k7Q9k5m1M5j5m8M8M7p1j0M9m4KP4k1o5L2K0m6M9K7o6l3P0mk5
4556a2N0j9q1O4N6n7rN6p7j6Q8Mq1M1J1p5P1O0j02qO0n0j5J01k2r8M0M6n3L5O9
4587G7j21l0J10rn8O6nj14P6Q4p7kM4p5j7J17j0r4L9J8p6O8P5j05m9J00k8l8J08
4616G4k3j27M8P5o8K2P0j02n2J25mo8N3pj11P6J06q7k7N6n3k9J30pj39M4L9o9
$$ y = [1, -5, -4, -13, 0, -1, -18, 1, -8, -6, -5, 5, -16, -14, -2, -1, -5, -1, 7, -5, 2, 5, 7, 9, 6, -9, -4, 19, 3, -1, 1, 4, -5, -2, 2, -7, -9, -1, 0, 9, -7, 0, -13, 0, 10, -7, -10, 6, 2, 0, 1, -1, -11, 11, -1, -6, 2, 6, -9, 7, 0, -2, -9, 12, -3, -13, 8, 9, -12, 5, -2, -1, 11, 17, -4, -12, 6, -2, -12, 8, 3, -24, 5, 5, -8, -9, -5, -11, -16, 7, -1, -7, 2, 1, -18, -9, 12, -7, -1, 9, -9, -6, 28, 12, -4, 0, 10, -18, 13, 34, -4, -20, 9, -13, -6, 35, 12, -36, -7, 9, -12, -4, 21, -27, -22, 20, 9, -22, 18, -9, -40, 9, 30, -7, -18, 0, -18, -18, 23, 13, -36, 0, 17, -35, 4, 41, -19, -19, 31, -1, -5, 35, 16, -45, -3, 31, -12, 16, 26, -23, -50, 39, 14, -27, 18, 3, -45, 3, 50, -21, -31, 18, -26, -24, 50, 29, -36, -4, 16, -30, 19, 46, -20, -53, 17, 13, -12, 38, 19, -62, 2, 58, 1, -8, 48, -29, -45, 43, 47, -34, 7, 18, -57, 14, 74, -28, -36, 24, -26, -41, 60, 38, -60, -20, 26, -27, 8, 77, -44, -74, 36, 27, -31, 35, 30, -84, -8, 76, -1, -3, 41, -34, -51, 66, 56, -38, 1, 19, -57, 11, 86, -19, -68, 32, 4, -34, 74, 51, -76, -28, 47, -21, 1, 71, -31, -83, 42, 38, -30, 23, 16, -95, -19, 87, 0, -27, 29, -24, -53, 77, 70, -69, -25, 14, -55]
4644e5O3Q9j13n8R8rn1R3j8j32O0R4p6J3N6r3n0J32J4q0K7K1j04P0R9r0o3Q3l8
4673a8l4J14Kj35L9O7p0L8P0j01n1J04J0n2N6qj11M7J02o5j9N0o5m4J27J2r9K2
4701a2K4o0N0P8q5n5P3j4l3P4Lj05K7O6m1%P3p8n8J04J6o6L9Rq9M5Q1n2m8N8k8
4732dl9Q7J0q8J4M8n3J5P0o9m7O0J0m1M6Qo9J3O7l8j8N6m9m4O2L3n3J4J1l8K2
4763dO3m6l7L8j3k1M7J0o2QM6k4pM4l5m9L8K0m1L9On6J5M6k6j7L6j3l8M7J9n6
4795b3kL6l0J4L5k6k2J8Qk7L3Pm4J4L8k5j2K7rk7K8K0l6KK8k8KJ9j1k2J7Kj9J4
4829aK3k2j1J8okRjl2L8Lj9MPk1pL4j0j7J5J2k6J4J2j2nJ4j1oJ8j0j2J5Mj4LP
4866EoLLonQKj3OJjj1J6mL%%j0jJ2lMoQkJJ3k1J2MqllmjJ8j4NPkqrPRj9K5pkP
$$ y = [-55, 8, 97, -16, -74, 24, 15, -36, 57, 39, -93, -33, 61, -15, -2, 54, -39, -89, 43, 57, -23, 4, 25, -79, -9, 90, 0, -63, 20, -18, -52, 62, 64, -71, -32, 35, -35, 3, 73, -28, -79, 25, 35, -17, 39, 31, -80, -33, 69, 4, -15, 35, -30, -74, 53, 65, -34, -12, 12, -48, 2, 80, -5, -60, 13, -1, -34, 40, 43, -62, -35, 31, -10, -10, 63, -15, -73, 31, 47, -19, 20, 29, -60, -15, 66, 14, -34, 24, -4, -43, 44, 54, -34, -20, 28, -25, -10, 60, -9, -56, 4, 14, -27, 19, 27, -42, -29, 38, 0, -18, 38, -11, -55, 7, 40, -13, 1, 12, -26, -4, 59, 13, -24, 14, 1, -20, 27, 37, -25, -17, 29, 5, -2, 42, 7, -42, -4, 16, -25, 14, 20, -36, -21, 25, -1, -18, 18, 5, -33, 14, 33, -23, -25, 11, -19, -5, 30, 4, -18, 0, 8, -19, 14, 21, -23, -9, 29, 4, -8, 19, 10, -17, 11, 31, -5, -3, 25, -3, -1, 18, 7, -15, 2, 4, -15, -1, 22, 0, -11, 7, 1, -1, 8, 7, -25, 13, 16, -3, 1, 8, -13, -20, 14, 4, -13, 2, 14, -12, 2, 14, 2, -3, 11, 0, -6, 12, 2, -10, 5, 9, -5, -2, 5, -1, 2, 5, -1, -6, 2, 4, -9, -3, -2, -3, -14, 2, -2, 1, 1, 1, -9, -10, 2, -1, 3, -3, 5, 3, 4, 17, -4, 8, 12, 4, 1, -2, -6, -7, 11, -3, 2, 9, 7, -1, -10, -3, 6, -13, 12, 5, 3, 10]
4915A0j1j2OJ4Rmj6J6j4MkJ2mqOLpKkLjnJ4Jj2rNLNpJ2j7J3j0mJ2o%jj6J1J2J0
4958A5k3JJ1kj1J7opQJ3j3J0Kl6K6Oj0jJ8pk0K1Nj4pQlnJ5j7nJ5Kk9K2K3k5oK9
4997B0k2oK6j3k7K5J2k1J3K2k7j1K7lk1J9j3oK0Lk4OOk1J2K4rk8K4qj5L3km0J
5032b4M7k8j7L7j8l5M7Kk4J3J3m1J1N0k5k3L1j1l5N1J7m4%K0j5rN5l5l3K7Nj6
5064gK8K6n8j5M0j2oL9j9n4M0J8l0J2Nl4lP1k8m2M0j6l9N8L0o3oM7l0kN6l0o0
5097d4M8K0l5L2K2p0qO8k2k2M4k9n4N4M3o1J0K3m9j7Q3j2m8J9Ol7N1L4p5k3P0
5128B1k9kN2k0p8M1M4m1K2K7o2k2Q8rn7M0j6n6O0M5n4j6L7l3nO8j2q0L4K9m5K8
5160aO1p0l6N8Mk9M9j5q2L9N4l8QL3o5k3Q7Ko5K9Qn1M1M9m8l1M6l0j1O6pp7L2
$$ y = [10, -1, -13, -7, 7, 16, 12, -4, 12, -2, 2, 0, 12, 8, 0, 6, 9, 2, 4, 2, 5, 4, -1, 13, 14, 2, -7, -2, 1, 6, -1, 11, -6, 7, -3, -7, 5, -1, -1, -2, -18, -7, 5, 15, -8, -7, 4, 2, -9, 8, 2, -5, 3, 16, 3, 13, 15, -21, 5, 11, 1, 0, 18, 11, -9, 12, 17, 3, -4, 4, 1, -4, 11, -6, -11, 4, 6, -23, -1, 22, -3, -9, 20, -2, -8, 18, 5, -22, 3, 15, -6, 7, 29, 2, -9, 18, 15, -6, 13, 0, -6, 14, 17, -7, -1, 5, -16, -4, 20, 11, -17, 7, -1, -16, 17, 15, -25, -24, 23, -5, -22, 15, -3, -38, 9, 11, -13, 0, 13, -28, -17, 33, 8, -15, 16, 5, -30, 21, 38, -6, -6, 14, -1, -10, 45, 10, -23, 4, 9, -7, 21, 47, -11, -26, 14, 2, -4, 35, 16, -38, 2, 20, -10, 2, 7, -27, -30, 41, 13, -29, 11, -5, -44, 14, 44, -19, -25, 22, -8, -10, 46, 16, -44, 4, 24, -11, 21, 43, -27, -35, 33, 11, -11, 33, 4, -50, 4, 47, -14, -4, 19, -30, -47, 36, 24, -24, -5, 1, -36, 15, 49, -26, -49, 21, -8, -10, 42, 22, -56, -15, 29, -12, 10, 37, -25, -47, 41, 32, -25, 15, -1, -57, 3, 48, -6, -22, 15, -18, -23, 45, 33, -47, -13, 16, -29, -1, 60, -10, -46, 12, 16, -13, 36, 21, -61, -22, 32, -6, 2, 35, -30, -53, 34, 36, -29, 0, 8, -43, -2, 47, -1, -32, 14, -16, -27, 39, 32, -45, -13]
5193a3L5l2J1M1o4k8O4Rn1O2k6o4L4O8m7j6L4l4l3Q0J1o8K6J4l9K5N3n9k0M1j5
5224aj1M8Jp4J9M2l0lL8l8l8O7Pm0J3Pn3L8L9k7j5K5l1j5N8jn3J0L0l1K0L8m8
5257ik0L8Jk1K9Jm1J6L2j2k3L1l6j9O1ml3J4Qm2K2L5k8j9K9Kk5L3mm1PL9k8JL4
5292B8l1j9K4J0k8K6Ll4QL1k0nJ5j1pK5jj1lJ8k7NK7k0j9J3J2k5J5J1j6j1K1o
5326boJ2mk0J4J5k4PJ0k1QK2nl0L8k6%J6Qqj5J9j8LJ3lj7QJ9k1OQpkJ8Kl2MRr
5366a1PRj8KJMK%Jj3RRnoJ8j4nRlMOlpOMj1JKoJKJ0llnOqJ3j4J0j0OnJ0%l%%j
5415bnK1rp%Rj6PPmnQJj3J8Lj1lN%oNlmKkJ1Knj2qJ5klJ7Jk0J2roJ5Jj0KRJj8
5462a1J4nmRjqKJ9rmPj2%J3qJJ1j8QKLn%Mj8kJ3PlJ0j4rQ%j4PJ2mqK3rk3PJ1q
$$ y = [-13, 22, -10, 1, 42, -22, -50, 14, 23, -28, 34, 8, -56, -22, 46, -1, -17, 17, -17, -50, 30, 41, -27, -1, 13, -26, -1, 52, -7, -27, 14, -1, -12, 36, 37, -37, -18, 24, -6, -9, 29, -9, -47, 20, 27, -13, 0, 7, -46, -8, 31, 4, -11, 14, -17, -32, 26, 25, -28, -18, 12, -19, 1, 39, -9, -29, 9, 10, -11, 18, 19, -22, -6, 26, 14, -9, 22, -14, -33, 28, 24, -9, 5, 13, -29, -7, 28, 0, -19, 10, 12, -13, 20, 16, -25, -18, 21, -7, -6, 28, -3, -22, 2, 12, -16, 10, 13, -21, -13, 18, -2, -7, 8, -3, -10, 15, 14, 3, 0, 18, -9, -4, 23, 3, -16, -3, 9, -16, -1, 10, -6, -17, 4, -2, -8, 4, 0, -20, -6, 9, -15, -8, 2, -19, -11, 11, 6, -24, 14, -12, -12, 4, 12, 4, -11, 8, -10, -7, 6, 3, -14, -6, 13, -8, -2, 6, -1, -3, 15, 17, -15, -11, -2, -11, -4, 5, -13, -11, -10, -6, -4, -4, -3, -16, -7, 2, -3, -9, 9, -5, -10, -1, -4, 0, 6, 3, -4, 2, 6, -5, -4, -2, -8, -7, -5, 5, 2, -1, -6, 0, -8, 5, -9, 1, -9, -3, -8, 2, 2, -1, -1, -1, -2, -7, 14, 5, -2, -2, 7, -9, -2, 5, 1, -4, 4, 5, -8, 10, 13, 2, -1, 4, 4, -2, 3, 0, -4, -2, -4, 7, 9, 4, -8, -16, -1, -3, -6, 11, 12, -8, 4, -5, -11, 4, 5, -5, -3, 6, 7, -11, 3, -2, -6, 3, 2, -6, -4, 15, 6, 2, 9, -3, -3, 10, 2, 3, 14, -4, 4, 6, 9, 4, 4, 8, -10, -12, 1, 8, 5, 15, 1, -8, 0, 0, -14, -7, 5, 1, -7, 16, 7, -16, -9, 2, -6]
5507fPjlJJ2rLJ6pl3K0Oj7J5Qk0kJ8j1KJ6j6j3J8Mrj3K0j6oL5rl6K7lj3K4Ql2
5546a5LK5k0j0L8j6j6K2Ql0J7J7m1KL7rl1K7Kl8L5J6l1mK3j3pK5nl2J6Nj0J3K0
5581B3m0j1M9l3LJ8pl2K4L0k9MK2m4%N2j5l1K5nl6M2L5m3k0K3j5JM4j2n5J8K9
5614A4k4J8L1p0j1M6mj3J9Jn2L9N0m8mK8l7j2N5j1m0K3J2k4K2L8n6pL8qk3L9p
5647B2p5M1M0l7K0J5m8j2N4kl5L2j2m0L7L6m4j2K5qj8N6pn6K1K0l2L0L7n3j9M7
5679B3Kk9K3Ro7L6M3l8kK5l9j4N8Om7J9Lm6L6M6m5k3L4j5j6M6Ln8RM0k7JM1l9
5713bk2N0mk9K7mn2L0N0m0j8L1k0k3M9Lm7J0K6k9LM2l4j7K0%qK6Nn4QM2j4oK3
5748B2l7j7L7J8k5J4lk9OM9l0k2K1Jk8M1Ml3MK0k7J3L8l2k7K6Pk4J4Rl3QL0j2
$$ y = [-6, 1, 0, -3, -2, 10, 1, 4, 20, 13, -20, 0, 6, -11, 4, 12, -8, -10, 8, -3, -1, 15, -1, -14, 4, 8, -1, -14, 6, -10, -16, 19, 10, -26, 1, -2, -15, 9, 17, -15, -12, 13, -7, -17, 21, 5, -11, 11, 19, -11, 6, 23, -18, -16, 21, 12, -19, 8, 10, -28, 7, 23, -8, -12, 11, -2, -9, 16, 11, -21, -5, 0, -10, 3, 23, -17, -28, 21, -12, -9, 9, 2, -30, -6, 24, -5, -1, 21, -23, -23, 29, 14, -17, 8, 3, -33, 9, 44, 1, -19, 4, -11, -10, 34, 22, -33, -15, 14, -10, 8, 39, -31, -42, 4, 0, -13, 6, 7, -45, -6, 44, -4, -8, 20, -17, -29, 26, 15, -25, -2, 10, -14, 8, 46, -10, -17, 21, 13, -10, 29, 22, -53, -12, 28, -9, 11, 26, -22, -34, 20, 18, -17, 15, 3, -37, 0, 36, -8, -20, 5, -3, -21, 35, 28, -28, -7, 13, -19, 11, 48, -5, -24, 23, 25, -4, 19, 28, -39, -3, 40, 2, 0, 25, -14, -28, 30, 36, -11, 8, 11, -35, 1, 47, 2, -21, 13, -2, -18, 28, 31, -27, -18, 22, -5, -4, 37, -2, -24, 26, 22, -7, 20, 16, -36, -6, 44, 4, -14, 17, -3, -26, 23, 26, -21, -11, 15, -14, -11, 31, -3, -20, 0, 0, -8, 18, 23, -31, -23, 19, 5, -1, 22, -15, -32, 5, 23, -2, 12, 9, -20, -14, 35, 5, -17, 4, 5, -23, 18, 22, -11, -7, 13, -14, -1, 37, 5, -22, 4, 11, -13, 1, 10, -23, -15, 15, 3]
5782CnNjm0N0J0l1JJ4l2J8K5j4k6K3J0l3K7Qk2J0RnOOj3k0J8K2j6k%k4PK7j1j4
5819a0J3Mk8J6K1l2QJ6j2rK2kk0J3Rj9J7J0l1MJ8j4mK1nj5J2Moj0K6pj5J4qrQ
5856@LrLK0j6nJ6j1Nj2%kJjJrK9nk2K8j1j5RNkjLNpOj5J5lrPnPLj5K2j6mPmlJ
5902fJ6pqJ2jj0Njj3J4LplJOpMrRRnpRKqoJ4lkLOmkRrmNj4JQJ2j2nKJJJ0okJ0
5952A1j9p%K0j2KMkoJ1klRLj2J6oj0OPk0J1J5nqJ3k3oK1kj1jJ7k8J8J0j3lJ6r
5992BnJ0j6RkNoNokrJ7%oJ1Ok3PJ5k1MK0j8JJ8rj4J7nqPQj4nJ8j3lJ7kk6J1Rj0
6035f%J5j9oK2rmJ1kj4J6J7k3%J2k0kL6ml2K7j4mPK0k6qK2Oj6J4Ml5PK4k5J4N
6073A0l1RL0rk1J3lj3J2K9l2oK3oj8M3qm3K3J5j9J3J3m0oL1jj7M1k1m6L8J6j9
$$ y = [3, -2, 3, 2, -38, 12, 22, -9, -8, 6, -26, -8, 17, 3, -23, 0, 10, -23, 4, 12, -10, 0, 9, 4, 10, 16, 3, -17, 1, 23, 7, 5, 5, -19, -12, 15, 4, -10, 3, 7, -21, -5, 16, -16, -8, 8, -4, -13, 9, 7, -13, 0, 9, -10, 7, 17, -14, -10, 8, -6, -10, 11, 6, -9, 3, 7, 1, -9, 17, 10, -5, 9, 1, -8, 0, 3, -6, -3, 17, 1, -4, 12, 1, 6, -6, -6, -8, -7, -8, -7, -16, 13, 8, -14, 14, 3, -12, -3, 2, 0, -1, 2, 7, 0, 6, -9, 6, 3, -6, 1, -4, 3, 6, -9, 13, -3, -7, 0, -4, -7, -6, 10, 3, -5, 7, 6, -4, 1, 0, -13, 1, 4, -3, -6, -5, 1, -6, -2, -11, -2, 7, 2, -5, 4, 6, -2, -8, 6, 3, 1, 4, 10, 6, 4, 13, 4, 0, 5, -9, -8, 0, 12, 0, -5, -3, -2, -1, 9, 3, 1, 11, -8, -15, -15, 5, -7, -5, -1, -3, -9, 2, 0, -3, 6, 9, -3, 13, 7, -3, 3, 10, -10, 1, 16, 11, 3, 16, -7, -13, 8, 6, -5, -6, 11, -17, 1, 11, -2, -5, 11, 2, -3, 7, -9, 0, -2, 3, -3, 2, -4, -6, -15, 2, 2, -4, 7, 13, -10, -3, 12, -9, -5, 15, -3, -2, 16, 7, -7, 10, 5, -3, 4, 12, -2, -7, 11, -2, -5, 12, 10, -16, -5, 4, -6, -6, 9, -10, -16, 6, -3, -7, 4, 2, -12, 4, 21, -2, -2, 10, -10, -12, 24, 20, -12, 15, 1, -3, 4, 24, -2, -10, 12, 18, 2, 16, 20, -15, -8, 16, -9, 5, 10, -21, -12, 18, 9, -12, 1, -2, -15, -3, 26, -6, -12, 11, 5, -13, 30, 22, -21, 2, 17, -2, 11, 24, -16, -22, 9, 8, -9, 32, 11, -35, 3, 19, 0]
6107@jPk3nK9Ol0J9Kl1L1L1l6j8L3k1j0M6j9k4J0J8k1J5J9l7k5O4j6j9K5ql0J7
6141bM2l7pJ6k6nM4Pm1QOj2QM1m1k6L7nj7L0No4K9K5j0KJ9m5j2N4j4j2Rpk1J4
6177hM9l3j8J3lpK3J9n0J3J4l5J4N7m9k7L4Qk4M3j3n7RM8k4oL4l3qL3J3n0J5R
6211Cj7RM5l3l3K6Mj6L7Km4PL9k5JK5k9l4M4Pk4J6J3n6J9M4k3j5K4k1k3L7J3l9
6245a7QK0k9J2L5k9k2K3J2k7J6K2m1pN3k3j0L0k4l4L8J1j7J6Nk9KL0j5j8J4mj2
6278a1K4Ol5J4J1j9NK3k6k2L9nqJ1J4l2lL6j3k3K8j8j4L5oj4NNpKK4k1j7J9lj9
6314a5J1J7j4j1K4j4rK8j7k3J5J1j1J2Mk1OJ3kj5RjrOJ6j8KJ1qMJ5mj7NJ3j8J7
6351A2Qj1k7K4Kj0NJj2LJ0KqopPK5j3j5J2JnKl%kjJ2j1NPmqOlkJ6mpMMqMNqpJ2
$$ y = [0, -1, 6, -17, -22, 7, 13, -17, 2, 4, -27, 4, 35, -1, -19, 14, -7, -17, 29, 10, -14, -4, 14, -7, 8, 27, -10, -35, 29, 13, -6, 19, 11, -19, -2, 40, 3, -4, 12, -14, -19, 25, 32, -9, -1, 5, -7, 1, 42, 1, -25, 12, 7, -10, 20, 25, -39, -10, 15, 5, 7, 26, -19, -31, 23, 9, -3, 6, -1, -22, -8, 41, 8, -10, 3, 0, -7, 16, 35, -15, -2, 12, -23, -9, 48, -1, -28, 6, 14, -10, 33, 20, -37, -28, 20, -4, -10, 24, -9, -17, 16, 29, -21, -6, 3, -14, -5, 40, 7, -26, 0, 4, -12, 25, 27, -17, -10, 29, 4, 5, 30, 1, -33, 11, 18, -6, 10, 23, -33, -14, 30, 7, -8, 16, -5, -28, 9, 22, -17, -9, 11, -18, -6, 29, 0, -22, 1, 13, -14, 2, 24, -17, -24, 29, 6, -4, 26, 2, -32, 6, 17, 0, 16, 21, -8, -6, 24, 9, -9, 5, 1, -11, 13, 19, -16, -2, 9, -10, -5, 18, -8, -30, 9, 4, -4, 7, 21, -11, -14, 22, 9, -14, 14, -4, -18, 17, 11, -3, 2, 7, 0, 2, 26, 5, -12, 7, 4, -15, -4, 13, -1, -12, 12, -2, -11, 17, 0, -23, -8, 3, -8, 4, 8, -13, -7, 6, 4, -11, -2, -3, -12, -6, 10, -8, -6, 5, -3, 1, 16, 12, -5, 0, 13, -5, 12, 20, 9, -18, 6, 8, -2, 3, 4, -8, -5, 5, 7, -1, -7, -14, -7, 18, 5, -10, 2, 3, -2, 0, -3, -3, -5, -6, 6, -5, 0, 7, 3, -5, 1, -2, -4, 12, 8, 1, 5, 9, 1, 5, 10, 2, -5, 7]
6398GNomjj0MJ2j7jJ2jKkKlkjnNJRj4J7j0QQoj5lJ9opJ2Jj6Qj0KJ7kpjMnLLmr
6446gQ%Kj0J2nkJ2lj9KjOmJ6n%KpJ0MnlJ8mj7j6K6qJM%KNj0rONj7J6mj2lJ6mj0
6492a2J7nlJ1%j2nJ0qjK8k9lJ9mnJ1mj2J8pnQQk1jJ9rlPlj1PJ1k2J1Mj6qK3%q
6534eJJ6k5LK1k0lK1kj4J0Oj9PJ8k1NJ5j6pK9j2j6J1j2j0J0J8kj8J5%j3K7pk4
6570a3NJ9k4J3K9l9j5L9j4oJ6Kk5J1K3k4jJ7j9nK9j1j9K3pj5J4K1k6j1L1j6j3
6603a1M2j2k6PK1l3J6K3k3k4K3J0j7J5ol3J9K6k6OJ8l1JL6pk4K2ok5J9L0k3l0
6636b3L8oj4K5Jm4J6J6j2JK2l0j5L0Mj0J5Jm2K1L6l1j4L1k4j4M4J7n4J2K4m3J6
6669fM5l9k5L3rj7K9nl9K1L9k2pK7l3k5M0Qk1PKl2L3K7k1k4J0j2lK6Rm0JL9k7
$$ y = [7, 12, 6, 2, 1, -9, -5, 7, -10, -11, 1, 0, 2, 0, 2, -1, -3, -4, -9, -4, -3, 6, -8, 9, -1, 7, 15, 9, -6, -9, 10, 4, -3, 9, 10, -6, 2, -8, -6, 11, 9, 2, 1, 5, 0, 3, 6, 2, -7, 1, 1, 3, -7, 5, 0, -2, 10, 7, -12, -10, -11, -5, -9, 7, 2, 2, 4, -3, 7, 11, 6, 3, 21, 17, 0, -16, 10, 2, 3, 7, 7, 9, 14, 4, -5, 1, 6, -11, 5, 1, -11, -14, 2, -2, -12, 5, 0, -3, 8, 8, -4, -9, 1, -7, -8, 20, -9, -12, 7, 3, -2, 9, 5, -7, 11, 4, -1, 7, 15, -6, -7, 12, 3, 0, 7, 4, -7, 0, 11, -11, 0, 4, -12, -20, 3, 3, -5, -4, 12, -13, -10, 11, -9, -12, 9, 7, -7, 3, 9, -10, -3, 15, -6, -1, 14, -2, -9, 20, 8, -8, 3, -9, -19, -9, 9, 7, -11, 4, 4, -9, 18, 11, -13, -8, 11, -13, 0, 29, -10, -25, 14, 0, -6, 10, 12, -13, -2, 21, -3, -4, 13, -6, -11, 18, 7, -12, 11, 4, -11, 3, 24, -2, -13, 18, 2, -11, 31, 19, -7, 0, 21, -12, 4, 27, 4, -20, 3, 13, -4, 11, 5, -28, -9, 17, -9, -3, 15, -16, -15, 21, 14, -10, 12, 6, -19, 0, 30, 7, -23, 15, 9, -5, 20, 21, -23, -7, 9, -3, -2, 20, -10, -25, 5, 9, -1, 14, 15, -27, -6, 30, -1, -15, 16, -8, -22, 22, 39, -15, -3, 21, -22, -6, 39, 0, -25, 8, -1, -18, 11, 6, -33, -12, 27, 5, -2, 25, -8, -33, 7, 15, -6, 1, 3, -29, 4, 31, 10, -14, -4, -16, -19, 7, 16, -24, -23, 16, -11]
$$ [...]
8191H
##END NTUPLES=NMR FID
##END=
