##TITLE=1H_Ser EL-9
 CDCl3
 8 sc, 
 13.8.2024
##JCAMPDX= 6.0         $$ Bruker NMR JCAMP-DX V2.0
##DATA TYPE= NMR FID
##DATA CLASS= NTUPLES
##ORIGIN= UXNMR, Bruker Analytische Messtechnik GmbH
##OWNER= root
$$ XWIN-NMR		Version 3.5
$$ Tue Aug 13 16:22:08 2024 Russian Standard Time (UT+4h)  she@DPX200
##.OBSERVE FREQUENCY= 200.1313
##.OBSERVE NUCLEUS= ^1H
##.DELAY= (6, 6)
##.ACQUISITION MODE= SIMULTANEOUS
##.ACQUISITION SCHEME= undefined
##.AVERAGES= 8
##.DIGITISER RES= 18
##SPECTROMETER/DATA SYSTEM= spect
##.PULSE SEQUENCE= zg30
##.SOLVENT NAME= DMSO
##.SHIFT REFERENCE= (INTERNAL, DMSO, 0, 15.7039)
##AUDIT TRAIL= $$ (NUMBER, WHEN, WHO, WHERE, WHAT)
$$ ##TITLE= Audit trail, XWIN-NMR		Version 3.5
$$ ##JCAMPDX= 5.01
$$ ##ORIGIN= Bruker BioSpin GmbH
$$ ##OWNER= she
$$ F:/spectra/data/she/nmr/H-F/1/audita.txt
$$ ##AUDIT TRAIL=  $$ (NUMBER, WHEN, WHO, WHERE, WHAT)
(   1,<2024-08-13 16:21:02.54 +0400>,<she>,<DPX200>,
      <created by zg, POWCHK disabled, PULCHK disabled
       configuration hash MD5:
       00 E9 B6 7A A2 85 ED C7 34 08 36 98 17 FE 4E 26
       data hash MD5: 16K
       12 19 00 35 64 DD 3F 9A 3C 1C E9 A5 3D 67 71 00>)
$$ ##END=
$$ 
$$ hash MD5
$$ 23 B0 28 26 59 33 19 31 5D C8 5E A4 58 AB BA EF
##$RELAX= 
##$RELAX= 
##$RELAX= 
##$RELAX= 
##$RELAX= 
##$RELAX= 
$$ Bruker specific parameters
$$ --------------------------
##$DU= <F:/spectra>
##$EXPNO= 1
##$NAME= <H-F>
##$PROCNO= 1
##$TYPE= <nmr>
##$USER= <she>
##$AMP= (0..31)
100 100 100 100 100 100 100 100 100 100 100 100 100 100 100 100 100 100 
100 100 100 100 100 100 100 100 100 100 100 100 100 100 
##$AQSEQ= 0
##$AQ_mod= 1
##$AUNM= <au_zg>
##$AUTOPOS= <>
##$BF1= 200.13
##$BF2= 200.13
##$BF3= 200.13
##$BF4= 200.13
##$BF5= 200.13
##$BF6= 200.13
##$BF7= 200.13
##$BF8= 200.13
##$BYTORDA= 1
##$CFDGTYP= 0
##$CFRGTYP= 5
##$CHEMSTR= <none>
##$CNST= (0..31)
1 1 145 1 1 1 1 1 1 1 1 1 1 1 1 1 1 1 1 1 1 1 1 1 1 1 1 1 1 1 1 1 
##$CPDPRG= <>
##$CPDPRG1= <>
##$CPDPRG2= <>
##$CPDPRG3= <>
##$CPDPRG4= <mlev>
##$CPDPRG5= <mlev>
##$CPDPRG6= <mlev>
##$CPDPRG7= <mlev>
##$CPDPRG8= <mlev>
##$CPDPRGB= <>
##$CPDPRGT= <>
##$D= (0..31)
0 1.2 0 0 0 0 0 0 0 0.06 0 0.03 0 0 0 0 0.0002 0 0 0 0 0 0 0 0 0 0 0 0 
0 0 0 
##$DATE= 1723551662
##$DBL= (0..7)
120 120 120 120 120 120 120 120 
##$DBP= (0..7)
150 150 150 150 150 150 150 150 
##$DBP07= 0
##$DBPNAM0= <>
##$DBPNAM1= <>
##$DBPNAM2= <>
##$DBPNAM3= <>
##$DBPNAM4= <>
##$DBPNAM5= <>
##$DBPNAM6= <>
##$DBPNAM7= <>
##$DBPOAL= (0..7)
0.5 0.5 0.5 0.5 0.5 0.5 0.5 0.5 
##$DBPOFFS= (0..7)
0 0 0 0 0 0 0 0 
##$DE= 6
##$DECBNUC= <off>
##$DECIM= 24
##$DECNUC= <off>
##$DECSTAT= 4
##$DIGMOD= 1
##$DIGTYP= 9
##$DL= (0..7)
0 120 120 120 120 120 120 120 
##$DP= (0..7)
150 150 150 150 150 150 150 150 
##$DP07= 0
##$DPNAME0= <>
##$DPNAME1= <>
##$DPNAME2= <>
##$DPNAME3= <>
##$DPNAME4= <>
##$DPNAME5= <>
##$DPNAME6= <>
##$DPNAME7= <>
##$DPOAL= (0..7)
0.5 0.5 0.5 0.5 0.5 0.5 0.5 0.5 
##$DPOFFS= (0..7)
0 0 0 0 0 0 0 0 
##$DQDMODE= 0
##$DR= 18
##$DS= 0
##$DSLIST= <SSSSSSSSSSSSSSS>
$$ [...]
##$SUBNAM2= <"">
##$SUBNAM3= <"">
##$SUBNAM4= <"">
##$SUBNAM5= <"">
##$SUBNAM6= <"">
##$SUBNAM7= <"">
##$SUBNAM8= <"">
##$SUBNAM9= <"">
##$SW= 24.0689771365484
##$SWIBOX= (0..15)
0 0 2 0 0 0 0 0 0 0 0 0 0 0 0 0 
##$SW_h= 4816.95568400771
##$TD= 16384
##$TD0= 1
##$TE= 0
##$TE2= 300
##$TE3= 300
##$TEG= 300
##$TL= (0..7)
0 120 120 120 120 120 120 120 
##$TP= (0..7)
150 150 150 150 150 150 150 150 
##$TP07= 0
##$TPNAME0= <>
##$TPNAME1= <>
##$TPNAME2= <>
##$TPNAME3= <>
##$TPNAME4= <>
##$TPNAME5= <>
##$TPNAME6= <>
##$TPNAME7= <>
##$TPOAL= (0..7)
0.5 0.5 0.5 0.5 0.5 0.5 0.5 0.5 
##$TPOFFS= (0..7)
0 0 0 0 0 0 0 0 
##$TUNHIN= 0
##$TUNHOUT= 0
##$TUNXOUT= 0
##$USERA1= <user>
##$USERA2= <user>
##$USERA3= <user>
##$USERA4= <user>
##$USERA5= <user>
##$V9= 5
##$VALIST= <valist>
##$VCLIST= <CCCCCCCCCCCCCCC>
##$VD= 0
##$VDLIST= <DDDDDDDDDDDDDDD>
##$VPLIST= <PPPPPPPPPPPPPPP>
##$VTLIST= <TTTTTTTTTTTTTTT>
##$WBST= 1024
##$WBSW= 4
##$XGAIN= (0..3)
0 0 0 0 
##$XL= 0
##$YL= 0
##$YMAX_a= 214300
##$YMIN_a= -118027
##$ZGOPTNS= <>
##$ZL1= 120
##$ZL2= 120
##$ZL3= 120
##$ZL4= 120
##$ABSF1= 10
##$ABSF2= 0
##$ABSG= 5
##$ABSL= 3
##$ALPHA= 0
##$AQORDER= 0
##$ASSFAC= 0
##$ASSFACI= 0
##$ASSFACX= 0
##$ASSWID= 0
##$AUNMP= <proc_1d>
##$AZFE= 0.1
##$AZFW= 0.1
##$BCFW= 1
##$BC_mod= 2
##$BYTORDP= 1
##$COROFFS= 0
##$CY= 11.3945322036743
##$DATMOD= 1
##$DC= 2
##$DFILT= <>
##$DTYPP= 0
##$F1P= 15.6554695791079
##$F2P= 12.8336369535428
##$FCOR= 0.5
##$FTSIZE= 0
##$FT_mod= 4
##$GAMMA= 1
##$GB= 0.15
##$INTBC= 1
##$INTSCL= 1
##$ISEN= 128
##$LB= 0.24
##$LEV0= 0
##$LPBIN= 0
##$MAXI= 10000
##$MC2= 0
##$MEAN= 0
##$ME_mod= 0
##$MI= 1.114404
##$NCOEF= 0
##$NC_proc= 0
##$NLEV= 6
##$NOISF1= 3.799351
##$NOISF2= 2.8
##$NSP= 1
##$NTH_PI= 0
##$NZP= 0
##$OFFSET= 15.70392
##$PC= 1
##$PHC0= -25996.4
##$PHC1= 13.38748
##$PH_mod= 1
##$PKNL= yes
##$PPARMOD= 0
##$PSCAL= 0
##$PSIGN= 0
##$REVERSE= no
##$SF= 200.130013532006
##$SI= 16384
##$SIGF1= 3
##$SIGF2= 2
##$SINO= 400
##$SIOLD= 16384
##$SREGLST= <1H.CDCl3>
##$SSB= 0
##$STSI= 0
##$STSR= 0
##$SW_p= 3612.71676300578
##$SYMM= 0
##$S_DEV= 0
##$TDeff= 0
##$TDoff= 0
##$TI= <>
##$TILT= no
##$TM1= 0
##$TM2= 0
##$TOPLEV= 0
##$USERP1= <user>
##$USERP2= <user>
##$USERP3= <user>
##$USERP4= <user>
##$USERP5= <user>
##$WDW= 1
##$XDIM= 8192
##$YMAX_p= 0
##$YMIN_p= 0
$$ End of Bruker specific parameters
$$ ---------------------------------
##NTUPLES= NMR FID
##VAR_NAME=  TIME,          FID/REAL,        FID/IMAG
##SYMBOL=    X,             R,               I
##VAR_TYPE=  INDEPENDENT,   DEPENDENT,       DEPENDENT
##VAR_FORM=  AFFN,          ASDF,            ASDF
##VAR_DIM=   8192,          8192,            8192
##UNITS=     SECONDS,       ARBITRARY UNITS, ARBITRARY UNITS
##FACTOR=    0.0002076,     1,               1
##FIRST=     0,             0,               0
##LAST=      1.7004516,     0,               0
##MIN=       0,             -118027,         0
##MAX=       1.7004516,     214300,          0
$$ Real data points
##PAGE= N=1
##DATA TABLE= (X++(R..R)), XYDATA
0@%%%%%%%%jRj6J6j9K7l2L7m5N6o8P9r4J10j27J47j71J99k29K60k95L35l79M27
32B26m81N41o04O75p56Q40r31J036j148J271j408J557j726J912k116K350k617
49a379K918l266L674m159M746n473O404p644R385j2019J6581l8442J93217j13492
63E1051j49439K10100o495n4375k5009q7159Q8551P9189j94832J3818J72991o1551
75C6840j03894K1670M0468L2852r1627n4336J52193M5349j32346R683R8890N111
87F0853p5181n2944Q0684P7558r4871l7397J15440K3745r8342n7788L1394N0062
99B3213n7853p8641Q2993R5085n5340m5881N4669M7888l8469r1065P00R6573k2231
112A1641r3935O9388J08756n3106p5573M0235N8359k8005p9147J104Q8326N926
$$ plain form
0 0 0 0 0 0 0 0 0 0 -1 8 -8 8 -11 16 -16 21 -24 32 -36 43 -51 59 -68 79 -92 107 -122 138 -157 178 -201 226
32 226 -255 286 -318 357 -399 441 -490 546 -602 669 -739 818 -908 1004 -1112 1238 -1379
49 -1379 1539 -1727 1947 -2212 2534 -2939 3465 -4179 5206 -6813 9768 -28674 164543 51051
63 51051 -98388 111712 105217 50842 25833 -61326 27225 106414 -88418 -74600 98391 36840
75 36840 -67054 -45384 -4916 27936 -63691 -118027 34166 79515 -52831 -43148 55742 60853
87 60853 -14328 -67272 13412 90970 -3901 -41298 74142 97887 -455 -58243 -26849 23213
99 23213 -34640 -113281 -30288 64797 9457 -36424 18245 66133 27664 -63401 -62701 33872 11641
112 11641 -82294 -12906 95850 42744 -32829 7406 65765 37760 -41387 -40283 48043 53969
124E3969r2540j4749P8891L297j02723l2212J07097M1015r3725Q0J18444J6805
136H3649q6338k4151O5907K7592r2306m5604J10836M4108r6124j5351P0047j615
148D0650p4811n1141M4600N4108n9598m0836Q9683O1180m6079m3880M0546O4013
160G8435n1300q2310O4865O9762o4131m5111L5749K9945k4368o9893P87P5743
172A8173k1166o1870M8378O1956j5685m9362j2304N8089O193q3408J1067Q8826
184D8887n913n1812M112M6499J6328p4289m6252O9064J9909o9319l392O3596L0835
197D8253m3558m8378M6152M5428p1351m5229O2210M2429l4319m0382M1728O7276
209G0259n4021p3285O4847N5406o0162l9383M4351M8979l5415p4639K8840O4076
$$ plain form
124 53969 -38571 -53320 25571 28868 -73855 -106067 1030 42045 -51680 -51600 66844 83649
136 83649 -2689 -26840 39067 66659 -25647 -71251 39585 83693 -12431 -27782 42265 40650
148 40650 -34161 -85302 -40702 13406 -46192 -87028 2655 63835 17756 -26124 14422 78435
160 78435 27135 -55175 9690 79452 15321 -29790 5959 35904 11536 -58357 -57570 18173
172 18173 -2993 -64863 -16485 45471 29786 -19576 -31880 26209 32402 -51006 -39939 48887
184 48887 42974 -8838 -4726 41773 58101 -16188 -62440 6624 26533 -42786 -46178 17418 48253
197 48253 4695 -43683 2469 47897 -23454 -68683 -6473 35956 1637 -38745 2983 70259
209 70259 16238 -57047 7800 63206 3044 -36339 8012 56991 21576 -53063 -24223 39853
221C9853n7253o4404N0447N8174j4866m0613J6760O7364j4790q1250J7890O7214
233D4526k4749n3296K1136N7542J302o0596q944N7993j2876p6464L777O0793j437
246H707m5274R7N4378K0384n2272k1219O1274J9900n8233j1257N4852J7417m4518
259D236l4693K9568L2465m8583m1750N3726L7281l9939k0434L3377L1563k2718
271A4099n3257J7249N3750l2696m7557M2826M8888k1199m1407J1168N2168j5611
283B8421p0856J6588O2927k2605n2317J7578N2558o061o2091K97O5344q139n9938
296c8294J4148N4419k032m8315p670N2759O279o1890l110N9895O167m4220n971
309a7835M5688J4774n6887k5559N0640J1968n2827j4606M8083K5456l7694k3696
$$ plain form
221 39853 -17400 -81804 -31357 26817 11951 -28662 -11902 55462 40672 -40578 -22688 44526
233 44526 19777 -33519 -12383 45159 46461 -14135 -23079 34914 22038 -54426 -50649 10144 8707
246 8707 -36567 -36470 17908 38292 -13980 -35199 26075 45975 -12258 -23515 31337 48754 4236
259 4236 -30457 -889 31576 -17007 -58757 -5031 32250 -7689 -28123 5254 36817 14099
271 14099 -39158 -21909 31841 -855 -48412 -5586 43302 22103 -19304 -8136 44032 28421
283 28421 -42435 -25847 37080 14475 -37842 -20264 32294 26233 -35858 -35561 29783 21644 -38294
296 -38294 -24146 30273 28241 -20074 -27744 25015 31294 -30596 -33706 26189 32356 -11864 -17835
309 -17835 27853 42627 -14260 -39819 10821 22789 -30038 -44644 3439 28895 -8799 -32495
321c2495M4877K7830m4494k7006L9112K8579l2747l2320L2917L3898l6626l3947
333c2422K8708K7774k3471l3574J9223M4573j8474m4098K2150L7564k0919l5327
345b8293R660M1120K78m5943O530N1765r356m5514K174L5208M766m3230j4429
358c5264N3018J3473n5787m772N0877M352m2174j3615M1180K2275m6986k0240
370c3663N2060J6288m8275j7172L9657K0950l7628k6800M2089L0173m1920k7761
382c2002L9197K7178l7069l3294L2916L3856l2592l3179L1811L5710k7034l6461
394c0963K6171L9582k5731l9835K4452L7178k2213l7768J7568L8019j5389l9395
406b8324J3748L9037q780l7817N697L9960k835m2634L283L9818k992l6157l938
$$ plain form
321 -32495 12382 40212 -4282 -31288 7824 36403 3656 -28664 4253 38151 1525 -32422
333 -32422 -3714 24060 589 -32985 -13762 30811 12337 -31761 -9611 27953 7034 -28293
345 -28293 -18633 22487 22765 -23178 -16648 35117 25761 -19753 -17579 17629 22395 -20835 -35264
358 -35264 17754 31227 -24560 -29332 21545 25897 -16277 -29892 11288 33563 -13423 -33663
370 -33663 18397 34685 -13590 -30762 8895 29845 -7783 -34583 7506 37679 -4241 -32002
382 -32002 7195 34373 -2696 -35990 -3074 30782 -1810 -34989 -3178 32532 5498 -30963
394 -30963 -4792 34790 9059 -30776 -6324 30854 8641 -29127 -11559 26460 11071 -28324
406 -28324 -14576 24461 15681 -22136 -16439 23521 20686 -21948 -18665 21153 18161 -17996 -21934
419b1934L3544J1641l5930j4690M2142J2502l9822j0428L3174J4110k8983k4698
431b9372L1276K9444l6991k5384L8657K3089l1490k4747K5090L0884k7796l8216
443c5556L0482L5738l2081k9689K7826L0947j9884l5709J7820M1554k0380m0776
455b9708K1950L8264j8148l8053J2717L8773j2023m2870J1531M3459r477m0426
467b4011R318M0360p556m1750L028L8051j771l8004n07M1573N797m0329k999L9597
481B0797J255l6343o028L1357J2573l2143j4877L5164J3118l5911j3322K6179
493A819J4704k2479k2123K6419K9430k7700k2902K7067J8981j9718k3806J2687
505g621L3017j3129l6290K0776L3136k2355k9726J0142K6320n086l7115O752M5832
$$ plain form
419 -21934 11610 23251 -12679 -27369 14773 27275 -12547 -22975 10199 24309 -4674 -29372
431 -29372 1904 31348 -5643 -31027 7630 30719 -771 -25518 -428 30456 2660 -35556
443 -35556 -5074 30664 -1417 -31106 -3280 27667 7783 -27926 -10106 31448 11068 -29708
455 -29708 -7758 30506 12358 -25695 -12978 25795 13772 -29098 -17567 25892 16415 -24011
467 -24011 -14693 25667 18111 -23639 -20611 17440 15669 -22335 -22842 18731 24528 -15801 -18800 20797
481 20797 22052 -14291 -20319 11038 23611 -8532 -23409 11755 24873 -11038 -24360 1819
493 1819 16523 -5956 -28079 -1660 27770 70 -22832 4235 23216 3498 -20308 -7621
505 -7621 25396 12267 -24023 -3247 29889 7534 -22192 -12050 14270 9184 -27931 -21179 24653
518B4653j0530l9785J5785L1066q255k9736k856L7844Q017m2595N39M4251n161
531B3237l9456l246K9619O573l5680j1777M3031J2145l9574n699L5267P819l3220
544a0961j5752L2408J9397l3592j5407L6568J5794l2063j8240K6432J9811k7815
556c420k2278K9498K3523k6781k1917K1126J9561k1522k6641J6947K8840j3922
568C014k4368J8843K8457j3589k7140P967K4253p406k8721N259L2595j442l0838
581a3116K817K9530m677l2141l914K8510N516l0030n294L5006P293l1889p041
594a9430K9045J0802k6991j2909L3308J8429l2710j5274K7671R932l0142k1323
606b9592K3367K3866k5723k0855L3262K2627k7997j9836K0881K0679k0880k7446
$$ plain form
518 24653 14123 -25662 -9877 21189 12934 -16802 -19658 18186 26203 -16392 -15853 28398 23237
531 23237 -16219 -19465 10154 16727 -18953 -30730 12301 24446 -15128 -20827 14440 22259 -10961
544 -10961 -26713 5695 25092 -8500 -23907 12661 28455 -3608 -21848 4584 24395 -3420
556 -3420 -25698 3800 27323 542 -21375 -249 19312 -2210 -28851 -11904 16936 3014
568 3014 -21354 -2511 25946 12357 -14783 -6816 17437 10031 -18690 -13431 19164 17722 -13116
581 -13116 -10299 19231 14554 -17587 -21501 7009 12525 -17505 -22799 12207 19500 -12389 -19430
594 -19430 9615 20417 -6574 -19483 13825 32254 -456 -15730 11941 21873 -8269 -29592
606 -29592 -6225 17641 -8082 -28937 4325 26952 -1045 -20881 0 20679 -201 -27647
618b7647K3952L1556k2253k3775K2740K1550j8004k8100J0520L0083j4843l1250
630b5471J8707K7777j5857k4990O406K5388n075l0325R764L5006p913k3763P912
643b434J9062j144k6473q811K9667M722l0507M191K8078N32k0150j0566J6971
656C138J2434k8329j4854L1093J1122k3247n894J9208J3855j6762k1881K0478
668C61K2883k2264j6229K2444J6821j6994k2807R732K3090j7612k8404J9604K6622
681A7247j4318k0761J2287K4554r930l1629R382L1506j1133k5411J4603K7127
693B3524n674k6265r8K6105m552l4550L618L1792m121k6253L995K3831O11k6150
707a4187o291K8228O321k7625M6K9880L966k3128o573J8201P419k3556j2832K4436
$$ plain form
618 -27647 -3695 27861 5608 -18167 4573 26123 8119 -19981 -9461 20622 5779 -25471
630 -25471 -6764 21013 5156 -19834 -13428 11960 6885 -23440 -13676 21330 13417 -10346 -2434
643 -2434 16628 15484 -10989 -19800 9867 14589 -15918 -11727 16351 16883 -3267 -13833 3138
656 3138 15572 -12757 -27611 3482 14604 -8643 -14537 4671 18526 1764 -20117 361
668 361 23244 980 -15249 7195 24016 7022 -15785 -6053 17037 -575 -28979 -9375 17247
681 17247 2929 -17832 -5545 19009 9079 -22550 -13168 18338 7205 -18206 -3603 23524
693 23524 17850 -8415 -8513 17592 13040 -21510 -17892 13900 9779 -16474 -12479 11352 11963 -14187
707 -14187 -20478 7750 14071 -13554 -13508 16372 20338 -2790 -9363 8838 16257 -7299 -20131 4305
721D305J2576k1975q213J8839J0118j7868j8115J4848J8284j7488j5750K1121
733F82J6985j2931j6016Q345J9068r977k4855J3020K4964j1594j8160R293J8115
746A6939o032k6117o18K5968m834k5961P941K5247n33k1652l181K4636L224k9546
760a4519j606K9649K495k2685j871K1798P621k7485j2220K6392O623k7013m681
773a7502K3478R628j9885j4944K0948J4329k6136j2623K6788J2672j7639r242
785a0128J7652J6051j9413k0735J7891J4285j9435j3875J5485J6800j0509j9877
797a5808J1080K0077j5471j9362J2781J7869o162j6143N532K2457n533k4774O129
810g328K0594o185j7455L040K0384K559k2988m105K2119j912k4240j018J9110
$$ plain form
721 4305 16881 -5094 -13307 5532 15650 -2218 -20333 -5485 12799 -4689 -20439 682
733 682 17667 4736 -11280 -2935 16133 6156 -18699 -5679 19285 7691 -10469 -1176 16939
746 16939 10907 -15210 -15828 10140 5306 -20655 -12714 12533 12000 -9652 -12833 11803 15027 -14519
760 -14519 -16125 13524 16019 -6666 -8537 13261 20882 -6603 -18823 7569 14192 -12821 -17502
773 -17502 5976 15604 -4281 -19225 1723 16052 -10084 -22707 4081 16753 -886 -10128
785 -10128 7524 23575 4162 -16573 1318 15603 -3832 -17707 -2222 14578 4069 -15808
797 -15808 -4728 15349 -122 -19484 -6703 11166 5004 -11139 -5607 16850 11317 -13457 -7328
810 -7328 13266 7081 -10374 -7334 13050 15609 -7379 -11484 10635 8723 -15517 -16535 2575
823B575O403j6508o486K2380J0435k4198r453K1932O688j9245q572J8589J4240
836A8780j7451j5964J8604J4295k2356j5221J8570J3714j4112j5237J4502J9140
848A7264j5867k1522J6249J8191j5065j5168J4281J9908q297k0897R357K1829
860B0263j4843k3578J1568J8546q559j7058N236K2091l573k5157N108K2481q042
873D483j8246N134J7758K892j8813l922K3011O38k4661J304J9484P22j3430o093
887i739J6164J0196k1690j1164K0330M519j8197n441J4114J3292j0636j5671J6468
900B545J5923j9172j2692J4373J1526q899j5294Q092K1186j1843k1647J2323J5963
913A2384j1178j4742N792J9336k863k2734N506K2549q833k0527O621J8888o86
$$ plain form
823 2575 8978 -7530 -14016 8364 18799 -5399 -14852 7080 13768 -5477 -14049 4540 18780
836 18780 1329 -14635 3969 18264 -4092 -19313 -743 12971 -1141 -16378 -1876 17264
848 17264 1397 -20125 -3876 14315 -750 -15918 -1637 18271 9974 -10923 -1566 20263
860 20263 5420 -18158 -6590 11956 3397 -13661 -8425 13666 10093 -15064 -9956 12525 4483
873 4483 -13763 -8629 9129 12021 -6792 -10714 12297 12935 -11726 -10422 9062 9784 -3646 -9739
887 -9739 6425 16621 -5069 -16233 4097 8616 -9581 -15022 -908 12384 1748 -13923 2545
900 2545 18468 -704 -13396 977 12503 3604 -11690 -3598 17588 5745 -15902 -3579 12384
913 12384 1206 -13536 -7744 11592 8729 -14005 -8499 14050 5217 -15310 -8689 10199 9513
926I513j8425J166K3982o53k5907J148K0351l278j9629k211K0035N348k1019l811
940a3390K3209K450k0926l232J7396O757j6975q042J9103Q553j9740p901J7568
953D830O905j5709q768J4900J2608j4141j3215J4359J1866j5602j3018J1398J3088
966I501r113j3185R775J6859q006j6754Q018J5100p631j5963M776J6451k029j7608
980i809K888J8488l626j7855J736J6340L05j7096k449J8980K482k0322k030J8599
994F631K800j6498m417J7957R229j8569q595J9775O327k0333p462J5118Q291j4545
1008d291j1361J7068J3323j8046j0497J7541R035j4193j1051J1931J4826j2478
1020A807j5790J4696J4288j5144j2044J0608J2704p632j6424Q097J7995r560j6624
$$ plain form
926 9513 -8912 -7746 16236 15583 -10324 -9176 11175 7897 -11732 -13943 6092 11440 -9579 -13390
940 -13390 9819 12269 -8657 -11889 5507 12264 -4711 -12753 6350 14903 -4837 -12738 4830
953 4830 11735 -3974 -12742 2158 14766 625 -12590 1769 13635 -1967 -14985 -3587 9501
966 9501 388 -12797 -3022 13837 5831 -10923 -2905 12195 4564 -11399 -6623 9828 7799 -9809
980 -9809 -6921 11567 7941 -9914 -8178 8162 8467 -8629 -11078 7902 10384 -9938 -11968 6631
994 6631 9431 -7067 -11484 6473 15702 -2867 -11462 8313 14640 -5693 -13155 1963 10254 -4291
1008 -4291 -15652 1416 14739 -3307 -13804 3737 12772 -1421 -12472 -541 14285 1807
1020 1807 -13983 713 15001 -143 -12187 -1579 11125 3493 -12931 -4834 13161 3601 -13023
1033a3023R252J3779n857j3970L124J6769k308j7559L745J7045m508j4890O27
1046g774J3872K081j5727k535J7794J812j6162j816J4467L813j3488p387J4863
1059C813Q464j6395p193J4733P628j3603q995J1563J1301j1952j2189J3462J2867
1072A3504j2606j2110J1178J2127r576j4001Q879J4792j0077j5218R507J5151
1084A1550r430j4506P834J6059o293j5985O048J6950n147j7745N145J6311m876
1097E915j6700L346J5617j071j6375Q49J7447l92j6840R83J4942O9j4382j934
1111h526J4304L492j5128l242J5288L432j3557m624J2003N726j2572p816J2203
1124I83Q297j2027p242J1323Q966q965r834R301J0665r404j1974Q219J0474p959
$$ plain form
1033 -13023 -3771 10008 4151 -9819 -6695 10074 7766 -9793 -6048 10997 6489 -8401 -7774
1046 -7774 6098 8179 -7548 -10083 7711 9523 -6639 -8455 6012 9825 -3663 -11050 3813
1059 3813 12277 -4118 -11311 3422 11050 -2553 -11548 15 11316 -636 -12825 637 13504
1072 13504 898 -11212 -34 12093 2517 -11484 -2605 12187 2110 -13108 -3601 11550
1084 11550 2120 -12386 -4552 11507 5214 -10771 -4723 12227 7080 -10665 -5520 10791 5915
1097 5915 -10785 -7439 8178 7107 -9268 -8419 9028 8636 -8204 -7221 7721 7790 -6592 -8526
1111 -8526 5778 9270 -5858 -9100 6188 9620 -3937 -8561 3442 9168 -3404 -11220 983
1124 983 9280 -2747 -9989 1334 10300 1335 -8499 802 11467 2063 -9911 -1692 8782 823
1138H23j1359N700J3189n433j3485O729J4251n058j3238M411J3730l313j5589
1151h642J941J5195k993j5185K115J5816q45j4805J60J5542L67j6377j158J4971
1165F102J720j5344k334J5794L897j5314l129J4978L883j4474n171J3859N722
1178A0189j4439o366J4223N785j3064o392J1806Q500j1169q978J2043R349j1859
1191c72r506R450Q401q847r771P999J2206p370j0136P409J0916o154j1467M001
1205c241J0916l692j3002L563J2839l199j1852J422J2022L42j2963LJ4018O88
1219G864j3280p07J2318J971j3152l959J3374M313j3563l469J3097M915j2117
1232b395o689J1715O944j3855p410J3330P323j1383p294J1439R389j0744j0484
$$ plain form
1138 823 -10536 -4836 8353 2920 -10565 -3836 10415 5357 -7881 -3470 10260 6947 -8642
1151 -8642 -6701 8494 5501 -9684 -7569 8247 7402 -7403 -7243 8299 8666 -7711 -8869 6102
1165 6102 7822 -7522 -9856 5938 9835 -5479 -8608 6370 10253 -4221 -9392 4467 10189
1178 10189 -4250 -10616 3607 9392 -3672 -10064 1742 10242 -927 -9905 2138 11487 -372
1191 -372 -9878 -428 7973 -874 -10645 -2646 9560 2190 -7946 -537 10379 4225 -7242 -3241
1205 -3241 7675 3983 -9019 -5456 7383 4184 -7668 -6246 5776 6118 -6845 -6842 7176 7864
1219 7864 -5416 -6123 6195 8166 -4986 -8945 4429 8742 -4821 -8290 4807 9722 -2395
1232 -2395 -9084 2631 9575 -4280 -11690 1640 8963 -2420 -9714 1725 11114 370 -10114
1245a0114J1248J0160j1303r679J0055R870q868j1447P850J1275q097j1675Q028
1258b697J2035o494j1149N568J1894m989j3430M725J2089m111j1477L845J2215
1271H024j039j2484R88J2476j643j3186K63J1245M37j0990j707J1458K933j1777
1285e002l242J2081L669j0298l418J0113N490r965p164R385O481j0113p949J0153
1299B21Q573r014p780Q221R568q247j1133P101J0410p629j0716P648J2053n997
1313C279j1187N946J1785n094j3639N156J2631n030j2080L503J2203k162j3764
1326h453J970J4164k480j3148K933J2216r24j1742k247J3109J316j4718j71J3834
1340E659J147j0800j207J1103L670j1631n586J1422L654j2799l017J0332M231
$$ plain form
1245 -10114 1134 11294 -9 -9688 367 10237 1369 -10078 -2228 9047 950 -10725 -2697
1258 -2697 9338 2844 -8305 -2737 9157 4168 -9262 -4537 7552 3441 -8036 -4191 8024
1271 8024 6985 -5499 -4511 7965 6322 -6864 -6601 4644 5081 -5909 -7616 3842 6775 -5002
1285 -5002 -8244 3837 7506 -2792 -6210 3903 9393 -572 -7736 1649 8130 -1983 -9932 221
1299 221 8794 -220 -8000 221 9789 1542 -9591 -2490 7920 291 -10425 -2777 9276 3279
1313 3279 -7908 -1962 9823 4729 -8910 -3754 8877 3847 -8233 -4730 7473 5311 -8453
1326 -8453 -6483 7681 5201 -7947 -5014 7202 6278 -5464 -7711 5398 6714 -8004 -8175 5659
1340 5659 6806 -3994 -5201 5902 9572 -2059 -7645 3777 7431 -5368 -8385 1947 6178
1353F178q546o090R595P012j0355o368R834O308p039o621O436R130o459j0932
1367g917P160R121p371q756M804R274k875j0982K577J2103m019j1908M046J1211
1381F468j912r520J002J1774j85j2952o75J1695o84j1874k64J1690K368j1432
1395d501l004J2956K405j2842l287J1525L902j0332m911J1293O086j1852n734
1408h296J1028N270j0537n669R420O999q669p828R464P739r693p181Q507P492
1422H046p105p919O034Q413o292j0314N810Q902n925q001N572R875k333q720K776
1437a181R924l060j1276J863Q660j593r637l6J0001J053j0350m19J0428P18r351
1452d256j494R063L413q887m719J0702M128j0853k924Q652M506p795o482P918
$$ plain form
1353 6178 -2368 -8458 1137 8149 -2206 -8574 1260 7568 529 -6092 344 9474 3015 -7917
1367 -7917 -757 8364 993 -7763 -2959 6315 3440 -7542 -4965 7138 3119 -8789 -4743 6468
1381 6468 4556 -4964 -3962 7812 7627 -5325 -6000 5695 5011 -6863 -7127 4563 6931 -4501
1395 -4501 -7505 5451 7856 -4986 -8273 3252 7154 -3178 -8089 3204 9290 -2562 -8296
1408 -8296 2732 8002 -2535 -8204 1216 8215 -454 -8282 1182 8921 -772 -7953 554 8046
1422 8046 941 -6978 -944 7469 1177 -9137 -3327 5575 -350 -8351 -2779 7096 4763 -3957 -1181
1437 -1181 8743 5683 -5593 -3730 4930 3337 -6300 -6336 3665 4718 -5632 -6051 4377 5095 -4256
1452 -4256 -5750 3313 6726 -2161 -6880 3822 7950 -2903 -5827 2825 7331 -464 -6946 972
1466I72P072j0155q140R660N483p772n212P363Q783m042r838O945R391q502r274
1481g266O139O501n665r048M363J1889m643j0029O442J0242n384q415K682Q882
1495F690j916j1542J623J1267l729j0192L347Q755N58q673n13J0635N00j1358
1509d548m40R073l32q352j509Q822L975q101l700R289K659r682l830O739M057
1524D120p234n536P854P706o908n358Q054O237o395o521M258O884n554r937M811
1539c519Q024n672p376M617Q796j635q302L123J0549k715j1068K546Q885l173
1553C080r146Q06J0364O1j0672L54J1416p76j0921M5R092Q45r470j519J0408K829
1569F796j0162j636J0420J958r619l072P695L663r132n234R306L986q665k993
$$ plain form
1466 972 8044 -2111 -10251 -591 4892 -2880 -8092 -729 8054 4012 -5826 1119 10510 2008 -7266
1481 -7266 -1127 5374 -291 -9339 -4976 6913 2270 -7759 -1317 8925 3541 -4874 -2192 6690
1495 6690 4774 -6768 -5145 6122 2393 -7799 -4452 4303 4861 -3812 -4325 6310 6810 -4548
1509 -4548 -4988 4085 3753 -4599 -6108 2714 6689 -1412 -5112 4177 6836 -2846 -6676 63 4120
1524 4120 -3114 -8650 -796 6910 2 -5356 2698 8935 2540 -3981 277 7161 1607 -8330 -3519
1539 -3519 4505 -1167 -8543 -3926 4870 3235 -5067 -1944 8605 5890 -5178 -2632 6253 3080
1553 3080 -6066 -5260 5104 5165 -5507 -5153 6263 5487 -5434 -5389 3703 4548 -4922 -6441 3967 6796
1569 6796 -3366 -5002 5418 7376 -2243 -5315 2380 6043 -3089 -8323 983 4969 -3696 -6689
1583f689P992N235o053n498P117O490q071o691O471M634n727o559M672P347l386
1598A284p551M838Q122m108p303L296O546j695q043J158R044j690q897K047P485
1613D533j066p817r86Q325J380r670p00R565J646p981j355Q720K718q660l963
1628e311R008K857j0130l455P546L786p270n096Q460O617p946m989Q615M936p352
1643B76n833O484N928p095p008O656P108o924n948N728O972n388p289M370P648
1658E685m508p594M861P470l515o595K840P990k333q448J493P032k260q159O91
1673e350P911j87p217O00Q542J562p723o69P712M76p644k649O124K639p609l572
1689g054P498M250o558l677P500M327n759n348N326N829o536o475O190N952n726
$$ plain form
1583 -6689 1303 6538 485 -5013 2104 8594 523 -6168 303 4937 -790 -7349 -2677 4670 1284
1598 1284 -6267 -1429 6693 2585 -4718 -1422 5124 3429 -4614 -3456 5588 3898 -4999 -2952 4533
1613 4533 3467 -4350 -5336 2989 4369 -5301 -6001 3564 5210 -2771 -4126 4594 7312 -1348 -5311
1628 -5311 3697 6554 -3576 -7031 515 4301 -2969 -8065 395 7012 -934 -5923 2692 7628 276
1643 276 -5557 927 6855 -240 -7248 -592 6516 -408 -6356 -628 6344 956 -6333 -1963 5685
1658 5685 1177 -6417 -1556 5914 2399 -4196 -1356 6634 4301 -4147 -2654 4378 2118 -6041 -5350
1673 -5350 2561 2374 -4843 -4243 4299 5861 -1862 -2531 5181 5657 -1987 -4636 1488 4127 -3482 -7054
1689 -7054 444 4694 -1864 -5541 1959 6286 527 -4821 505 6334 -202 -6677 -487 5465 -261
1704b61n189M811P197m323q080M545P205n055q021M355P382k799p495L541Q954
1719F767l077q347L285P699l105q517J154P870j202r279J492R403n96p692J075
1734c070Q436O66p708j613P757M92r062j752P048J587o914j205P162L790o779
1749a165l400P305K386n965l974N517M596n911m765N678N554n308n344M541M995
1764D740l981o370L561O278l359o481L356O951k760o284K880P472j981p381J574
1779a785O983k121p770L3P245q4p543K76Q704R50p857l88P555P75p762j741P473
1796B943J531p561j842P412K759p759k679P176L354p121l189O948L489o445l951
1811d935O169L764n946m316N615M749n398m849N330N001n069n601M623N450l744
$$ plain form
1704 -261 -5450 -639 6558 2235 -5845 -1300 5905 850 -7171 -2816 4566 1767 -5728 -2187 6767
1719 6767 3690 -4657 -1372 6327 3222 -5295 -4141 3729 2527 -6752 -5260 4143 3547 -4145 -3070
1734 -3070 5366 6032 -1676 -3289 4468 4960 -4102 -5854 1194 2781 -4133 -5338 1824 5614 -1165
1749 -1165 -4565 2740 5126 -839 -4813 704 5300 -611 -5376 302 5856 548 -4796 -255 4740
1764 4740 759 -5611 -2050 4228 869 -5612 -2256 4695 1935 -4349 -1469 6003 4022 -3359 -1785
1779 -1785 5198 3077 -4693 -4660 2585 2501 -5042 -4766 3938 4888 -2969 -3357 4198 4973 -2789 -4530 2943
1796 2943 4474 -3087 -4929 2483 5242 -2517 -5196 1980 5334 -1787 -4976 1972 5461 -984 -4935
1811 -4935 1234 4998 -948 -5264 351 5100 -298 -5147 183 5184 115 -5486 -863 4587 843
1826H43n408L781O326l536n939K895N645k797o632J931O199j162o419J117O912
1841C756q71o500N36O491Q2o756k77O880J592p256j041O211J271o546k607O547
1857A512K508o387k803O576L437o621l628O444L881n478m370O183N112o404m916
1872d954N317M690n507n072M646N587m098n903M865N988m352o246L547N878l693
1887F93o277L431O862k674o241K698O135j625o741R95O983j563o591J070O876
1902D031r15o552j9O177M06o185q43O728R52n928j827O090J731o074k465O015
1918A322K661m752k870N502L530n813l896M789L615n255l876M215M775l508n162
1933d723M140N397l701n615L378N576l064n360K637O078k345o836K057O754k455
$$ plain form
1826 843 -4565 -784 5542 2006 -3933 -1038 4607 1810 -4822 -2891 3308 2146 -4273 -3156 3756
1841 3756 2885 -3615 -3079 3412 3494 -3262 -3539 3341 4933 -2323 -3364 2847 4118 -2428 -5035 1512
1857 1512 4020 -2367 -5170 1406 4843 -1778 -5406 1038 4919 -559 -4929 1254 6366 -38 -4954
1872 -4954 363 5053 -454 -5526 -880 4707 609 -5294 -429 5559 1207 -5039 -1492 4386 693
1887 693 -5584 -2153 4709 2035 -4206 -1508 4627 3002 -3739 -2744 4239 2676 -3915 -2845 4031
1902 4031 3116 -3436 -3455 2722 3128 -3057 -3900 2828 3780 -2148 -3975 2115 3846 -2228 -4693 1322
1918 1322 3983 -769 -3639 1863 5393 -420 -4316 473 4088 -1167 -5043 -828 3947 439 -4723
1933 -4723 -583 4814 1113 -4502 -1124 4452 1388 -3972 -1335 4743 2398 -4438 -2381 4373 1918
1948A918o536K045O573r79o637P15O791j106o827L12O842j14o707N00O722P86
1964D298o841o29O588L53n923j602O043J783n979k463O207K039o218k354N698
1979A000K895m982k884N029L203m773l515M520L444m444l734M097M654l843m137
1994c470L519M466l206n329K488M713k208n246J927N615j374n612J395N707q61
2009B524n501R18N691m81n711r2N378O9o263o23O305R47n628j107O012K170o168
2026a560k323O025J989o524k140N503K875n489k448N397L404n037l620N078L519
2041D649m980l838M755L893n139l984M162M644m261l952L539N014l277n329L167
2056i37N228l598n373L187M476j561m604J653N797j272n951J563M733j245n610
$$ plain form
1948 1918 -4618 -2573 4000 3021 -3616 -2901 3890 2784 -4043 -3731 3111 2997 -3710 -3210 3512 4298
1964 4298 -2543 -3172 3416 3769 -2154 -3756 2287 4070 -1909 -4372 1835 3874 -2344 -4698 1000
1979 1000 3895 -1087 -3971 1058 4261 -512 -4027 493 3937 -507 -4241 -144 4510 667 -3470
1994 -3470 49 4515 1309 -4020 -1532 3181 973 -4273 -2346 3269 1895 -3717 -2322 3385 2524
2009 2524 -2977 -2059 3632 3151 -2560 -2652 2726 2795 -3468 -4091 2214 3161 -2467 -3574 2438 4608 -1560
2026 -1560 -3883 2142 4131 -2393 -4533 970 3845 -1644 -4092 1305 4709 -328 -3948 1130 4649
2041 4649 -331 -4169 586 4479 -660 -4644 -482 4162 -99 -4051 -512 4502 1225 -4104 -937
2056 -937 4291 693 -4680 -1493 2983 1422 -3182 -1529 4268 2996 -2955 -1392 3341 2096 -3514
2071c514N0N136L21n297M9N655O56n140o67N516J381n081k242N063J662m968k693
2088d113N184J955m710k699M972L614m501l536M462L485m076m181L666M298l497
2103C23m496L780M972l487m563K995M806l523m971K673N233k538n269K543N494
2118C972k434m932J564N824j290n960Q45N774q41n905O04N391l54n230Q8N838
2134B954J55n083o58N559O63n660r56M547J045m794j542N173K067m574k043M383
2150A236K141m116k986M160L089l666l068L235M043l939l775L436L450k306m422
2165c488J872N247k983m681K808M510j823m445J363N172j340n038J024N345j240
2180B303n404O85N172m89n493K94N772k60n517R3N316M29n224p91N467P71m954
$$ plain form
2071 -3514 -3464 1672 1993 -3304 -3255 2400 3056 -2084 -2751 2765 4146 -935 -3177 1886 3548 -1420 -4113
2088 -4113 1071 3026 -1684 -4383 589 4203 -298 -3834 628 4113 37 -4144 -478 3820 323
2103 323 -4173 -393 4579 1092 -3471 -476 4330 807 -4164 -1491 3742 1204 -4065 -1522 3972
2118 3972 1538 -3394 -1830 3994 2704 -3256 -2411 3363 2522 -3383 -2779 2612 2258 -2972 -2884 2954
2134 2954 3109 -1974 -2632 2927 3590 -2070 -3026 1521 2566 -2228 -3770 1403 3470 -1104 -3147 1236
2150 1236 3377 -739 -3725 435 3524 -142 -3210 25 4068 129 -3646 -210 3240 934 -3488
2165 -3488 -1616 3631 648 -4033 -1225 3285 1462 -2983 -1620 3552 2212 -2826 -1802 3543 2303
2180 2303 -3101 -2416 2756 2267 -3226 -2932 2840 2580 -2937 -2844 2472 2901 -2323 -3114 2353 3124 -1830
2197a830j214N293J071n153j419M591K189n283k006M625K270m561k319M840K720
2212C814m146k825M054K933m214l532L670L338l342l351K814M282k928l763K824
2227c72L809k142l632J603L549j567m370J478M331j080m069O87M219k97m189j49
2243b191M486K30m663p08M715L37m500r30N121J762m829j601M452J953n068j979
2259c413M138K403m611k212M307K936l750l127M111K970l735l428L825K963l528
2274a51l683L182M117l357m077L400L747k555l447K493M454k616m608K152M106
2289C157k261m252J421M501q06m534J249M443q57m635Q50L996o61m289L18L997
2305A637J012m243q59M681O64l978j434M001J530l982j970L842K324m394k283
$$ plain form
2197 -1830 -3044 2249 3320 -1833 -3252 1339 3528 -1755 -3761 864 3134 -1427 -3746 1094 3814
2212 3814 -332 -3157 897 3830 -384 -3916 -246 3092 -250 -3601 -787 3495 567 -3196 -372
2227 -372 3437 1295 -2337 -734 2815 1248 -3122 -1644 2687 1607 -2462 -1775 2444 2147 -2042 -2191
2243 -2191 2295 2525 -2138 -2846 1869 2206 -2294 -3224 1897 3659 -1170 -2771 1681 3634 -1434 -3413
2259 -3413 725 3128 -1483 -3695 612 3548 -202 -3329 782 3752 17 -3411 414 3377 -151
2274 -151 -3834 -652 3465 108 -3969 -569 3178 623 -2824 -331 4123 1507 -3101 -949 3157
2289 3157 896 -3356 -1935 2566 1760 -2774 -1525 2918 2061 -2574 -1724 2272 1611 -2678 -2360 1637
2305 1637 2649 -1594 -2453 2228 2892 -1086 -2520 1481 3011 -971 -2941 901 3225 -1169 -3452
2320c452L957K389l355k405L236L376l438l114L117K679l387l072K458L574j811
2335G52l991K742L835k234l731J717L795j150m946J542M527j292m888J758M376
2350B812r16m889J069M818o36m718M64M922o08m680l74M798qm682k57M866O80
2367B661m207o70M030Q88m183j602M181J263l697j324L789J934l673k219L756
2382I27K131l007k793K788K911k694l298K446L097k412l190K159L813k060l172
2397b354J568L753j856l547J226L679j184m094O59M585m19m445L80M349k72m356
2413b328L01L945L03m158o76M586M06m291o98M208J081l699j588M178J923m149
2429f56k120L938K063m619j888L549K507l745k247L665L097l582k922L041K643
$$ plain form
2320 -3452 505 2894 -461 -2866 370 3746 308 -2806 311 2990 -397 -3469 -1011 2563 752
2335 752 -3239 -497 3338 1104 -2627 -910 2885 1735 -3211 -1669 2858 1566 -3322 -1564 2812
2350 2812 1896 -2993 -1924 2894 2258 -2460 -1996 2926 2318 -2362 -2736 2062 2054 -2628 -2885 1981 2661
2367 2661 -1546 -2216 1814 2702 -1481 -3083 1098 2361 -1336 -2660 1129 3063 -610 -2829 927
2382 927 3058 51 -2742 46 2957 263 -3035 -589 2508 96 -3094 -935 2878 818 -2354
2397 -2354 -786 2967 1111 -2436 -1210 2469 1285 -2809 -2150 2435 2016 -2429 -2049 2300 2028 -2328
2413 -2328 -2027 1918 2221 -1937 -2613 1973 2379 -1912 -2610 1598 2679 -1020 -2608 1570 3493 -656
2429 -656 -2776 1162 3225 -1394 -3282 267 2774 -971 -3218 447 3544 -38 -2960 81 2724
2444B724l019k540K651L209k661k914K682L254k783k975J604L192j537l742J972
2459h83L256j222l672P56L506n87l598P39L760J79l583J99L386j57l704p17M004
2476A662M59l839k08L203J125l537q61L267J336l598j832L418J794l107j776L168
2492F74K271l467k455L014K928l072k415K843K781k523l245K053L133k409l136
2507c025K020L630k178l259J558M154k094l679J840L760j530l593J026L955p68
2522A817l993Q60L551n03m185O62L702j12l920J57L641L50m082k86L272P44l111
2539a436o41L347J235l065j529L614J155l602j607L266J641l328j747K968K364
2554B635k762k054K049K568k100k674K538K822k471l328K057K985j686l123J556
$$ plain form
2444 2724 -295 -2835 -184 3025 364 -2550 132 3386 603 -2372 -768 2424 887 -2855 -883
2459 -883 2373 1151 -2521 -1765 1741 1154 -2444 -1705 2055 2234 -1349 -1150 2236 2079 -1625 -2342 1662
2476 1662 2121 -1718 -1926 1277 2402 -1135 -1996 1271 2607 -991 -2823 595 2389 -718 -2494 674
2492 674 2945 -522 -2977 37 2965 -107 -2522 321 3102 579 -2666 -613 2520 111 -3025
2507 -3025 -1005 2625 447 -2812 -1254 2900 806 -2873 -1033 2727 1197 -2396 -1370 2585 1817
2522 1817 -2176 -1316 2235 1732 -2453 -1791 1911 1799 -2121 -1964 1677 2027 -2055 -2341 931 1675 -1436
2539 -1436 -2077 1270 2505 -560 -2089 1525 2680 -922 -2529 737 2378 -950 -2697 271 2635
2554 2635 -127 -2181 -132 2436 336 -2338 200 3022 551 -2777 -720 2265 579 -2544 -988
2569i88L137o49l335J206L471j176l879O86L576q44l795N49L923N6l881J02L920
2586B079rl818m81L885M58l604o67L779O16l837m14L241J052l017j430L282J300
2603B415l383j773K753K087k972j807K528K495k174j842K509K522k703k378J688
2618c5K585k815k458K060K799j511l121J981K883j559l022J488K812q24l182P39
2634a180K860o60k762K61L174k27k924j64L613O7l504k19K705O01l055r73L039
2651F52J616l217j049L265J493l572j151K897J252k665k325L503J565k765k036
2666b537K766K135k869k205L190K170k438k463K351K271k459k561K007K968k201
2681A25k730K191K676j649k210J257K503j039l231J077K921o75l372Q41L347r47
$$ plain form
2569 -988 2149 1500 -1835 -629 2842 1666 -2213 -1527 2049 1205 -2590 -2041 1882 1938 -1943 -1841 2079
2586 2079 2070 -1748 -2229 1656 2114 -1490 -2157 1622 2238 -1599 -2013 1228 2280 -737 -2167 1115 2415
2603 2415 -968 -2741 12 2099 -873 -2680 -152 2343 169 -1673 836 3358 655 -1723 -35
2618 -35 2550 -265 -2723 -663 2136 625 -2496 -515 2368 809 -2213 -725 2087 1263 -1919 -1180
2634 -1180 1680 1020 -1742 -1481 1693 1466 -1458 -1622 1991 2058 -1446 -1665 1040 1641 -1414 -2387 652
2651 652 2268 -949 -1998 1267 2760 -812 -1963 934 2186 -479 -2804 699 2264 -501 -2537
2666 -2537 229 2364 -505 -2710 480 2650 212 -2251 100 2371 -88 -2649 -642 2326 125
2681 125 -2605 -414 2262 613 -1597 -340 2163 1124 -2107 -1030 1891 1216 -2156 -1315 2032 1085
2697A085l188O16L093r4l448M70K778K75k869m67L006M02k968l53K887N78k550
2714g47r38K282J478k982j065K237J485k227j747K312J981j941k233K282K320
2729B497k026k491J971K237j766k778J879K630j765k662J601K654j152k906J229
2744h48L180j208l043P48K891o18l076O59L037j32l254K87L180j9l285k5L212
2761A686l35k668k98K749P25l327n83K828J223k776j430L150J074k409j676K568
2777E01J678k626j549K146J802k349j582K314K044k258j893J607K364j708k549
2792b058J521K381j424k204J073K685j183k437J056K789j295k493L84K960l66
2807A389l193M90L083k84l157K29K923o4k863j30K964K09k953m42K996K57k963
$$ plain form
2697 1085 -2103 -1487 1606 1512 -1936 -1466 1312 1587 -1282 -1749 1257 1659 -1309 -1662 1225 1803 -747
2714 -747 -1685 597 2075 -907 -1972 265 1750 -477 -2224 88 2069 128 -2105 177 2497
2729 2497 471 -2020 -49 2188 422 -2356 -477 2153 388 -2274 -673 1981 829 -2077 -848
2744 -848 2332 1124 -1919 -1171 1720 1102 -1974 -1315 1722 1590 -1664 -1377 1803 1784 -1501 -1526 1686
2761 1686 1351 -1317 -1615 1134 1859 -1468 -2051 777 2000 -776 -2206 944 2018 -391 -2067 501
2777 501 2179 -447 -1996 150 1952 -397 -1979 335 2379 121 -1772 -165 2199 491 -2058
2792 -2058 -537 1844 420 -1784 -711 1974 791 -1646 -590 2199 904 -1589 -1205 1755 1389
2807 1389 -1804 -1314 1769 1485 -1672 -1443 1480 1416 -1447 -1577 1387 1596 -1357 -1799 1197 1454 -1509
2824a509n08K866P60k388j196K907J175k749j350K701J433k524j857K487J874
2839B122k754j298K011K254k511j644J801K028j527k365J540K227j700k186J411
2854e91K385j391k003R46K523j052k260O86K264n40k454N89K246l69k595J91K458
2871A033M24k437m97K917L64k807p04K405J070l137o11K589J289k691j086K725
2887H46J312k784j073K251J560k682j929K521K056k457j975K299K253k051j979
2902a832K022J862j274k545J475K296j569k741J351K339j124k548J909K208q22
2917A007k705R47K708r63k993J195K455n91k634K00K465K44k471j03K789j63k136
2934g49p63K671K75k492o57K361N89j850p14J918J358k040j271K186P89k008j547
$$ plain form
2824 -1509 -2017 849 1609 -779 -1975 932 2107 -642 -1992 709 2142 -382 -2239 248 2122
2839 2122 -632 -1930 81 2335 -176 -1820 -19 2009 482 -1883 -343 1884 184 -2002 -591
2854 -591 1794 403 -1600 -654 1869 817 -1443 -757 1507 967 -1487 -898 1348 979 -1616 -1425 1033
2871 1033 1457 -980 -1477 1440 1804 -1003 -1707 698 1768 -1369 -1980 609 1898 -793 -1879 846
2887 846 2158 -626 -1699 552 2112 -570 -2499 22 2078 -379 -2354 -55 2198 147 -1832
2902 -1832 190 2052 778 -1767 -292 2004 435 -2306 -955 1384 260 -2288 -379 1829 1007
2917 1007 -1698 -751 1957 994 -1999 -804 1651 1060 -1574 -1374 1091 1335 -1136 -1239 1550 1387 -749
2934 -749 -1512 1159 1434 -1058 -1715 646 1235 -615 -1329 589 1947 -93 -1364 822 1611 -397 -1944
2951a944J642J548j457j639J548J935j288j264J340J812j525k454J597J798j533
2966A16k184Q32K914j071k320J026K642q80k141M14K179l69k647K16K662m67k187
2983a265R5K549N4k332l14K306K56k692K3J965P50k801QK193J019k027j309K388
3001H66R47j958j354J880J180k364j487K049J666j764j227J847J493j847j338
3016a411J503J814j391k157J558J652j392j973J016K309j123j678N97K476o16
3031A184k692L67K254j35k082J37K260O3k520k13K825K13k761o14K736J44k401
3048a235l14K625M56k084n35K319R75k438j244K155J066k458j094J937J328k145
3064f86j019J658J866j970j488J676J828j619j758J321J740j413j820J085K613
$$ plain form
2951 -1944 -302 1246 -211 -1850 -302 1633 345 -919 421 2233 708 -1746 -149 1649 116
2966 116 -2068 -1236 1678 607 -1713 -687 1955 1075 -1066 -652 1527 1158 -1489 -1273 1389 922 -1265
2983 -1265 -1170 1379 1433 -899 -1213 1093 1349 -1343 -1320 645 1395 -1406 -1398 795 1814 -213 -1522 866
3001 866 1813 -145 -1499 381 1561 -803 -2290 -241 1425 -339 -1566 281 1774 -73 -1411
3016 -1411 92 1906 515 -1642 -84 1568 176 -1797 -781 1528 405 -1273 -676 1800 1184
3031 1184 -1508 -1141 1113 978 -1104 -967 1293 1356 -1164 -1377 1448 1661 -1100 -1714 1022 1166 -1235
3048 -1235 -1549 1076 1532 -552 -1087 1232 2207 -231 -1475 680 1746 -712 -1806 131 1459 -686
3064 -686 -1705 -47 1819 -151 -1639 37 1865 246 -1512 -191 1549 136 -1684 -599 2014
3079B014j718j797Q13J881j000j884Q18K077n82j952O57K442l04k352N91J747
3095A451l11k182n2J873J80k339o4K483k2j690l68K099N86j863q71J749Q59k217
3113f99p69J598J259k043r09J454J649j541j566J934J503k052j697J376K091j727
3129a39j514J345K138j290j769J134J604j261j948P88K017j033j948J059K311
3144A494n90k111O44K478n73k055J71J914k89k524o4J997L08k308K72K280K96
3161A340j819m36K246L73k221n61J566Q08j970q97J926J110j911p54J642R76k112
3178f94q28J586J522j777j348K104Q20j213j166Q84J815j047j886P76J944j374
3194A18j756J042J685j013j501Q38J546K91k177O26J731l09k317j7J846j91j649
$$ plain form
3079 2014 296 -1501 -688 1193 193 -1691 -873 1204 622 -1330 -673 1769 1465 -887 -296 1451
3095 1451 1140 -1042 -1094 779 959 -1380 -1444 1039 1017 -673 -1041 1058 1644 -219 -1090 659 1518 -699
3113 -699 -1468 130 1389 -654 -1563 -109 1540 -1 -1567 367 1870 -182 -1879 -503 1588 -139
3129 -139 -1653 -308 1830 540 -1229 -95 1509 248 -1700 -912 1105 72 -1876 -817 1494
3144 1494 904 -1207 -563 1915 1342 -713 -542 1372 1083 -1441 -1505 492 800 -1508 -1236 1044 1340
3161 1340 -479 -915 1331 1704 -517 -1078 488 1296 -674 -1571 355 1465 -446 -1200 442 1418 -694
3178 -694 -1522 64 1586 -191 -1539 565 1385 172 -994 -110 1705 658 -1228 -452 1492 118
3194 118 -1638 -596 1089 76 -1425 -587 959 1250 -927 -301 1430 1121 -1196 -1213 633 442 -1207
3211a207l90K302M76k504K43K392N7k018n64K064L67j638q08J619J034k642m21
3228a638K286P22j761j076J951J063k048p31J702J085j696j401J694J226j233
3243A45j133J431J075j329j444R19J436r51j685J023J565r38j334R01J667l20
3259A028j833J21J947n82j947L32J711J19k045P5K011l7j601j90J607N39j733
3276d78l76J102P57j722o14K164N15j738r18J833R98j857j065J242J376j373j182
3293a336J758J073j258j228J172J328j466j586J470J318j249j725J256J865j301
3308I1j496Q60J862p48j757Q94J798p81j947N30J862l49k126O89J707l69j863
3325a143K76J723k38j700J69J452L58j511k53J609R24k026m06J399M93j628j272
$$ plain form
3211 -1207 -1597 705 1181 -1323 -1080 1312 1369 -649 -1213 851 1218 -420 -1228 391 1425 -1217 -1638
3228 -1638 648 1370 -391 -1467 484 1547 -501 -1232 470 1555 -141 -1542 152 1378 145
3243 145 -988 443 1518 189 -1255 -336 1100 149 -1536 -513 1052 114 -1220 -319 1348 1028
3259 1028 -805 -684 1263 681 -1266 -934 777 896 -1149 -1074 937 900 -701 -891 716 1255 -478
3276 -478 -854 248 1005 -717 -1331 833 1348 -390 -1308 525 1523 -334 -1399 -157 1219 -154 -1336
3293 -1336 422 1495 237 -991 181 1509 43 -1543 -73 1245 -4 -1729 -473 1392 91
3308 91 -1405 -545 1317 569 -1188 -294 1504 723 -1224 -694 1168 819 -1307 -618 1089 720 -1143
3325 -1143 -867 856 618 -1082 -913 539 897 -614 -867 742 1666 -360 -766 633 1126 -502 -1774
3342a774J615J235j659q11J469J114j340p41J209J216j365j793J701J137o74j863
3358a324Q54J677j216j369J196J429n79j780P18J670j064j440K66J936l26j786
3374a138L58J860m15j689L92J754j84j897m2K121m45j765n4K232j28j725l35K126
3392A026K09k006k72J659L66j715m90J275J096j722o85J629Q20j051j038J295
3408C96R79j482j102J004J348j234j172R34J374j106q39O38J593p54j624L67J551
3425H71l17j635K75J355Q7j642L69J571l42j424k8J621J2j627q5J620N44k319
3443a094J15J541M72j865p4J704J80j368q07J678O60j686o90J488Q20j352j297
3460a575K132M84j295j009J479J050j165r29Q54J018j219j035R74J156p68j236
$$ plain form
3342 -1774 -159 1076 -583 -1394 75 1189 -151 -892 317 1533 168 -1625 76 1213 539 -1324
3358 -1324 -470 1207 -9 -1378 -182 1247 668 -1112 -394 1276 212 -1228 -962 974 648 -1138
3374 -1138 -780 1080 665 -1024 -632 1122 938 -959 -1001 1120 675 -1090 -1144 1088 960 -765 -1100 1026
3392 1026 1235 -771 -1043 616 982 -733 -1223 52 1148 -574 -1259 370 1190 139 -899 396
3408 396 1375 -107 -1209 -205 1143 -91 -1263 -329 1045 -61 -900 -262 1331 577 -1047 -680 871
3425 871 554 -1081 -806 549 636 -1006 -637 934 592 -832 -860 761 773 -854 -939 681 1225 -1094
3443 -1094 -979 562 1034 -831 -905 799 979 -389 -1196 482 1142 -544 -1234 254 1074 -278 -1575
3460 -1575 557 1041 -254 -1263 216 1266 101 -828 26 1044 -175 -1210 -236 920 152 -1084
3476a084Q21J568q57j719J092J420q04j325M39J118l47j411N79J711n37j781P12
3493d05J517k47j623k13J145P82j785m41J735N01j656j33J296P49j566n95J536
3510E97L53j097j077J402J039j378j033J407P59j105j049J604Q82j435r91J076
3526d6J277j211j618J609J267q88j369O84J366n74j352M60J454q59j635R74J478
3543A017n97j265L64J637k77j619J32J751l03j555j54J378J10j458l0J264J74
3560E69j087m74J563L30j540k60J692N4j230q27J607O63j420n81Q78Q74j106r15
3578a210J131R68p39j189J219R74j106j129Q00J515q34j474J062J140p88j412
3594a072L95J525o30j385O63J468j59j828L20J906l84j447k50J932o3j942K57
$$ plain form
3476 -1084 -263 1305 448 -1271 -179 1241 437 -888 -449 669 322 -1089 -510 1201 664 -1117 -405
3493 -405 1112 865 -758 -971 174 956 -829 -1270 465 966 -690 -823 473 1222 -344 -939 597
3510 597 950 -147 -1224 178 1217 -161 -1194 213 972 -133 -1182 422 1304 -131 -1122 -46
3526 -46 1231 20 -1598 11 1278 390 -979 -295 1071 497 -855 -395 1059 200 -1435 -461 1017
3543 1017 420 -845 -481 1156 879 -740 -608 1143 840 -715 -869 509 619 -839 -869 395 569
3560 569 -518 -992 571 901 -639 -899 793 847 -383 -1210 397 1060 -360 -941 -63 811 -295 -1210
3578 -1210 -79 889 150 -1039 180 1154 48 -1081 -281 1234 400 -1074 -12 1128 340 -1072
3594 -1072 -677 848 218 -1167 -504 964 805 -1023 -703 1203 819 -628 -878 1054 991 -951 -694
3611f94J249M12j694m42J907J71j720j91J662J52j441j19J347M40j327p06J519
3628E25M27j198j011J241P56q21j152J275Q68o15j155R43J166j119j035O37J015
3645G47m00j228N27R66k49j288O44J088o07j159N02J619n13j457L07J243J07j802
3663i53J16J409Q0j149k99J837k6j829KJ295J42j316l71J331R06j636l02J273
3681E10M04q67j122J211J105j518q56Q31J193j147q85J474L98l19j241J036J337
3698A544j236j247O88J408p59j462J006Q99o64j200P70J361o81j290O12J027m39
3715C37j141L36J274l0j862N02J176K57j526o3J322K74j530k04J452J75j273m79
3733a003J396O09j342l99J335N86j370j014J334M83r40r32J300N64p65p79J096
$$ plain form
3611 -694 555 967 -727 -1169 738 909 -811 -1002 660 812 -629 -748 599 1039 -288 -994 525
3628 525 952 -246 -1257 -16 740 -81 -1233 42 910 295 -860 83 1249 130 -905 -268 747
3645 747 347 -881 -354 612 363 -925 -281 807 200 -959 -457 1162 649 -808 -501 742 849 -953
3663 -953 -837 572 652 -497 -796 1041 1015 -814 -812 483 625 -691 -1062 269 1175 -461 -763 510
3681 510 914 47 -1075 136 1241 -277 -1133 -302 891 -256 -1141 333 731 412 -829 207 1544
3698 1544 308 -939 -251 1157 398 -1064 -58 841 177 -1023 -253 1108 427 -863 -251 776 337
3715 337 -804 -468 806 776 -1086 -584 592 849 -677 -740 582 856 -674 -878 574 749 -524 -1003
3733 -1003 393 1002 -340 -739 596 1182 -188 -1202 132 615 -325 -1257 43 607 -158 -937 159
3750A59J046r94p60N50J117j044j204O87J268q04j026L91J210K89j582L91J271
3767I65m00j416M54J389n96j373M94J173k07j277L77J159n18j088L24J050J88
3784F98j250m63J227M73j303j44J571L3j222k07J086K65j144n05J025P03j163
3801c20r55J071Q67j095m10J139N79o54j345J025R26j063o23O88P45o32r15Q94
3819g8P41k73r82N31J082n96j252K45J298l1j192j2J373m96j004M8J298J07j376
3838e69j25J300L42j506j00J506Q2j290j83O76Q53j377m79J527N16j545l93J022
3856B57M24p83p44Q60Q86r51j013J274R14j020q69Q00Q69p59j099R56Q76p22r38
3875g82Q04Q84p86j128N50J232n17r60O36O72m50q48P36N64n25r98M30J280k51
$$ plain form
3750 159 1205 211 -549 1 1118 74 -1130 -443 825 21 -1005 -614 596 885 -697 -306 965
3767 965 565 -851 -397 992 396 -977 -483 690 483 -794 -417 742 224 -864 -540 510 698
3784 698 -552 -1015 212 685 -618 -762 809 842 -380 -587 499 764 -380 -885 140 843 -320
3801 -320 -1275 -204 663 -432 -842 297 876 222 -1123 -98 828 -235 -858 -170 575 -57 -972 -78
3819 -78 663 390 -592 -61 1021 425 -827 -582 716 685 -507 -519 854 358 -646 -598 700 807 -569
3838 -569 -694 606 948 -558 -658 848 930 -360 -543 133 986 -391 -870 657 1173 -372 -765 257
3856 257 681 -102 -846 14 900 -51 -1064 210 1124 104 -765 35 904 145 -954 2 878 156 -782
3875 -782 22 906 120 -1008 -458 774 257 -703 -67 605 155 -693 43 607 82 -916 -486 794 543
3894E43j175o8J440j6j101l27J238K63j067m16J041L90j106k58R99N58q33r20
3912h15P41Q31p23p60Q94L20m63r27P52P49n91q42J139O10o56j260R07Q34q54
3931a14j075J020Q26m14j288Q42J102o87q62J42J255k66j106M10R65k21j337j2
3949h20J589n49r66j6J415R5j036l3R38K18j103l91J060K03j276p9J218J84o43
3968Ho72R71N82r81m71R28M41q49j049Q82J068j016p83J056Q90q63p60N10Q93
3987G85n04j183L72J367p13j027O89R65k57j371O28J009J04j253k64J193L23j588
4005g25R5J353r2j183J00J320jj174k33J229J37j215m79J183K00j168j61J157
4023C43K44q05m62J085L23j321NN61Q45j449k47O75Q52n59p63M79Q04o17p31R47
$$ plain form
3894 543 -632 -700 740 724 -377 -704 534 797 -270 -686 355 745 -361 -619 380 938 105 -815
3912 -815 -74 757 34 -726 168 488 25 -902 -150 599 8 -834 305 915 259 -1001 -94 740 -114
3931 -114 -1189 -169 657 243 -1045 -203 899 212 -650 -508 747 481 -625 -215 750 529 -808 -820
3949 -820 769 220 -746 -762 653 748 -288 -321 617 835 -268 -659 401 604 -672 -751 467 651 8
3968 8 -664 307 889 -92 -563 365 806 -43 -1092 -210 858 -158 -941 115 1005 142 -618 -108 785
3987 785 281 -902 -530 837 124 -903 -214 751 494 -877 -249 760 864 -389 -653 540 863 -725
4005 -725 -630 723 631 -552 -452 868 867 -307 -540 689 826 -389 -868 315 515 -653 -814 343
4023 343 587 -218 -680 405 728 -593 -588 -27 818 -631 -878 -203 649 90 -673 -194 610 -7 -738 209
4043B09O96p51p09K43P75j00p34K27Q22k61j098N16J038j42j392J56J414l68j137
4062e96PJ070R0j064Q2N61M73j033J26O89L66r26p38J155L17j093j25Q04P52q63
4082E4r94J440j0o17r30J016P95q62p34P46P86n71r21P45P73m60j135J153L94
4101F68m25r49L15J042n36r29P07O93m14p54K87P19J7j076K00Q37k24o69l4Q27
4121C02M50j243K59J035j2j078k69J045l3o23k85P83K93q75n13J082L36p89l08
4140d43Q84K46q26r61J323Q27j139o87P23O30n91k58J75J074q79q16O04J183p39
4159C30j125O07P67r5j202N89R85k93j476N26R93j34r72l38J500l49p90j45J163
4178E41L7q77j70Q22K46q97j22P36J96m79n72Q99L85q18n41J010L96j175m0O94
$$ plain form
4043 209 905 154 -555 -312 463 363 -371 -144 678 417 -681 -165 873 731 -661 -505 909 541 -596
4062 -596 -589 481 571 -493 -411 150 623 -410 -284 405 771 -155 -893 262 579 -514 -639 165 917 54
4082 54 -940 500 490 -127 -1057 -41 754 -108 -842 -96 690 119 -802 -57 716 256 -879 274 668
4101 668 243 -706 -391 651 115 -814 -107 586 172 -582 -295 424 441 -635 -435 402 178 -491 -525 302
4121 302 752 -491 -232 803 791 -287 -556 489 456 -167 -452 331 624 -251 -764 318 654 -135 -443
4140 -443 441 687 -139 -1100 223 1050 -89 -776 -53 577 -14 -272 -97 977 98 -718 -114 1069 330
4159 330 -795 -188 579 484 -718 -129 856 563 -913 -387 606 472 -500 -838 662 313 -477 -622 541
4178 541 578 -299 -469 353 599 -298 -420 316 512 33 -539 360 745 -73 -614 396 792 -383 -423 271
4198B71P5p21k49Q67K71k69j132J063N05r97n1J35O73l34m93K14P44n26n37N86
4218I5M93l09j425Q23Q88k90j061N22J193k90j005n5Q61K4j139m6Q64O27j466
4237f96K27P77J23p76k48Q49K47q27m07J538M1r33m83O84L24r51j99Q51O55r10
4257a14o29J013M83q26o29Q93L29m51j139J025P40l20r60N91P58q20n35J53Q69
4276D31l53q97M20Q72l8p66J69J009k45j124N42Q07m24m79m30P88J53j330K76
4295f19J065j16n99J15O27J85j111j99R13M77p58p73P92M27n55o24P62Q92o56
4314B45p11N63O63o99n53L53R34q47o74N08P23m19q42N58R36p21o82O23M70k50
4334A78p89K96Q54l38o07L83P31j90r63J08P63l5q23k28J302k00q90k29J125r2
$$ plain form
4198 271 346 -375 -624 243 514 245 -887 176 681 -316 -367 -232 441 107 -386 -172 572 46 -491 95
4218 95 588 279 -1146 -323 565 275 -786 -264 929 639 -366 -421 440 464 -675 -721 143 770 -696
4237 -696 -469 308 431 -345 -593 256 503 -324 -731 807 848 -85 -568 116 440 -511 -710 141 796 -114
4257 -114 -743 270 753 -73 -702 191 520 69 -1070 -45 695 375 -585 6 764 -56 -591 -438 431
4276 431 78 -819 -399 473 435 -331 -162 847 602 -522 20 827 403 -76 -506 282 435 -895 -619
4295 -619 446 330 -269 -154 473 658 -453 -652 261 738 -20 -793 -1 426 -129 -753 9 901 245
4314 245 -466 97 760 61 -492 -139 795 -52 -726 -218 505 86 -756 -198 738 17 -665 -42 428 178
4334 178 -611 -315 539 201 -406 -23 708 518 -445 -337 426 391 -432 -660 642 442 -448 -677 448 356
4354C56o40j32O56K33q60j06Q70Q8r82L08O22P3o00m36J055K48q75n07O27P65
4374G63p30p51O94P35q77o20P06J023q28n62K50Q89m02r37K00J012m14p06M81
4393g4L95J09q72J69J037l12q09k3J075k48j008L52L75O49j428J82O02L72p79
4412b36mN75L23p57m58P03N35o48l41M64L17p14k39R11K90p85p51R37K22m43k11
4433c10K37L04l65o55N48M15k50l90M70M77m42m00K18O69m67n47M67K40J49r98
4453f30N62M08J18p54J11N45P2q98J5Q65j33p56R6P51J10p30k19P51p6k24j70
4474a86M74J53r38k84P22P87r67k55J077Q7p21p24Q54N69o56p52O44O90m58n70
4494d54L78O17o87k66N24K83m36k26J04N80l1j151M10P08k6o04l8O89k41p82M17
$$ plain form
4354 356 -284 -416 240 473 -387 -493 377 465 -517 -209 413 486 -114 -550 505 753 -122 -629 -2 763
4374 763 33 -718 -24 711 -166 -786 -80 943 115 -447 -197 692 290 -647 -447 565 151 -555 -74
4393 -74 321 430 -442 -273 764 452 -357 -380 695 447 -561 -209 166 815 -613 -431 171 543 -236
4412 -236 -240 335 658 -99 -557 146 681 33 -308 156 473 -241 -480 431 721 -64 -815 122 344 -99 -310
4433 -310 -73 231 -134 -789 -241 174 -76 -466 4 481 39 -361 -143 526 59 -488 -21 219 368 -630
4453 -630 -68 340 458 -296 -185 360 432 -466 -451 414 281 -475 -379 372 482 -248 -467 284 208 -16 -186
4474 -186 288 441 -497 -781 -59 728 -239 -494 583 670 -51 -775 79 648 -8 -760 -116 574 116 -454
4494 -454 -76 541 -146 -412 112 395 -41 -267 -163 417 386 -765 -355 353 327 -277 -315 374 133 -649 -232
4515b32O88L2r29j17Q71j93m47P8N47M27j199K12M52J79o89k70Q21R1k92k98L87
4536A19L86m34n22L14R02o73o17N20K13J01p42K65O49n12l27J19Q01m93n72L55
4556a48M63k57o79P21N82k66p57J25N58l28q81O20L88K94r44K76N42q0n53n8R01
4577E19j68j051K36P23k48j90l01P15M02j002LQ70R6n46l10O44J04o30j83N05
4597A88M81q03k26L47O62l14q87K34Q13m73n89K90Q75p82k10K86M02J0m04R4N43
4618E37k27p37K16O52m09p26J34P85N29j224J05P80K22j065L84N27k0r88j55Q99
4638B19j5n77k50Q94J55p03j42R31J27p96l80Q59K33o18j17Q1N15r49K59K83N46
4659E55o07l72M30N11m46j052Q93M79j73o74N18J92r9n41K78M70m41l25n5Q30
$$ plain form
4515 -232 456 488 -441 -558 313 120 -327 -249 298 725 -474 -262 190 369 -320 -590 231 322 30 -268 119
4536 119 505 71 -451 -137 765 92 -525 -5 208 309 -433 -168 481 -31 -358 -239 562 69 -503 -148
4556 -148 315 58 -621 100 682 416 -341 -216 342 14 -867 -247 141 435 -509 -233 309 229 -324 -382 519
4577 519 351 -700 -464 259 11 -179 -480 235 637 -365 -362 508 604 58 -252 392 496 -134 -317 188
4597 188 669 -134 -360 -13 649 335 -552 -318 495 22 -567 -277 598 -184 -394 -108 294 304 -100 -6 537
4618 537 310 -427 -211 441 32 -694 -560 225 754 -470 -365 415 637 -428 -44 483 463 -525 -680 219
4638 219 204 -373 -623 271 426 -277 -419 512 639 -157 -537 322 555 -63 -180 -99 416 -533 -274 9 555
4659 555 -52 -424 6 517 71 -981 -88 391 218 -456 62 254 155 -386 -108 362 -79 -404 -459 371
4679C71l31m02j12P12j1n56L52K94j04q19J81P95k07r36O87K75J13n05k41Q45
4699D01m6o05k80R60k15n19LL19L01l68k82K11M41k25n16N00M81q73n9N85L93
4720F07p73k96L66L81J68q19O44j73J27o09L72O09l13j021O43K94q5l28k69J185
4740G10k47p66L33K09J54n88N5N30j18o57L49M58k84m94j80Q21q1o10n2O53P6
4761B71m97k05P27K69m64n08O57K18m53o04L36M67m94OL35L91k62p12P78M06n60
4782A02l06K94J59J01j034L75O21q1p97L76N38r9o35J86P21k51n32j98O73M96
4802G09q09j20P07j54p15m3M32K84m47l58M57M23p87o0J069j63n92R0L80L37p49
4823a09k42M76Q9p21qM71M68m68l70O54L10o49k35N65K13k82o30K42K32L91o75
$$ plain form
4679 371 40 -362 -474 238 227 -329 23 317 213 -606 -425 370 163 -773 -86 189 302 -203 -444 401
4699 401 355 -250 -530 430 215 -304 -301 18 319 -49 -331 -120 321 96 -420 80 561 -312 -371 214 607
4720 607 -166 -462 -96 285 453 -366 278 105 232 -377 -5 604 291 -730 -87 207 122 -206 -475 710
4740 710 463 -303 30 239 393 -195 -140 390 272 -385 -36 422 138 -356 -536 285 204 -406 -458 195 271
4761 271 -226 -431 296 565 101 -407 250 468 15 -589 -253 214 -280 -274 61 452 190 -522 256 662 102
4782 102 -204 90 249 350 -684 -309 312 231 -566 -190 348 249 -386 -200 521 270 -262 -460 213 709
4802 709 -100 -220 487 333 -382 -425 7 291 -156 -514 -57 366 -421 -481 588 425 -167 -77 303 640 -109
4823 -109 -351 125 214 -507 -515 -44 424 -44 -414 240 550 -99 -334 231 444 162 -468 -226 6 397 -278
4844b78J36O02j30n77J65L46j81m94j57N99L19l90l55N63J16m67j89N81K11p26
4864c06J34K48K57o12k34O00L25o12k50M90M05m09m84L86O95o15k91K35K5l11
4884c24q1L52K97Lp19M55J36Q3o91N25J15l56n42M82M32l02m20L44O55Q0r01L89
4906A2L25j04o84k07Q63M6k21l09O09j66l95QL73J30m31l38N26J00m10N8K16J14
4928A15n8k11L67J64m85k90O21L68o20l08K47O79o54l28K02O8M13n48R5O89l79
4949A47m74J85M40l54p62M70P11l04m48Q8P79r5p02K63M55j06o55n6Q14l60j66
4970a30K4M81l27l78J91M66r4m06K15J97K6n66o8N70L77o35n63Q03J30n18L60
4991A55N6j39l5n52M08L88j96l71J3Q07m15l20K33L30k46o33O78J45k94n16L34
$$ plain form
4844 -278 -142 460 330 -247 -82 264 83 -411 -568 31 350 -40 -395 168 284 -183 -372 209 420 -306
4864 -306 -172 76 333 -279 -513 87 412 -200 -450 40 445 36 -448 -62 633 18 -273 -38 -13 -324
4884 -324 -405 -53 244 247 -472 -17 119 202 -489 36 151 -205 -747 -265 167 -135 -555 -211 444 524 -377 12
4906 12 337 233 -451 -658 205 251 30 -279 330 164 -231 -223 150 280 -151 -489 37 137 -273 -215 1 115
4928 115 57 -154 213 377 -108 -398 223 591 -29 -337 -90 589 -65 -393 -191 -123 290 -258 -163 526 147
4949 147 -327 -142 298 -56 -818 -348 363 59 -389 -301 478 383 -319 -56 399 293 -362 -418 396 36 -130
4970 -130 -106 375 48 -330 -139 327 233 -173 42 239 265 -301 -369 201 578 -57 -620 183 313 -205 155
4991 155 211 72 37 -515 -107 281 85 -286 -273 534 119 -201 32 362 116 -517 161 306 12 -504 -170
5012a70J65n5l10J45O87l79l08J31N62o4n97j68N75J01n90q3O28k27j35jN49l
5034D53q74j92J012r2l49l77P59k01k91K6K93O3l81j22M20K77m99k11P03r2m20
5055i5l89N47K01k70k25M66J44l90k31J92N53o91l19M58L68k22o61M00M95j76
5075A55o34K71M18m0p84M55N53l41m97J19P51o1m91j38P22q2l38k90M03J02k06
5096D7k90K74K9j63j9L14M01q19o2M19L42o79j92N19L51o31j19L86J24k19o11
5117e98O37K49k14l89K73M40j8n31k04P56o07n4K71m1J87q41P42O00p79m4K17
5138E2L23M3n59r3L08j34m99K91O51K74o55k40K57K69p74K93L55J73n91k91Q23
5159B76q4l17l04P29j30M7m49N50J38n46m69M67J70N1p80O41K92k48k15J74J59
$$ plain form
5012 -170 -5 -60 -370 -225 462 83 -225 -94 468 404 -193 -361 214 315 -275 -358 270 43 -92 -93 456 453
5034 453 -421 -613 399 307 -42 -419 340 139 -152 -126 167 230 -151 -273 147 424 -75 -286 417 325 -95
5055 -95 -484 63 264 -6 -231 235 379 -11 -242 -50 503 -188 -507 -49 319 97 -564 -164 331 155
5075 155 -479 -208 210 170 -614 -159 394 53 -444 -325 426 365 -126 -264 458 376 38 -252 151 253 47
5096 47 -243 31 60 -103 -122 192 593 -226 -288 131 473 -206 -398 121 472 -159 -278 108 232 13 -598
5117 -598 39 288 74 -315 -42 398 380 -151 -355 401 -206 -260 11 -30 157 -684 58 658 -121 -165 52
5138 52 375 418 -141 -234 74 -60 -559 -268 383 657 2 -238 19 288 -486 -193 162 335 -256 -547 276
5159 276 192 -125 -429 300 170 217 -232 318 456 -90 -559 -92 78 129 -651 -10 282 34 -181 -7 152
5180A52J51o56N34jK4o27r9Q37j76n30L38J18Q3m74P8L33J65n84J13O47m89j76
5202b39p8M20J04k17n3K87J67n52J83Q7L67p22O5K12M62n46j89O21k08j52o09
5223e90N68J61O6l78K68K01m62l33O14L06n58j71L73l3L91l48k74L19J4j77l38
5244c81P60o3n26J08L51L7n76o5Q61n23l97M67L59n44J23k30J91J53l15KN20j36
5266A76l49l48Q36j42J2n06K12K28j51j53L83L37n77k84L64M33n06q1k0N09k82
5287I1m74L35M06j25p07M00K97j27j34l56Q35k35m31O9K93l10l7R2N95p8p39J06
5309b34N06o2n15R6K11J08k67qK26J98p19J54N91P3l53l88L63L85k48m99L45J12
5331G5k69j55L78M7k5m61K32P51n61k32K74M11n64l65J95P36m36j95j32M48J14
$$ plain form
5180 152 303 -353 181 180 204 -423 -522 315 139 -391 -53 65 148 -326 -248 85 250 -334 -221 426 -63 -239
5202 -239 -317 103 207 -10 -63 224 391 -161 22 109 476 -246 -181 31 493 -53 -242 379 171 19 -590
5223 -590 -22 139 205 -173 95 296 -166 -499 115 421 -137 -308 65 32 423 75 -199 120 134 -43 -381
5244 -381 379 316 -210 -102 249 286 -290 -355 506 -17 -414 53 412 -132 -9 -239 -48 105 -210 -208 312 176
5266 176 -173 -521 315 173 185 -321 -109 119 -32 -185 198 535 -42 -326 38 471 -35 -116 -136 373 91
5287 91 -383 -48 358 233 -474 -74 223 96 -38 -394 441 206 -225 -156 137 -173 -210 -118 477 399 -340 -234
5309 -234 272 210 -305 -209 2 110 -157 -165 61 259 -460 -306 285 358 5 -383 -20 365 117 -382 -37 75
5331 75 -194 -349 29 76 51 -410 -178 573 12 -220 54 465 -99 -464 -269 467 31 -164 -296 152 266
5352B66l66r0K93L1m84K30L07N9p78K67M86l43k46K58M78l3l78K4J75K6l71k44
5374d33O77Q3p12L24K87o4n44J83M15k0j62n33N05L52o39M7K35J85k05o6K73J80
5396C68j21l93J82N8O7k51J8L65l28l23L39M41o00kJ05J45o1m85K83K36L00o38
5418b95J38N98k02l64k84N11K23m17j64K77R3k00j57L75k13J95l82L29J83j37
5438A07k32L35K6l69j80L30J33J3n62N27M19q21R8J48K50j09m19J82L93j3n35
5459b79J35L70j99j66j42R25o56k04J73M38m62j78P5K00j06j25m4M18K46n57k4
5480a62O35k20k75m11O03K44q27J35M63j33m41M40o1J6j54k56N17Rl98j84L67
5501i3Q7o4L2P5J49j98l35L35L25j28m75L03K70r5o54M54J73j31j94M35r0l3N7
$$ plain form
5352 266 -100 -190 103 134 -350 -120 187 246 -532 -265 221 -122 -368 -110 368 335 -43 -19 156 182 -189 -433
5374 -433 244 327 -385 -61 226 162 -382 -199 216 196 34 -499 6 358 -281 -234 1 186 -19 -85 188 368
5396 368 247 -146 36 94 161 -90 -72 293 -35 -358 -19 422 -178 -180 -75 70 9 -476 -193 43 343 -295
5418 -295 -157 441 239 -125 -409 102 325 -92 -256 21 114 -86 -243 132 -81 114 -268 61 244 107
5438 107 -125 210 236 -133 -313 17 150 163 -399 128 547 -274 -176 -28 222 113 -306 -124 269 256 -279
5459 -279 -144 226 27 -139 -281 644 -12 -216 -43 395 -67 -245 -170 30 -76 -201 -245 173 419 -138 -162
5480 -162 473 253 -22 -433 170 414 -413 -278 185 52 -389 51 -10 6 -148 -404 113 122 -276 -460 -93
5501 -93 -6 -70 -38 37 186 -12 -347 -12 313 185 -290 13 283 188 -466 -12 161 30 -164 271 181 148 205
5524B05k74K79n0n84K60L83j23j72ML92o8o04L12L59o2l27k17P37k42p39L83N29
5546C81q3l53k37M38J25l46k70J06O91m80l42M18J64k01k97O4K82J03n68L55M81
5567D31m49k65M05O2j64j53J93J00p4l80L67K50k24k81K25K43j58o1j72J48J33
5588A76p89M70L72j82m24L50L41j98n21L13o3K00j73O6K36J3l14k4J20J69Rj62
5610a5J99m0j46l64O23r2k23l0J44K63m97j49L83M00n87j40L80j4q4l46K61K06
5632A32j29j66K32J70J17l45j75M65l6o05J09K77rl01J74J48L30o83J30L90O8
5653B93k09l34J51L51j45l77K86K36m19K71J48l0m58j53M36J0l34j77L60M08k67
5674D7l86K05Q0l5j64J73L49j15k79k72O58k49j54L93n8L4n02j68N96m10k3M42
$$ plain form
5524 205 -69 210 160 -424 -164 219 96 -76 -72 320 252 -352 -40 319 257 -70 -287 450 208 -531 -148 381
5546 381 298 -55 -292 146 271 -75 -345 -239 452 -28 -370 48 212 11 -286 -222 60 163 -405 -50 431
5567 431 -18 -283 122 184 20 -133 60 160 86 -294 73 323 99 -182 43 286 128 67 -105 43 176
5588 176 -613 -143 229 47 -377 -27 314 116 -405 -92 -155 45 -128 -62 174 187 -127 -151 -31 138 147 -15
5610 -15 184 144 -2 -366 257 165 -58 -88 56 319 -178 -327 56 456 -131 -271 109 95 11 -335 -74 132
5632 132 3 -163 69 239 356 11 -164 301 265 -340 -231 46 37 -264 -90 58 388 -295 -165 225 293
5653 293 84 -250 -99 252 107 -270 16 252 -167 104 252 222 -236 -389 47 57 -277 -454 -94 314 47
5674 47 -339 -134 -54 -89 -253 -80 269 154 -125 -397 261 12 -142 251 193 227 -275 -443 153 -257 -280 162
5696A62r5j37l70L66M88ro94J19K16M3o4j83p1L65m89J25M19K22n86l8K30J97
5718B16m32p9K42K1j7o4K30jo4K26l87J60r5k6o9J75J09n16K62K96j32m49M99
5741A05Q5k14J8k9K50l58j69o7L03M4k17k7L74J08n26L5L22Q9m72L09J04L0j82
5764h5l7L29K2n91J34N29j0k72L7O4M6k28N6K05J27n31K12J41M0n36J7N57k74
5787d8K75l69K17K60l23p2K1J76P9j99n4K57k35l26N41k37j06J8j17L23k78K11
5809A4k19L39Q8m59K63J20J30n77L59J13O1m34j6M10J22n69J62M05j3l87k12L08
5831Hq2n2k21K30L84k43l7J04K58j07k08k5L95n51j08L01Q0k41r4K74N17n67n9
5854d4j50L21M9m71P5L65p6k16RK81m3L8J7k32J42k14j79N66l04j0J11q6L27m97
$$ plain form
5696 162 67 -70 -440 -74 414 405 -289 -170 46 89 25 -158 -229 136 -353 -228 191 413 -173 -211 19 216
5718 216 -216 -295 -53 -32 -49 -113 117 116 52 278 -109 51 -44 -70 -139 36 145 -371 -109 187 55 -394 105
5741 105 190 -24 -6 -35 215 -143 -312 -379 -76 -32 -249 -276 98 206 -320 -285 37 126 -346 -37 67 97 -85
5764 -85 -122 207 229 -362 -228 301 291 19 56 120 166 -62 -6 199 326 -205 7 148 188 -348 -331 226 -48
5787 -48 227 -142 75 335 12 -60 -39 137 216 17 -37 220 -15 -341 200 -37 -143 -125 -242 81 -197 14
5809 14 -205 134 222 -237 26 146 276 -301 58 171 232 -202 -218 192 314 -255 -93 312 299 -88 -300 8
5831 8 -74 -126 -347 -117 267 24 -13 91 349 242 34 9 404 -147 -255 46 126 -115 -209 65 582 15 -44
5854 -44 -194 127 176 -295 -220 145 69 -147 -138 143 100 138 155 -77 65 -149 -328 238 -66 -76 35 -51 276 -221
5878b21J07P6M09l97m5R5K56k95k72N12q6l42L31k2r7m5J06l4m1j90K58j98K82
5901A47m1m45O02k80J48m28L56J60n3n48M50K11j43l59q9N72k94l50K59J95K72
5922C42r60N44M89m58k50J33L42j86p4j27K75o4j23k34L02K5j36r4N34q8J14l15
5944iP9J9l94pL90l5J10k07R8k21K01j91N6L69l18l47R1M71k2k99K11K96o20M2
5968b37j45J81K52j83J86j3R7l22k5M43k3l96Q7L69l60M0J56r2K01k37n9J84J64
5991B68m92K58k04K02l28K45j6P6j45J11L14j27j87q2M26j78J75m49jL06m70L73
6013G5j55K84o2m76L81j46N4m39O51o1j62l61M10L16j42m46N93j46j98k68Q2K62
6035D6O5j17P0Q3j31j92L12j46M30n20J45J61J06l15k37O62l53k28K00J42O7k48
$$ plain form
5878 -221 -114 -38 371 -26 -71 24 280 -15 -287 225 139 -203 128 106 9 -36 70 36 -5 -195 63 -135 147
5901 147 106 -339 263 -17 131 -297 59 219 166 -382 68 279 136 -223 -312 260 -34 -384 -125 70 342
5922 342 -618 -74 415 -43 -293 -160 182 -4 -78 -205 70 6 -117 -351 -49 -24 -160 -254 280 192 306 -9
5944 -9 70 89 -305 -312 78 43 153 -54 44 -177 24 -167 -111 258 -60 -407 -316 155 133 -166 45 341 -279 -237
5968 -237 -382 -201 51 -132 54 41 138 -184 -209 234 211 -185 -98 271 -89 -49 107 15 216 -21 -80 104 268
5991 268 -224 34 -170 32 -296 -51 -67 9 -136 -25 289 162 -25 -107 319 141 316 -133 -134 172 -298 75
6013 75 -80 204 142 -334 47 -99 -45 -484 167 106 -56 -417 -7 309 167 -279 314 168 -30 -298 -216 46
6035 46 111 -6 64 147 16 -176 136 -10 420 -100 45 206 312 -3 -240 422 69 -159 41 183 250 2
6057Bk62M66J4k00j5j50J89K2l54J56M58j70m92O76j66j31m49L11L56o34N68m84
6079b89N87Q1n57J35J88j98n5J14J68J48k12l62L81j09m33K77L19j03l12J88K91
6100B47q5l2l18j3K03j54l05M61J36j87r3p0L11k46J65l94L12K0j45p9N65k94
6122Ej40j84O69n23K97J2j21j00l75P03m2j76l47L95N7K7j69k32J95M31p92L87
6144b3J66J03l49J40J40P6k15j43J40p1Q2k79K61J46k56L3n3J97q4l06M67l8k04
6167g0k16L46J8k5o2M1N2J11j13k25M68k93j28J55J01r4m7ml8J35l76K60M0L4
6191G0j84K34j61k2o8K34L73m06n33L19J81K15j99j70J98k47O5j97L93j9k73P2
6213a25K01L3r0j98N8N69k77k45m7K24l18q3R0K58l91L08j46K54J73j21o5J07
$$ plain form
6057 2 -260 206 220 20 5 -145 44 66 -288 -132 326 156 -336 340 174 43 -406 -95 261 -373 195 -289
6079 -289 298 379 -178 -43 145 -53 -108 6 174 322 110 -252 129 20 -413 -136 183 80 -232 -44 247
6100 247 162 130 -188 -201 2 -152 -457 4 140 -47 -140 -210 101 -145 20 -374 -62 -42 -187 -266 299 5
6122 5 -135 -319 350 -173 124 136 15 -85 -460 243 201 25 -322 73 130 157 -12 -244 -49 382 -410 -23
6144 -23 143 246 -103 37 177 253 38 -105 35 -36 46 -233 28 174 -82 -49 -102 95 11 -295 172 134 -70
6167 -70 -286 60 78 53 -9 32 84 195 82 -143 325 32 -96 59 160 66 19 15 -23 112 -264 -4 36 70
6191 70 -114 120 -41 -63 -131 103 476 70 -463 -144 37 252 53 -117 81 -166 -101 -298 95 76 -197 -125
6213 -125 76 109 19 -179 -121 448 171 -74 -121 103 -215 -298 -208 50 -341 -33 -179 75 248 127 62 169
6235A69q6o2o9L54m58j46L9N51j35k57k25N07j04J71k57QO6J68l91J07r1J3MK26
6259A02l4j85J99q1R1m52O43l61K85k57l17J97J89k80L41kJ87k97p0p8J18n8K61
6282A41k81j16K03J21j06K58j12l42K45K68k92j58L94k17j71P5n2M44j56j61N
6303a0M06l40l53N42m47m4L00k09M45l02l30J37M06l3j25k57J76K93k18l09M84
6324B12r3o5k02L02Rl41q4J85J72k87J68p9L71l65n1J02j5j38j87M62N1j24l4
6347c1J46q9Q2j7j79K58Rj03k19N24k88n26Q7K59L57j88j36J17L1p5J0J61j62
6370B8j71K47J94j29k00k8p8K76k52K0J69q2q9K52k09J52o1j13%J92l10j39K35
6393i6L78n45J68m4L24l78J58K69k10j62L1m5L0r7j48L99j76P9k89N30M8nl60
$$ plain form
6235 169 83 21 -48 306 -152 -298 -259 292 157 -100 -325 182 78 249 -8 0 66 234 -157 -50 -141 -128 -124 102
6259 102 68 -117 82 1 92 -360 283 -78 207 -50 -367 -170 19 -261 80 78 265 -32 -102 -180 -62 -120 141
6282 141 -140 -256 -53 68 -38 220 108 -234 11 279 -13 -171 223 6 -165 -90 -142 302 146 -15 -10
6303 -10 396 56 -297 245 -202 -246 54 -155 290 -12 -342 -205 201 168 43 -214 -38 255 37 -272 212
6324 212 119 54 -148 154 163 -178 -262 -77 95 -192 -24 -103 268 -97 -148 -46 -61 -199 -386 76 127 3 -31
6347 -31 115 26 108 91 -88 170 179 76 -143 381 93 -433 -346 -87 270 82 -54 63 94 19 29 190 28
6370 28 -143 104 298 169 -31 -59 -137 139 -113 -93 76 -6 -95 157 -52 100 39 -74 -74 118 -192 -331 -96
6393 -96 282 -263 -95 -139 185 -193 -35 234 24 -138 -107 -152 -122 -219 -367 32 -144 -65 -354 176 224 219 -141
6416a41K14m5J83oo11L98J70n60O9M57J0n33L37K02j60j17K6K63J09k85M4M04
6438D28j79j42k45R3O8l4l28N11o5k5k63j6J95q7k93K91J40l7J60j27K84m15R6
6461A0n3L9m2k03J62K87n26K20j36K88O7k36j54L32J6j50j55N00l68r7K44N0J92
6484B87l31l35N44j41l4j93J43J84j66k63N05l8l81Q5M18j88j85J78p0L0k44K05
6506A0k4J84j95l95L08K01l02J72K14j73k29j01M01l0J0k69Q3K25j15m30L86J69
6528A00jj40m8K15j76m20L32J04J35k57j4K57m4j37K95M6k45K34l24J05K75l24
6550c2m26N18K2k8j70J98J20o9m29M85O0o6l60M21p3j30k97L08q0J92j07k41L79
6573A95l07j0j53O25k63q3q7K83l1n5n1o8L6j88K90l1L2n05K32L85p7k83K70K76
$$ plain form
6416 -141 73 28 211 205 -406 -8 162 -398 -329 128 138 -395 -58 144 -16 -133 -107 156 265 -20 24 428
6438 428 249 107 -138 -45 23 -11 -339 172 107 82 -181 -197 -2 -89 -382 -91 49 12 172 45 329 -86 10
6461 10 -43 -4 -46 -249 -87 200 -326 -106 -242 46 113 -123 -277 55 71 -79 -234 266 -102 -199 45 95 287
6484 287 -44 -379 165 24 -10 -203 -60 124 -42 -305 200 162 -219 -134 284 96 -89 89 19 49 -195 10
6506 10 -14 170 -25 -420 -112 89 -213 -41 173 0 -229 -330 71 41 51 -218 -135 90 -25 -455 -69 100
6528 100 99 -41 -89 126 -50 -470 -138 -34 101 -156 -170 87 43 -94 201 247 2 236 -88 17 292 -32
6550 -32 -458 60 82 54 -116 82 202 133 -296 189 249 183 -177 244 171 41 -256 52 -28 164 57 -184 195
6573 195 -112 -122 -275 350 87 4 -83 200 169 114 63 -5 31 -157 133 102 134 -371 -139 246 169 -114 156 432
6597D32k84j41l95O36j52m52L8L18n5J20P3l47N14n14j08M62m3l2l05%p6L34k26
6620b03L49K50m61J60J3P7k5l2j19J7K10l42J52Rm32J70K76j08J76k18j91L91
6642A19N4l31qJ05K64q9k02M30l52K66j60k56K96k20k3J92o5j42K27o7J56K9l76
6665a53K46m5L1j63k3N21k44l06L90J61n41j76O07l33Q4m40J63L35P9l56j80Q06
6687D63m68k13O5L73k15q8j28M91l98k34N23k09L26k23m17O26k90m89L67J72R
6708D3m8P9k81K65m1j91K53l5j67j89M98r4m8J04p7J19k19j0j85n9L15k66J99
6731c5K92k83k09J20J5k45M07j8k5q3l65M43K14j33j74J35K0l24K57o8M0j22q9
6754b30K59K10l80Q8j01L89k26k09L0J69J10j73j62L57j41l11J28J70K32m05p3
$$ plain form
6597 432 148 7 -388 248 96 -356 -318 0 -55 65 138 -209 305 -209 -317 145 102 70 -235 -235 -311 23 -203
6620 -203 146 396 -65 95 108 185 160 128 9 26 236 -106 46 55 -377 -207 69 -39 137 -81 -272 119
6642 119 173 -158 -166 -61 203 114 -88 342 -10 256 96 -160 136 -84 -107 85 20 -122 105 38 194 223 -153
6665 -153 93 48 79 -84 -107 414 170 -136 254 415 -126 -302 305 -28 56 -384 -221 114 193 -163 -343 463
6687 463 -5 -218 -153 220 5 -83 -211 280 -118 -352 171 -38 288 65 -352 274 -16 -505 -138 34 43
6708 43 -5 74 -207 58 17 -174 79 44 -123 -312 186 92 44 148 71 190 -29 -39 -224 -283 32 -234 -35
6731 -35 257 -26 -235 -115 -100 -345 62 44 19 -64 -429 14 228 95 -79 56 76 -248 9 -59 -19 -141 -230
6754 -230 29 239 -141 -53 -154 235 9 -200 -170 -1 109 -64 -226 131 -10 -321 -193 -23 209 -196 -269
6775b69K83K58l45q9K20K01l11L18k32M80p42L91j36Pj38q8J0M47R9o89K00J10
6797a5o9K93k26J29m32Q8J68J86p3n7kQ2j51K58j0J04J04q27M41j51K08p8N4N2
6821G6J56j80k33K03o3j69K11J28J81o52OM49q8j73K11k8K22l78K10NL36o71o0
6844c01L79l3J06k73n0j84K90j06M35j39k33k06M40L12n40K8m9M16n20O3n0L40
6866A25rm5q4J1l1l20K63n2K06k67L8K72J65n93N98P1j70j90k45N29l30k98N52
6889A96K1n66L38k24L74O3m42J51K09R3l27J79l60K72J65n50L58K50k26l4J20
6910F0P7Kl67J43k6o4J42j34L33l99J5K40k3j1J28k58O4J10J8k6J67l4l17J12
6934d8L20l71K90l56J03J92l83K88k15N39p85M00Q2M9j1l83J51J84K2j81j7J97
$$ plain form
6775 -269 14 272 -73 -162 58 259 -52 266 34 514 -228 163 27 34 -104 -192 -182 265 364 -325 -125 -15
6797 -15 -84 209 -17 112 -320 -232 -64 122 49 -8 -10 72 -79 179 169 273 377 -450 -9 -160 48 -30 24 76
6821 76 232 52 -181 22 -41 -210 1 129 310 -342 -336 113 25 -148 63 35 257 -121 89 94 430 -241 -301
6844 -301 78 45 151 -122 -172 -356 -66 -172 263 124 -109 -315 125 437 -103 -75 -124 292 -228 -165 -215 125
6866 125 116 71 -13 -2 -33 -353 -90 -142 64 -203 -165 107 272 -321 277 348 178 -12 -257 272 -58 -356 196
6889 196 217 -349 -11 -235 139 202 -240 -89 120 213 -114 65 -295 -23 142 -408 -50 200 -26 -60 60
6910 60 137 139 -228 -85 -111 -175 -33 -167 166 -233 -218 22 -1 -12 116 -142 -78 32 50 24 191 157 -160 -48
6934 -48 272 -99 191 -165 -62 130 -253 35 -180 359 -426 -26 56 105 94 -289 -138 46 68 -113 -130 67
6956F7j61J46j23J08k59J61j28M15j9j23j61l2N8l76N24p6M10p57K52N31j20n38
6978b01j98M69L95m64l6l4N34p38L62%k89N63n33K02J87m01j16N61k52K00m33
6999b22M54k76K1j10J92l3o5j66M38m6q1j09j86K66l40r9K26M22m05jM06j98k78
7022a90L44n46O10j96j78K51Q2j09j34j02J09ok19L71L2k49Q0J76l53J71k30L03
7044A7J77rl81L19pj11R0J99p0k05R9k32O9K02J72n50jJ98J12l68O68k72k69j37
7068b90J99L9oj26M88l30P8l14K23J19l6l61M92l04K43k40J9L4J21m65N40r8Q6
7091A11r3l0r3K04p4qm6j82L82k07O69o73K15k35L8j1P3N9O8L2m6k38M39l11q3
7116d0k31N51o1l70o6N64j57l78N16m00j2M8K6j06K19k63J88k94P14n37j37M03
$$ plain form
6956 67 -94 52 -71 37 -222 -61 -189 226 207 84 -77 -109 -51 -427 97 21 431 -326 -74 457 337 -201
6978 -201 -399 70 465 1 -35 -69 465 -273 89 89 -200 363 -170 32 219 -182 -298 263 11 211 -222
6999 -222 232 -44 -23 -133 59 26 -39 -205 233 187 106 -3 -189 77 -263 -362 -136 286 -119 -120 286 88 -190
7022 -190 154 -392 218 22 -156 95 177 68 -66 -168 -59 -65 -284 87 119 -130 -50 126 -227 -56 -286 17
7044 17 194 185 -196 123 116 5 95 294 224 19 118 -114 -45 157 329 -221 -222 -24 88 -280 388 116 -153 -290
7068 -290 -91 -52 -58 -184 304 -26 52 -262 -39 80 44 -317 175 -129 114 -126 -107 -73 48 -417 123 25 111
7091 111 18 -12 -105 99 25 17 -29 -211 171 -36 633 -40 175 -60 -22 -33 40 99 167 199 153 -85 354 43 -40
7116 -40 -271 280 219 -151 -217 347 190 -188 328 -72 -84 -36 -10 -116 103 -160 28 -266 448 -89 -226 177
7138A77J15L0o9l86J23q9p1J75J18k16J39l4K74k93j90O8K53k20J18qK21k99J07
7161D3J04k00J22m40J18N03l0k48m0J71K95n62J37K06J32l96nP4J25J01r3lk08
7184i4P9j78R9K49j57q1L94j00m24O4L01J05j48q1j43L52m96L38j26Q0j48K29
7206A14k21K52j84o7K61m7L6n1m9J76l08K52k13J97j16m6l79M67K0k06k11L14
7228ip0J03pj82K05k20Q9L15o8N6n67L47k8k63L20l0J83r7k94K55K28j30l37R5
7252a06K52l13N4j7N14p90K88rK81l17O1J23O0j09j22N35K49n50j89J84j67l50
7274d38K69L23l69K84P1m16L37J7k23j13O3L56l40j02O06j91j05J4K06k48k61
7295b60J23LJ95m39L54oL56m86R3o8K10K8l75K44K29R0n30M03L8l04o0R5L7j14
$$ plain form
7138 177 292 322 253 -133 -10 -99 -170 5 123 -93 46 12 286 -7 -197 -129 124 -96 22 14 235 -64 43
7161 43 147 -53 69 -371 -253 250 220 -28 -68 103 398 -164 -27 179 311 -85 -90 -16 109 210 117 114 -94
7184 -94 -15 -193 -94 155 -2 -83 311 211 -213 -149 152 257 109 28 -115 237 -259 79 -47 33 -115 114
7206 114 -107 145 -39 -106 155 108 144 93 44 220 -88 164 -49 148 32 -14 -393 74 94 -112 -323 -9
7228 -9 -79 24 17 -165 40 -180 -91 224 156 212 -355 -8 -36 -299 21 -9 174 77 -217 38 266 136 -201 -106
7252 -106 146 -167 -113 -130 384 -406 -118 -127 154 -163 -102 21 81 -28 -150 385 634 84 -105 79 -88 -438
7274 -438 -169 154 -215 69 140 -276 61 78 -145 -258 -195 161 -179 -281 325 134 29 43 249 1 -260
7295 -260 -137 -134 61 -378 -24 -30 326 -160 -67 -135 75 103 -272 -28 201 291 -239 164 202 -102 -162 -67 -30 -144
7319a44L08K39l02Q2j35O6J1Q4J26k62j54L4Kj66J76L49n99L2K22K59n11M02M3
7342A62Rk38j36L96K44n86j50O2J17K14j61K67j6j80J77Rq3l46J37J94nk30J38
7365eJ04K28j33k49J61J7J31n43N14j41K82m19J9j85K80j37j44N26m40L94l65
7386a05M21k88J41m62M32j28k50R9J59K20k63j00K22J78n41L38j01q8J6j74L12
7407C8O3j35q5J84r8M9m2J3j95L67m28K82l9k7J15k01J97LJ32k13j69M63j70K04
7431C08n5l26K33j0J67k43Om44M97k89K70n6Lj15J48l36L42k46j92M59n1J56l17
7454i1J19o3J17r4%N2K15k23J22J3Q8m35J45k2L88m08j76M04l91J84k43L82Qj02
7478a1j30NL44j53j13l4J11l5n9n7K83j6n8j85LK01j23n1N3n7j21kM10j17k31
$$ plain form
7319 -144 164 403 101 183 48 114 125 209 335 73 -81 -47 -45 -211 -35 314 -285 -253 -31 228 -283 119 162
7342 162 171 -67 -203 193 437 -149 -299 -237 -120 94 -67 200 184 4 181 190 107 -239 -102 92 87 -143 -5
7365 -5 99 327 194 -55 106 123 254 -289 225 84 366 -53 -34 -219 61 -76 -220 306 -134 260 -105
7386 -105 316 28 169 -293 139 11 -239 -140 19 239 -24 -124 98 276 -265 73 -28 -116 -100 -274 38
7407 38 101 -34 -119 65 -33 16 -26 -13 -208 159 -269 13 -26 -53 62 -139 58 61 193 -20 -189 274 104 308
7431 308 253 -73 160 150 317 74 80 -364 133 -156 114 58 61 -54 94 -242 100 -146 -338 121 70 226 -91
7454 -91 28 -35 82 -12 -12 40 255 32 154 167 255 -180 -35 -57 331 -77 -253 151 -240 -56 -299 83 91 -11
7478 -11 -141 -136 208 55 -58 -92 19 -16 -75 -132 151 135 77 -108 -105 96 -27 -78 -25 -82 -203 -205 205 88 -143
7503a43JK89j10j33J56l9j61KR1J56J76j70j65o9L1R7J04J50l21q4j31R1K13r0
7527e9K4J84j83K15j11J33m07J20j61R4J97l81O51l70L64m35j23K02M84k83J8
7548A73j42n0M91m04k15PJ72l1J74Q0l6k89R6N8P1j96R0j51N6j68J47m3M32m39
7572a17j8Q2N6Q1l01P4L77l87Q2k5M5N0J7J79l7m70J05J94M59k45j24k24K61k6
7596H8r7k75M39r2j76j2K07k12k28K09J86j8k94L46J13m5k68j08L62J19o25k2
7618d03L88J57j0k58L72p7k01l5j42J35R1or4J10k8MJ19k16NK87k43k02M11j82
7642a8L60k82J12K3J03k82Mj03L36k79K41k53K29j69l2N5k59N08k39j82p2K23
7664B4J49q1mK00l84N0r0L71L05n25J16l63K1n0L51K05j93k07KK00j12q7R3J36
$$ plain form
7503 -143 -142 147 37 -96 60 21 -140 -138 -47 109 285 115 -50 -119 -88 9 113 263 -58 -142 -273 -182 31 -59
7527 -59 -35 149 -34 181 70 203 -204 -84 -245 -151 46 -335 316 -54 310 -125 -248 -46 438 155 173
7548 173 31 -19 472 68 -147 -140 32 1 175 255 219 -70 26 84 155 -41 49 -102 -46 -214 -67 -110 322 -117
7572 -117 -135 -53 3 84 -217 -143 234 -153 -71 -96 -51 -1 16 195 158 -312 -207 -13 446 201 77 -147 114 88
7596 88 -9 -284 155 63 -113 -125 82 -130 -358 -149 37 19 -275 71 184 139 -129 -237 125 244 -381 -403
7618 -403 -15 142 132 -126 246 169 -32 -67 -209 -74 17 11 -83 27 -1 3 122 -94 -89 198 -45 -247 164 -18
7642 -18 342 60 172 195 298 16 20 -83 253 -26 215 -38 191 22 -10 45 -214 294 55 -127 -199 24
7664 24 173 92 88 288 -96 -46 -136 235 540 15 131 -232 -211 -261 90 295 102 -105 -103 97 -15 -102 -9 127
7688A27N1m78K21q4J41k40mJ47j41M34l35K63j15J47m01J98J19n9O9p9j13Nj63
7711b90K85k2R2LK85j22k53l88L56Q4j60K59q7qk23R0RK80j08R2j04j6K58o12
7735c00M10N2j07k14k05J71O71m43l39M89j63J2P4o4J37k45j47N37j19p5m10j14
7757c92N87q6k67P3J2j87K80o8j95K66l49N93J3k90k01J08J08J55j39L3K81l24
7779A1p4k3L50j73j69J23J6l98Q9q6N13m5l10k4L19M1l61L1J3N28m83J31k10L96
7803B05k11J90j81j69O01m70n1K77n29P12l87K59j26o71M30K50J46l97R6l0N2
7824dk51M78j92l6j57K8L74r0O2l69K72k70J03J96J35l5l75J55N1P9j46k44J58
7847g8N3J1O0j67K76k88P4J74l94K13n3j14M67k60j84J92k4m8p5L54r5j08j15
$$ plain form
7688 127 178 -300 -79 -163 -22 -262 -266 -119 -260 174 -161 102 -13 134 -267 -69 50 -9 60 -19 -132 -127 -290
7711 -290 -5 -27 65 68 353 231 -22 -410 -54 30 -130 129 42 34 -189 -99 -90 190 82 174 70 54 312 -300
7735 -300 110 162 55 -159 -364 -193 478 35 -304 185 22 34 108 44 181 -64 -211 326 207 132 -278 -392
7757 -392 195 109 -158 -85 -73 -260 20 -48 -243 23 -326 267 280 -10 -211 -103 5 160 21 54 335 11
7779 11 -63 -86 264 91 -78 45 61 -337 -248 -334 179 134 -176 -200 119 160 -201 -170 -157 371 -112 19 -191 205
7803 205 -6 184 3 -166 435 -35 -86 191 -338 374 -13 246 120 -551 -121 129 275 -122 -26 -56 -4
7824 -4 -255 223 31 -5 -162 -134 240 150 212 -157 115 -155 -52 144 279 244 -131 24 75 154 8 -236 -78
7847 -78 -25 -14 46 -121 155 -133 -59 115 -279 -66 -119 -233 234 -26 -210 -18 -42 -90 -165 189 94 -14 -129
7870a29R0k28J30N0l2L71l58N0M55n88P0j58J48L5K69k19k3j0J38j46J67j7K01
7893B66k21r3L9K12j71j62K38m2L8r0l0Q1j50OJ41Rm8j73L60j47k90J8K17n8m1
7918i1N2J58j61J49o7J14k01J39j71J92K08m78j35L29K04m03O24n58L35m42K25
7939B2J08l0N3j27K62k18j08j01J3K16j26l46M64J64l18L15l09K55q2j9j20P4
7961D2K02n67L84J73k01m3pj03J63k0K8m48O85l84J01K37o8m88K64j20N95m67
7983d2L5N1K0p1P6Ml10K59jk75K74N8r1J43j27K11j20n5O5R5l09l8j60M34j71
8008d5J20K21l19O5j48O33p33P5M67k07M2j79l09N50m7l63R6J79Q3k94J23m25
8030d15L71K25J72j66k41k1O5K71n68M52k54N6R2j40J89J70k44k56K46L3j79K04
$$ plain form
7870 -129 -39 -267 -137 -87 -119 252 -106 -56 399 -189 -119 -277 -129 -94 175 -44 -67 -77 61 -85 82 65 266
7893 266 45 -48 -9 203 32 -130 108 66 104 14 -16 65 -85 -79 62 71 23 -150 210 63 -227 -209 8 -50 -91
7918 -91 -39 119 -42 107 40 154 -47 92 -79 113 321 -157 -292 37 241 -162 462 -96 239 -203 22
7939 22 130 100 153 26 288 70 -38 -139 -126 90 -36 -382 82 246 -72 243 -66 189 107 88 -32 42
7961 42 244 -323 61 234 33 -10 -17 -120 43 23 51 -397 288 -96 5 242 174 -314 -50 -170 425 -42
7983 -42 -7 44 64 -7 69 73 -237 22 21 -254 20 78 -13 130 3 214 94 39 104 199 -110 -148 -308 126 -45
8008 -45 75 296 -23 42 -106 527 -206 -131 336 129 171 -8 -317 233 186 -177 -81 98 181 -113 10 -415
8030 -415 -44 181 353 187 -54 -75 -10 261 -307 145 -109 -53 39 -101 88 258 14 -242 4 37 -142 62
8052F2j5J5J07k20J5p9J65k49L83qN0l89j21Q1J80J3oj73J87j65J37l9K54m7j99
8077f1L1O0L11m57j97K30K88j13k69N14l27j41K05M3Q0k74q6M75k14k82R1K56
8099A63L7j75n3n1L44m43K91p3K87j19m16O4L24j34m51L29J13O0l43L81k23K48
8121A60j90l21L73jj83K45J69j83l54J42K27L9k23m5J51J73k39L15q12M91K06
8142A40j70P6O8m52M79j76P8J37k09j26nK68j5PL7M3J63J40m38J69k03n8q8K28
8166I3m2l4o4o3q1K86l98N53m48J52N19o47k06J34L81j28K8j51K37k97J32N3K18
8189B27k32k7
$$ plain form
8052 62 47 62 169 -51 -36 -115 50 -199 184 176 226 -163 -284 -203 -23 -10 -16 -189 -2 -167 -30 -69 185 138 -61
8077 -61 -30 30 341 -116 -313 -83 205 92 -177 337 10 -131 74 117 197 -77 -163 312 98 -184 -93 163
8099 163 200 25 -28 -79 265 -178 113 40 327 208 -208 -144 180 46 -405 -76 37 97 -246 135 -88 160
8121 160 -30 -351 22 21 -162 83 252 69 -285 -143 84 123 -100 -145 6 179 -60 255 -557 -66 140
8142 140 -30 46 114 -338 141 -35 43 180 -29 -155 -160 108 93 100 137 180 343 483 45 214 11 -47 -135 93
8166 93 51 17 -47 -110 -191 95 -303 250 -198 -46 473 -174 -380 -246 135 7 35 -116 121 -176 -44 9 227
8189 227 -5 -32
8191c2
$$ Imaginary data points
##PAGE= N=2
##DATA TABLE= (X++(I..I)), XYDATA
0@%%%%Qj6J6j6J6k4L2m0N6o4P2r4J18j36J60j92K24k62L02l50M06m63N27n99O80
29C61p68Q67r78J097j225J369j527J698j887K094k321K572k849L154l491L866
45B032m285M759n298N913o624P458q457R672j1185J3137j5764J9508k5305L5547
59B1108n8898K02346M9744l11423K08105J2102j38981k1334k3803L3262J09472
70H1700j59233k7489J90505m2396j46300N5916N9601J4867n5328m0895J29009
81E9957O1796j51434j3097J12709j0138q6825k8594P3274P2736q9548o2972J02646
93D0510J9975j18927m2922N9568N7732l3785n6323Q0743R7743o9223p1350N1586
105A5327L6637n2217p0316J6820J00295k250r1007N1433J03906o7331r7919M2309
$$ plain form
0 0 0 0 0 0 8 -8 8 -8 8 -16 16 -24 32 -32 40 -54 64 -72 88 -104 120 -142 160 -190 216 -247 280 -319 361
29 361 -407 460 -518 579 -646 723 -804 894 -993 1101 -1220 1352 -1497 1657 -1834 2032
45 2032 -2253 2506 -2792 3121 -3503 3955 -4502 5170 -6015 7122 -8642 10866 -14439 21108
59 21108 -37790 164556 214300 -97123 110982 123084 -15897 -37231 -61034 -27772 81700
70 81700 -77533 -105022 85483 43087 -103213 -47297 12304 27171 -28157 -69052 59957
81 59957 121753 -29681 -42778 69931 59793 -27032 -55626 17648 90384 836 -62136 40510
93 40510 60485 -58442 -101364 -41796 15936 -17849 -74172 6571 104314 35091 -36259 15327
105 15327 51964 -253 -70569 -53749 46546 44296 -46711 4722 108628 41297 -56622 -14313
117a4313N9096l8567o9323J2543Q3921L098r3519j1677Q5026R110q5955j0992
129g1552J13741M7380r4252j7704J07165K923j09855k5943O8028K1316p7648l7528
141g3929J03060M7765j08951l4044P8800j317p3458k1149O2876O3787m0650l9779
153c6989Q4161N3936p0436n4253L6291M7492m8083p9076N5736P7312p0370o0470
165f4749M8956L0918l0137m7096J2013Q0798k920o5532M1791O3403l6473n6039
177b5067k055M9757J3221p0758M505R1677j1065p2152L459M0553P33o2706l6029
190g5927P4538L8379o6770m729O9660J5062n3089m3532M0415M8658o0087m3238
202f0660P3158M5635m5175l8565L4813N2502m9433p5556N9642O4106o5652m5881
$$ plain form
117 -14313 44783 6216 -63107 -50564 33357 36455 -57064 -68741 16285 25395 -60560 -71552
129 -71552 42189 89569 -4683 -22387 84778 87701 -22154 -48097 19931 41247 -36401 -73929
141 -73929 29131 76896 -32055 -66099 12701 11384 -62074 -83223 -20347 43440 2790 -36989
153 -36989 47172 101108 30672 -23581 12710 60202 12119 -66957 -11221 66091 -4279 -64749
165 -64749 -15793 15125 -15012 -62108 -50095 30703 27783 -37749 4042 67445 30972 -25067
177 -25067 -27122 22635 35856 -34902 -30397 61280 50215 -21937 -18478 22075 22808 -39898 -75927
190 -75927 -1389 36990 -29780 -34509 35151 50213 -2876 -46408 -5993 42665 -17422 -60660
202 -60660 12498 58133 12958 -25607 9206 61708 12275 -63281 -3639 60467 -5185 -51066
214e1066N1038L8745m0667o4768K9027P2284m0944o0218O2426O6300k9157m5468
226a2468J3065N0962j7866p8953J3929P5049k2099n8600K4257N2751j1691o2028
238c3692j0952N6197k178o7852J2014P4225J519m8215M762N0570J0716n3393k2683
251b8962N6062K0276o1999j6826N5368R900n2476k8639L3995L4312l7105l5187
263e1281N5625M3372m6161k7299L6522K2282k9062m3215J7616N6644k2535m9771
275c7263M2048M8795l4348m5597J2771M2822j4131o3329J5262O9209j9808n6234
287c9803K2194N0997j1558n7098J794O6126k869o2453J3100N7566j0147n0309
299b2460m258M9027Q110n7605m223O3102M207n2172o513M1129Q076n3502k2334
$$ plain form
214 -51066 -28 38717 -1950 -66718 -37691 34593 -6351 -66569 -4143 62157 33000 -12468
226 -12468 597 51559 33693 -45260 -31331 43718 21619 -36981 -12724 40027 28336 -33692
238 -33692 -44644 11553 9375 -58477 -46463 27762 29281 -18934 -14172 36398 47114 -6279 -28962
251 -28962 27100 47376 -14623 -31449 23919 33819 -18657 -47296 -13301 21011 -16094 -51281
263 -51281 4344 47716 1555 -25744 10778 33060 3998 -39217 -21601 35043 12508 -37263
275 -37263 4785 53580 19232 -26365 -13594 29228 15097 -48232 -32970 36239 16431 -39803
287 -39803 -17609 33388 21830 -35268 -33474 32652 29783 -32670 -19570 37996 27849 -22460
299 -22460 -26718 22309 30419 -27186 -31409 31693 35900 -16272 -22785 18344 26420 -27082 -49416
312d9416N3989K0499n0308r135N3245K1436m0294k5081M0247K5579m6714k7919
324c3872M1730K6803l6042l1447L1753L2836l5893l5348L3449L0744k5274k8174
336b8735K1676L9676j8249m5417K0298M1220k2745l4962J6408L8295k949m3834
348a9318J487M9488j0183n1183O212L8700J061l7535r652M9175J5738n5429q703
361c0142N4052L699m5618q628M0598J8621m3825k2280N0116J8047n1488j6117
373c2965M4030J8745l7564k4131L9987K9101m2976k9273M0216K6811l8494l0355
385c6868L5038L4422l1937l3141L3273L4427k9735l5771K5832L7849k5867m0687
397c3165K4842L8508k3696l7089J9551L8092j5791l8588J4557L9834j1256l8247
$$ plain form
312 -49416 4573 25072 -25236 -34371 18874 40310 16 -25065 15182 40761 -5953 -33872
324 -33872 7858 34661 -1381 -32828 -1075 31761 -4132 -39480 -6031 24713 -561 -28735
336 -28735 -7059 32617 14368 -31049 -10751 30469 7724 -27238 -10830 27465 24516 -19318
348 -19318 -17831 31657 21474 -29709 -23497 15203 16264 -21271 -30923 18252 33990 -21439 -30142
361 -30142 23910 27609 -18009 -26637 13961 32582 -11243 -33523 16593 34640 -16848 -32965
373 -32965 11065 29810 -7754 -31885 8102 37203 -5773 -35046 5170 31981 -6513 -36868
385 -36868 -1830 32592 655 -32486 787 35214 5479 -30292 -4460 33389 7522 -33165
397 -33165 -8323 30185 6489 -30600 -11049 27043 11252 -27336 -12779 27055 15799 -22448
409b2448O874L8379m281m1601K590M1743m153l7607L68L4576Q127l3769j3600
422b4802L8868J4277m1912j0788L6188J1066l0847j9140K9429K8475l3521k7909
434c0616L8725K3561l6447k3200K7230K6551k5155l5346K9083L8820l1581l1854
446c0229L0896K9645k3913l2524J7760L9040j9301m1766K1489L8958k0647l7841
458b8433J4884L7717j1640m0996J2298M4121j0215m2183R294L9676q502m1814
470b5793N099M0365k160l6936J565M0387L830m1343n553L9600J371l8362l941
483b1871L3898R292l1818j3971L3233J3868l6449j2667L1236J4103k2747j6685
495b0578K4652K6605k7262k6928K7652J9794k4124k0634J5156K8349j1457l5925
$$ plain form
409 -22448 -15574 22805 18524 -23077 -20487 21256 17103 -20504 -20136 14440 22567 -11202 -24802
422 -24802 14066 28343 -13569 -24357 11831 22897 -7950 -27090 2339 30814 -2707 -30616
434 -30616 8109 31670 -4777 -27977 -747 25804 649 -34697 -5614 33206 1625 -30229
446 -30229 667 30312 6399 -26125 -8365 30675 11374 -30392 -8903 30055 9408 -28433
458 -28433 -13549 24168 12528 -28468 -16170 27951 17736 -24447 -15153 24523 16021 -25793
470 -25793 -20694 19671 17511 -19425 -17860 22527 26357 -14986 -20539 19061 20432 -17930 -21871
483 -21871 12027 21319 -10499 -24470 8763 22631 -13818 -26485 4751 18854 -3893 -20578
495 -20578 4074 30679 3417 -23511 4141 23935 -189 -20823 -5667 22682 11225 -24700
507b4700J5883L4667k3404l1916J6754K7588n920l0286N641M3660p763m3672J3518
520i950L5105j2927k9300K502L3338O636m0855n195M3350n252m3366J312L3382
533H780N471l0537q795M0990J3748m2097q903L7554N521l4420j1264L2760J8532
546B7340l2570j7434L5118J4885l5098j7916K8517J8973k6967k0942K9135K3135
558B6176k8760k3212K3198J9858k1079k2096K0818K9114j3460k5879J6872K6109
570B7659j7896k9170R405K4980p911k5732O905L1087l035l2663R83K9359m769
583I202l1171N63L1021O010k7404m654L3321O867l3692o758L0328Q800k7445j2265
597a7277K9758J5055l4452j9032K8970J0718k9700j4729K7895K4354k1841k1902
$$ plain form
507 -24700 -8817 25850 2446 -29470 -12716 14872 8952 -21334 -15693 27967 20204 -23468 -9950
520 -9950 25155 12228 -17072 -14570 18768 25404 -15451 -20646 22704 17452 -25914 -24602 8780
533 8780 14251 -16286 -25081 15909 29657 -12440 -21343 16211 21732 -12688 -23952 8808 27340
546 27340 -5230 -22664 12454 27339 -7759 -25675 2842 21815 -5152 -26094 3041 26176
558 26176 -2584 -25796 -2598 17260 -3819 -25915 -5097 24017 10557 -15322 1550 27659
570 27659 9763 -19407 -10002 14978 7067 -18665 -11760 19327 16292 -16371 -15388 13971 9202
583 9202 -21969 -21406 9615 15625 -11779 -16433 16888 23755 -9937 -16695 13633 22433 -5012 -17277
597 -17277 12481 27536 -6916 -25948 3022 13740 -15960 -30689 -2794 21560 -281 -22183
609b2183L0771K2486l2218k0979K3078J9337j9421k3441K2409L0983k3637k8521
621b1336K2550K0598k2059k5288J3940K9037j1573l0914J7659K9799j7986k5707
633b1280J1420K4784l771k6599P411L4731r051l0508P364J8983n879k2734m905
646b0034K8800Q429l0268L07L0586l992k4973o046J6347J2306k1787j3146L1543
659H072J4753k6883p278K1058Q719j7674j8443J8362K3247k2425j9745K2369J4776
672A8908k1058k0608J1548K3375j2871k5344K0736K9167j6534k2865J3215K1259
684A8928j0456k8135R075L2833r651k8148J3418K5346j1204k7776N69K4540j882
697G457l0636M599L4551l361k8496M913K4883k100k4376l235K7845P695k7366
$$ plain form
609 -22183 8588 31074 -1144 -22123 955 20292 871 -22570 -161 30822 7185 -21336
621 -21336 1214 21812 -247 -25535 -11595 17442 5869 -25045 -7386 22413 4427 -21280
633 -21280 -9860 14924 11153 -15446 -8035 26696 17645 -12863 -5499 13484 7605 -15129 -20034
646 -20034 8766 17195 -13073 -12766 17820 13828 -11145 -17191 -844 11462 -10325 -23471 8072
659 8072 22825 -4058 -11336 9722 18441 767 -17676 686 23933 1508 -18237 4132 18908
672 18908 -2150 -22758 -11210 12165 -706 -26050 -5314 23853 7319 -15546 -2331 18928
684 18928 8472 -19663 -10588 22245 12594 -15554 -2136 23210 12006 -15770 -15201 9339 7457
697 7457 -23179 -18580 15971 12610 -15886 -10973 13910 11810 -12566 -15801 12044 19739 -7627
710g627k657K8824O52k7602o227J8859O200k0597j0011K4623J3689k3336j0354
723a5564K0199P950j8190j4074J5929K0215j5151j6295K0681J6258j8113j6243
735a2398R540J6622q923k2405J2061K5625j2568k2060R662J6424q201k2315J575
748a7361K7142n06k5359Q223K6619n188k2525j810K2049L776k7484k379L1008
761A6205J393k6230k081K0441L778k5163j1147K6912J0113k6169m615K5608O824
774A5869k0813j2272J9451J5765k3801j2173K7984J2835k1590j0858J5530J1558
786A7485j9425k0124J7974J7794j9217j2995J8758J4924j2232j8582J0615J9857
798A4832j3001j9493J5335J9182r261j6173N269J9058o110k4948N904K2646o535
$$ plain form
710 -7627 -10284 18540 19192 -8410 -14637 4222 10422 -10175 -20186 4437 18126 -5210 -15564
723 -15564 4635 12585 -5605 -19679 -3750 16465 1314 -14981 5700 21958 3845 -12398
735 -12398 -2858 13764 4841 -17564 -5503 20122 7554 -14506 -4844 11580 3379 -18936 -17361
748 -17361 9781 9275 -16084 -7861 18758 13570 -8955 -10765 11284 15060 -12424 -14803 16205
761 16205 17598 -8632 -10713 9728 13506 -11657 -22804 4108 14221 -11948 -16563 9045 15869
774 15869 -4944 -17216 2235 18000 -5801 -17974 10010 22845 1255 -9603 5927 17485
786 17485 -1940 -22064 -4090 13704 -5513 -18508 250 15174 2942 -15640 -5025 14832
798 14832 1831 -17662 -2327 16855 7594 -8579 -3310 15748 9638 -15310 -9406 13240 6705
811F705j8564N345J8230o08k2242m872K2493P52k3143J901K3189M247j6416o068
825i051J9060Q657k4479j0659K3072P713k0227p235J8819J1114j7865j6347J7423
838eJ4722k1151j3787K0540J4840j5713j4033J4345J6888j4959k0732J6542K0864
851A8361j5408j6241J5642J7150j1776k1856P828K0665j3006k3016J3661K1227
863A3231r276j6716O823J9245m071k4189M419K4606o403k0074P459J7697j146
876A1605j7872m828K0987K354k4805N95K2426l58j5937l778J3866P769j9671j1439
890a9086K1864P953j8808l111J6532R672j1055j5384J2963J6128j9003j4428J6798
903A035J2056j1590j3158Q023J7698r354k3348J2355J9061j1933j4574R261J6706
$$ plain form
811 6705 -11859 -6514 11716 11108 -11134 -16006 6487 7239 -15904 -14003 9186 13433 -2983 -9051
825 -9051 10009 18666 -5813 -16472 6600 14313 -5914 -13149 5670 16784 -1081 -17428 -5
838 -5 14717 -6434 -20221 319 15159 -554 -14587 -242 16646 1687 -19045 -2503 18361
851 18361 2953 -13288 2354 19504 7728 -14128 -6300 14365 1359 -21657 -7996 13231
863 13231 3955 -12761 -5938 13307 9236 -14953 -10534 14072 7669 -12405 -4946 12751 11605
876 11605 -6267 -11095 9892 12246 -12559 -11964 10462 10104 -5833 -9611 4255 12024 -7647 -19086
890 -19086 2778 10731 -8077 -11188 5344 15016 3961 -11423 1540 17668 -1335 -15763 1035
903 1035 13091 1501 -11657 -3634 14064 4710 -18638 -6283 12778 845 -13729 -4468 12238
916A2238l485k1142L713K3458p845k1822Q825K0091l197j8316J52K0607q14k6602
930a4139K91K2831k877j9417J138K0373M587j9980m667K2628K365k2086k153J8861
944G755M644j6757p726J7878Q390k0126q777J9175P237j5939p334J4863J0884
957A4167j4564j3598J3918J1809j5030j2034J3913J3140r143j2986R970J4922
969A4484q837j7351P733J5277q534j4936O322J6375l482j6904K550J8055l462
982G290j8783K304J7668o79j6876j284J8273K945j9680k521K0393K515j7395l026
996h856J6914O811j8568r687J8545O615k0544o683J8026P721j3946r631J5804
1009B521J3387j7416j2645J8147R789j6060r351J2565J2689j2197j5914J3968
$$ plain form
916 12238 8753 -12389 -8676 14782 6937 -14885 -6060 14031 10834 -7482 -7330 13277 12463 -14139
930 -14139 -13848 8983 6106 -13311 -12173 8200 12787 -7193 -11860 10768 13133 -8953 -11106 7755
944 7755 12399 -4358 -12084 5794 14184 -5942 -14719 4456 11693 -4246 -11580 3283 14167
957 14167 -397 -13995 -77 11732 -3298 -15332 -1419 11721 2578 -10408 -438 14484
969 14484 5647 -11704 -3971 11306 2772 -12164 -5842 10533 7051 -9853 -7303 10752 7290
982 7290 -11493 -9189 8479 7800 -9076 -10360 7913 10858 -8822 -11343 9050 11565 -5830 -8856
996 -8856 8058 14869 -3699 -13386 5159 11774 -8770 -15453 2573 10294 -3652 -13283 2521
1009 2521 15908 -1508 -14153 3994 13783 -2277 -11628 937 13626 1429 -14485 -517
1021e17J5235j5737j3066J3166J2094r054j4080P501J7687r146j7683R920J5311
1034A1631p849j3013M466J5237k312j7693K680J7337m796j5727K543J4380J004
1047G888j4052k898J7021K974j7826j927J5091K789j3803o121J4235P690j5049
1060c988q048J5491P026j3798p845J2698J0076j1129j2037J2555J2916j3284j2160
1073a1527J1511J1333j0623j3478R708J4522r703j5072R728J6219r512j4932Q736
1086c090J5692p140j5996O327J6072o065j7414M770J7281n294j6369M596J5924
1099I294k257j5657J151J7041j056j6980N99J5790k30j5118q03J4382L161j4851
1113e534l667J5831K918j4993m018J2995M616j1998p004J2909Q603j2737o810
$$ plain form
1021 -517 14718 -1019 -14085 -919 11175 2121 -11959 -4458 13229 4083 -13600 -3680 11631
1034 11631 3782 -9231 -4765 10472 8160 -9533 -6853 10484 5688 -10039 -7496 6884 7888
1047 7888 -6164 -9062 7959 10933 -6893 -8820 6271 9060 -4743 -10864 3371 11061 -3988
1060 -3988 -12036 3455 10481 -3317 -11162 1536 11612 483 -11554 1001 13917 633 -11527
1073 -11527 -16 11317 694 -12784 -3076 11446 1743 -13329 -3601 12618 3106 -11826 -3090
1086 -3090 12602 5462 -10534 -4207 11865 5800 -11614 -6844 10437 5143 -11226 -6630 9294
1099 9294 7037 -8620 -7469 9572 8516 -8464 -7865 7925 7695 -7423 -8226 6156 9317 -5534
1113 -5534 -9201 6630 9548 -5445 -9463 3532 8148 -3850 -10854 2055 10658 -2079 -8889
1126h889J1867Q027j0163r643Q602J0308r924j2121R491J0804p895j0407O405
1139c538J3148n178j3242O344J3828o436j3908N077J2834m120j4627K372J5436
1152G990k358j4997K525J6052j295j5197k33J5545Q5j6486j115J5913K152j5247
1166f666k259J6150L313j5805l744J5188L009j4558m785J4115N595j4077o461
1179a0985J4581O033j3353n937J2644P754j1446q765J1016Q760j1994r328J0481
1192e39Q860q661r181Q907J1235p364j1063P415J0012p251j1175M397J1048m022
1206B618j1868L838J3521l488j2422K773J2279r68j1988m57J3814L91j3931q37
1220f725J2583Q04j2417l172J3202M769j3735m088J4111L416j2762n922J1980
$$ plain form
1126 -8889 2978 11005 842 -8801 -199 10109 185 -11936 -2445 8359 464 -9943 -3538
1139 -3538 9610 4432 -8810 -2466 11362 4926 -8982 -3905 8929 4809 -9818 -7446 7990
1152 7990 5632 -9365 -6840 9212 7917 -7280 -7513 8032 8117 -8369 -9484 6429 8581 -6666
1166 -6666 -8925 7225 10538 -5267 -9011 6177 9186 -5372 -10157 3958 9553 -4524 -10985
1179 -10985 3596 9629 -3724 -9661 2983 10737 -709 -9474 1542 10302 -1692 -11020 -539
1192 -539 8321 -340 -9521 -614 10621 3257 -7806 -391 9621 2370 -8805 -4408 6640 2618
1206 2618 -9250 -5412 8109 4621 -7801 -5028 7251 6283 -5705 -6162 7652 8043 -5888 -6725
1220 -6725 5858 6662 -5755 -8927 4275 9044 -4691 -8779 5332 8748 -4014 -9936 2044
1233B044O723j2500p129J3370Q365j2371p030J1407Q130j1150j0216J0662J0149
1246A0454j1133j0243J0778R611r415j0339Q009J1629p939j1491Q341J1901p171
1259B992j1333N588J1678n622j2905M780J3189m249j1235M229J1500k503j2226
1272f117L40J2144j674j2913Q71J2393rj0487j139J1053L031j1075l536J2283
1286E165L599j1495l660J0337M072j0267o761R344O815r273p614J0851Q475r709
1300a21p779Q394Q157q445j0122P393J0813p122j0233Q348J1159p084j1001N469
1314b174J1548n867j3394N316J3115m862j2322M128J2065k667j3043J945J4353
1327H141k165j3800L322J2330k109j1986n20J2161J210j3383n33J4872R76j2275
$$ plain form
1233 2044 8767 -3733 -10862 2508 10873 -1498 -8528 2879 11009 -141 -10357 305 10454
1246 10454 -679 -10922 -144 9467 52 -10287 -2278 9351 1412 -10079 -1738 10163 2992
1259 2992 -8341 -2753 8925 3303 -9602 -4822 8367 4118 -7117 -2888 8612 6109 -6117
1272 -6117 -5777 6367 4693 -8220 -7349 5044 5035 -5452 -6591 4462 7493 -3582 -7118 5165
1286 5165 8764 -2731 -6391 3946 8018 -2249 -9010 334 7149 -2124 -9738 1113 9588 -121
1300 -121 -7900 494 8651 206 -9916 -2523 8290 1168 -9065 -717 10442 3358 -7643 -2174
1314 -2174 9374 3507 -9887 -4571 8544 3682 -8640 -4512 7553 4886 -8157 -6212 8141
1327 8141 5976 -7824 -4502 7828 5719 -6267 -6787 5374 6584 -6799 -7332 7540 8516 -3759
1341c759r80R798K293j1260o204J2067M532j2004l311J1941M241q963n326Q861
1355A926O931r795o871J0005O647q812o061O627P373o385j0835O836J0004p463
1369A27r128O674Q827l893r872K711J2048l091j2410M887J1783l149r932Q92J0186
1384F660p93j2833q10J2845N1j2179N38J2046J782j1543l020J2220K485j2806
1398e357k531J2184L269j0805m063J0878N322j1671o017J1239N216j0677m869
1411g882R668O572q681p792R174P620r389p824R057P261p743p792O506P926o753
1426g2r272O588J0062n401q218O376Q865l682r435J921Q830l579j1071J980J0306
1441D198k209q219J292R762Q88j0049m92J0267O36r861j378R234K596q958m714
$$ plain form
1341 -3759 -4739 5059 7352 -3908 -10112 1955 6487 -5517 -8828 3113 7354 -1609 -6935 1926
1355 1926 8857 -938 -7809 2196 8843 31 -6030 597 7970 1585 -9250 -2414 7590 127
1369 127 -9001 -2327 6500 2607 -7265 -4554 7494 4403 -8007 -3120 8663 5514 -4418 -3526 6660
1384 6660 5867 -6966 -7776 5069 5120 -7059 -6521 5525 7307 -4236 -7256 4964 7449 -5357
1398 -5357 -7888 4296 7565 -3240 -7303 3575 8897 -2774 -8791 2448 7664 -3013 -7882
1411 -7882 1786 8358 -323 -8115 1059 8679 -710 -8534 523 7784 41 -7751 -1245 6681 -72
1426 -72 -9344 -2756 7306 1905 -6313 63 8928 5246 -4189 -2268 6562 2983 -8088 -6108 4198
1441 4198 1989 -6230 -4938 4824 5712 -4337 -4829 5438 6074 -3787 -5165 4069 6665 -2293 -7007
1456g007R976M296j0465l667J0074L307q648n522P081P077q743q100J0244P668
1470G571q252m736P636P548o065r417N183Q751q901r997P699P781n607o691M938
1485b559J0546l443j0787N299J0111o356r341L432Q728k882j0635K218J1407k224
1499C514j0546L817R747j135q693q46R557M32j1698q15J0653J33q727k22Q523
1514C694L081q437m343Q531K930r949l291Q374L711n726m415P643P427p138o911
1529d819P441N100p263p324M593O684n355q527N346R505m554p423N654Q873l253
1544D678q470K638Q873l381j1168K361R583k753r520K462R729L4j0165j38J1212
1559E975q46j1569Q05R867N78r174o90J0073K547j0475k291R937J519j0560k611
$$ plain form
1456 -7007 2969 7265 -3200 -6867 3207 6514 -2134 -7656 -575 6502 -2241 -10341 -97 7571
1470 7571 -681 -5417 2219 9767 3702 -5715 -532 8219 -682 -10679 -2980 4801 -806 -7497 -2559
1485 -2559 7987 4544 -6243 -944 9167 2811 -6530 -3098 5630 2748 -7887 -5669 5738 3514
1499 3514 -7032 -3215 6532 5397 -3296 -4142 5415 5847 -5851 -6666 3987 4120 -4607 -4829 3694
1514 3694 6775 -1662 -6005 2526 5456 -4493 -7784 590 4301 -1425 -5840 1803 9230 2092 -4819
1529 -4819 2622 7722 459 -6865 -2272 4412 -943 -9470 -4124 5381 827 -6596 -942 7931 4678
1544 4678 -3792 -1154 7719 4338 -6830 -4469 5114 2361 -7159 -4697 5032 5066 -5099 -5237 5975
1559 5975 5129 -6440 -5635 4232 4810 -4364 -5054 5019 7566 -2909 -5200 4737 6256 -4304 -6915
1574f915Q708K901q354m014R365N083q803l323Q942M337p365n884O439N927q060
1589a016p354P246N672o129n441N944P057l469p586M482P979n052p705L578O770
$$ plain form
1574 -6915 1793 4694 -3660 -7674 1691 6774 -2029 -5352 3590 7927 562 -5322 1117 7044 -1016
1589 -1016 -8370 -1124 4548 -1581 -7022 -1078 5979 2510 -5076 -594 7385 2333 -5372 -1794 4976
$$ [...]
8191I2
##END NTUPLES=NMR FID
##END=
