##TITLE=1H_Ser EL-8
 CDCl3
 8 sc, 
 10.9.2024
##JCAMPDX= 6.0         $$ Bruker NMR JCAMP-DX V2.0
##DATA TYPE= NMR FID
##DATA CLASS= NTUPLES
##ORIGIN= UXNMR, Bruker Analytische Messtechnik GmbH
##OWNER= root
$$ XWIN-NMR		Version 3.5
$$ Tue Sep 10 14:42:06 2024 Russian Standard Time (UT+4h)  she@DPX200
##.OBSERVE FREQUENCY= 200.1318
##.OBSERVE NUCLEUS= ^1H
##.DELAY= (6, 6)
##.ACQUISITION MODE= SIMULTANEOUS
##.ACQUISITION SCHEME= undefined
##.AVERAGES= 8
##.DIGITISER RES= 18
##SPECTROMETER/DATA SYSTEM= spect
##.PULSE SEQUENCE= zg30
##.SOLVENT NAME= CDCl3
##.SHIFT REFERENCE= (INTERNAL, CDCl3, 0, 15.7039)
##AUDIT TRAIL= $$ (NUMBER, WHEN, WHO, WHERE, WHAT)
$$ ##TITLE= Audit trail, XWIN-NMR		Version 3.5
$$ ##JCAMPDX= 5.01
$$ ##ORIGIN= Bruker BioSpin GmbH
$$ ##OWNER= she
$$ F:/spectra/data/she/nmr/H-F/1/audita.txt
$$ ##AUDIT TRAIL=  $$ (NUMBER, WHEN, WHO, WHERE, WHAT)
(   1,<2024-09-10 14:40:31.56 +0400>,<she>,<DPX200>,
      <created by zg, POWCHK disabled, PULCHK disabled
       configuration hash MD5:
       00 E9 B6 7A A2 85 ED C7 34 08 36 98 17 FE 4E 26
       data hash MD5: 16K
       D9 9D DD 97 66 09 E3 2B 70 FC 40 B4 2C F5 5A D7>)
$$ ##END=
$$ 
$$ hash MD5
$$ 5E AD E5 8F 6E AA 49 7C B9 54 48 BA 09 C9 90 D0
##$RELAX= 
##$RELAX= 
##$RELAX= 
##$RELAX= 
##$RELAX= 
##$RELAX= 
$$ Bruker specific parameters
$$ --------------------------
##$DU= <F:/spectra>
##$EXPNO= 1
##$NAME= <H-F>
##$PROCNO= 1
##$TYPE= <nmr>
##$USER= <she>
##$AMP= (0..31)
100 100 100 100 100 100 100 100 100 100 100 100 100 100 100 100 100 100 
100 100 100 100 100 100 100 100 100 100 100 100 100 100 
##$AQSEQ= 0
##$AQ_mod= 1
##$AUNM= <au_zg>
##$AUTOPOS= <>
##$BF1= 200.13
##$BF2= 200.13
##$BF3= 200.13
##$BF4= 200.13
##$BF5= 200.13
##$BF6= 200.13
##$BF7= 200.13
##$BF8= 200.13
##$BYTORDA= 1
##$CFDGTYP= 0
##$CFRGTYP= 5
##$CHEMSTR= <none>
##$CNST= (0..31)
1 1 145 1 1 1 1 1 1 1 1 1 1 1 1 1 1 1 1 1 1 1 1 1 1 1 1 1 1 1 1 1 
##$CPDPRG= <>
##$CPDPRG1= <>
##$CPDPRG2= <>
##$CPDPRG3= <>
##$CPDPRG4= <mlev>
##$CPDPRG5= <mlev>
##$CPDPRG6= <mlev>
##$CPDPRG7= <mlev>
##$CPDPRG8= <mlev>
##$CPDPRGB= <>
##$CPDPRGT= <>
##$D= (0..31)
0 1.2 0 0 0 0 0 0 0 0.06 0 0.03 0 0 0 0 0.0002 0 0 0 0 0 0 0 0 0 0 0 0 
0 0 0 
##$DATE= 1725964831
##$DBL= (0..7)
120 120 120 120 120 120 120 120 
##$DBP= (0..7)
150 150 150 150 150 150 150 150 
##$DBP07= 0
##$DBPNAM0= <>
##$DBPNAM1= <>
##$DBPNAM2= <>
##$DBPNAM3= <>
##$DBPNAM4= <>
##$DBPNAM5= <>
##$DBPNAM6= <>
##$DBPNAM7= <>
##$DBPOAL= (0..7)
0.5 0.5 0.5 0.5 0.5 0.5 0.5 0.5 
##$DBPOFFS= (0..7)
0 0 0 0 0 0 0 0 
##$DE= 6
##$DECBNUC= <off>
##$DECIM= 24
##$DECNUC= <off>
##$DECSTAT= 4
##$DIGMOD= 1
##$DIGTYP= 9
##$DL= (0..7)
0 120 120 120 120 120 120 120 
##$DP= (0..7)
150 150 150 150 150 150 150 150 
##$DP07= 0
##$DPNAME0= <>
##$DPNAME1= <>
##$DPNAME2= <>
##$DPNAME3= <>
##$DPNAME4= <>
##$DPNAME5= <>
##$DPNAME6= <>
##$DPNAME7= <>
##$DPOAL= (0..7)
0.5 0.5 0.5 0.5 0.5 0.5 0.5 0.5 
##$DPOFFS= (0..7)
0 0 0 0 0 0 0 0 
##$DQDMODE= 0
##$DR= 18
##$DS= 0
##$DSLIST= <SSSSSSSSSSSSSSS>
$$ [...]
##$SUBNAM2= <"">
##$SUBNAM3= <"">
##$SUBNAM4= <"">
##$SUBNAM5= <"">
##$SUBNAM6= <"">
##$SUBNAM7= <"">
##$SUBNAM8= <"">
##$SUBNAM9= <"">
##$SW= 24.0689170037331
##$SWIBOX= (0..15)
0 0 2 0 0 0 0 0 0 0 0 0 0 0 0 0 
##$SW_h= 4816.95568400771
##$TD= 16384
##$TD0= 1
##$TE= 0
##$TE2= 300
##$TE3= 300
##$TEG= 300
##$TL= (0..7)
0 120 120 120 120 120 120 120 
##$TP= (0..7)
150 150 150 150 150 150 150 150 
##$TP07= 0
##$TPNAME0= <>
##$TPNAME1= <>
##$TPNAME2= <>
##$TPNAME3= <>
##$TPNAME4= <>
##$TPNAME5= <>
##$TPNAME6= <>
##$TPNAME7= <>
##$TPOAL= (0..7)
0.5 0.5 0.5 0.5 0.5 0.5 0.5 0.5 
##$TPOFFS= (0..7)
0 0 0 0 0 0 0 0 
##$TUNHIN= 0
##$TUNHOUT= 0
##$TUNXOUT= 0
##$USERA1= <user>
##$USERA2= <user>
##$USERA3= <user>
##$USERA4= <user>
##$USERA5= <user>
##$V9= 5
##$VALIST= <valist>
##$VCLIST= <CCCCCCCCCCCCCCC>
##$VD= 0
##$VDLIST= <DDDDDDDDDDDDDDD>
##$VPLIST= <PPPPPPPPPPPPPPP>
##$VTLIST= <TTTTTTTTTTTTTTT>
##$WBST= 1024
##$WBSW= 4
##$XGAIN= (0..3)
0 0 0 0 
##$XL= 0
##$YL= 0
##$YMAX_a= 247737
##$YMIN_a= -266173
##$ZGOPTNS= <>
##$ZL1= 120
##$ZL2= 120
##$ZL3= 120
##$ZL4= 120
##$ABSF1= 10
##$ABSF2= 0
##$ABSG= 5
##$ABSL= 3
##$ALPHA= 0
##$AQORDER= 0
##$ASSFAC= 0
##$ASSFACI= 0
##$ASSFACX= 0
##$ASSWID= 0
##$AUNMP= <proc_1d>
##$AZFE= 0.1
##$AZFW= 0.1
##$BCFW= 1
##$BC_mod= 2
##$BYTORDP= 1
##$COROFFS= 0
##$CY= 11.3945322036743
##$DATMOD= 1
##$DC= 2
##$DFILT= <>
##$DTYPP= 0
##$F1P= 15.6554695791079
##$F2P= 12.8336369535428
##$FCOR= 0.5
##$FTSIZE= 0
##$FT_mod= 4
##$GAMMA= 1
##$GB= 0.15
##$INTBC= 1
##$INTSCL= 1
##$ISEN= 128
##$LB= 0.24
##$LEV0= 0
##$LPBIN= 0
##$MAXI= 10000
##$MC2= 0
##$MEAN= 0
##$ME_mod= 0
##$MI= 1.114404
##$NCOEF= 0
##$NC_proc= 0
##$NLEV= 6
##$NOISF1= 3.799351
##$NOISF2= 2.8
##$NSP= 1
##$NTH_PI= 0
##$NZP= 0
##$OFFSET= 15.70392
##$PC= 1
##$PHC0= -25986.82
##$PHC1= 3.387475
##$PH_mod= 1
##$PKNL= yes
##$PPARMOD= 0
##$PSCAL= 0
##$PSIGN= 0
##$REVERSE= no
##$SF= 200.130013532006
##$SI= 16384
##$SIGF1= 3
##$SIGF2= 2
##$SINO= 400
##$SIOLD= 16384
##$SREGLST= <1H.CDCl3>
##$SSB= 0
##$STSI= 0
##$STSR= 0
##$SW_p= 3612.71676300578
##$SYMM= 0
##$S_DEV= 0
##$TDeff= 0
##$TDoff= 0
##$TI= <>
##$TILT= no
##$TM1= 0
##$TM2= 0
##$TOPLEV= 0
##$USERP1= <user>
##$USERP2= <user>
##$USERP3= <user>
##$USERP4= <user>
##$USERP5= <user>
##$WDW= 1
##$XDIM= 8192
##$YMAX_p= 0
##$YMIN_p= 0
$$ End of Bruker specific parameters
$$ ---------------------------------
##NTUPLES= NMR FID
##VAR_NAME=  TIME,          FID/REAL,        FID/IMAG
##SYMBOL=    X,             R,               I
##VAR_TYPE=  INDEPENDENT,   DEPENDENT,       DEPENDENT
##VAR_FORM=  AFFN,          ASDF,            ASDF
##VAR_DIM=   8192,          8192,            8192
##UNITS=     SECONDS,       ARBITRARY UNITS, ARBITRARY UNITS
##FACTOR=    0.0002076,     1,               1
##FIRST=     0,             0,               0
##LAST=      1.7004516,     0,               0
##MIN=       0,             -266173,         0
##MAX=       1.7004516,     247737,          0
$$ Real data points
##PAGE= N=1
##DATA TABLE= (X++(R..R)), XYDATA
0 0 0 0 0 0 0 0 0 0 0 8 -8 8 -16 16 -17 24 -32 35 -41 48 -58 69 -80 93 -109 125 -141 161 -184 209 -236 266
32 266 -300 334 -374 419 -465 521 -577 640 -711 785 -870 962 -1066 1178 -1308 1451 -1616
49 -1616 1802 -2018 2271 -2570 2932 -3383 3954 -4705 5730 -7176 9203 -19719 247737 -25207
63 -25207 -196161 199215 -3203 -159424 137107 35125 -132194 84672 13683 -86430
73 -86430 59210 -8342 -61154 83765 -9584 -65006 65920 5882 -46145 46171 -12604 -27943
85 -27943 50610 -25838 -47580 40635 -3687 -16933 37668 -15945 -30965 30852 13575 -4347
97 -4347 128 -15926 11143 8779 -41038 7574 43551 -31466 -21447 41147 -9613 -25882 40402
110 40402 10087 -41514 8208 28089 -19340 -22589 8089 15124 616 -11637 -1509 5231 -1795
123 -1795 12559 13777 -17356 -9646 12753 -7475 -8457 9422 -3122 -1799 4153 -14365 4925
136 4925 24890 -6285 -6858 5761 -10517 6160 8477 -23626 3200 16309 -17949 2675 9976
149 9976 -18843 16284 23680 -20900 -4163 8570 -9174 8137 -2684 -15065 17375 -6720
161 -6720 -21691 24452 889 -14387 32841 -8465 -33130 31971 4134 -27401 22440 -7433
173 -7433 -25051 29069 -7433 -24459 33068 -264 -16462 25403 -16057 -15275 35564 -14285 -22041
186 -22041 26713 -15105 -16738 26194 -11693 -8473 28038 -10172 -10572 14333 -11169 7819 15165
199 15165 -28961 -244 18933 -23665 3925 20386 -20931 6455 19310 -22246 4041 17332
211 17332 -15597 7096 5153 -25940 9572 14026 -21879 6755 15185 -14675 4538 9164 -12068
224 -12068 8153 10429 -13714 -1241 2066 -11064 6338 7611 -11813 1635 11132 -5125 -2648
237 -2648 8478 1240 41 325 -8812 -2770 4745 -4484 308 5917 -8089 -882 14031 -4716
251 -4716 -5508 15483 -1977 -11811 5227 -4174 -5530 10348 -6889 -7192 12971 -7322 -4351 19830
265 19830 -6438 -9143 19406 -8188 -16597 15666 -1162 -11999 10143 -5150 -8929 13241 -323
278 -323 -4828 11699 -1615 -6057 6968 -4182 -5618 5934 -2052 -4882 -224 -2447 3024 4486
292 4486 -1391 3632 2374 -3247 241 -590 -703 1799 -5216 -1065 1077 -6746 5195 8812 -7486
307 -7486 2581 7662 -7933 1815 5481 -7966 2637 1185 -10627 4685 2194 -7484 10549
320 10549 2331 -10536 10930 2241 -11675 10707 1050 -13223 8920 -2310 -13146 12565 1888
333 1888 -10304 12103 244 -9747 12659 -276 -9147 9731 -4311 -9564 8194 -4898 -5250
346 -5250 11319 -3869 -4094 10042 -3455 -2290 9582 -3994 -4301 5064 -6288 -3268 5708 -3947
360 -3947 -716 5691 -4167 -145 7089 -1822 -258 4313 -3955 -3556 1929 -2294 -3061 2415 904 -3192
376 -3192 1817 4704 -2704 1271 7326 -5203 -4076 6805 -6317 -5836 8665 -4477 -6092 9067
390 9067 -2211 -3935 10134 -1517 -3324 7598 -4933 -4663 6444 -5070 -3710 6402 -5879
403 -5879 -2233 8001 -4223 168 9176 -5749 -1470 6926 -7412 -2281 6352 -6850 -2685 5195
417 5195 -4283 491 5286 -1788 2232 2846 -3400 1860 1124 -4586 1215 761 -5092 129 2375 -1203
433 -1203 574 3760 1235 -1455 829 2059 -2310 -1219 2490 -3862 -3377 3506 -1805 -1768 5911 -894
449 -894 -2109 5564 -1353 -1861 4501 -3334 -3137 2949 -5019 -1001 4822 -4717 1442 6216 -4483 1408
465 1408 5443 -5946 1543 4114 -7537 1 3128 -6566 2095 4106 -5213 3471 3607 -4690 4119
480 4119 2757 -5389 3596 366 -7721 3212 2005 -5663 2073 2871 -2442 2337 1923 -318 1008
495 1008 -1022 558 -65 -4529 431 1443 -3544 1524 1282 -1758 4034 97 -2218 5235 -1127 -4017
511 -4017 4463 -3126 -4666 5025 -2753 -3755 5615 -2103 -405 7518 -5214 -1149 9731 -6333
525 -6333 -4707 8243 -5804 -4816 6887 -4288 -1951 6579 -3411 1637 5358 -6645 3558 6549
539 6549 -10886 131 7808 -8584 -1392 6116 -6173 1520 5941 -4942 2451 4406 -5999 3313
553 3313 3566 -10063 1514 6367 -7984 -1040 5775 -3750 971 4344 -3782 2437 4878 -5788
567 -5788 324 4289 -7287 -854 6058 -6132 -4119 7563 -237 -3654 4035 395 -130 3212 -4655
582 -4655 -1232 5446 -6568 -3235 8040 -6405 -4362 11975 -2820 -6861 9911 565 -5509 5191
596 5191 -3722 -3208 7780 -6784 -5046 9673 -4802 -4002 10921 -4004 -4810 10254 -2750 -5015
610 -5015 6234 -4198 -1679 6061 -9138 -1755 9973 -5543 -2233 8123 -3665 -45 5742
623 5742 -5581 508 3390 -6490 2936 1259 -9878 5627 7122 -9266 1676 7675 -4308 570
637 570 2323 -3838 2764 -108 -4919 3191 -1905 -3933 7080 -121 -6151 6022 2683 -3788 2571
652 2571 -1406 -1300 4037 -4850 -3543 4795 -2254 -775 4421 -3616 261 5927 -3210 -832 2837
667 2837 -4123 844 2643 -7450 -518 6253 -3268 -2110 3444 -141 1752 2032 -2214 1354 742
682 742 -3447 1900 -766 -5848 4209 3929 -6242 490 5433 -1707 4 2326 -2754 614 1996
697 1996 -4342 -1259 1996 -2458 826 2513 -4418 1195 6709 -2841 -1664 4231 -3558 -570 3647
712 3647 -7045 -1626 7692 -5081 -3620 7083 -1880 -1392 6830 -3286 -3151 5347 -2981 -1731 2888
727 2888 -5941 1422 6140 -8478 -602 9880 -4646 -1222 7402 -5446 -1240 6856 -6034 -1857
741 -1857 4638 -5319 919 3884 -7074 3748 7186 -6331 1108 4569 -4940 2555 2214 -7750 2481
756 2481 3114 -6711 2557 2767 -4588 4578 3243 -5356 2134 2658 -2447 1740 -2340 -3490 5213 -1906
772 -1906 -5053 5237 951 -2962 4105 240 -3031 3041 901 -1924 -1202 -1939 1168 1087 -3410 360
788 360 3307 -703 -34 861 -737 2018 826 -2010 375 -1323 -1457 2505 -1433 -2574 3491 1001
804 1001 -1685 2220 -272 -50 3097 -2797 -3099 3143 -1356 -2536 2921 -801 -2007 3683 366 -2218
820 -2218 1825 1470 -55 64 -2408 -522 2167 -1856 -2078 1921 -2 -1056 2954 455 -1672 2942
836 2942 1069 -2546 -407 -79 -1107 1282 -1159 -2821 3012 1102 -2591 2742 1620 -2329 2257
851 2257 435 -4377 2020 1490 -4309 1693 226 -3738 4662 1726 -5229 4786 2403 -4840 3155
866 3155 596 -4997 3499 62 -5520 3295 253 -3756 5616 -247 -4036 6096 -239 -5740 4899
881 4899 -684 -4589 4463 -1870 -5295 5686 -615 -3509 5704 -1512 -2709 5878 -1985 -3736 4814
896 4814 -2053 -3224 3208 -2698 -1545 4792 -1968 -708 4092 -1888 -406 3265 -3162 -289 2668
911 2668 -3459 -1181 1853 -1841 1015 1597 -2153 1448 1785 -1339 1634 221 -2547 1358 -473 -2698
927 -2698 1200 -142 -1335 2196 118 -590 2640 -412 -814 1664 -1081 -1131 1030 -1872 -1035 1770
943 1770 -899 -424 1486 -777 654 2032 -853 -490 1004 -1620 -812 1157 -1440 -490 1601 -741
959 -741 -185 1800 -34 -72 1542 -529 -999 771 -1307 -1771 1504 -506 -1324 2156 64 -1302 2546
976 2546 1012 -1489 1832 -245 -2683 1897 -674 -3084 2444 -851 -2356 3289 -127 -1753 3917
991 3917 -858 -2411 3584 -1443 -3053 3440 -2114 -2978 4212 -1606 -2577 5353 -1231 -2697 4982 -2118
1007 -2118 -2825 4582 -2276 -3263 4406 -3020 -2758 4891 -2452 -1626 5614 -2023 -1448 5244 -2539 -2083
1023 -2083 3856 -3178 -1671 3012 -2794 -805 3414 -2082 -41 3404 -2106 -110 2673 -2479 -381
1038 -381 1701 -2403 -520 1280 -1902 917 1785 -1796 1136 1819 -1211 533 1174 -1663 -232 -46
1054 -46 -1508 -330 139 -413 694 449 -111 843 862 -127 -108 177 -204 -1139 -335 459 -752 114 826 -280
1074 -280 457 954 -176 657 272 -1544 256 150 -1890 -53 1070 -1170 207 1272 -90 1423
1090 1423 821 -559 830 -59 -1738 724 -732 -1797 873 330 -1170 777 727 596 1256 -370 -189
1107 -189 652 -971 -697 356 -601 -771 470 -151 205 439 433 1126 -356 -751 724 -400 -1221 623
1125 623 -818 -734 713 -862 404 1841 -1105 420 2657 -1446 -214 2107 -2091 -1023 1553 -1820
1141 -1820 -399 1074 -1593 1005 1818 -1695 1041 2452 -2195 179 1653 -2121 -842 1096 -1332
1156 -1332 306 880 -916 1270 1071 -1321 1522 1154 -1954 -37 681 -1437 -438 109 -538 628 64
1173 64 78 1108 -133 -277 694 8 -491 -130 -628 -302 -651 -616 650 439 -509 781 502 146 189 -180
1193 -180 449 125 -1576 252 435 -2133 328 1548 -1265 428 1766 -800 341 748 -1679 898
1209 898 145 -2937 1300 697 -2375 1531 1190 -1893 1886 1562 -1758 1103 210 -1906 1499 -336
1225 -336 -2632 1653 371 -2324 1378 1008 -1096 1571 499 -1300 1145 -537 -1034 1043 -981 -1566
1241 -1566 1953 -123 -2093 1417 1233 -369 291 -45 -210 137 -534 -780 111 -396 -557 753 184 -593
1259 -593 738 1523 -213 -484 938 265 -1276 -659 -173 -556 -244 -112 -342 829 245 0 1677 -201
1277 -201 -664 988 -441 -1388 251 -164 -242 230 -1073 206 2085 -703 -381 1590 -647 -727 1060
1294 1060 -743 -1169 72 -342 97 -267 -368 1814 822 -1106 422 996 -735 -8 279 -990 -406
1311 -406 19 -229 108 -325 797 1348 -685 -165 874 -100 -277 -124 -1134 304 260 -1413 368 583
1329 583 -538 1440 788 -1109 1095 698 -936 568 -1016 -1286 1933 -884 -2380 2617 643 -1642
1345 -1642 2206 237 -1346 2458 -169 -1867 1246 -1233 -1194 2022 -1105 -1505 3021 -626 -1657 2621
1361 2621 -185 -1001 1773 -1295 -1612 1637 -983 -1034 1347 -1417 -131 2419 -1211 -584 2208 -566
1377 -566 -492 741 -1573 -173 1176 -1445 -701 1127 -826 -146 1032 -544 -101 1555 -114 -1082 184
1394 184 -465 -121 189 -1097 -436 1707 -49 -399 1305 285 -179 883 -513 -1083 593 460 -740
1411 -740 47 149 -46 865 -168 -296 1279 413 -1086 683 -363 -781 966 -1007 -1363 812 -133
1428 -133 -431 1186 -302 -318 1887 -287 -931 993 -618 -577 121 -1198 -363 1442 -903 -186 1026
1445 1026 -384 956 1141 -1598 160 1063 -1176 -16 -223 -1155 1208 159 -1446 1406 639 -764
1461 -764 1421 -491 -1258 1606 -155 -1741 1011 -403 -1072 1979 -650 -873 2387 -532 -682 1423
1477 1423 -827 -624 1720 -1382 -1462 2031 -1205 -561 2003 -1544 -77 2558 -898 -772 1750 -1485
1493 -1485 -499 1227 -2137 -250 2137 -1823 -642 1738 -1056 104 2033 -1598 -197 1840 -1523
1508 -1523 -707 1226 -1177 10 1450 -1492 -250 1800 -600 40 1452 -1160 -315 1197 -1804 -621
1524 -621 1076 -1114 -80 1104 -950 -229 1858 -588 -598 1292 -899 -734 797 -1516 -745 1157
1540 1157 -967 -692 1320 -637 -228 1917 -1072 -560 1515 -994 -1195 952 -1175 -927 1338 -1088
1556 -1088 -293 1894 -478 -245 1307 -887 -184 1370 -1585 -481 1047 -1462 -438 1065 -1342 339
1572 339 1949 -1155 1 1595 -1085 183 713 -1879 60 464 -1556 345 947 -819 1091 852
1588 852 -846 908 457 -932 494 4 -1133 619 -319 -991 1004 71 -379 1193 -206 -241 1248
1605 1248 -572 -548 472 -1000 -417 571 -1076 -260 1099 -614 -6 1165 -787 -74 539 -1140 -138
1622 -138 503 -947 -142 487 -923 154 864 -698 880 673 -976 393 491 -989 -258 384 -981
1639 -981 208 549 -767 568 795 -219 417 576 -781 262 514 -1022 -182 -37 -761 -146 691 -167
1657 -167 35 894 -434 142 835 -635 -390 551 -799 -704 901 -639 -383 1052 -157 11 1111 -560
1675 -560 -34 1072 -952 -640 766 -964 -646 922 -732 -198 1091 -736 70 1355 -818 -12 1035
1692 1035 -1207 -395 978 -902 -290 1053 -762 268 1050 -751 469 768 -1205 31 384 -1407
1708 -1407 -20 539 -712 -21 865 -478 727 324 -393 511 480 -1041 368 79 -1289 138 222 -473
1726 -473 19 357 -9 587 59 460 489 -352 -151 103 -421 -241 -200 -330 287 -141 -31 706 170 -214 115
1747 115 115 -290 -357 -217 -204 189 -519 -39 826 -239 402 1194 -192 -113 658 -391 -326 165 -427 -119 366
1768 366 -722 128 961 -481 11 969 -156 51 188 -577 -482 -165 -429 47 198 -28 347 466 24
1787 24 258 606 -158 -426 63 -107 -429 84 134 -167 81 451 506 130 112 -178 187 216 -624 10 418 -671
1809 -671 -85 350 -284 49 525 -67 412 6 -192 402 17 -963 -118 -98 -827 -22 417 -470 402 486 -277
1830 -277 475 142 -785 601 135 -968 446 -67 -790 416 453 -462 745 180 -279 640 -161 -116 464
1849 464 -187 -1012 205 -197 -374 152 483 41 344 -100 197 383 -425 -331 -425 -21 -57 -14 63 -146 -82 478
1871 478 296 -45 535 652 -32 87 -142 -546 -146 129 -439 470 7 -505 733 350 -444 590 348
1890 348 -671 88 264 -818 357 -295 -241 134 104 -271 980 479 -235 714 -342 -479 123 -48 -150
1909 -150 219 -391 -336 588 -202 -121 555 -47 -162 166 -461 -418 -187 -411 -313 172 -142 178 127 -136 -17 521
1931 521 133 -346 -117 -171 83 -526 -206 46 -348 194 409 -170 230 257 -89 310 -285 -229 258 -246 -631
1952 -631 -29 88 -270 339 -61 -193 548 120 -263 189 -402 -558 416 -311 -704 226 329 -278 402 48
1972 48 202 730 -42 -111 319 -271 -370 363 -420 -224 567 103 112 618 142 88 -181 -45 -277 -66 -336 -554
1994 -554 -208 234 18 126 28 69 239 472 -255 -239 117 32 -216 -222 -233 -182 503 -97 -66 760 -43 -79 572
2017 572 -477 -316 502 -291 -579 487 -163 -127 630 -782 357 747 -308 -143 357 -508 126 659 -985
2036 -985 -344 357 -668 53 531 -313 407 881 -522 -106 333 -688 -14 -43 -675 193 672 -650 80
2055 80 215 11 237 325 -485 101 331 -407 -380 -205 -392 327 181 -41 758 214 -143 293 145 -194 153
2076 153 -95 -696 -125 74 -218 -185 -12 123 235 107 199 -202 120 127 -129 -98 74 -152 -128 -51 -239 225
2098 225 361 -151 293 49 -195 451 192 -472 -16 -24 -23 222 117 32 351 500 -87 325 -170 -59 -142 -259
2120 -259 -377 -262 -339 66 13 40 266 427 -187 31 319 154 1 -169 -267 -84 103 -670 157 54 191
2141 191 386 -119 -44 603 57 -166 182 -547 -336 30 -746 20 634 24 24 229 -314 437 608 -506 92
2162 92 -61 -333 -21 451 -499 43 389 -343 285 509 -404 428 49 -623 -30 -45 -772 144 -41 -211 373
2183 373 142 -759 514 411 -883 70 -75 -562 184 -168 -475 -12 -47 -116 243 -330 10 423 -26 -57
2203 -57 103 14 -85 169 13 -270 212 65 -229 182 85 136 32 -126 -363 -164 229 -427 -468 163 18 -91
2225 -91 396 50 -262 481 140 -235 163 -83 -146 306 -307 -608 142 -219 -274 485 -54 -96 580 -313 -142
2246 -142 152 -414 -277 -162 -113 -80 157 120 123 228 -131 343 310 -282 -261 -260 -339 -302 2 -311 91 -100 186 -15
2270 -15 -1 -55 183 -179 38 19 -248 -245 -266 -56 -96 50 -70 155 272 -488 303 -13 -143 -42 -129 -511 -42
2293 -42 -53 -345 326 -70 -295 391 -75 -188 229 -93 -473 449 -131 -366 -25 -256 -59 468 -134 -57 427
2314 427 -485 233 564 30 -227 367 -274 -197 223 -288 43 423 -154 160 579 -189 130 -58 -212 6
2334 6 -102 -120 -345 268 10 7 174 -11 367 217 -238 -88 -229 -35 -166 -77 53 -110 265 220 152 89 219
2357 219 245 -22 -86 54 -173 -85 -173 -184 126 -95 -296 332 224 302 343 39 -287 -191 107 -180 -96 -152 122
2380 122 201 -251 82 100 7 -151 121 14 -167 155 -274 39 44 -142 267 216 -46 -136 142 182 118 -254 -217
2403 -217 20 -84 -184 -18 -210 329 -78 -5 113 74 162 117 -110 -188 193 -158 -71 5 -243 32 243 -31
2425 -31 20 136 -124 413 181 -635 -102 367 -168 -102 65 -333 -194 240 -182 129 400 -270 73 70 -582 -17
2447 -17 -24 -163 17 212 -35 303 83 38 381 -125 -79 -16 206 -2 -192 99 -195 -73 209 -190 -133 77
2469 77 -76 342 -29 -103 -126 -160 -538 -37 197 128 -174 -238 184 82 -189 -172 -59 -181 180 -250 45 54 -420
2492 -420 170 116 -191 196 132 -363 286 -19 16 336 70 -288 -196 -65 -319 207 -113 -182 -24 102 -118 356
2514 356 -10 -182 90 -305 -293 -132 -225 -163 237 -239 -72 552 136 20 192 -64 -17 164 -400 -352 -106 41
2536 41 -144 185 81 -63 379 -18 253 -84 -79 -101 -303 -246 -141 -246 -169 52 -200 256 288 -9 -18 12 37 -258
2560 -258 15 -285 -153 44 -432 -155 241 143 290 -30 -170 442 137 -413 60 -11 -94 -215 -8 294 -38
2581 -38 -137 219 211 118 -91 160 -246 -255 101 -70 -20 -133 -199 24 319 7 89 335 32 405 105 -183 66
2604 66 -41 99 -271 -269 6 -184 -255 188 344 -35 53 -83 -172 49 -294 -120 -111 6 -177 260 -22 -291 173
2627 173 -272 -195 189 261 -309 -303 -471 -307 134 -122 -217 302 49 79 125 114 -135 135 56 -138 143 -327 -31
2650 -31 144 -198 333 344 -65 -68 197 -52 -267 -14 -495 -253 277 -236 -44 230 62 92 105 124 159 174 -6
2673 -6 243 -67 -321 -76 177 48 -172 255 325 194 -319 487 269 249 -90 185 -346 -190 -42 142 -12
2694 -12 106 58 114 96 -299 125 -10 100 -19 -242 -162 -103 -75 57 -46 129 60 574 133 -252 127 -97 -322
2717 -322 271 -117 -102 78 -227 -221 123 172 74 423 -82 88 253 -71 -21 83 -50 -146 -137 -92 -181 -80 -189 353
2741 353 376 -36 -43 -115 15 64 -164 -524 -352 -84 154 165 -154 -31 -171 374 129 -115 60 -30 -239 -60
2763 -60 133 -100 162 242 -55 -124 306 159 44 -144 -107 105 380 -534 24 27 -57 402 123 -271 -82 224
2785 224 -82 194 -13 -103 120 -325 -445 -14 20 -98 -97 306 195 301 27 124 9 -324 -34 214 -421 -311
2807 -311 239 -107 -73 -73 231 124 173 -120 -60 87 -185 -153 238 -26 -189 -187 -92 169 378 316 80 -85 -154 -92
2831 -92 -153 -346 24 435 163 259 238 91 159 -254 -143 74 15 -19 -134 -271 -209 181 56 102 -297 -37 119
2854 119 93 -162 165 25 180 -454 1 -200 -56 113 -350 -21 155 62 307 90 -226 247 230 -12 -37
2875 -37 -191 7 172 -168 161 96 110 -91 57 -96 74 -78 159 -176 114 -5 20 5 197 315 292 257
2897 257 73 -101 69 -5 -215 135 -153 -168 21 93 -235 358 329 -350 178 131 50 206 182 9 52 89 108
2920 108 391 93 -199 70 72 174 86 -176 -230 194 -229 -393 108 -42 -254 196 -61 -55 238 79 -82 246
2942 246 -7 -161 -90 -83 -384 43 -25 141 90 -257 190 -14 -49 206 266 40 -238 148 237 -67 88 -89 93
2965 93 204 -44 135 -171 65 139 -120 6 -275 -141 -382 84 -303 238 -65 -23 -15 90 7 20 41 22 -69
2988 -69 -348 150 198 -33 -230 315 96 -18 229 60 -9 -23 -68 -258 21 180 -20 -124 31 212 107 -66
3010 -66 121 143 -119 189 -212 -269 -79 211 -67 -180 78 -342 4 147 232 276 108 -13 -37 -247 -210 176
3032 176 -245 -94 -222 132 120 -23 -25 62 -144 -65 401 -204 -68 -67 -168 -137 83 -355 116 238 -225 71 201
3055 201 32 238 135 -216 -17 -37 -338 -8 121 327 129 301 -81 -154 81 -209 108 38 -198 36 -118
3076 -118 -337 179 24 244 -119 -54 -177 270 15 -415 -64 46 -61 -188 -142 37 -71 140 221 335 199
3097 199 236 -24 -10 -30 85 59 -100 -121 10 141 187 -58 -68 116 6 400 -37 -63 54 -183 112 97 -196
3120 -196 15 87 23 250 178 213 191 91 -89 -76 -94 -120 -124 -119 4 49 -247 -152 356 78 299 -12 -232 -59 10
3145 10 6 -160 -104 -246 -3 -76 -99 102 -51 247 307 -211 -103 -33 112 23 16 130 44 -125 -89 124 156 -87 176
3170 176 256 -259 -91 -125 -249 191 -150 -264 110 191 80 221 319 133 -104 -46 -179 186 -91 -218 24 167
3192 167 48 235 213 188 -10 -88 -84 27 21 -247 118 27 -92 -104 8 -47 60 228 -88 48 135 107 40 -143
3216 -143 -156 116 -41 -102 -97 3 -56 169 -84 -97 248 1 -387 -20 -112 53 -3 -98 -186 42 146 94 134 -23
3240 -23 -42 -16 5 34 -9 -15 -171 -332 14 120 158 461 -14 -2 -142 34 -93 253 -87 -185 2 164 11 -226
3264 -226 -3 -48 69 30 111 -96 243 -427 -157 109 16 81 -185 -13 -112 -34 -71 108 -31 -8 -67 54 -243
3287 -243 -120 317 420 -166 -49 -193 209 23 444 50 -106 102 -8 -168 -104 201 47 -3 139 133 -44
3308 -44 13 227 -26 97 170 -308 -57 0 -50 -53 -177 -195 161 400 231 38 125 -37 -51 239 -51 -24 150 -187
3332 -187 -43 63 -133 147 8 -234 -242 -88 -303 58 -239 -23 100 -139 -156 -335 122 -56 82 323 -70
3353 -70 -229 -332 -104 -256 13 -207 -218 -156 -77 11 -62 37 -272 260 398 -36 -49 -27 323 243 -29 -251 -129
3376 -129 83 6 182 -1 220 175 135 -59 86 15 -241 221 130 -160 279 8 -183 -105 267 196 -93 -253
3398 -253 27 -92 88 -151 -30 -2 -6 92 48 115 58 49 -85 -43 -174 -125 -53 1 -355 31 149 -81 53 0 -17
3423 -17 238 -17 -144 249 54 174 198 -92 -36 -415 66 -20 73 74 48 253 -16 79 -73 -215 -468 -87 -37
3446 -37 -4 -15 46 121 -286 146 -5 64 386 120 -121 -22 -6 -120 73 -192 -288 85 166 -160 -169 -68 135 185
3470 185 -118 -16 -88 -50 -354 47 56 -40 394 86 -40 -232 82 221 -262 -27 -174 131 96 -236 285 -69
3492 -69 185 -212 5 257 -130 117 -150 -210 -1 81 -36 -251 198 16 -173 313 437 185 39 189 -187
3513 -187 -57 -145 -36 -69 -122 -107 230 -357 249 311 98 -96 1 -270 210 -91 -66 -98 259 62 -168 -184 214
3536 214 86 29 300 -79 105 -257 -112 91 -384 17 205 133 159 -6 79 -272 -53 -254 231 -128 -249
3557 -249 53 116 -207 34 46 -54 205 36 299 159 -27 34 -3 -73 -423 155 80 -25 267 166 44 440
3579 440 129 -1 79 -39 -37 -298 -263 -92 -157 109 -206 -70 65 -95 322 -96 -182 68 51 14 52 48 29 -152
3603 -152 55 78 44 -37 174 100 -20 -245 51 249 54 128 -284 -221 45 12 -91 18 169 -178 102 3 179
3626 179 -257 -40 -111 160 -82 -344 140 83 16 153 -48 34 15 200 29 -153 -140 -398 73 -199 -549 24
3648 24 184 142 280 -87 118 141 -173 65 73 -417 54 -104 48 3 -179 12 225 1 76 -136 111 -97
3670 -97 -1 -57 -252 3 69 -74 59 21 172 275 -105 -66 -420 -90 -39 -284 7 -76 4 -65 -50 115 -24 236
3694 236 256 -155 140 -117 132 -98 -283 77 -80 -82 26 17 170 25 67 54 -212 61 175 -124 -474 -206
3716 -206 230 -24 201 -53 156 152 -76 56 31 40 -87 97 4 -26 -176 -12 46 182 -139 -91 132 158 303
3739 303 56 93 -375 -173 159 -70 80 -155 346 2 146 -38 247 -298 -17 317 -73 72 242 -129
3759 -129 19 183 55 -367 403 -207 -234 147 -9 122 2 109 25 462 -130 -201 116 -69 28 38 -77 234
3781 234 -8 111 115 -131 -361 -163 -343 -328 247 -218 188 164 96 154 33 -88 -203 -100 -239 -188 28 104 107
3804 107 250 408 65 364 164 93 110 -10 154 169 -115 9 24 28 140 -4 23 -9 -10 -88 -74 260 -124 -154
3828 -154 -122 -19 -278 5 -57 -195 147 137 23 -292 -64 -170 48 -81 117 -49 -114 -47 36 19 -315 -6
3850 -6 96 -43 162 22 -121 42 -321 -296 -29 -138 -169 -40 127 14 -44 -177 -77 -250 -241 -247 -340 -84 -94 101
3874 101 -75 -127 232 -52 280 171 -203 -44 301 -101 46 -155 -449 -322 63 406 28 -98 -13 188 -77
3895 -77 115 -217 118 -268 -202 121 156 84 -50 45 -245 225 -246 -282 16 98 -112 -20 20 -32 -218 -316 -116 154
3919 154 5 408 -166 -15 313 112 -106 142 -15 -153 -98 202 -154 -45 221 -9 215 297 4 -65 -225
3940 -225 -95 79 83 36 192 -53 -325 90 135 200 46 -34 -170 -7 67 -162 1 -246 8 299 45 201
3962 201 48 -3 42 264 246 66 -202 127 -126 -91 -259 -177 -168 252 5 -2 9 303 -25 -330 -50 53 83 -217
3986 -217 -131 -29 -49 79 20 134 278 47 234 174 -148 193 275 -116 98 -156 -183 167 307 -241 -44 -452
4008 -452 391 -97 -159 11 73 -101 -124 -155 -84 16 -312 276 142 -87 344 -239 -34 -3 -262 39 13 -55 -132
4031 -132 70 63 106 106 -188 -21 143 -42 -142 -92 -199 116 113 -127 -205 -117 230 -155 -29 -5 -118 199 301 -110
4055 -110 -203 61 40 -313 -235 -3 8 240 -42 -45 120 -12 85 -8 -73 202 73 -178 114 -60 -137 175 222 28
4079 28 -115 36 5 253 -76 22 101 26 -213 88 101 141 54 -410 257 -140 -141 -251 -135 31 -56 -43 84 267
4103 267 2 -127 281 -238 -150 131 161 -148 -44 -171 -125 30 -124 -66 22 119 -90 14 -17 339 7 68 -234
4126 -234 -38 -324 34 88 -331 -252 -216 -103 -30 54 -271 132 -120 77 -143 -103 -97 -78 150 3 27 36 -41 196
4150 196 -61 -93 -104 -68 -2 118 -22 124 150 88 464 -198 -33 39 230 369 -19 55 99 -80 72 -100 108
4173 108 51 -269 13 -3 232 3 -143 -19 81 -19 295 -49 85 -314 -313 205 -161 34 45 -111 -120 -175 35
4196 35 47 400 59 -278 -110 18 93 -254 118 89 -134 120 -204 -148 -84 -172 -117 -117 -19 212 61 -159 -313 -303
4220 -303 -361 35 94 280 266 -164 36 -1 18 40 219 -165 -77 -148 -62 -202 55 1 90 -55 -145 -87 -135 406 341
4245 341 60 88 146 32 -43 -62 32 -180 -161 -190 -9 -153 54 142 -175 -39 -170 283 59 201 -303 7 56
4268 56 -82 -345 102 161 -37 -31 89 -209 63 24 24 206 -156 149 -178 -214 -196 139 124 84 65 153 101 112 4
4293 4 -165 -116 32 35 -209 -176 -32 -41 68 -10 -83 -36 230 19 222 -235 56 187 33 -84 161 -315 190 -138
4317 -138 -166 100 2 -43 -102 110 118 224 12 -106 -104 -221 352 -102 -155 -208 8 29 70 -104 144 109 -7 97
4341 97 10 29 -271 222 60 -39 109 13 158 -33 -5 184 -126 -323 63 -194 -61 -347 -169 -212 -108 170
4363 170 -114 -54 5 86 -19 105 254 179 228 -88 63 -24 83 121 -93 42 187 9 -321 190 413 -95
4385 -95 146 104 322 -52 82 -248 168 1 -16 250 122 -176 78 25 68 -117 -233 -35 194 71 -216 68
4407 68 -39 209 -98 -240 -93 77 105 -151 -60 114 -301 -122 106 13 66 -91 128 188 -76 -54 -133 -76 -79 65
4431 65 93 -59 -84 -65 177 -40 -43 -68 166 -136 12 -344 -126 295 44 210 54 103 -88 -71 41 -113 -236
4454 -236 -9 189 148 120 75 -26 87 -123 -122 200 -147 -124 21 228 -159 70 -128 86 -91 112 -25 24
4476 24 44 -107 45 28 -237 -138 -173 -1 234 -313 -93 121 -221 -50 55 178 -22 69 -95 -2 299 -229
4498 -229 -100 -115 429 -73 -70 119 101 -61 -190 -119 50 -72 -193 -8 11 -219 -45 128 101 69 -244 -140 -126
4521 -126 -26 90 29 46 -306 -84 11 267 160 -142 214 -228 319 -3 -192 -64 176 235 84 142 151 201 -213
4544 -213 91 -44 36 -18 201 209 -53 22 42 33 -334 -371 -105 106 5 -50 -275 94 -372 -4 -154 -195 -3 -59
4568 -59 -56 -237 10 55 70 13 169 92 8 -97 -2 318 70 -401 -204 -271 -30 145 29 195 173 143 -246 215
4592 215 148 60 385 -130 -75 186 -2 31 188 -49 -92 358 21 68 -57 73 154 99 -237 -156 378 202 -5
4615 -5 -240 132 36 103 -112 7 -252 -411 -268 -31 -62 125 -17 346 -44 119 88 -107 -210 -40 -254 128
4637 128 -131 -164 -116 -229 212 -314 59 -53 411 -117 -159 -37 -102 115 -268 74 -333 -183 27 101 -259 88
4659 88 50 -104 6 -92 -159 115 346 44 52 98 -73 94 172 5 -10 -104 60 -106 -118 14 -48 92 276 49
4683 49 116 144 134 64 -249 -117 223 119 139 -31 38 41 -16 136 -67 18 -205 -187 -248 -242 360 114 -119 87 -105
4708 -105 -146 -191 -58 35 -96 -153 -49 81 313 10 94 88 144 218 -177 110 128 -82 347 -202 -242 35 167 30
4732 30 34 12 -7 -42 -254 -122 22 82 -213 -122 -325 -31 -170 -271 -131 18 -228 147 17 194 107 169 273
4755 273 -58 -64 -42 124 244 118 36 30 37 15 30 -73 8 -70 -217 87 -131 38 68 -110 88 -15 -9 35 -112
4780 -112 -172 168 -1 81 59 -15 54 -151 90 -205 -99 191 100 -116 -22 -14 -41 138 134 -116 114 -27 164 -7
4804 -7 146 -175 -34 175 132 -321 -52 32 -105 -106 -94 -36 235 24 -220 -55 3 -146 -315 249 -194 -164 -132 85
4828 85 -128 -107 18 103 12 161 60 -76 -18 -44 101 -86 -324 0 177 -193 -14 227 118 264 -140 -128
4850 -128 -72 57 -66 -79 -27 -88 34 -54 45 78 158 225 -13 12 130 -83 -70 12 -185 96 -205 46 -43 135
4874 135 -14 101 -142 -240 -142 144 -177 126 112 -127 91 123 35 203 -68 178 -176 149 38 -349 -99 -193
4896 -193 49 131 161 92 -42 -133 264 302 103 37 -138 -279 54 44 -301 -123 202 -79 75 -217 196 29
4918 29 -34 -165 -34 -78 -323 -83 -26 -434 -54 138 110 -86 -55 72 162 42 -18 126 -30 145 -49 -285 77
4941 77 145 -181 168 -84 -17 -202 49 -111 82 -108 -16 187 -155 -228 140 29 -92 -44 -139 205 133 321 272
4964 272 -154 59 -260 -62 261 -190 46 132 -47 -229 -128 -51 -18 -232 -84 110 114 25 -367 -116 94 72
4986 72 209 409 1 285 -74 56 -15 -328 163 -91 -283 -51 5 62 -50 139 168 -23 226 11 43 -142
5008 -142 -69 -261 -227 268 234 60 21 -215 -151 -331 8 92 71 -231 4 -278 19 -221 -215 -88 -159 28 -18 149
5032 149 -22 -287 -65 -80 215 48 -195 17 -62 3 -135 -79 -18 -212 44 -148 -226 291 141 -3 -84 -267
5054 -267 -122 -54 90 145 121 -76 -24 -28 190 -265 -118 -1 -160 -63 -12 94 -61 -239 -76 218 -22 86 -173
5077 -173 4 -39 -34 -91 -161 -392 49 -374 160 126 -194 115 -58 -243 -333 -162 152 -39 -70 -22 248 141 119
5100 119 -229 -78 -78 -227 341 -60 107 230 -77 -43 -168 -326 -148 -130 -40 68 158 -177 166 -125 -81 88
5122 88 -134 -147 -119 53 140 -2 72 70 69 213 175 -134 -73 -210 116 118 78 -249 -71 -163 34 81 257 344 144 53
5148 53 -228 -109 156 85 -96 71 41 -119 115 -94 83 -60 -130 48 182 111 -160 -51 -31 -79 -211 -23
5170 -23 160 -136 117 252 145 70 84 92 -73 -216 -294 -72 -111 14 127 320 213 -64 -222 84 -12 31 -24
5193 -24 -64 55 -263 0 89 216 -196 125 -99 -10 -195 16 -151 -16 209 -158 -63 -179 -192 -120 -69 -123 184
5216 184 52 161 264 -145 9 -368 -44 -291 58 391 17 -99 -220 28 195 153 -133 11 195 -141
5236 -141 -270 80 71 79 52 68 39 8 -37 73 16 164 -284 -163 174 2 115 136 -226 -62 149 81 7 25 -255
5261 -255 39 84 -62 23 174 0 -3 94 -68 -16 -109 -68 334 28 -43 54 23 -198 96 -13 -73 74 128 37 219
5286 219 213 74 224 23 -27 80 -161 -41 47 171 -78 -226 -60 -140 100 287 18 -31 49 -56 -1 102 29
5309 29 119 -220 -97 -56 -269 -143 150 -100 -213 10 154 31 25 19 -252 -184 -147 -93 28 180 -191 123 -177
5332 -177 -20 -79 51 77 121 140 316 -23 -89 -410 -21 128 -108 -129 236 -24 -184 -10 12 100 326 89 141
5355 141 236 322 12 53 217 -191 96 17 -45 -5 53 -70 323 178 54 93 34 58 26 -75 88 -93 -98 37
5379 37 28 12 87 -90 180 118 197 105 59 154 147 21 -44 -175 61 44 42 -6 -58 -111 48 107 206 161 79 323 257 121
5407 121 3 -15 -140 209 94 -28 45 -43 105 -1 178 212 -12 39 363 -233 -158 57 -38 54 68 94 -143
5430 -143 -172 13 -63 -70 -175 99 32 -102 85 -352 -14 -117 92 300 -270 38 24 -313 95 -134 -68 -28 -85
5453 -85 55 154 148 40 152 -25 43 -242 29 388 -202 -92 -59 -78 42 -93 287 -147 280 70 8 9 255
5476 255 183 -29 9 -355 -48 -83 252 -123 205 240 -419 -157 -285 -189 -24 -162 -113 1 37 -218 -10 -101 188
5499 188 158 200 -171 140 118 348 408 -137 346 -243 -170 136 -21 175 -100 372 124 -165 97 -95 -218 40
5521 40 -6 67 -32 129 284 219 117 132 24 -113 143 30 155 -82 107 -201 -61 -30 232 -67 117 59 27
5544 27 -30 -89 315 -13 -186 -114 128 65 -72 -113 -34 123 209 129 -97 22 -116 105 -286 -297 -5 15 130 191
5568 191 -61 68 113 -241 67 -106 -134 -111 -40 -57 70 89 -10 -96 -1 -86 90 17 159 54 250 312 -42 -216
5592 -216 -45 -156 -2 112 -63 160 -116 43 108 -66 -432 132 128 -257 297 -5 44 -102 -302 -197 135
5613 135 -28 17 12 -85 223 -147 152 333 211 -227 -135 134 185 -82 149 209 -125 -31 275 -23 179 -22 353
5636 353 313 -378 43 10 227 35 -264 -161 20 81 -274 -214 -208 -27 -214 -129 -23 -222 -64 190 43 -231
5658 -231 249 0 -33 -26 -124 -107 -147 0 55 -129 34 -141 -96 -97 186 66 157 -124 266 -40 -121 205 -45 2
5682 2 -214 -160 435 -121 -23 160 141 -25 52 -61 -95 -70 -128 50 166 140 -368 -68 -212 -255 -110 171 257 -48
5706 -48 464 421 -136 9 238 141 -225 -19 -299 -103 -64 20 362 -83 -61 28 -241 53 127 3 274 23 131
5729 131 10 -50 19 -8 86 -103 -50 209 17 -174 115 88 -94 -239 429 93 149 29 -54 105 -303 -103 -44
5752 -44 -303 149 47 161 151 -92 11 -222 246 -86 202 280 289 -128 -52 47 -25 176 -130 -106 -142 178 168 -25
5776 -25 -73 -136 84 -211 -39 54 -5 334 -156 28 180 202 17 160 -267 -188 75 -31 211 249 -321 -9 -221
5799 -221 6 41 -31 170 -41 -101 67 -51 284 -234 112 -249 -75 130 291 -101 -148 202 40 171 101 -25
5821 -25 -165 83 -7 116 -73 -73 113 -8 -123 77 155 -89 -108 -35 139 -52 -8 -52 69 82 165 212 120 -40
5845 -40 -25 44 -111 -199 156 288 -143 -143 107 -123 -37 161 -47 -6 -224 -72 13 -379 268 -88 20 4 478
5868 478 95 224 -209 0 141 24 -159 -346 -7 -121 -59 282 166 69 263 34 261 14 136 169 245
5889 245 -330 -27 285 -336 3 21 -144 -33 -89 94 121 74 22 -249 -78 -1 60 -50 322 294 -33 -71 128
5912 128 -167 -196 27 162 -211 -19 -150 -232 81 10 -8 -78 164 -47 -72 372 63 162 -66 233 138 -159 187
5935 187 -113 12 -138 -23 183 -208 233 213 -127 -6 -119 18 -3 -147 -69 372 -101 18 10 -162 -91 254
5957 254 206 110 -42 -121 -43 -335 43 -268 30 2 -136 -272 -46 -104 -4 49 208 -104 188 512 -203 27
5979 27 -355 14 -46 -112 -96 154 -255 54 95 153 166 55 220 11 86 -135 45 -189 148 21 41 63 -335
6002 -335 59 -66 211 122 -87 72 335 111 -10 -88 244 64 -150 -18 1 -217 177 -20 -330 176 -104
6023 -104 -171 -34 231 -153 155 -251 12 5 -215 -59 210 29 -226 249 -48 -68 23 -71 -63 202 -39 -108 -211
6046 -211 -99 102 127 301 196 27 79 -3 -119 -34 167 -111 -219 -76 76 18 186 85 -51 -335 198 12
6068 12 140 132 -107 -259 -107 16 296 237 -169 -26 73 -59 -191 -170 -35 -80 251 26 359 -163 113 -142
6090 -142 -534 -27 -12 111 -194 147 112 5 21 108 -52 5 -148 -30 -1 150 -49 -84 -155 4 -159 75 -59
6113 -59 -303 49 90 -183 -73 -200 118 84 -418 108 155 340 165 100 177 151 -144 64 -21 17 83 -13 142 -101
6137 -101 -265 106 35 -36 185 6 95 203 -54 -131 -21 69 2 59 30 -18 228 -177 90 45 -88 4 -42 -282
6161 -282 -312 -287 192 212 75 -276 -132 164 240 -236 -52 -124 -165 96 41 -277 4 147 -211 -42 -312 -9
6183 -9 -181 233 -154 26 66 -83 -87 -70 -119 7 -17 -24 31 -7 103 -90 109 -42 182 404 378 -65 2 192 -116
6208 -116 18 -65 -7 -153 414 -58 106 259 -68 -195 251 5 -71 3 -47 237 -50 -217 -204 36 162 -162
6230 -162 122 -436 -119 -171 76 -300 116 -109 -145 -60 -203 26 -370 -97 197 -321 -250 228 47 117 -247 -228
6252 -228 148 66 201 104 136 166 -32 72 -82 162 36 -84 87 -31 -96 73 288 14 -86 -75 293 163
6274 163 -179 -169 -270 -72 173 194 209 4 -75 248 86 211 172 49 134 -47 82 113 219 -12 94 74 -5
6297 -5 -55 204 -78 146 -331 11 -104 74 -64 -35 180 -112 238 145 82 23 213 37 267 -140 48 339
6319 339 12 -104 255 326 -70 -153 -112 236 212 156 108 26 -25 -145 143 -47 -170 14 68 163 32 -203 -120 122
6343 122 -92 4 -10 241 -176 -158 233 -49 163 -200 -22 126 -149 159 -82 65 248 -144 -222 200 14
6364 14 -94 -267 -197 339 343 33 137 -117 -216 13 101 185 206 -284 -120 183 44 95 -11 -264 -117 2 125
6387 125 -354 31 -72 -48 22 -148 -125 101 -157 -19 236 22 168 -90 32 -84 -154 153 -134 53 120 200
6409 200 -34 96 -169 343 197 29 -157 5 -88 -150 95 -126 95 121 -136 -21 123 134 27 -262 61
6430 61 102 36 -23 158 -39 130 325 -136 -86 -19 101 -93 241 147 165 16 -9 -76 -32 -214 -13 -93 189 154
6454 154 218 114 -154 44 312 50 -113 -37 -198 119 344 27 -127 29 56 100 -122 -50 -20 -70 23 -115 52
6477 52 -190 -271 -35 126 131 -15 -12 -42 -64 -161 120 45 55 -171 -76 165 336 -21 90 -164 80 61 -74 261
6501 261 46 67 -185 -142 -135 135 66 149 -163 104 -217 160 191 -169 -10 -51 212 224 72 -120 174 -115 -69
6524 -69 -234 69 32 67 33 -198 -103 233 -153 399 -165 6 238 465 0 -94 220 29 6 205 96 12 -61
6547 -61 33 -32 -95 255 -167 20 126 156 205 120 117 -44 -36 292 -248 -128 59 -67 126 -66 103 37 170 21
6571 21 -4 -1 -33 104 32 94 -51 -174 -193 124 -207 -246 7 -158 -220 -42 -2 -26 12 74 -232 -202 159 -54 -58 219
6597 219 40 -169 -199 26 287 32 -17 -214 -54 -167 63 -219 228 -30 -162 129 -308 -172 -162 -179 -309
6618 -309 -116 -210 192 -71 199 85 98 234 -208 -17 124 -217 -149 23 53 147 -206 314 85 -56 -50 -119 -17
6641 -17 85 -107 156 -107 -13 -316 -273 -123 -245 57 -291 168 80 -53 180 -20 81 73 -109 201 233 474
6663 474 -119 -60 183 -1 -140 -54 172 -145 -102 -168 -73 -254 -34 129 94 -275 -115 70 347 -59 -183 13
6685 13 74 -81 -51 -110 -170 -115 210 135 -165 -267 -13 -9 45 -149 103 -68 19 -125 -79 294 -61 48 -80 58
6709 58 -277 -64 -234 -53 -57 54 -17 24 115 109 -49 -185 124 -117 -185 -67 -64 163 53 -80 -15 204 -278 -122
6733 -122 134 48 200 0 -16 240 -139 79 -22 149 -131 157 -123 80 -204 -34 131 289 89 42 -357
6754 -357 157 30 -292 127 -46 209 -35 147 181 197 57 10 261 56 43 87 -418 -61 74 -64 58 -284
6776 -284 -169 -128 -156 -272 330 19 -7 -50 -62 81 -212 33 -108 147 -118 -208 182 -11 3 44 -29 -8 48 190
6800 190 -209 -71 -174 -88 -70 -208 164 22 -76 -107 120 -35 -41 -62 173 -12 159 209 -101 88 84 376 -88
6823 -88 -64 -273 -164 -181 183 152 309 -223 -192 -84 283 84 3 43 -150 -34 -103 140 79 -93 185 -170 -41
6846 -41 5 -169 109 351 170 -55 246 -53 167 0 -133 109 -44 -171 -111 -45 203 313 316 104 -7 245
6868 245 76 -230 161 -269 84 216 -130 90 244 132 -125 -85 5 7 -56 266 37 59 -49 14 132 -150
6890 -150 -312 24 91 206 43 -50 -132 -41 -57 98 51 120 85 124 17 59 -219 274 107 125 -4 124 -194 113
6914 113 -114 248 -84 -68 192 246 74 -168 354 115 87 71 -201 14 -48 79 -28 -112 3 -176 -262 -365
6936 -365 38 -169 -212 -64 -98 242 23 -446 -136 -105 -293 -82 -135 4 47 143 -141 191 -108 -215 -104 -22
6958 -22 131 80 -20 -361 312 42 96 50 -14 333 -32 0 -160 73 -31 129 -32 209 -132 -95 250 -7
6980 -7 229 -73 -301 122 394 -361 126 281 -155 -9 -182 -99 -134 -78 -4 -8 202 63 -32 121 221 53 69
7003 69 208 70 -117 67 368 88 -84 -45 -114 -110 89 191 342 53 -204 -190 139 17 109 -25 -41 -111 -245
7026 -245 -151 -79 -190 -341 251 106 78 58 252 262 101 81 42 102 18 -65 168 2 109 105 287 -42 -195 -135
7050 -135 -84 -339 -46 -196 -101 -9 -11 -87 200 168 -351 150 26 -102 -44 -97 147 -75 56 47 103 219 -192 -176
7074 -176 -56 -141 -79 -329 -85 45 98 -35 -31 -356 108 342 -220 -130 -18 -55 -240 58 58 -106 161 -360 56
7097 56 80 258 327 36 -81 -21 97 62 20 -332 -134 100 -181 96 -279 -76 -283 157 -15 -95 87 -107
7119 -107 -37 -28 -219 2 -210 61 -148 -254 16 -29 -179 366 14 -351 -48 -63 206 167 -106 328 29 -94
7141 -94 239 97 361 -17 -186 291 5 135 -145 -130 -47 -124 29 74 175 -107 108 132 5 -215 -9 -180
7163 -180 -119 -93 -175 108 304 185 -165 71 31 153 -21 -3 47 -314 -323 -17 63 43 -4 15 -163 -44 5 -34 -161
7188 -161 -51 211 -133 -146 95 -125 -135 -266 -277 30 -192 -87 -200 2 27 193 -140 -16 112 -23 71 -113
7210 -113 -174 149 92 -258 6 -94 67 35 -30 -183 17 -132 95 -41 -181 7 -87 33 -89 -140 76 94
7232 94 -47 77 271 -21 219 396 136 324 147 -230 -211 -97 -25 -23 -111 -249 -207 -200 89 50 -235 64 -147
7255 -147 -8 -49 -152 -125 -1 -163 -148 -18 -97 439 -55 -12 -38 16 -136 222 121 -180 -9 135 -336 88
7277 88 -51 -91 -128 -323 340 -201 -64 96 287 -1 143 11 2 -111 -16 94 -148 -41 -18 41 -54 59 -17
7300 -17 196 -62 -124 48 -8 302 -201 -402 -9 -202 47 -2 -134 52 -292 -64 149 -123 259 -190 20
7321 20 68 19 364 -17 -22 -43 -81 116 -213 -16 21 0 85 -68 4 -76 160 296 224 -125 108 -130 118 38 278
7346 278 67 -77 -49 83 -32 -51 255 -211 72 238 -172 55 -181 -69 -3 -44 -113 22 -71 154 -253 122
7368 122 241 37 -330 45 74 46 61 81 -266 -116 -68 -177 82 -29 -11 -148 114 111 112 109 235 57 -82 72
7392 72 14 -7 140 303 -1 45 -129 -210 -118 34 33 -157 33 44 519 -179 -131 -148 110 -143 148 168 227 54
7416 54 36 -99 -68 69 -37 -149 -20 -162 -70 314 68 -37 53 -68 25 50 -31 -161 -110 -53 -79 -82 31 71 -283
7441 -283 142 297 16 176 -292 -87 -31 63 -4 173 -81 -172 -204 -6 -183 144 9 149 38 -97 -7 95
7463 95 47 151 -108 -34 195 -45 -332 10 -83 14 -84 -78 -51 -115 -39 -206 168 -331 55 -231 -12 -60 150 -113
7487 -113 106 -30 352 -202 -48 247 115 -125 113 51 -75 -71 13 62 -238 24 -201 -116 47 -326 -42 135
7509 135 -49 105 -383 283 -30 145 177 -133 -153 154 7 113 84 -64 46 388 331 72 -9 -120 -52 -25
7531 -25 -155 4 -93 -7 267 204 -108 21 -2 -129 -357 -66 -194 -53 96 86 82 135 -169 197 0 -11 31 145
7555 145 164 -265 -133 -177 182 -66 52 64 59 -205 -25 -86 89 251 -64 195 149 -208 -207 -32 141 62 -201
7578 -201 -49 -31 -157 129 -404 -199 -120 -64 185 258 313 126 212 -69 -72 282 -146 65 196 107 -135 45 128
7601 128 186 121 43 -74 39 236 -201 -282 8 -142 11 145 -354 -101 -237 29 18 2 134 165 2 39 -121
7624 -121 184 204 -148 211 -321 -120 -227 372 -104 185 19 -42 -89 -186 268 6 216 189 -204 -9 59 -102
7646 -102 -181 178 190 272 129 364 210 -64 296 -34 90 94 -20 -166 64 470 136 -6 136 -174 -309 -111
7668 -111 183 -120 11 -255 376 -32 42 -196 36 -172 142 -78 -151 -36 105 -211 -112 99 -64 -27 58 -236
7690 -236 47 220 -146 263 95 -39 36 -2 -42 -13 -18 93 100 163 -249 -30 -181 -55 -149 8 121 -87 27
7713 27 106 9 -85 130 -245 85 364 -306 6 -232 -333 49 -39 66 91 -262 48 -57 147 113 -131 -41 -52
7736 -52 267 38 99 -59 -247 68 125 -320 19 145 114 96 168 28 -92 -63 8 -14 217 -128 -81 213 279 141
7760 141 234 -111 -129 -314 -182 -133 -164 92 9 -48 -14 -157 188 -327 -182 95 277 -243 -50 -249 250 313 153
7783 153 144 -241 -227 141 -129 59 -289 52 236 -40 112 313 -212 13 80 -187 -51 -228 -16 -186 92
7804 92 -84 -84 -147 153 48 356 251 -83 -50 224 -169 270 -43 255 -160 160 -163 -255 -87 83 288 226
7826 226 -157 -298 58 39 -264 370 -398 0 -17 -168 -39 -27 76 139 124 -174 -382 -125 226 -119 184 -64
7848 -64 -41 8 -44 -292 51 -92 48 -87 150 279 -55 151 20 -190 -207 -124 311 101 78 139 -141 -238 -163
7871 -163 85 -31 -157 33 131 -228 1 -109 100 5 228 -179 -34 -137 124 291 -28 21 137 -99 205
7892 205 255 2 -275 22 132 -86 -283 -19 7 26 306 209 89 -130 139 169 -119 56 -80 159 -232 -480
7914 -480 -31 142 25 37 -151 61 24 68 -16 54 -481 -46 77 193 94 41 -167 218 -6 62 247 -192 -20
7937 -20 97 110 -46 281 -18 159 352 -161 51 86 25 -43 105 -92 161 55 -13 106 -44 51 52 -200 -278
7960 -278 56 151 312 50 72 -56 5 -74 -349 -279 -236 139 236 -290 109 152 234 217 -71 -148 -179 -25 91 305
7984 305 -15 -84 -35 190 79 -40 -89 181 69 -138 -121 -102 88 50 236 -84 113 -133 -146 -49 1 -38 35 -71
8008 -71 -47 238 282 31 -95 296 -77 -84 162 58 43 -375 -8 197 -116 -57 -21 -212 28 -227 58 -180 308
8031 308 156 46 -62 -182 80 -146 54 -158 -126 -20 148 263 79 229 -202 -72 338 24 -325 -239 -293
8052 -293 -181 101 131 42 55 -92 -222 2 274 -213 -34 -165 20 -49 240 363 -44 100 169 -154 43 138
8074 138 -164 -213 65 259 -224 -288 -306 54 -122 33 1 60 374 244 -114 -122 107 -98 -75 -30 -22 -24 -119 -347 210
8099 210 239 193 111 142 66 45 -46 -45 -152 -294 126 -211 212 -12 -60 -182 -86 40 52 -211 92 8 2 98 53 -173
8125 -173 351 45 -134 -205 67 -57 154 -75 -177 -256 -174 -274 -13 -41 -73 12 -35 -190 -97 -222 103 -208 -16
8148 -16 -144 27 93 -131 328 -261 -37 -78 -31 294 142 -28 -67 -80 -187 -242 183 -115 1 -119 -30 -155 -58
8171 -58 229 -112 -162 -116 -211 236 -288 53 97 -232 -7 -113 -328 -38 -46 -75 225 -42 139 -124
8191a24
$$ Imaginary data points
##PAGE= N=2
##DATA TABLE= (X++(I..I)), XYDATA
0 0 0 0 0 0 8 -8 8 -8 8 -16 16 -24 30 -32 40 -53 64 -72 88 -104 120 -140 162 -187 213 -244 278 -316 358
29 358 -404 455 -512 574 -641 715 -795 884 -983 1091 -1209 1338 -1482 1639 -1816 2012
45 2012 -2233 2481 -2765 3091 -3473 3923 -4464 5131 -5975 7079 -8596 10813 -14360 20916
59 20916 -36900 148580 93381 -266173 146577 89225 -191892 77266 107578 -160799 37601
70 37601 72170 -99309 28870 47949 -72704 59235 29406 -81943 43933 39251 -66702
81 -66702 26366 15285 -45500 34498 425 -56562 40885 24339 -30493 25989 1114 -37699
93 -37699 28774 21904 -20711 -5536 -9433 898 14454 -27519 -1237 46661 -19413 -33925 39971
106 39971 7009 -35029 27267 17802 -45193 -1891 33985 -17003 -24800 15798 19250 -2019 -12481
119 -12481 -854 9954 1271 3609 7950 -17607 -15230 15030 420 -11287 10365 2667 -6615
132 -6615 6244 -4973 688 22574 -6197 -18743 6117 -4413 -2214 11361 -16352 -3937 23605
145 23605 -11524 -6999 18357 -11003 3472 24225 -22313 -16135 15728 -6084 -333 5091 -15165
158 -15165 10990 7055 -21478 18674 15483 -22382 17321 3877 -38272 21523 19819 -35052 10667
171 10667 11164 -28251 21922 12389 -29501 25204 13891 -29353 15334 227 -25441 28670 56
184 56 -34149 23241 3455 -24276 25818 3957 -19331 23945 -1955 -22414 14989 -2150 -5790
197 -5790 15317 -21653 -10367 27703 -12640 -7706 26780 -13444 -7630 23032 -16985 -8287 22408
210 22408 -13480 -6792 12071 -19475 2027 23666 -16861 -2328 21959 -12248 -5020 13887
222 13887 -10312 -1519 11746 -14076 -6962 8031 -6145 3191 11661 -8953 -2315 13111 -3732
235 -3732 -7055 7480 1029 -5776 -1570 -6091 -2110 7488 -447 -2109 6840 -3553 -3022 12866 -1354
250 -1354 -10457 9949 766 -16280 3637 3530 -6942 8941 -132 -9907 12052 1675 -9213
263 -9213 15865 -463 -17368 13643 -811 -21491 13176 7832 -15450 7575 4350 -10259 11874
276 11874 5724 -9950 7531 1063 -11292 4052 -65 -7957 5562 1484 -6136 2614 2034 2434
290 2434 5539 -1796 -830 2129 -5117 -1814 736 -1847 1037 -2912 -1976 4385 -2313 2518 10024 -6189
306 -6189 -3543 8226 -6401 -3991 7222 -6566 -2199 5279 -7880 2606 8494 -6334 5713
319 5713 6467 -12293 4613 7256 -13612 3870 6581 -14399 3924 6720 -12411 9268 9712 -12560
333 -12560 6756 5888 -12916 7003 4907 -13394 5550 1541 -11648 7584 3010 -7018 9923
346 9923 1131 -8361 8645 100 -7537 7632 -1653 -8584 4707 -2015 -5113 7586 179 -2760
360 -2760 6265 -1568 -3018 6547 -1401 -4500 2934 -3260 -5068 2749 494 -2262 3088 2998 -2522 766
376 766 4986 -2025 -2555 4968 -3960 -7290 5688 -1390 -7192 8586 1303 -7930 8048 2832 -6805
391 -6805 7495 1399 -8472 4641 -1557 -7920 6104 -551 -5871 7263 -809 -4751 8936 -5
405 -5 -4276 7501 -3729 -6507 6522 -4115 -5442 7517 -2823 -4889 7348 -665 -1993 6112
419 6112 -890 -2226 2557 -3955 -977 1837 -4229 -299 2838 -3310 -46 4728 -61 -49 2914 331
435 331 -2602 -638 791 -2008 -2262 1807 -1426 -3052 4477 1610 -2397 5077 890 -4277 3307 -174
451 -174 -4741 3412 -1265 -4799 3457 -841 -2326 5982 -1203 -1753 6767 -3291 -2737 5706 -4896
466 -4896 -2931 5529 -5540 -2840 5732 -3868 -147 6840 -3441 332 5064 -4853 3 3823 -6214
481 -6214 -308 2713 -6668 1485 5485 -4589 1350 5109 -2341 462 2324 -2066 -443 -920 -1288
496 -1288 174 -3420 -58 3698 -2284 700 3592 -1533 1769 1505 -3527 2469 1 -6408 2643
511 2643 186 -5683 4809 1631 -5009 5411 1173 -3440 6116 -2505 -5593 7757 -3368 -8913
525 -8913 7652 -734 -7327 7742 583 -4862 6829 -628 -2529 5468 -5143 -1806 7295 -8718
539 -8718 -4050 10092 -5200 -4692 8955 -2660 -1881 7553 -3357 -1923 5380 -5463 -1074 5326
553 5326 -8181 -1765 8682 -5191 -3239 8475 -1283 -2057 5262 -2832 -1188 4702 -5527 -3201
567 -3201 5171 -4037 -3025 7449 -2188 -5355 8221 2555 -5801 2375 1854 -2920 1110 -2836 -3339
582 -3339 5474 -2895 -4998 8442 -1059 -7026 10493 1470 -10458 7283 3614 -9002 2541 415
596 415 -5731 6532 -1970 -7452 9570 753 -7316 9585 247 -8752 8262 42 -9318 5171
610 5171 -245 -5166 6540 -3783 -4447 11229 -1858 -6359 8642 -1384 -4969 5550 -3822 -3692
624 -3692 5454 -4873 -330 5355 -6757 2461 10309 -7817 -2591 9483 -4049 -3643 3239 -3645
638 -3645 23 2197 -4859 1722 2490 -3767 5386 2828 -7084 4189 4752 -6187 165 916 -3263
653 -3263 3060 -1899 -4710 5737 1201 -2679 4512 -969 -2054 5662 -1959 -4050 3031 -2575 -1751
668 -1751 3710 -4777 -1617 7724 -1229 -3802 3982 350 -946 1698 -2955 -828 1750 -3062 204
683 204 1693 -4212 2775 5725 -5421 -1434 7173 -1062 -2727 1823 -2381 -1159 2278 -3142 -2056
698 -2056 3739 -452 -407 3294 -2383 -349 6319 -2442 -4669 3695 -1507 -2963 3865 -3419 -3562 8221
714 8221 -1314 -5911 7221 1182 -4585 5075 -1467 -5915 4747 -635 -4635 3164 -2278 -1169 7199
729 7199 -4886 -3689 10464 -2007 -6377 6907 -2913 -5021 6755 -3485 -5488 6354 -1940
742 -1940 -1784 5893 -4344 -27 8201 -5595 -3652 5939 -4151 -1516 3704 -6249 -46 6188 -5148
757 -5148 154 5541 -3891 1506 4565 -5961 -716 4055 -3328 -765 -23 -3655 4396 1098 -5227
772 -5227 4204 3801 -4589 2306 1894 -4538 1532 1689 -3220 -1207 -208 870 1700 -1905 -130 4227
788 4227 -256 -1686 1167 -1320 296 508 -3066 -509 417 -1281 2350 770 -2693 2890 2273 -2810
804 -2810 930 848 -1373 1877 -1753 -4142 3115 1059 -3383 2610 1446 -2225 3070 1587 -2708 766
820 766 1669 -1436 -905 -1497 -585 2661 -907 -1982 2476 1577 -1324 2048 926 -2501 1295 881 -3259
837 -3259 -804 986 -881 945 615 -1756 2764 2599 -3070 754 2434 -3076 252 1449 -4493 446
853 446 3167 -3670 306 3162 -2877 2849 3381 -5113 1601 4123 -5523 208 2471 -5175 1657 3204
869 3204 -5272 2243 3743 -3959 3203 2622 -5603 3264 2039 -6909 2958 2487 -6131 2813 1445 -5427
885 -5427 4840 2918 -5369 4058 1694 -4919 4020 84 -5872 3429 545 -4853 3292 481 -2620
900 -2620 4393 -56 -2976 3541 -577 -2679 2617 -1839 -2317 3053 -2079 -2192 3077 -378 -122 2498
916 2498 -1688 181 2425 -1968 -469 1025 -2590 226 886 -2543 905 1848 -1155 1507 652 -1590
932 -1590 1838 95 -2199 917 -587 -2268 984 -391 -1163 2408 413 -570 1727 -134 -514 1786
948 1786 -1291 -1613 781 -1058 -1443 1486 -350 -599 1675 291 -931 1978 89 -1370 963 -495
964 -495 -1681 832 -579 -1828 1708 906 -1346 1555 1352 -1151 1859 902 -2528 622 368 -2971
980 -2971 936 878 -2419 1716 1603 -2500 2655 1900 -2824 2169 576 -4042 2495 506 -4286 2563
996 2563 520 -3978 3773 985 -3651 4242 717 -4632 3845 145 -4963 3588 169 -4524 4205
1011 4205 192 -4006 4800 624 -3489 4718 -178 -4082 4028 -955 -4337 3732 -977 -3154 3635
1026 3635 -442 -2198 4194 -620 -1816 3834 -1235 -1780 2819 -1791 -1880 2163 -1604 -1282 2495 -753
1042 -753 199 2868 -1203 -234 1985 -1436 -831 1296 -1580 -762 513 -750 -29 1010 20 541 614
1059 614 -248 162 452 -409 -962 -21 -156 -1025 -210 1076 -45 632 1088 -91 241 858 -517 -515 300
1078 300 -1387 -319 807 -1364 -330 1705 -425 -143 1672 -358 -172 862 -1120 -225 -86 -1695
1094 -1695 437 687 -1461 1151 1363 -1325 581 1148 -346 754 -320 -1031 223 -510 -1436 527
1110 527 266 -648 914 796 240 360 507 519 -331 -866 533 -444 -1327 430 394 -578 1009 337 -279
1129 -279 1981 -660 -720 1777 -1345 -1580 2009 -1353 -1840 2018 -579 -775 2060 -367 -40 2313 -1680
1146 -1680 -814 1853 -2091 -1377 2005 -1529 -1595 1762 -643 -241 1626 -613 319 1642 -1800 132
1162 132 1392 -2140 -660 1318 -1119 -878 991 6 295 597 -192 827 -171 -982 555 -309 -944
1179 -944 -180 -114 109 -31 15 1448 522 -509 443 510 -632 -73 -688 -222 144 -1062 -357 1116 -1087
1198 -1087 48 2253 -1321 -468 1864 -691 -739 989 -1320 32 899 -1990 704 2343 -1799 772
1214 772 3081 -2030 204 2138 -2183 -425 973 -2324 505 1190 -2494 1112 1940 -2159 1274 2011
1230 2011 -1858 446 956 -2026 150 442 -1266 778 264 -1650 1680 1275 -1728 1052 1782 -911
1246 -911 -603 -49 -639 -120 -203 -341 35 152 48 1075 704 -224 578 1244 -555 -1449 535 70 -1398
1265 -1398 -387 406 -462 60 348 -176 780 454 -601 422 -336 -1370 784 -110 -1571 276 663
1282 663 -57 597 -19 5 1717 -261 -998 1027 -448 -1494 721 -130 -1133 747 463 113 382 -306
1300 -306 929 1019 -1407 -604 897 -1076 -562 282 -889 -559 555 13 289 184 227 1150 -447 -844
1318 -844 561 -62 -687 -248 -899 524 797 -988 169 1393 -450 492 1209 -1277 315 736 -1555
1335 -1555 -142 13 -1413 1871 646 -2230 2165 1844 -2251 1354 947 -2038 1137 727 -2574 893
1351 893 415 -1630 1850 -151 -1857 2657 427 -2382 1583 838 -1954 1071 -499 -2282 1579 -57
1367 -57 -1276 1911 179 -958 2318 -322 -1624 1795 327 -1626 813 -603 -855 1702 -597 -928
1383 -928 1600 130 -753 934 177 -703 1203 -323 -1584 217 293 -246 627 -442 -115 1370 313
1400 313 -954 1112 78 -1004 274 -240 -1314 152 781 -1099 55 828 -86 867 -233 -671 773
1417 773 720 -1413 -160 267 -1038 825 -54 -1183 1186 750 -641 1193 259 -723 1245 -302 -1737
1434 -1737 611 138 -665 458 -124 -39 1753 67 -301 1438 -220 -210 704 -1484 -865 940 -913
1451 -913 -592 894 -510 900 1258 -1310 347 917 -1112 614 382 -1988 486 637 -2132 762
1467 762 906 -1048 1288 367 -1551 1732 526 -2291 946 -452 -1783 1580 -592 -1742 1754 597
1483 597 -1232 2013 113 -1229 2286 -816 -1979 1817 -709 -1694 1426 -784 -900 2654 -738 -1010
1499 -1010 2252 -396 -934 1592 -1612 -1049 1595 -930 -1443 1582 -479 -593 1943 -654 -520 1950
1515 1950 -300 -1043 985 -914 -834 1471 -825 -1215 1238 -256 -605 1512 -12 -476 1395 -500
1531 -500 -1430 1049 -196 -1194 764 -338 -1112 1499 314 -1062 1631 563 -1279 1516 -685 -1511
1547 -1511 1381 -483 -1644 1112 15 -1028 1981 -77 -1040 1899 164 -1142 1174 -647 -1130
1562 -1130 1058 -799 -968 1715 -289 -521 1825 -562 -264 1944 -1070 -576 1253 -895 -758 884
1578 884 -1179 -546 1143 -504 -309 1409 -202 436 1000 -1103 -55 937 -1247 -65 338 -1048 374
1595 374 775 -1111 758 878 -1087 634 173 -792 548 -57 -1379 458 -243 -648 1132 -188 -596
1612 -596 1525 -173 -587 1101 -471 -665 645 -708 -1044 661 -572 -335 1057 -106 216 813 -707
1629 -707 -215 639 -778 -245 460 -885 -163 816 -579 -76 987 -122 491 694 -536 -288 556 -519
1647 -519 -418 255 -515 -321 326 -105 -69 756 94 -136 824 -489 -420 230 -769 -1090 581 -283 -567 658
1667 658 -74 -596 1142 178 -407 803 -402 -802 690 -426 -923 874 -443 -685 1152 1 -394
1684 -394 1153 -229 -582 1116 -813 -1029 1047 -1033 -979 1096 -436 -547 1249 -269 -166 1059 -661
1701 -661 -309 956 -1179 -435 786 -1147 -431 791 -616 -216 1059 -353 386 522 -428 2 362
1718 362 -976 -320 378 -641 -188 615 -253 255 283 -193 508 -229 -375 381 -145 -504 210 -408 29 119
1738 119 66 409 470 60 528 22 -334 289 -22 -839 -242 -74 -32 385 244 -83 813 79 -18 1039 -219
1759 -219 -633 186 -382 -642 281 -227 -69 356 -456 370 1098 -238 -84 638 -293 -359 216 -274 -149 -141 -70
1780 -70 174 414 -288 334 612 -215 43 265 -389 -529 -21 -176 -381 29 301 320 212 203 345 102 243
1801 243 -16 -22 -103 -921 -503 182 -366 -234 492 -59 -152 601 -267 -27 -144 -759 -243 199 -1016 -147 448
1822 448 -323 12 794 -183 293 218 -656 183 381 -710 233 -69 -870 33 557 -235 410 708 -474 221
1842 221 255 -469 239 -20 -647 245 -548 -604 336 96 -325 684 272 -176 126 103 -186 225 -541 -509 -41
1863 -41 -347 -79 345 244 159 52 451 370 -84 -134 -77 -302 -297 118 -312 -196 154 -110 305 435 -144 152
1885 152 226 -464 172 349 -740 -291 238 -581 -101 166 -573 685 465 -432 86 396 -591 71 -33 -785
1905 -785 -151 86 -426 158 -48 -325 951 -30 -567 413 407 -809 243 190 -275 144 -216 -285 486 132
1925 132 446 390 -160 -72 268 -116 -385 27 -90 -100 -194 215 584 85 -106 636 -13 6 93 -272 -463 -130
1947 -130 -357 195 214 -297 113 514 -147 219 168 -257 286 13 -448 -52 5 -797 696 279 -475 745
1967 745 702 6 28 -37 -261 193 -240 -612 94 -68 -396 337 83 55 522 100 -354 160 388 -165 -242 -257
1989 -257 78 10 -153 -483 -68 198 116 132 13 296 50 81 -244 -420 -46 -32 -264 -143 -590 -100 691 180
2011 180 -192 920 90 -373 151 -174 -760 320 24 -740 292 364 -1 467 -263 -108 908 -483 -452
2030 -452 616 -362 -831 600 -414 -574 849 285 -258 334 125 -198 542 -632 -433 826 -350 -525
2048 -525 525 -368 229 957 -104 153 846 -357 -149 423 -625 -80 225 -793 -394 131 -415 147
2066 147 -43 -94 167 293 98 -175 44 -214 39 -292 -394 -161 11 24 -69 47 335 286 82 -140 -112 -41
2088 -41 -129 -388 -86 19 -231 -28 120 3 527 349 -103 18 -162 -267 -69 -211 -730 -132 -8 -21 436
2109 436 215 122 260 113 -239 -183 90 -136 -182 -52 92 373 -113 -295 209 332 207 280 -74 -5 59 -386
2131 -386 -91 -135 -435 309 145 -73 165 385 -63 500 56 -386 343 -370 -349 -241 -196 -190 245 -19 -160 875
2153 875 107 -29 305 -318 -335 334 -361 -358 363 -390 -269 654 -311 42 704 -426 36 437 -348 -214 268
2174 268 -595 48 34 -628 38 382 -331 523 364 -367 87 397 -605 -176 -57 -284 204 184 -602 7
2194 7 337 -355 214 42 -117 131 -84 -809 -255 -72 -28 -31 -155 -271 -6 404 220 16 85 -233 -342 79
2216 79 -494 -330 18 0 -152 261 43 -194 76 -40 -101 -101 195 -143 87 -324 -177 97 7 -17 196 233 -303
2239 -303 -50 142 -112 8 -143 -356 77 -181 -268 131 0 97 313 -57 158 337 -252 -271 248 -339 -128
2260 -128 -177 -327 -200 -138 78 212 -10 -195 23 101 118 -218 -301 -69 225 -40 -65 -91 -1 397 162 71 116
2283 116 460 -74 372 5 -645 -335 -159 -375 -433 -7 -386 231 28 -128 44 -16 -575 70 -76 -320 186
2304 186 -86 -635 332 -50 -365 176 35 -169 234 -55 -322 477 -76 -599 388 -60 -89 388 -65 160
2324 160 264 -225 -147 497 -230 -363 -169 -144 -291 82 139 -174 93 31 356 145 201 176 45 -98 -260 12
2346 12 -69 -39 99 226 -83 259 169 32 -416 -223 -171 -5 -3 -156 -214 63 24 -19 271 142 -316 375 230
2369 230 -245 431 41 -8 -236 -312 -106 268 -39 58 239 356 270 374 -323 -218 59 -108 14 132 -311
2390 -311 234 -173 -287 240 296 260 90 58 170 -35 -698 -80 -34 -205 213 61 88 -42 187 -2 -66 134
2412 134 -87 -62 -166 -476 -121 128 -280 88 32 74 279 213 -211 485 -329 94 302 -424 -271 287 -246
2433 -246 -147 405 285 423 279 -202 52 169 -181 -470 215 -398 -356 162 -271 -106 411 60 -152 289 -151
2454 -151 -12 213 -202 -148 286 -179 86 157 -337 5 455 -16 148 184 -201 191 4 22 2 -66 -331 -282
2476 -282 221 -214 108 312 87 188 -34 -174 -1 282 -49 -310 131 164 -305 -30 261 94 52 147 -229
2497 -229 -45 256 -238 -103 -34 130 40 161 -334 218 380 -213 -26 108 -200 -120 393 -398 107 -16 -235
2518 -235 410 -8 -215 262 258 -256 1 131 -175 -64 -9 -437 65 226 -27 135 37 414 249 48 -184
2539 -184 78 26 -2 15 -171 142 -318 -427 75 103 -9 432 -71 41 71 -155 -81 -29 -242 176 -17 -70 -142
2562 -142 147 162 8 359 -224 88 -11 -285 -37 247 -223 -106 148 -310 43 31 -189 316 140 -146 173
2583 173 42 52 -26 129 -372 124 84 -173 -136 256 83 193 -53 209 18 -107 8 32 -18 62 -393 -37
2605 -37 -26 225 185 223 268 51 -281 -101 -141 -66 -77 -173 -48 -109 21 -177 -120 -27 259 -284 -104 -140 -323 34
2629 34 331 -346 122 41 -308 31 177 -117 180 149 -293 -57 49 -171 16 -246 -167 166 -279 -1 575
2650 575 -50 -93 258 -76 -286 -12 -144 -255 360 -96 -128 -108 63 62 119 -5 44 -87 241 -66 352 -205
2672 -205 -109 -107 -76 264 96 167 -235 196 252 -72 -262 -199 41 -23 -443 41 -64 173 -12 55 133 305 -31
2695 -31 29 77 4 158 -27 -208 33 235 -313 89 329 -88 286 34 53 222 247 -225 -279 -388 -299 139 147
2718 147 268 253 41 -69 33 5 52 350 -302 -153 336 -455 15 420 -61 64 97 174 234 -126 -147 -190 -172
2741 -172 -152 -28 -164 -175 -87 -105 -170 184 158 -161 155 -58 -79 88 113 -207 73 -187 64 -253 -100 157 47
2764 47 44 148 172 121 532 -17 -1 -218 -35 149 233 -180 -8 547 -8 81 197 19 -124 -75 -347 -128 -327
2787 -327 -246 -250 -3 14 18 468 48 179 140 -34 -68 87 -228 0 145 -116 224 -141 -74 -22 204 -180 61
2810 61 121 -130 106 -146 -39 -60 -191 -83 227 163 -77 164 99 110 77 161 -75 -330 -66 -160 -200 85 -80
2833 -80 275 -171 143 215 20 364 -107 111 -77 -277 68 -159 10 77 66 -39 -36 221 -209 -58 217 43
2855 43 -143 131 146 65 -17 -58 -167 125 208 101 197 -383 93 -4 -34 -69 -176 -145 -193 9 104 -121 422 51
2879 51 74 -49 -27 113 -237 -5 50 -163 -237 -66 296 102 -102 63 185 -297 105 159 -228 -55 -306 -130
2901 -130 -289 116 -148 228 198 -175 402 188 -57 126 9 -289 100 -123 -98 18 226 -22 158 26 -22
2922 -22 283 77 22 106 55 -171 -183 -95 -125 -216 -127 -267 -129 24 -6 148 37 91 -253 -67 95 -165 -166 42
2946 42 283 75 8 210 -120 -11 182 234 -103 -129 -268 -159 170 -1 -75 -9 80 217 -38 -16 186 214 -117
2969 -117 -373 -75 -263 -343 -124 3 116 -78 -160 154 7 98 160 176 -463 -69 -59 58 -73 -350 134 120
2991 120 -312 211 110 119 236 285 77 -135 -295 59 -23 -72 92 183 113 -67 -30 -28 -25 -175 27 -35 -241 -123
3015 -123 -19 -21 -150 7 -111 182 249 201 -12 18 -110 -65 -156 -210 -65 -334 14 -116 -107 105 -25 44 -136 102
3039 102 -38 91 108 -180 97 376 -26 -182 46 109 -130 394 -222 -95 169 -268 -354 -211 -408 -106 124
3060 124 60 -217 96 -123 -83 208 -151 -70 49 -118 -413 175 -415 -90 210 -40 151 187 -29 80 -92
3081 -92 -138 -72 -198 -70 -81 -204 14 254 -39 58 395 -62 -1 72 -115 155 -39 -270 -266 -30 -130 -146 115
3104 115 -83 -14 371 139 -55 -90 209 -189 185 80 168 95 73 -44 142 88 119 -11 143 22 11 -17 -126
3127 -126 86 31 10 -155 -115 -231 129 161 281 1 62 -137 -315 -20 -186 31 15 35 -47 86 -59 206 214
3150 214 83 -11 -18 6 43 -361 -33 -45 -66 -171 -93 -17 219 142 -336 -246 217 -194 63 -96 -186 -105 77 -265
3174 -265 79 416 224 263 195 138 255 -198 -513 107 181 -99 -6 111 -228 258 588 46 175 -70 53 -22
3196 -22 -54 69 -205 -51 51 209 -26 116 389 326 27 317 177 -387 -184 -402 -213 -240 88 -152 -109 34
3218 34 354 22 107 -146 81 138 7 259 -217 -157 31 -89 148 46 87 -261 -152 -130 -50 77 80 -108 -450
3241 -450 -65 -105 -117 -400 131 127 4 119 162 -62 -70 0 104 -550 123 67 -15 -67 22 -16 70 -7 -39 193 349
3266 349 -19 -34 313 -196 122 -61 253 266 245 -149 14 48 80 127 280 36 -132 -177 149 303 368 -65 107
3289 107 465 -58 227 236 -56 74 45 37 -42 -115 7 -36 -6 94 -12 -65 335 -51 -174 43 -104 -24 179 -173
3313 -173 114 17 -30 48 -184 331 258 107 56 -338 -27 -156 -177 325 63 -281 161 162 129 57 36 -21 -173 234
3337 234 91 36 -132 -124 -314 85 -119 -12 -14 -103 30 -11 -284 52 371 70 -27 0 257 -23 -245 56 236
3360 236 -23 305 14 -240 144 -33 -266 75 -193 236 91 -178 58 385 -101 29 254 64 -3 171
3380 171 21 -92 210 79 -60 -204 0 100 -75 296 -270 -161 96 116 -103 -206 76 -81 -165 -85 -166
3401 -166 -147 -18 -104 145 33 -8 -76 50 -164 -68 -60 -100 33 -195 -87 142 106 103 -110 19 -31 -192 -41 -63
3425 -63 -269 -23 80 -218 286 -168 123 276 126 -55 -153 -93 -57 16 -40 -347 36 54 -373 117 276 184 77
3448 77 -124 85 258 118 -134 -153 -304 -128 -126 150 52 322 134 -34 -30 68 16 127 -152 64 28 -164 287
3471 287 242 105 -40 -4 -27 268 11 9 -519 34 58 -366 48 -155 -116 -67 82 409 217 427 -20 307 41
3494 41 95 19 5 -73 -124 63 79 167 176 99 163 -48 -24 -71 181 -208 -229 -408 -146 73 -158 167 -54 32 -116
3519 -116 -108 -229 -28 12 -133 -222 -207 -310 112 219 109 -72 98 -161 -39 32 156 76 -61 100 60 -135 -25
3542 -25 -180 -63 -48 155 51 14 -90 86 -250 -48 -116 106 -79 -279 -177 43 -240 162 -14 -89 -232 -26
3564 -26 186 -338 293 -75 -31 103 -13 -103 -211 171 -9 -70 79 -124 22 -21 138 -168 258 -74 -233 -127
3586 -127 0 -24 -254 291 34 -109 48 -218 -106 -159 -45 -125 -401 -11 -59 104 50 80 -197 335 -193 -54
3608 -54 50 -164 -109 230 38 168 68 236 -29 22 28 -26 236 -206 395 168 -26 111 -211 -24 -115 -89 81
3631 81 -321 318 18 -101 -205 -175 84 124 46 24 215 -150 -215 17 -205 9 205 55 213 39 -54 6 441
3654 441 -136 -20 -39 10 501 3 214 82 -189 232 -46 -279 -65 -133 -188 224 58 -188 -127 204 -46 260
3676 260 126 -221 -47 182 48 333 0 -319 -24 -150 -146 404 177 -205 -341 -350 227 -170 289 -322 -14
3697 -14 -71 -165 357 114 -275 453 -118 -111 252 4 -166 -290 -97 81 169 -57 -140 -154 122 -141 69 127 7
3720 7 467 -11 -60 -126 163 138 40 -134 -98 -12 168 -53 285 -1 88 -21 -219 17 -15 15 -250 68 81 -30
3744 -30 220 -139 -117 199 -237 -174 -37 83 -177 -220 -243 -313 -76 254 47 -63 -112 -87 -137 -159 -301 154 -116
3767 -116 -143 -319 216 -78 -66 -16 141 21 -16 -83 266 -231 -30 -236 119 50 -265 -289 35 -21 12 -277 -66
3790 -66 308 246 19 110 173 22 -197 -26 289 -87 26 128 -82 169 -29 -43 -21 169 -70 -28 98 98 -104
3813 -104 58 -125 -52 273 65 170 16 -201 0 -312 -407 153 4 277 23 145 -104 128 -2 55 177
3834 177 8 -188 -100 -79 49 -21 -29 -222 251 -71 52 31 -99 -40 -70 -38 -228 113 -223 159 -105 369 -198
3857 -198 23 -48 -202 -99 -266 15 -146 28 36 -108 -53 -155 11 102 -97 147 340 -208 -17 -114 -65 125
3879 125 -53 -176 -4 73 -37 235 -230 89 133 -37 91 165 212 -129 194 345 16 24 -59 3 -279 -351 -381
3902 -381 6 -190 -48 -110 -209 141 -314 175 -181 151 -190 -36 76 2 179 158 -125 -15 -55 81 150 -307
3924 -307 -71 -20 -75 -174 -106 181 -97 158 86 97 97 -35 -207 -153 94 83 -64 261 -125 34 351 234 29
3947 29 -215 8 34 -138 -94 -47 167 -78 42 -109 126 303 123 161 321 193 -5 154 -51 65 75 126
3969 126 -160 -17 259 28 -117 -114 -249 -195 16 -147 -40 -218 194 -41 -69 -1 139 -147 -8 88 -27 -13
3991 -13 192 209 -288 -91 -191 157 -242 17 151 -44 -110 -27 264 163 35 8 64 -91 138 33 -78 89
4013 89 201 259 -57 64 -34 -439 -61 123 220 4 -24 166 48 7 260 -13 86 -17 145 215 77 -54 -61
4036 -61 248 -62 58 -114 -11 -112 119 210 64 4 -264 33 183 35 -123 -148 -56 -16 -108 -52 -59 -55 77 158
4060 158 10 207 172 -68 -64 -73 24 -105 -175 -37 -220 -119 -207 173 -88 97 -214 -215 -269 -334 72 54 89 -70 -68
4085 -68 -100 -217 234 207 106 -137 -183 -69 45 -40 -76 -176 -23 189 21 200 -185 74 -14 -20 185 55 -70
4108 -70 -35 102 -5 -32 -67 -227 -34 23 97 19 76 -274 -118 137 -141 23 -44 -186 -173 -149 253 -33 86 82
4132 82 159 179 10 -241 19 -32 -7 -42 -145 89 233 -111 71 241 -59 41 122 106 46 24 -152 -180 118 -48
4156 -48 275 -299 159 -40 -12 -258 -221 -21 122 7 113 -284 -74 42 -47 -40 -16 45 333 26 -83 -110 10
4179 10 58 169 -103 123 194 -39 -115 315 -1 -169 -178 -175 198 -380 -69 19 82 -202 -67 38 399 218 -292
4202 -292 -249 48 -42 151 -212 8 -81 -157 -131 -39 92 1 -107 121 257 52 -67 -59 15 -468 135 34 -308
4225 -308 100 -357 5 32 82 -1 -134 -22 -11 -534 19 32 188 -66 -20 88 280 63 231 -118 308 -91
4247 -91 -126 94 97 153 -189 76 -14 34 -218 25 -373 -140 -301 83 97 -263 -139 22 102 -72 257 -112 30
4270 30 32 -34 288 -87 -280 173 31 -238 119 -134 -41 -313 -25 -128 -98 103 -27 181 -135 -179 281 -173
4292 -173 -136 4 -92 -9 135 -137 85 17 189 -185 -50 112 131 6 26 -48 -20 -234 154 147 223 129 -106 132
4316 132 -133 -300 128 149 -100 -221 -54 -180 -32 -193 43 -114 8 107 -95 95 -19 135 -123 -76 141
4337 141 155 19 385 -151 -291 -149 155 165 236 269 -26 58 34 -290 -173 -287 5 153 -105 43 356 458
4359 458 -73 11 -163 253 -138 51 -373 -263 321 375 275 197 55 -58 57 184 235 -169 82 20 -157 -66
4381 -66 -125 34 -7 -99 -1 -185 -188 -132 -104 64 100 80 -193 189 -111 -169 16 21 -28 152 -211 -3 184 77 110
4406 110 75 -149 47 207 48 -232 -115 -209 150 108 -16 57 124 -74 197 -108 280 -37 9 -94 -18 87
4428 87 -33 -48 95 -51 147 -78 -20 183 50 -200 29 358 73 56 -189 -139 13 -40 62 147 -1 53 127
4451 127 40 -240 255 5 -6 73 52 120 51 253 -248 -89 16 -33 -196 4 63 75 78 -426 124 303 -189 345
4475 345 154 -169 -39 189 -258 89 1 -161 100 -40 73 106 -28 8 7 156 -33 84 -310 195 279 274 -248
4498 -248 150 -177 71 119 -8 -19 -89 145 267 198 188 -230 11 -94 -21 9 127 191 13 128 -61 84 51
4521 51 -233 425 -147 -316 -26 -175 239 -60 -5 -154 148 -158 -88 233 75 130 87 159 -94 -142 113 -15
4543 -15 -88 253 -218 229 81 -4 311 313 187 106 -129 45 -219 32 -163 621 -89 -6 -1 -268 152 60 -28 -155
4567 -155 -323 -37 -152 204 283 -264 127 -99 -121 273 -176 307 -177 -118 -89 -327 130 178 35 214 8 -75
4589 -75 83 199 -267 -46 236 159 -117 146 168 52 -65 69 -131 -57 -75 -16 31 -76 -65 -44 57 128 115 7
4613 7 -205 -219 -185 149 137 137 131 125 -51 66 20 -244 -146 -282 -101 -15 36 5 -364 -186 -211 -205 168 -18 -29 -19 259
4640 259 -106 -170 -122 -291 161 15 -5 -111 17 83 42 -62 102 -7 -96 -33 75 69 -23 -187 52 -8 185 -204
4664 -204 86 -125 2 178 293 -15 28 -147 -18 -275 148 -315 -65 53 -249 202 82 -112 110 242
4684 242 -2 -125 188 87 -189 113 -123 121 -35 5 -41 -64 15 -192 -1 121 145 8 -120 -12 115 -56
4706 -56 -189 -361 109 -42 -55 30 -6 81 -194 24 299 -73 36 139 89 -27 21 -85 -455 269 38 506
4728 506 -100 -23 -221 82 -33 257 96 0 -62 -189 76 76 251 139 177 -41 119 -54 -138 -35 -182 -162 172
4751 172 -190 -27 206 132 303 -88 -69 150 -103 211 6 131 -32 -2 75 289 -50 -306 -30 156 24
4772 24 25 -162 111 47 -60 -310 8 -168 259 -179 165 295 60 144 14 -17 25 34 -12 67 -46 -92 22 296
4796 296 -103 -267 -109 308 35 98 163 60 153 131 -74 -125 130 -172 -267 17 390 43 91 -326 -273 12 -130
4819 -130 -425 134 -122 -123 -118 -374 -136 321 253 -107 -154 52 430 -149 -181 -62 -50 -144 301 6 314 298 -3
4842 -3 104 478 72 -23 -48 117 -71 86 176 163 -32 -20 -38 34 -46 -235 -33 -77 -220 -96 -91 -86 -28 -132 -79 -307
4868 -307 -163 34 62 122 -46 50 -166 -53 167 -17 140 2 135 -219 -159 270 -227 -243 -36 117 69 24
4890 24 4 -36 301 77 49 49 -12 33 429 -31 4 -199 44 -20 -221 54 89 -16 136 160 55 -50 -163 149
4914 149 -9 16 58 124 72 210 468 18 -39 -256 204 -1 57 -67 -55 -358 33 -19 -207 -8 -150 205 93
4937 93 -102 131 -200 -33 -31 -272 141 -130 31 215 -66 324 19 -158 40 -154 281 117 30 -18 96 21
4959 21 9 -58 -302 -204 110 186 168 40 284 -169 -214 -58 -95 314 -65 -45 72 215 -75 -25 218 86 0 7
4983 7 140 185 -70 -145 276 -302 -26 -127 -102 -2 227 -25 345 185 -40 220 -140 -218 34 133 -203 149
5005 149 232 -182 101 -76 30 210 135 63 17 -76 8 128 -85 21 104 50 -85 160 -64 476 -215 171 67
5028 67 34 -23 222 119 -296 100 -116 -123 -18 -11 -116 131 -228 -90 17 -53 8 -143 21 -2 -135 311 -263
5051 -263 -68 117 -56 225 45 -72 -125 -24 117 79 -198 289 -148 140 -34 -43 286 -26 -196 -31 24 16
5073 16 25 -42 52 20 -93 61 -78 277 -76 37 143 -245 -194 41 40 -286 -93 153 21 -20 -288 -327 -61 14
5097 14 -8 45 -102 151 2 43 -81 102 84 15 326 -13 151 -380 -276 -53 154 -115 351 222 -335 35
5119 35 -2 -185 233 -126 96 47 -28 121 -3 111 37 132 308 60 -55 -45 -82 -52 -101 -132 -145 -34 -49 -129 165
5144 165 146 115 265 -59 92 77 149 120 140 4 -76 155 -148 105 25 -144 0 184 -240 -257 -182 -201 224 -147
5168 -147 -298 126 18 -147 -215 90 -139 73 4 122 297 116 126 -334 286 -25 239 -45 -92 30 -81
5189 -81 -146 19 138 -266 -156 158 -227 -5 234 -5 74 78 115 -206 108 -123 96 -519 6 225 -38 12
5211 12 232 30 180 -141 74 20 57 -129 33 26 2 23 82 114 8 30 -130 303 -26 -195 -37 -195 -14
5234 -14 95 167 -112 -22 -81 266 214 -157 -69 54 144 37 -443 -76 -104 -58 5 137 187 -27 27 -35 -207 -258 177
5259 177 373 -56 -23 26 -35 81 -70 18 62 -186 94 -76 -89 -90 48 -78 34 -29 81 105 -242 -187 64 -31
5283 -31 -15 266 -129 -167 -118 256 46 -210 -221 -132 -179 110 -169 214 -10 -145 130 207 158 122 -39 -72 186 60
5307 60 111 -138 43 83 127 42 346 -122 194 -233 237 -185 -113 207 -232 167 -267 -85 22 -125 179 -118
5329 -118 -17 155 -28 -54 -425 240 101 -45 -151 261 -16 49 -216 -319 -56 -253 77 137 169 -51 -161
5350 -161 8 -12 -66 -306 -131 29 92 -5 -218 101 -154 -85 251 55 -38 214 134 238 390 -177 144 123 -122
5373 -122 -207 70 -314 241 -1 80 -80 178 -249 -119 85 14 191 -182 -193 -310 -31 217 -207 277 5
5394 5 155 84 143 -259 88 -150 24 270 -114 -137 255 -84 -47 -115 -15 289 -143 47 -94 -104 -296 -56 284
5417 284 0 400 91 -146 15 244 -116 -205 25 -142 -52 62 -19 -317 -228 -109 100 -159 162 -19 108
5438 108 -97 110 -165 66 24 -35 -23 -82 -20 -111 -111 13 177 16 -133 -132 13 74 172 327 -77 -130 115 106 -14
5463 -14 -170 117 -273 98 0 4 88 -132 228 -97 -45 69 -75 -120 -135 134 -465 86 26 -63 -6 349 211 -25
5487 -25 121 306 44 21 89 111 104 89 -55 -52 100 -122 156 -75 -111 -238 -141 175 -264 -63 185 200 149 105 -125
5512 -125 38 -37 24 175 -116 -145 84 75 -116 27 186 -90 -14 146 133 153 -121 180 -164 10 -73 -100 42
5535 42 -498 -392 -184 8 -151 235 -22 -161 -121 5 -125 21 -228 59 -53 -131 -195 -27 68 25 139 -155
5557 -155 -60 87 -65 169 -74 91 -128 34 77 25 74 -32 275 -164 172 -274 -171 -165 -62 115 102 136 133
5580 133 -320 121 114 250 -61 13 -15 -246 227 30 -74 139 43 40 -32 88 55 -194 154 -10 157 9 67
5603 67 -87 -156 -14 -165 -196 -128 -235 -91 386 -158 111 117 -267 78 -216 -192 33 69 -168 0 -303 -111 -166
5626 -166 126 96 -33 28 -113 128 -225 554 90 -93 -225 165 247 79 -61 -3 -132 76 -111 -73 35 90
5648 90 6 46 7 -118 -149 297 68 106 -159 136 5 -217 -114 137 -138 -100 -46 87 173 49 -188 -151 -46
5671 -46 124 -81 83 -34 -57 119 154 198 110 61 -146 -153 60 5 -68 -32 162 253 105 131 -276 -185 -232 66 -188
5696 -188 -175 47 16 376 -150 181 -104 -93 -408 -24 201 -18 54 -120 91 -55 -4 66 163 158 149 260 68 41
5720 41 11 -57 -33 -297 9 91 114 -42 -253 277 198 -114 -63 -165 -72 164 201 -258 216 -72 13 -26 -41 -420
5744 -420 -244 128 -255 71 55 138 199 -44 180 286 -171 -103 -14 -61 46 -6 76 -163 220 -218 -145 113 -173
5767 -173 55 -78 183 201 3 21 -67 129 -251 -84 -236 -34 -121 -87 97 16 -42 -120 -313 -46 -105 -45 -209
5790 -209 -61 415 399 -25 -95 -125 11 179 29 1 38 190 -155 -115 -55 32 17 180 78 264 -177 -91 102
5813 102 114 -23 94 18 -204 -219 -130 89 -149 22 -21 60 -20 5 329 167 136 75 -63 292 -133 -210 106 166
5837 166 -8 -247 -154 12 -25 -103 159 57 76 -379 -133 -18 -79 -176 -59 110 -26 -5 146 -198 -135 -34 -139
5860 -139 -165 -61 -95 -73 133 122 237 -565 297 42 -84 -32 16 118 22 97 -76 30 338 103 205 -42 -207
5883 -207 162 14 -292 -25 49 85 74 249 65 11 -126 23 331 34 37 -10 34 -26 -308 133 -134 -8 -140
5906 -140 -18 -129 117 -101 -63 -57 -52 310 -125 -67 9 -70 -18 -49 39 -59 401 -118 -194 -110 -74 42 131 100 -31 169
5932 169 -69 68 59 94 170 55 30 -49 -76 -173 281 -99 54 98 -144 -77 41 51 -14 288 84 237 219 38
5956 38 45 -31 -11 -34 139 -27 -67 9 53 49 -276 -105 -95 -221 72 -151 -105 -123 23 -223 -171 -53 188 -60 -250
5981 -250 91 11 -33 -143 118 25 -104 287 60 -33 37 7 -54 -64 -78 78 -81 82 -10 -360 106 -357 47
6004 47 234 212 59 -40 246 64 -82 -186 120 -256 121 115 -180 -90 98 -147 229 105 -283 76 100 -73
6026 -73 -72 -156 -97 74 11 -103 -18 -158 142 -230 1 -13 211 -119 -1 64 -178 -207 92 -129 48 53 -232 51
6050 51 -192 -36 31 259 -114 142 -1 147 298 -42 88 -79 159 32 -116 -55 -20 245 73 78 129 -63
6072 -63 -104 187 178 -1 -14 -147 70 -101 124 11 -197 -38 56 78 305 -78 294 -56 203 -93 468 -16
6094 -16 215 300 -157 -27 -176 -163 -102 -126 191 94 68 -115 116 71 3 -130 -57 -39 45 29 -118 362 -121 181
6118 181 35 -50 -65 3 -175 -9 32 5 54 -224 46 143 -66 -203 -276 -104 -49 150 6 162 21 -103 -93
6141 -93 14 -108 -33 265 157 107 71 -88 -7 -88 -174 -94 -350 -120 -91 -24 -63 -104 35 -106 236 -55 24 12 164
6166 164 -109 -204 -9 208 68 43 289 90 58 -167 23 195 164 72 11 -24 31 47 -124 -108 122 -104 90
6189 90 175 -400 153 -16 87 129 181 287 64 -63 190 -34 -221 -100 -233 283 123 -25 98 -149 244
6210 244 12 -144 -275 47 -15 -9 274 -203 -110 57 156 67 119 -182 -31 24 -205 94 210 -46 180 -186 -68
6233 -68 -28 -354 279 59 -162 81 -121 -42 89 529 59 -42 319 32 -270 -219 -56 46 -200 307 -56
6254 -56 12 -110 -48 116 234 131 -213 -265 -54 270 120 -208 -181 -198 -56 81 -25 -103 443 254 133 -239
6276 -239 -144 71 -237 42 -4 44 -31 -191 324 -151 -80 -233 -131 248 146 -31 -35 -16 41 -238 18 185 27
6299 27 -150 -160 113 -20 63 -149 151 67 -118 126 166 -158 -130 -54 -45 116 -211 13 59 -107 126 -117 164
6322 164 5 -274 -85 -4 218 -227 292 -79 -108 -192 -133 -509 -73 244 180 68 124 -346 208 58 -195 -49
6344 -49 -22 98 -111 -31 -129 -102 194 -155 -117 -25 -136 -106 -13 147 260 -17 -204 254 -208 23 -159 48 165
6367 165 102 -124 83 -58 45 117 -158 34 -141 122 -28 -448 310 -117 33 -1 -223 -373 47 213 -103
6388 -103 -85 -67 -60 46 -209 121 -1 176 -310 -151 154 -162 -114 247 295 -19 -62 133 75 19 -249 25 295
6411 295 -111 79 -275 -67 101 -141 -108 255 159 112 100 -52 206 1 197 64 91 -87 45 13 105 147 -5
6434 -5 188 -34 -140 -5 207 -126 74 207 -191 208 187 60 -206 -249 -298 -34 318 92 121 -206 -225 62
6456 62 -96 -49 -41 49 -171 105 54 122 77 111 -4 10 41 215 -43 44 4 13 101 223 266 132 -19 -17 -184 -24
6482 -24 -273 87 95 -106 92 -34 -39 11 -329 33 -88 101 -202 192 358 105 120 -114 57 -28 55 -24 -69 -180
6506 -180 24 127 -210 -96 -19 -390 236 376 239 34 316 76 96 -142 52 79 42 -33 123 -154 -143 98
6528 98 142 122 -121 -112 14 -109 -322 231 -89 77 -348 43 -153 9 49 136 -195 -62 34 133 196 -157 32
6551 32 65 71 -36 -62 -25 102 -23 -86 -120 17 -83 74 -109 -116 17 293 -246 30 -122 -11 -20 -57 228 138 -108
6576 -108 67 30 -239 -153 18 -32 -83 63 132 -7 -328 -55 50 -279 -250 95 -76 205 -10 32 -218 37
6598 37 -121 73 267 -256 -44 -10 -200 -17 -77 -118 171 191 -136 -14 48 11 -345 100 44 104 54 268 70
6621 70 184 -154 -129 217 -8 -156 -267 -189 20 163 185 -196 -175 43 146 -118 -140 -48 -20 -201 -212 -181 -127 48
6645 48 161 -23 -262 -37 -147 74 -21 -88 -132 -131 55 -60 -233 34 -232 -97 -122 -19 -20 103 158 -2 52 82
6669 82 -301 8 2 -88 -171 104 112 -22 -77 -261 -61 129 -67 -6 46 -340 -130 153 124 33 71 -11 -27 56 -99
6694 -99 204 54 -154 -17 10 -52 60 2 198 -12 146 -26 184 148 -213 99 42 -188 158 -7 234 -201
6716 -201 -113 174 -11 375 267 349 140 15 -136 52 342 38 -28 118 -200 61 243 -120 259 -5 77
6737 77 -38 -359 -209 -21 -23 -42 -87 -213 31 169 89 -242 -68 27 -259 -10 208 -147 -46 48 -137 56 -187
6760 -187 83 -137 -173 -100 47 -34 485 140 -32 27 -72 -231 266 -220 239 16 -143 -10 -91 56 -95 307
6782 307 -53 17 -262 252 -157 -11 -354 -48 -11 -227 -132 111 144 46 0 80 202 -239 146 99 21 134 -11
6805 -11 68 94 -169 -179 95 210 118 217 0 9 -283 -5 -282 -151 125 -230 159 -112 -60 -80 -171 -74 -287 -184
6829 -184 280 215 -223 -134 35 -191 148 -71 -227 135 -139 190 -223 50 121 28 -89 -106 184 136 -65 -21
6851 -21 133 -197 107 128 -26 58 289 -175 46 -92 -161 -194 345 80 -52 43 50 -28 -187 -17 179 -43 -185
6874 -185 -213 106 -59 113 -195 -182 -103 181 90 85 -334 -30 136 2 528 94 -295 -17 -19 -38 26 -94 -70 8
6898 8 19 6 291 134 35 50 126 -11 223 -1 39 92 191 -120 -392 220 -228 86 -65 -48 -93 77 -81 161
6922 161 169 165 -13 -212 149 -19 -76 240 213 -230 112 -310 120 102 91 213 5 288 -288 61 10 255 137
6945 137 -56 46 37 257 35 -113 11 -286 -149 -37 -46 68 195 -33 153 -422 -47 67 -117 388 -182
6966 -182 -82 -317 -109 110 -19 115 -279 -87 142 27 106 22 73 67 33 170 142 -10 81 186 113 -270 243
6989 243 49 129 362 -274 -107 -112 81 -468 60 -283 125 33 -117 -100 -109 -186 23 -81 256 141 -132 104 116
7012 116 -58 -60 -54 -90 67 -97 99 18 25 -165 21 128 163 146 189 211 -336 -107 89 58 -344 54 -49 10 -68
7037 -68 28 -40 137 -165 -268 -35 179 112 -119 359 47 -121 -136 285 24 194 218 44 -221 92 -274 -88
7059 -88 -130 72 98 167 110 111 -114 65 11 15 -18 410 3 -194 115 -72 -7 -94 -189 -19 -86 -31 165 80 -34 195
7085 195 29 -62 75 -61 -114 -61 183 91 56 -213 -213 -295 -142 -113 -273 114 240 130 -142 49 90 244 -69
7108 -69 30 2 101 63 58 20 185 102 -40 5 265 75 87 -83 225 -8 -152 143 -139 32 -133 157 -97 178
7132 178 27 241 -41 -46 249 75 100 -14 -61 -110 -147 11 -77 360 -15 -250 -72 183 -349 400 -56 -54 -117
7155 -117 -256 73 -20 -3 -150 82 142 146 -106 -19 -45 351 -208 -110 -89 13 124 115 -153 259 -98 -7 -94 100
7179 100 245 -268 -57 -149 0 -257 -123 -119 -21 317 44 29 -79 182 114 5 21 204 -53 -202 -43 258
7201 258 82 63 84 92 -140 -197 -202 56 134 142 323 -163 83 300 39 220 84 374 -90 -33 -226 -242 -335 -210
7225 -210 -216 -57 -77 123 -100 -160 76 10 54 -304 -15 -92 -308 34 100 -47 -123 162 -59 59 -61 64 26
7248 26 -156 -243 202 219 -13 34 -49 -45 242 51 -118 284 -362 -306 23 279 77 -29 23 237 -45 -66 -8 -59
7272 -59 -106 -105 70 -118 44 103 -101 189 -267 -159 44 105 140 140 -208 -148 136 -176 167 -258 116 -138 -60 132
7296 132 -85 -256 -84 -61 152 125 -353 -200 7 53 -174 -91 102 -116 -119 -21 40 -50 107 40 544 -6 90 159
7320 159 1 0 188 -82 139 -98 184 -279 317 -208 -236 -24 69 324 164 -100 -30 -53 6 98 -195 243 160
7343 160 20 -237 61 -111 -186 141 103 -84 181 220 259 -7 208 -81 -106 181 48 -287 -266 -84 322 -202
7365 -202 298 -462 118 -61 22 -128 169 183 3 -131 -89 -74 7 -173 62 -42 65 112 -46 196 4 -84
7387 -84 69 102 189 -204 -68 -62 115 290 26 25 126 44 39 -113 129 183 53 -288 -224 369 -71 -77 128 81 -282
7412 -282 32 87 -249 193 -2 91 111 -320 -37 -307 83 257 -146 114 34 -64 -115 -160 19 -1 -36 -212 -27
7435 -27 -283 -10 244 -159 31 154 -77 44 -21 -36 259 16 35 83 -241 15 62 -250 201 -151 158 178
7457 178 249 45 1 -18 86 228 26 -320 -364 80 -166 -297 136 -148 -36 -50 -53 35 -206 153 201 108 -261
7480 -261 -82 163 -107 180 -78 116 140 -43 155 -129 39 -467 188 40 -115 -142 -144 92 -485 63 -262
7501 -262 -79 -4 -68 -246 2 36 47 137 -333 -83 -78 112 68 -119 79 -10 173 -61 -1 256 258 -64 -150 80
7525 80 -175 80 -80 57 -121 -64 -78 -5 338 185 -44 219 149 -38 39 131 95 -192 63 -73 -291 216 -12
7548 -12 -17 43 -55 13 46 148 -55 -114 232 -18 216 183 -252 -111 224 -66 -25 -41 71 -107 -144 -48 226 -54
7572 -54 31 173 187 -131 59 -91 -304 -45 91 -61 75 24 -87 358 -184 245 54 -73 -61 184 -306 -151
7594 -151 60 219 -17 -24 -144 34 -38 85 79 26 -138 -366 -122 231 89 323 -11 -195 279 71 -63 -147
7616 -147 120 47 138 -189 -243 69 -66 -293 -327 21 -79 238 -121 34 -6 -237 97 -97 -112 -6 222 -55
7638 -55 -136 184 2 169 72 -38 -48 -429 -77 194 92 -224 91 -131 -216 -150 -76 61 -44 -116 -179 115 -127
7661 -127 -10 67 -197 49 -38 266 -199 -128 -127 280 -101 -48 -135 69 1 249 239 12 -194 -54 -84 212 295 -63
7685 -63 24 230 -91 198 -103 -161 94 -284 -104 15 150 -199 -96 -191 -188 -291 -253 23 -294 -73 -59 -160 147
7708 147 -182 -52 272 -41 50 207 114 155 -15 -165 -18 120 364 -101 -103 60 81 150 -239 139 -144 426
7730 426 107 -13 53 -11 344 -37 9 -151 -185 73 -180 193 78 -6 415 279 -43 -62 154 -142 116 171
7752 171 2 203 -225 -31 -111 -194 -108 94 -4 -24 73 27 11 -70 17 98 343 199 118 63 -139 348 138 129 -34
7777 -34 -195 65 -109 22 201 60 222 -51 -62 -165 149 48 -131 27 -129 145 148 -236 -159 -123 187 -89
7799 -89 77 151 -75 132 126 279 60 -169 28 151 27 82 -67 150 -254 107 -176 48 -89 125 21 -63
7821 -63 -166 73 -268 116 24 213 154 -16 -31 -137 -96 -42 -47 103 140 -246 -25 28 -298 -186 12 -24 177 -273
7845 -273 -150 -3 -154 -178 -125 -133 -213 -46 35 165 -66 -131 196 365 -128 -103 -117 -155 -99 -104 -120 -15 36 -182 -538
7870 -538 34 32 144 -105 -31 235 0 251 126 -127 256 -12 22 90 -98 -6 148 3 -2 178 -90 109 25
7893 25 239 207 53 -184 128 -74 -139 -616 -107 41 60 20 255 63 156 -204 -207 -92 39 -262 250 -170 129
7916 129 188 -13 -21 -12 -39 -245 236 -95 190 -18 111 172 25 -166 -181 -314 -80 -189 184 -224 -290 73 -60
7939 -60 -167 405 295 57 161 125 8 -234 103 -22 -184 -10 -28 113 185 67 -127 -277 45 281 120
7960 120 264 65 -49 5 -123 29 -159 71 -17 -145 1 -111 -98 -158 275 116 218 42 -96 -43 60 -98
7982 -98 232 -48 72 -69 293 7 460 114 -131 -34 -28 1 98 121 95 149 -173 -266 87 -261 41 29 -84 -242
8006 -242 -147 59 -74 -221 149 242 -1 -130 68 -231 -102 -39 129 67 301 -81 -140 -140 -281 -189 -420 -20 161
8029 161 55 153 25 -16 -45 -63 -208 154 -296 -352 27 -16 -208 356 -149 19 -56 171 109 77 276 21 -30
8052 -30 165 164 -269 124 -29 -157 -49 209 -94 -464 -155 298 -69 -138 -184 -179 -391 263 41 -16 316 64 249
8075 249 128 -15 -54 -175 128 -145 -45 -163 -101 38 -8 -214 -240 126 -187 -79 94 -124 72 -148 144
8096 144 156 117 -266 47 -87 283 27 30 105 -59 -55 -103 -178 -56 -225 95 463 -350 76 -245 127 302 260
8119 260 203 -76 -78 20 213 -249 -115 13 50 -239 96 -159 72 -245 -162 157 179 336 -39 -225 235 -23
8141 -23 171 -268 -105 -171 -137 -172 15 -23 83 -25 -92 354 250 -25 -65 173 -204 121 -121 53 -345 -201
8163 -201 -37 -139 169 393 191 -113 -51 -124 -112 388 32 286 -136 194 -114 56 -136 111 42 -120 -33 -10
8185 -10 -341 -217 -54 48 84 -44
8191d4
##END NTUPLES=NMR FID
##END=
