##TITLE=1H_Ser EL-7
 CDCl3
 8 sc, 
 13.8.2024
##JCAMPDX= 6.0         $$ Bruker NMR JCAMP-DX V2.0
##DATA TYPE= NMR FID
##DATA CLASS= NTUPLES
##ORIGIN= UXNMR, Bruker Analytische Messtechnik GmbH
##OWNER= root
$$ XWIN-NMR		Version 3.5
$$ Tue Aug 13 16:34:03 2024 Russian Standard Time (UT+4h)  she@DPX200
##.OBSERVE FREQUENCY= 200.1313
##.OBSERVE NUCLEUS= ^1H
##.DELAY= (6, 6)
##.ACQUISITION MODE= SIMULTANEOUS
##.ACQUISITION SCHEME= undefined
##.AVERAGES= 8
##.DIGITISER RES= 18
##SPECTROMETER/DATA SYSTEM= spect
##.PULSE SEQUENCE= zg30
##.SOLVENT NAME= DMSO
##.SHIFT REFERENCE= (INTERNAL, DMSO, 0, 15.7039)
##AUDIT TRAIL= $$ (NUMBER, WHEN, WHO, WHERE, WHAT)
$$ ##TITLE= Audit trail, XWIN-NMR		Version 3.5
$$ ##JCAMPDX= 5.01
$$ ##ORIGIN= Bruker BioSpin GmbH
$$ ##OWNER= she
$$ F:/spectra/data/she/nmr/H-F/1/audita.txt
$$ ##AUDIT TRAIL=  $$ (NUMBER, WHEN, WHO, WHERE, WHAT)
(   1,<2024-08-13 16:33:00.70 +0400>,<she>,<DPX200>,
      <created by zg, POWCHK disabled, PULCHK disabled
       configuration hash MD5:
       00 E9 B6 7A A2 85 ED C7 34 08 36 98 17 FE 4E 26
       data hash MD5: 16K
       7B 67 40 16 E4 58 65 93 9A 90 8E 02 AD 37 62 6E>)
$$ ##END=
$$ 
$$ hash MD5
$$ D4 6C 3C FF 90 13 37 C6 DC DC 34 A9 63 7D 8E B9
##$RELAX= 
##$RELAX= 
##$RELAX= 
##$RELAX= 
##$RELAX= 
##$RELAX= 
$$ Bruker specific parameters
$$ --------------------------
##$DU= <F:/spectra>
##$EXPNO= 1
##$NAME= <H-F>
##$PROCNO= 1
##$TYPE= <nmr>
##$USER= <she>
##$AMP= (0..31)
100 100 100 100 100 100 100 100 100 100 100 100 100 100 100 100 100 100 
100 100 100 100 100 100 100 100 100 100 100 100 100 100 
##$AQSEQ= 0
##$AQ_mod= 1
##$AUNM= <au_zg>
##$AUTOPOS= <>
##$BF1= 200.13
##$BF2= 200.13
##$BF3= 200.13
##$BF4= 200.13
##$BF5= 200.13
##$BF6= 200.13
##$BF7= 200.13
##$BF8= 200.13
##$BYTORDA= 1
##$CFDGTYP= 0
##$CFRGTYP= 5
##$CHEMSTR= <none>
##$CNST= (0..31)
1 1 145 1 1 1 1 1 1 1 1 1 1 1 1 1 1 1 1 1 1 1 1 1 1 1 1 1 1 1 1 1 
##$CPDPRG= <>
##$CPDPRG1= <>
##$CPDPRG2= <>
##$CPDPRG3= <>
##$CPDPRG4= <mlev>
##$CPDPRG5= <mlev>
##$CPDPRG6= <mlev>
##$CPDPRG7= <mlev>
##$CPDPRG8= <mlev>
##$CPDPRGB= <>
##$CPDPRGT= <>
##$D= (0..31)
0 1.2 0 0 0 0 0 0 0 0.06 0 0.03 0 0 0 0 0.0002 0 0 0 0 0 0 0 0 0 0 0 0 
0 0 0 
##$DATE= 1723552380
##$DBL= (0..7)
120 120 120 120 120 120 120 120 
##$DBP= (0..7)
150 150 150 150 150 150 150 150 
##$DBP07= 0
##$DBPNAM0= <>
##$DBPNAM1= <>
##$DBPNAM2= <>
##$DBPNAM3= <>
##$DBPNAM4= <>
##$DBPNAM5= <>
##$DBPNAM6= <>
##$DBPNAM7= <>
##$DBPOAL= (0..7)
0.5 0.5 0.5 0.5 0.5 0.5 0.5 0.5 
##$DBPOFFS= (0..7)
0 0 0 0 0 0 0 0 
##$DE= 6
##$DECBNUC= <off>
##$DECIM= 24
##$DECNUC= <off>
##$DECSTAT= 4
##$DIGMOD= 1
##$DIGTYP= 9
##$DL= (0..7)
0 120 120 120 120 120 120 120 
##$DP= (0..7)
150 150 150 150 150 150 150 150 
##$DP07= 0
##$DPNAME0= <>
##$DPNAME1= <>
##$DPNAME2= <>
##$DPNAME3= <>
##$DPNAME4= <>
##$DPNAME5= <>
##$DPNAME6= <>
##$DPNAME7= <>
##$DPOAL= (0..7)
0.5 0.5 0.5 0.5 0.5 0.5 0.5 0.5 
##$DPOFFS= (0..7)
0 0 0 0 0 0 0 0 
##$DQDMODE= 0
##$DR= 18
##$DS= 0
##$DSLIST= <SSSSSSSSSSSSSSS>
$$ [...]
##$SUBNAM2= <"">
##$SUBNAM3= <"">
##$SUBNAM4= <"">
##$SUBNAM5= <"">
##$SUBNAM6= <"">
##$SUBNAM7= <"">
##$SUBNAM8= <"">
##$SUBNAM9= <"">
##$SW= 24.0689771365484
##$SWIBOX= (0..15)
0 0 2 0 0 0 0 0 0 0 0 0 0 0 0 0 
##$SW_h= 4816.95568400771
##$TD= 16384
##$TD0= 1
##$TE= 0
##$TE2= 300
##$TE3= 300
##$TEG= 300
##$TL= (0..7)
0 120 120 120 120 120 120 120 
##$TP= (0..7)
150 150 150 150 150 150 150 150 
##$TP07= 0
##$TPNAME0= <>
##$TPNAME1= <>
##$TPNAME2= <>
##$TPNAME3= <>
##$TPNAME4= <>
##$TPNAME5= <>
##$TPNAME6= <>
##$TPNAME7= <>
##$TPOAL= (0..7)
0.5 0.5 0.5 0.5 0.5 0.5 0.5 0.5 
##$TPOFFS= (0..7)
0 0 0 0 0 0 0 0 
##$TUNHIN= 0
##$TUNHOUT= 0
##$TUNXOUT= 0
##$USERA1= <user>
##$USERA2= <user>
##$USERA3= <user>
##$USERA4= <user>
##$USERA5= <user>
##$V9= 5
##$VALIST= <valist>
##$VCLIST= <CCCCCCCCCCCCCCC>
##$VD= 0
##$VDLIST= <DDDDDDDDDDDDDDD>
##$VPLIST= <PPPPPPPPPPPPPPP>
##$VTLIST= <TTTTTTTTTTTTTTT>
##$WBST= 1024
##$WBSW= 4
##$XGAIN= (0..3)
0 0 0 0 
##$XL= 0
##$YL= 0
##$YMAX_a= 199552
##$YMIN_a= -200666
##$ZGOPTNS= <>
##$ZL1= 120
##$ZL2= 120
##$ZL3= 120
##$ZL4= 120
##$ABSF1= 10
##$ABSF2= 0
##$ABSG= 5
##$ABSL= 3
##$ALPHA= 0
##$AQORDER= 0
##$ASSFAC= 0
##$ASSFACI= 0
##$ASSFACX= 0
##$ASSWID= 0
##$AUNMP= <proc_1d>
##$AZFE= 0.1
##$AZFW= 0.1
##$BCFW= 1
##$BC_mod= 2
##$BYTORDP= 1
##$COROFFS= 0
##$CY= 11.3945322036743
##$DATMOD= 1
##$DC= 2
##$DFILT= <>
##$DTYPP= 0
##$F1P= 15.6554695791079
##$F2P= 12.8336369535428
##$FCOR= 0.5
##$FTSIZE= 0
##$FT_mod= 4
##$GAMMA= 1
##$GB= 0.15
##$INTBC= 1
##$INTSCL= 1
##$ISEN= 128
##$LB= 0.24
##$LEV0= 0
##$LPBIN= 0
##$MAXI= 10000
##$MC2= 0
##$MEAN= 0
##$ME_mod= 0
##$MI= 1.114404
##$NCOEF= 0
##$NC_proc= 0
##$NLEV= 6
##$NOISF1= 3.799351
##$NOISF2= 2.8
##$NSP= 1
##$NTH_PI= 0
##$NZP= 0
##$OFFSET= 15.70392
##$PC= 1
##$PHC0= -25995.12
##$PHC1= 13.38748
##$PH_mod= 1
##$PKNL= yes
##$PPARMOD= 0
##$PSCAL= 0
##$PSIGN= 0
##$REVERSE= no
##$SF= 200.130013532006
##$SI= 16384
##$SIGF1= 3
##$SIGF2= 2
##$SINO= 400
##$SIOLD= 16384
##$SREGLST= <1H.CDCl3>
##$SSB= 0
##$STSI= 0
##$STSR= 0
##$SW_p= 3612.71676300578
##$SYMM= 0
##$S_DEV= 0
##$TDeff= 0
##$TDoff= 0
##$TI= <>
##$TILT= no
##$TM1= 0
##$TM2= 0
##$TOPLEV= 0
##$USERP1= <user>
##$USERP2= <user>
##$USERP3= <user>
##$USERP4= <user>
##$USERP5= <user>
##$WDW= 1
##$XDIM= 8192
##$YMAX_p= 0
##$YMIN_p= 0
$$ End of Bruker specific parameters
$$ ---------------------------------
##NTUPLES= NMR FID
##VAR_NAME=  TIME,          FID/REAL,        FID/IMAG
##SYMBOL=    X,             R,               I
##VAR_TYPE=  INDEPENDENT,   DEPENDENT,       DEPENDENT
##VAR_FORM=  AFFN,          ASDF,            ASDF
##VAR_DIM=   8192,          8192,            8192
##UNITS=     SECONDS,       ARBITRARY UNITS, ARBITRARY UNITS
##FACTOR=    0.0002076,     1,               1
##FIRST=     0,             0,               0
##LAST=      1.7004516,     0,               0
##MIN=       0,             -200666,         0
##MAX=       1.7004516,     199552,          0
$$ Real data points
##PAGE= N=1
##DATA TABLE= (X++(R..R)), XYDATA
0@%%%%%%%%%Kj0J6j6K4l2L2m0M9n7P2q8J04j20J36j57J82k09K40k73L09l51L97
$$ 0 0 0 0 0 0 0 0 0 0 2 -8 8 -8 16 -16 16 -24 25 -32 40 -48 56 -64 72 -85 97 -112 128 -145 164 -187 210
32B10m47N03n64O30p03P83q70R66j072J186j311J452j607J780j972K184k426K702
$$ 210 -237 266 -298 332 -371 412 -458 508 -564 622 -689 763 -844 936 -1036 1148 -1278 1424
50A424l017L382l810M322m946N721o708Q002r723J1846j7345K10404k41055q2189
$$ 1424 -1593 1789 -2021 2301 -2645 3076 -3632 4370 -5353 6493 -10852 199552 -41503 -123692
64a23692K91458k23346l3661K14360j57932l1370J48677j35407J9930R6018j03832
$$ -123692 167766 -55580 -89241 125119 -32813 -64183 84494 -50913 -30983 65035 -38797
75c8797L3228N0317q7239O3763O826q2761P3779R850o9834N1949p133k6617N0133
$$ -38797 -5569 44748 -42491 21272 28098 -54663 19116 28966 -40868 11081 3948 -22669 27464
88B7464k9865j2904M8747m8412r016N6264l3840k0674K9895j3579N104R262j6259
$$ 27464 -2401 -15305 33442 -14970 -23986 32278 -1562 -22236 7659 -5920 -816 8446 -7813
101g813J9558m465k5353L0553n064k8786L6952q354m2403M5352J3692n0366K9846
$$ -7813 11745 7280 -18073 12480 7416 -21370 15582 7228 -35175 10177 23869 -26497 3349
114C349K8470m9938J632L7333j7634j4902J2384j317l538K516L747J252l291N510
$$ 3349 31819 -18119 -16487 20846 3212 -11690 694 -623 -4161 -1645 2102 3354 63 5573
128E573k947j1644J3140O60j7027J7043J308k2243J8700M743j3905K1113j0442
$$ 5573 2626 -9018 4122 4782 -12245 4798 6106 -16137 2563 7306 -6599 14514 4072
141D072k4999L0483J422k6566J8838J666j6121J1031L291K107J95j4456J2750
$$ 4072 -20927 9556 10978 -15588 3250 4916 -11205 -174 3117 5224 5419 -9037 3713
154C713M364j8536J4827j226j7417K2800n913j7717K7566o693j6444K2311j1818
$$ 3713 8077 -10459 4368 3142 -14275 8525 2612 -15105 12461 5768 -10676 11635 -183
167a83r675K0395j6593P54J8114k4574M280K0904j7957O359O524j8715J5443j183
$$ -183 -9858 10537 -6056 -5302 12812 -11762 -7482 13422 -4535 1824 8348 -10367 5076 3893
181C893j6710K2963o519k0003K3125l435j1782J9004q655q136J3281j0171n06
$$ 3893 -12817 10146 3627 -16376 6749 3314 -8468 10536 1881 -6255 7026 -3145 -3651
194c651Q477r523N573n70q651J6228m708j2129J9381q366j2229J7796q958o247
$$ -3651 4826 -4697 876 306 -8345 7883 3175 -8954 10427 2061 -10168 7628 -1330 -7577
208g577J6281j3581j440J6463j4643J360J4524j5102J252P614j1932P764M355
$$ -7577 8704 -4877 -6317 10146 -4497 -3137 11387 -3715 -2463 5151 -6781 983 5338
221E338j2994Q310K687r550J0759J83r302Q187k623p251J0165k052q178P439o7
$$ 5338 -7656 654 3341 -6209 4550 4733 -4569 3618 995 -6256 3909 1857 -6321 1118 1051
236A051m119N264l55k031K679l089j545M129l350j331N331l809j291N227k916
$$ 1051 -3068 2196 1841 -190 2489 -600 -2145 1984 -1366 -2697 2634 -1175 -2466 2761 -155
251a55m25N559o332j701O400n991K10O932q127J456O942q808M246P148j1728K659
$$ -155 -580 4979 -1353 -3054 3346 -2645 -2435 4497 -3630 -2174 4768 -4040 206 7354 -4374 -1715
267a715O994j0541M405N209r837N440L488q260P580R50p829O794j147n844P165
$$ -1715 5279 -5262 -857 4352 -5485 -45 3443 -4817 2763 3713 -4116 2678 1531 -4313 2852
282B852k788l737O288l516j514N437l473K20L210m976J771J684m694L832J050
$$ 2852 64 -3673 2615 -901 -2415 3022 -451 -231 2979 -1997 -226 1458 -3236 596 1646
297A646m077K845L20j653K706q73j469J222j920O46J395k031J173M41j494J885
$$ 1646 -2431 414 734 -919 1787 914 -555 667 -1253 -607 788 -1243 -70 371 -1123 762
313G62K61p73P48j436L96J95j883K075K46k170K415k35k213L420j403j247K242
$$ 762 1023 250 998 -438 -42 153 -1730 345 591 -1579 836 601 -1612 1808 405 -842 1400
330A400k362l77K812l071Q06K807l891K072K490m025J882J099l973K647J14k426
$$ 1400 -962 -1339 1473 -1598 -792 2015 -1876 196 2686 -1339 543 1642 -2331 316 430 -1996
346a996L429j201k023L581j984n57L147k790j214L477l184K14K782k936P70J811
$$ -1996 1433 232 -1791 1790 -194 -751 2396 -394 -1608 1869 -1315 -1101 1681 -1255 -485 1326
362A326k570J443J472k705J687Q7j994J231M03j681J676k75p25R36j50k74O12
$$ 1326 -1244 199 1671 -1034 653 740 -1254 -23 380 -1301 375 100 -625 311 161 -113 499
379D99p01l46M12q6L8J38J65l25Q6L34j61R2P15j622L25R43j152l6J123q96N29
$$ 499 -202 -548 -136 -222 -184 -46 119 -206 -120 214 53 145 860 -762 -437 506 -646 -682 441 -455 74
400G4L47l97N27k58o13N16o39k98J520j384L0J568j259n3J497j341J15P99j340
$$ 74 421 24 551 293 -320 196 -443 -741 779 -605 -575 993 -266 -319 1178 -163 -48 751 -589
419e89M31R62j716J281L0j332J271J59r89J560p06j349J148n63l97J359o23j68
$$ -589 -158 804 -912 369 399 -933 338 497 -492 1068 362 -987 161 -402 -799 560 -63 -231
437b31J119q92r8J234j289J59L15j163O48N94r34O48N6n66M41L22p04N18r9k89
$$ -231 888 -4 -102 1132 -157 2 317 -846 -198 396 -538 110 166 -400 41 363 -341 177 78 -211
457b11K07n0j54J14J96J60p2J85k25n23O62l37k76O63o33R4P89j017L25N45m63
$$ -211 -4 -54 -208 -94 102 262 190 375 150 -373 289 -48 -324 339 -294 -200 589 -428 -103 442 -21
478b1k90P82r94K29O17r19P72K73j234Q23L41r28R27l16n19P13m88j95P34m60
$$ -21 -311 471 -523 -294 323 -596 176 449 -785 38 379 -549 378 62 -457 256 -232 -427 307 -153
498a53l29J072r54J23O47p88L21O24q67K35M21q22L73M19r49N84L95n82O89n97
$$ -153 -482 590 -364 -241 406 -382 -61 563 -304 -69 352 -470 -97 322 -627 -43 352 -230 459 -138
518a38k99N03m06j2M37J30o03P29l66r5K64k11K42n8l88K37J00l04K59n7J86m8
$$ -138 -437 66 -340 -352 85 215 -388 341 -25 -120 144 -67 175 117 -271 -34 66 -238 21 -36 150 102
540A02k93J65K7p7K52k74P0J0k7k86M58K3J24Jk78K26k64k29J21N68m32k87L99
$$ 102 -191 -26 1 -76 176 -98 -28 -18 -45 -331 127 150 274 275 -3 223 -41 -270 -149 419 -13 -300 99
563I9j50j92K82J75j98K40N0j05j69l37M94j55k0k6L62o8k99Pk12J43J94O1n48
$$ 99 -51 -243 39 214 16 256 306 201 32 -305 189 34 14 -12 350 282 -17 -10 -222 -79 115 176 -372
586c72Q10m23m18O72l63K98r5l73L66j5n39M21K67l62Q3L15m12L67l15rK67m22
$$ -372 438 15 -403 269 -94 204 109 -264 102 87 -452 -31 236 -126 -43 272 -140 227 -88 -97 170 -252
608b52m1N15l32j53R33r75J67P35q77L72M21q70L02K29q54P66R4n93Q35j62p16
$$ -252 -293 222 -110 -263 670 -305 -138 597 -280 92 513 -357 -55 174 -680 86 180 -413 422 260 -456
629d56P49j9m99N89m66j39J029j147%Q50r53M50P20q31N0O61p10k94R05r07K10
$$ -456 293 274 -225 364 -102 -241 788 -359 -359 491 -462 -12 708 -123 -73 588 -122 -416 489 -418 -208
650b08M94m72L26j39j16M49l42n04R46q66l6N96k12l05R39n52j34N53l90l16P40
$$ -208 286 -186 140 1 -115 334 -8 -512 434 -432 -468 128 -84 -389 550 -2 -136 417 27 -289 451
671D51k70l36J61l83J27K46k10j93O07m97L10J80k89K21l36j03M69j58j77L21
$$ 451 181 -155 6 -377 -250 -4 -214 -407 200 -297 13 193 -96 125 -211 -314 155 -3 -180 141
691A41j33n05N74K11p00K52N47o62L91j36j9O4k1j75M25n84L88K71p66L87K36
$$ 141 8 -497 77 288 -412 -160 387 -275 116 -20 -39 25 4 -171 254 -330 58 329 -437 -50 186
712A86l64N7J70R0N8j4n66K63M20o88M19J93n41L22K06n54M12MO1Rk16M58k88
$$ 186 -178 -121 49 139 197 183 -383 -120 300 -388 31 224 -317 5 211 -343 69 73 134 143 -73 385 97
735I7o52N52K04o81P76J24q27N05p2j95L09j69p6K60m32o0N39k64O0J16o78P02
$$ 97 -555 -3 201 -480 296 420 -407 98 26 -169 140 -29 -105 155 -277 -337 202 -62 -2 114 -564 138
757A38J95o89O15l34l46O90l62R7L22k64l20N55k14m94N10l58M91K9n92M01K82
$$ 138 333 -356 259 -75 -421 269 -93 4 326 62 -258 297 83 -411 99 -259 232 261 -331 70 352
778C52p31N38r0o15M98L08p78P31j20m14L05J43k49L78n32L10n5j15K1M21n03
$$ 352 -379 159 69 -546 -48 260 -518 213 93 -321 -16 127 -122 256 -276 34 -21 -136 -115 306 -197
799a97L01L01n43Q3L84o6N7O0o20J72j61R6O8J56m63O09k5k60K62j9o11M24K31
$$ -197 104 405 -138 -55 329 263 320 380 -240 -68 -229 -133 -65 91 -372 237 212 -48 214 195 -416 8 239
822B39l18N9k08K34J39l71M81J69m67j1K70l51r7P6OL20J45n81K04M50l43P0j50
$$ 239 -79 -20 -228 6 145 -226 255 424 -43 -54 216 -135 -232 -156 -150 170 315 -266 -62 388 45 115 -35
845c5j20K53J4k32K66j07j76M55N7l64J37k39P2J83l67M08j73j23k20M17j65K95
$$ -35 -155 98 112 -120 146 39 -137 318 375 11 148 -91 -19 164 -203 205 32 -91 -311 106 -59 236
867B36j92l49L37l75K25lj47q0P40n81K39OQ9J37J7o35L22L23n68L18k3m55N15
$$ 236 44 -305 32 -343 -118 -121 -268 -348 392 -189 50 56 145 282 299 -336 -14 309 -259 59 36 -419 96
890I6Ll57M13Jm17K28m6m4M25j44l12K07m1O2J74k52J41l45m5N97j29m37p1M28
$$ 96 99 -258 155 156 -261 -33 -79 -123 302 158 -154 53 12 74 248 -4 137 -208 -253 344 215 -222 -293 135
914A35j17J91j84l56R67p84P6O7j47J96K32o81Q4M20j0Lm5l6j07J72l63L94j26
$$ 135 18 209 25 -331 636 -148 -72 -5 -152 44 276 -405 -321 99 89 92 47 11 -96 76 -287 107 -19
937a9j98L69N5l22K45k88O8L49j82kN3k47J13L21l82P0K63m03J99R0l09L31j89
$$ -19 -217 152 207 -115 130 -158 -90 259 77 75 128 -119 -6 315 -67 3 266 -137 62 152 -157 174 -15
960a5j73K64j33j62M21m20J29K23j12m3J0Q5l63N67k80n5M07k37N2k02r6%K83
$$ -15 -188 76 -57 -219 202 -218 -89 134 22 -21 -11 74 -289 278 -2 -57 350 113 165 -37 -133 -133 150
983A50k43M1K62l83M49J57n37j34N72o17L01K4j88K61J16j18J03oj29M3k00j55
$$ 150 -93 -52 210 -173 276 433 -104 -238 334 -283 18 42 -146 115 231 113 216 210 81 124 -76 -231
1005b31M52n28J64J29k01N9M53o58L82j33k60M06P6l8q4L70m24L6m2Q4k12L18
$$ -231 221 -307 -143 -14 -215 -156 297 -361 21 -112 -372 34 110 72 -12 358 -66 -30 -72 12 -200 118
1027A18r9j58J25j16K79m8l74K95p0K33o1m16L27Q0p6n08N79K29k32m13J30K72
$$ 118 19 -139 -14 -130 149 101 -273 22 -48 185 124 -292 35 115 39 -469 110 339 107 -306 -176 96
1049I6k18K2L36l85J60j64P1J69O8n89K90R8N6J23j85j26J66k5K95o8R3j40j41
$$ 96 -122 -100 236 -149 11 -153 -82 87 155 -434 -144 -46 10 133 -52 -178 -12 -37 258 190 283 143 2
1072BJ43k82L42k40o7K9l1L27m48M37l60o7K62j48K58o3Q5l32K08j70L83j58j69
$$ 2 145 -137 205 -35 -102 -73 -104 223 -225 212 -148 -215 47 -101 157 94 179 -153 55 -115 268 110 -59
1095e9J55k12J65J26m28O7L71j7k44M42l77l70N08k51J14K61k07j52M44m49q9
$$ -59 96 -116 49 175 -253 -186 185 168 -76 366 -11 -381 127 -124 -10 251 44 -108 336 -113 -202
1116b02L20j77K13l54J16K01m6K16k55j43J37Q1k00K98r6k36J40k73K62J62m05
$$ -202 118 -59 154 -200 -84 117 71 287 32 -111 26 107 -93 205 109 -127 13 -260 2 164 -241
1137b41L35j5P2k17P8J47j19L4R0m6l57L05k11K12l8J07k32K12J8p2j15j82K67
$$ -241 94 79 151 -66 12 159 40 74 164 118 -239 66 -145 67 29 136 -96 116 134 62 -53 -235 32
1160C2ok35J54J31j73J37J7j26J04j43J57o4M6k15P7M2J66Q3j33Q3l21JK22J98
$$ 32 26 -209 -55 76 -97 40 57 -69 35 -108 49 -15 31 -184 -107 -65 101 184 51 134 -187 -186 36 234
1184B34j81p1op2J95r0J05l57M33l28K87l78M34k24l04K80j42r8K27J59j54J22
$$ 234 53 -18 -24 -96 99 9 114 -243 190 -138 149 -229 205 -19 -323 -43 -185 -283 -56 103 -51 71
1206G1j28P2j10K03j45L50k19m35K77M97k46m95K60J86l5n6k11q3O06n16K29k45
$$ 71 -57 15 -95 108 -37 313 94 -341 -64 433 187 -308 -48 138 103 47 -164 -247 359 -157 72 -173
1228a73K10J02k55K83l79K99j43MK56k43n0nK36k79J16q4j94N94n37K81k50J79
$$ -173 37 139 -116 167 -212 87 -56 -52 204 -39 -89 -94 142 -137 -21 -105 -299 295 -242 39 -211 -32
1250c2q5K81j72l3R4k00J08O6n5J80m5n58M64l5J03j58qrK07k9J03j67k87K76
$$ -32 -117 164 -8 -41 53 -147 -39 27 -28 152 107 -451 13 -22 81 -77 -85 -94 113 84 187 20 -267 9
1274IJ94k50J81k48K0J4K7q0J51L2r0P9k21J71k9J54j61K53p5J59m53K98J08n42
$$ 9 203 -47 134 -114 -94 -80 -53 -133 18 50 -40 39 -182 -11 -40 114 -47 206 131 290 -163 135 243 -299
1298b99K89L9l47M35J76m39L73l70K15j84O5j2Q9Pp3J61rk8k93K06L0j97J41m
$$ -299 -10 29 -318 117 293 -146 227 -143 72 -112 -47 -59 30 37 -36 125 116 88 -205 1 31 -166 -25 -29
1322b9M8K45j59j88l2m6L25l96M48Rk80K86k11L2m30M87j25M13o16N83l98J51
$$ -29 19 264 105 -83 -115 -161 164 -232 216 225 -55 231 20 52 -378 109 -16 397 -219 364 -34 117
1344A17j24J91k29J95n8l09J37Q8K81k63oj36M25m29J36K52m14J14K03l40m0k8
$$ 117 -7 184 -45 150 92 -217 -80 8 289 26 20 -116 309 -120 16 268 -146 -32 171 -169 -209 -237
1366b37J63j58m12N08l4Qj59J58K14l70J27M07l16K79l0r3k97L17J62j50p0n4
$$ -237 -74 -232 -644 -136 -170 -162 -321 -163 51 -319 -192 215 -101 178 148 55 -242 75 237 87 17 -37
1388c7J6q5J07K1p7j72L54N8K6j30j16J57j81L85k64j09J58j13j28J99K0OJ9k87
$$ -37 -21 -106 1 22 -55 -227 127 185 211 81 -35 122 -59 326 62 -47 111 -2 -130 69 89 95 114 -173
1412a73q7L33j42K31l78K13Q2Q2j46l25J69K06j7j60J85j02j49K07K49q9m57M13
$$ -173 -260 73 -69 162 -216 -3 79 161 15 -310 -141 65 48 -112 73 -29 -178 29 278 189 -268 145
1434A45l85pK82k21J06j47Q9L9K20k67J74Q7l52j55N94l73J67p1M5lk43J70j41
$$ 145 -240 -247 35 -186 -80 -227 -138 -99 121 -146 28 115 -237 -392 202 -171 -4 -75 -30 -33 -276 -106 -247
1457b47N19k25j09K71j37J51k3k33J23L6Kk29r6N13j83K7j71l04K75J81m06N51
$$ -247 272 47 -62 209 72 223 200 -33 90 126 128 -101 -197 316 133 160 -11 -315 -40 141 -265 286
1479B86j50J5O4j68j43J62J61J2n51O18k87J46k20k43K59K87k99n1O5j04K21j38
$$ 286 136 151 215 47 -96 66 227 239 -312 306 19 165 -55 -298 -39 248 -51 -102 -37 -141 80 -58
1501e8J05k09K71j07k41K72j15R6J75j08J62m3l17j65M52l01J54k11L79l25k9
$$ -58 47 -162 109 2 -239 33 -82 14 189 81 243 200 -117 -282 170 -131 23 -188 191 -134 -163
1522a63J78O2l31L97j9m3N5Q1j65n3j33J56l7J25j70J22R0j72M6j43l6N0j17j00
$$ -163 15 77 -254 143 124 81 136 217 52 -1 -134 22 -15 110 -60 62 152 -20 26 -117 -153 -103 -220 -320
1546c20L41o5K33k18J46N4k08r4q3K32J13r8N5k6k90J02M26m64M3K54j46Q8p3
$$ -320 21 -44 189 -29 117 171 -37 -131 -214 18 131 33 88 62 -228 -126 300 -164 -121 133 -13 75 2
1569BJ61l32L28p4k6m0j46L32n3Jl91M60l65r0L86j61K96r9j33j75N43m99q2L9
$$ 2 163 -169 159 85 59 19 -127 205 152 153 -238 222 -143 -233 153 -8 288 189 56 -119 424 -75 -157 -118
1593a18J59J38O5j48j55Q9j0k59L33L00o39M29K19l68q2Q4j3J49k58P9j78Q0l5
$$ -118 41 179 244 96 -59 30 20 -239 94 394 -245 184 403 35 -47 37 24 173 -85 -6 -184 -104 -139
1616a39N41j22k57J54q0j08J13j95J3j1l7Q5n8P9J01k6k22P0J8R0J44k88j2J62
$$ -139 402 280 23 177 97 -11 102 -93 -80 -91 -128 -43 -101 -22 79 53 -169 -99 -81 9 153 -135 -147 15
1640A5J02J3o6j74j30M65M0n82K32K53J85k12l1K0j37k9N9l03p7K42k28L35K03
$$ 15 117 130 64 -110 -240 225 265 -317 -85 168 353 141 110 130 -7 -36 23 -280 -357 -115 -343 -8 195
1663A95l59K63k19L80j88k76J76Rk99J83j64K53J25J9k68J36J31k14L35J31m59
$$ 195 -164 99 -120 260 72 -204 -28 -19 -318 -135 -299 -46 79 98 -170 -34 97 -117 218 349 -110
1684a10J15l46J58J42O3r4j9K10k13K17n1l20J26O9p7KN1m23L75j30J93J48l77
$$ -110 5 -341 -183 -41 22 -72 -91 119 -94 123 72 -248 -122 -53 -130 -128 -77 -500 -125 -255 -62 86 -291
1707b91M82m93J53K01j83j01Kj10R4J90L94k24k53J16l46N88j39j62l5K82q7J79
$$ -291 191 -302 -149 52 -131 -232 -230 -340 -246 -56 338 114 -139 -23 -369 219 80 -82 -117 165 78 257
1729B57j28j41lL82K35p21o5j37N45l00N9j92J07J98ol03Q9K10K0l46L28km92
$$ 257 129 -12 -15 367 602 -119 -184 -321 224 -76 -17 -209 -102 96 90 -213 -124 86 106 -240 88 86 -406
1752d06K68J38k41L34j02j43K73M0j47n4j29N3Q3J55j54N7m7m5n1Q6j80L94j75
$$ -406 -138 0 -241 93 -9 -152 121 161 14 -40 -169 -116 -33 122 -32 25 -22 -67 -118 -32 -212 182 7
1775GK71j90R7m93R3J48J22k95L17k1j84J27j53K50j70j18J1J85Lmo2m7L51k29
$$ 7 278 88 185 -308 -215 -67 55 -240 77 56 -128 -1 -154 96 -74 -192 -181 4 7 3 -59 -106 245 16
1799A6L01n32%M39M0k61j07J41j98K66j64j46L87m03L72j84K17k70K86l26L0Q1
$$ 16 317 -215 -215 224 264 3 -104 37 -161 105 -59 -205 182 -221 151 -33 184 -86 200 -126 -96 -15
1821a5j60M34n08L79L7l35J50p5K8L53m98K30l40K55q6J04k44K68P4J6n8K25k59
$$ -15 -175 259 -249 130 167 -168 -18 -93 -65 288 -210 20 -320 -65 -151 -47 -291 -23 51 67 9 234 -25
1844b5k48L47j63N1L20j07k17J52k20n4M35l21p4j10M04j69Mp7R2P0N7o2n6J53
$$ -25 -273 74 -89 -38 282 175 -42 110 -110 -164 271 -50 -124 -234 170 1 5 -72 20 90 147 85 29 182
1868A82l26R7J37k71J45J17j38J02K05l14K15%l12Q9J14j88pL16k2j8m15K94M7
$$ 182 -144 -47 90 -181 -36 81 -57 45 250 -64 151 151 -161 -72 42 -146 -153 163 141 123 -292 2 49
1891D9j68L77n15K16j21p1K39R4p2k29L80k77KJ9P6J75m20QK14l68Q22m20L15
$$ 49 -119 258 -257 -41 -162 -233 6 100 28 -201 179 -98 -96 -77 -1 174 -246 -238 -24 -392 430 10 325
1914C25k97l89M57Q4J0l22J97r0K49l55Pk70K96p7j2L32Ol38O5rK52q3m01N82
$$ 325 28 -361 96 180 190 -132 65 -25 224 -131 -124 -394 -98 -175 -187 145 151 -187 -122 -131 121 38 -363 219
1938B19j47l12K00j1nj1K77k3k60j52K22j65J51k5K0j90K45k8k4J09k89L08j64
$$ 219 72 -240 -40 -51 -56 -67 210 187 -73 -225 -3 -168 -17 -42 -22 -212 33 5 -19 90 -199 109 -55
1961e5K75j33l94K21J52m07L55o0J03Q0J3pq2o1K04j49K29m64L59K20m45L2M3
$$ -55 220 87 -307 -86 66 -341 14 -46 57 137 150 143 61 0 204 55 284 -180 179 399 -46 -14 29
1984B9Ml70L57k68K0K93j11J84l02K80k51O9J65q9o4j22L56l38j96O41k21j49
$$ 29 33 -337 20 -248 -228 65 -46 138 -164 116 -135 -66 99 10 -54 -176 180 -158 -354 287 66 -83
2006h3Q2J14l7j74J40k96M61o7J49k43J66j88J06k37Q2M9J09n2p3j12K27j81k3
$$ -83 -1 113 76 -98 42 -254 207 140 289 46 212 24 130 -107 -25 24 133 81 8 -104 123 -58 -81
2029h1O7J14O3j13P7j33K73k88q6j12Q3N2J82r5k47J87q6J30J32j55M04n72N7
$$ -81 -14 100 163 50 127 -6 267 -21 -107 -219 -136 -84 98 3 -244 -57 -143 -13 119 -36 368 -204 -147
2052a47L26j06J35l06K40n2n3L1j29Q7r5J74J97j83k67L08j60n2N7N0nl01J16
$$ -147 179 73 208 -98 142 90 37 68 -61 26 -69 105 302 119 -148 160 0 -52 5 55 50 -251 -135
2075a35NJ74J42l36J95K21n30K38qQ7O2m1J30n57L44k12m0Q3J00k6M1J6NpK3K03
$$ -135 -130 44 186 -150 45 266 -264 -26 -34 53 115 74 204 -353 -9 -221 -261 -178 -78 -104 -63 -47 -42 -49 -26 177
2101A77k15K5p9j02J82J99j73j37j73L44k56J52L57k85K2J62l60K30Q9j24m58
$$ 177 -38 -13 -92 -194 -12 187 14 -123 -296 48 -208 -56 301 16 38 200 -160 70 159 35 -423
2122d23M71N2r1J24k11k60K59J55j83L2q6M6J80m43N26j12J61k10J09r5j18K32
$$ -423 48 100 9 133 -78 -338 -79 76 -107 -75 -161 -115 65 -378 148 36 197 -13 96 1 -117 115
2144A15j48J4k5K2R6J01j65r2k41O84k27m64J40j8J43q7J11M14m74O1L1jJ2N7
$$ 115 -33 -19 -44 -22 74 175 10 -82 -323 361 134 -330 -190 -208 -65 -152 -41 373 -101 -40 -9 -10 2 59
2168E9J9k5K96o92L34J31j51L2Q2L31m60j4K38l04l5J94L40l57J12k37p8K99k91
$$ 59 78 53 349 -343 -9 122 -29 3 85 416 -44 -58 180 -124 -159 35 375 18 130 -107 -185 114 -177
2191a77j40N60k22j47K19q9J39k30L27k81k52L35m4j88m3K02j00l0Q9J16k48L05
$$ -177 -317 243 21 -126 93 4 143 -87 240 -41 -293 42 -2 -190 -233 -31 -131 -161 -72 44 -204 101
2213A01J94k36r4r5n0K67j19J38j79r1m2K95Q7j29j80j9L52j92Q5l7P7k21J92
$$ 101 295 59 -35 -130 -180 87 -32 106 -73 -164 -206 89 176 47 -133 -152 200 8 93 56 133 -88 104
2236A04j37p6K34m0n5k07L09l53J61J40j03j22j97L48j04K58j3k02K46k18k0O3
$$ 104 -33 -109 125 85 30 -177 132 -221 -60 80 -23 -145 -342 6 -98 160 147 -55 191 -27 -47 16
2258A6j31J12J15j54J41q3j62R7K5ON4j66K14L05l15N0j03Q6l17N22j78r4j94
$$ 16 -115 -3 112 -42 99 16 -146 -49 -24 -18 36 -130 84 389 74 124 21 107 -210 312 134 40 -154
2281a54k55O15n60K47mK64P7k34J02l89J75R7J48j59J64k35o3L68j45J95m22J85
$$ -154 -409 206 -354 -107 -111 153 230 -4 98 -291 -116 -19 129 -30 134 -101 -164 204 59 254 -168 17
2303A7j63L37r2M7j45k41N25m14J33n8L20k56M7j12n2Q9nR1N2l8k46O6M5J56k06
$$ 17 -146 191 99 146 1 -240 285 -129 4 -54 266 10 57 -55 -107 -18 -23 68 120 82 -164 -98 -53 103 -103
2328a03J76j63j64J73K42l75L47k16k62L76R8j7r4k33J11%K11Q4m0k06K29k76
$$ -103 73 -90 -254 -81 161 -214 133 -83 -345 31 129 112 18 -215 -104 -104 107 191 151 -55 174 -102
2350a02J6J43p6R3K23j89k39K16p6l1K66j93K01l11K15j09j51j83n5O10k67r8
$$ -102 -86 57 -19 74 297 108 -131 85 9 -22 244 51 252 -59 156 47 -104 -287 -342 268 1 -97
2372i7Q8k42L98l86K15J8J76l46L27l98J92K69N3j92r0J36k20J74j95O1K41j10
$$ -97 -9 -251 147 -239 -24 -6 170 -176 151 -247 -55 214 267 75 -15 121 -99 75 -120 -59 182 72
2394G2o3j18P7j52o0K20j3K6J93l33J84M6K03Q5q6j25l33N53m41K96k53m4L81
$$ 72 9 -109 -32 -184 -244 -24 -37 -11 182 -151 33 79 282 367 281 156 -177 376 -65 231 -22 -66 315
2417C15l14k4L19l37J55k47J10J17k04J70j21k40M72j34M5k06J49j06Q4n0Q9j93
$$ 315 1 -23 296 -41 114 -133 -23 94 -110 60 -61 -301 171 37 82 -124 25 -81 3 -47 42 -151
2439a51J43l0j30N02m00J61j69Q5o3l96M78K7k71oM45m46J28K74j09l8M8j50l4
$$ -151 -8 -38 -168 334 -66 95 -74 11 -52 -448 30 57 -214 -220 225 -221 -93 181 72 34 82 -68 -102
2462a02J25O7kj14j31L59k20j47J97j09K37P1J12k80j19L0n3n2K5m3K09k31j3
$$ -102 23 90 88 -26 -157 202 -18 -165 32 -77 160 231 343 63 -56 -26 -79 -131 -106 -149 60 -171 -184
2485a84K0K50m03M02k68K48J5R6Q8M9m84J93J34r7k00J91P6q0N7P0m8j72l1K13
$$ -184 -164 86 -317 85 -183 65 80 176 264 313 -171 22 156 59 -141 50 126 46 103 173 125 -47 -78 135
2509A35L7j03j24k44M81l02J18K00o4Rnj27L18j79M0J69m44j0K51j90k4O8k53
$$ 135 172 69 -55 -299 182 -120 -2 198 134 143 138 11 329 150 190 359 -85 -95 156 -34 -58 10 -243
2532b43M72j71J31j24j4j32p5K60r0j26J15k06K64J48l78J3L62j38J3j23m9j70
$$ -243 229 58 189 65 51 -81 -156 104 14 -112 3 -203 61 209 -169 -156 206 68 81 -42 -91 -261
2554b61K63QO5J29k03j77O2J81k73K73j61J98r3J15j48k97L87j05O2O3k58K97
$$ -261 2 10 75 204 1 -176 -114 67 -206 67 -94 104 11 126 -22 -319 68 -37 25 88 -170 127
2576A27M4m00O3J3K42J10k43j46K97J77l95L15n34L05R5Kk13P8J33J60l18l16
$$ 127 171 -229 -166 -153 89 199 -44 -190 107 284 -111 204 -330 -25 70 72 -141 -63 70 230 -88 -404
2598d04P11k53j86K38l76J83L52k11j48p0J27R3j24M9P1J03k86l4n2N8J47NL8
$$ -404 307 54 -132 106 -270 -87 265 54 -94 -164 -37 56 -68 -19 52 155 -131 -165 -217 -159 -12 -7 31
2621C1r8oQ4k4lj00N0K19J51j70n4J29j59L9k28L10k11j02K66j71M31l72J03j69
$$ 31 -67 -73 11 -13 -16 -116 -66 153 304 134 80 209 50 89 -139 171 -40 -142 124 -47 384 12 115 -54
2645e4kj00J44l7o6J19P6o0r3j5K20j32j53J19n7M9J38o2k05J81J30l3j30J06
$$ -54 -56 -156 -12 -49 -115 4 80 20 -73 -88 132 0 -153 -34 -91 -42 96 34 -171 10 140 107 -23 83
2669H3j55j43K90K5k52Q4K96m00p3J26o4J94k7p5R9J12J1L3j35J55j6o6K97m27
$$ 83 -72 -215 75 100 -152 -68 228 -172 -245 -119 -183 11 -16 -91 8 120 131 164 29 184 168 102 399 -28
2693b8J55k46J25k37Q8L5r3K23m0Q8O6k16j21M13m0m4J06n59K77j58K80k21j32
$$ -28 127 -119 6 -231 -143 -108 -201 22 -18 70 136 -80 -201 212 172 128 234 -325 -48 -206 74 -147 -279
2716b79M47j20oj83j3J00J21j28o0J76J5l9k59K54j6M78l45j93M3L00m33M7k5
$$ -279 168 48 42 -141 -154 -54 67 -61 -121 55 70 31 -228 26 10 488 143 -50 -7 293 -140 -93 -118
2739a18O6J76m30L37j98M43Nk0l11J08J02k37p3m0M20k18q7J88j35l1P4J6k22
$$ -118 -52 124 -306 31 -167 276 281 261 -50 58 160 -77 -150 -190 230 12 -75 113 -22 -53 21 37 -185
2762a85L59m21L36m3m6L4K5K58m85j05N6L57j00L02l80j8O1J42k23o4o1p1N02
$$ -185 174 -247 89 46 0 34 59 317 -168 -273 -217 140 40 342 -38 -56 5 147 -76 -140 -201 -272 230
2785B30n69J66M68k6j94k6k65L40j9n3r2Oj67K53j55L1K3N6j25J19M10k62j02
$$ 230 -339 -173 295 269 75 49 -216 124 105 52 -40 -34 -201 52 -103 -72 -49 7 -118 1 411 149 47
2808D7R9l87L95j85L85m64M06n51J74O8p1M5L00l64J64j0K0j8m8j3j23L89m77
$$ 47 146 -241 154 -31 354 -110 296 -255 -81 -13 -84 -39 261 -103 61 51 71 53 5 -8 -131 258 -219
2831b19J67j08J1r6M86j57j38J32J20o6Lk61J71p3q1Ql9R8N5pJ10l59J51K62n0
$$ -219 -52 -160 -149 -245 241 84 -54 78 198 132 135 -126 45 -28 -109 -101 -140 -42 13 6 116 -243 -92 170 120
2856A20k43J18m9n9M9j73L91k31K16l45K69o2q3p4J57p3K58j29r2M3J23o7J18
$$ 120 -123 -5 -54 -113 -64 -237 154 -77 139 -206 63 1 -82 -156 1 -72 186 57 -35 8 131 64 182
2879A82j9l21K67l2J22l6l94K4M88o29L79m07O11j41p6N2m7J01J7j81j16J09J22
$$ 182 163 -158 109 77 199 163 -231 -207 281 -348 31 -376 235 94 18 70 23 124 141 -40 -156 -47 75
2902G5jk14J15N5k37L39k84K06q5J20k38Q3Q9O5k19J91k21K49j28N4M7l02L04
$$ 75 74 -140 -25 30 -207 132 -152 54 -31 89 -149 -66 23 88 -131 60 -161 88 -40 14 61 -241 63
2925F3o4q2q1J94q3K13m4k42j5j83J51K39K37k31j50n9K03l42j4K11J80m1n6j78
$$ 63 -1 -83 -164 30 -53 160 116 -126 -141 -324 -173 66 303 72 -78 -137 66 -276 -290 -79 101 60 4 -174
2949a74N3J2K4N5J05j6Q8k62R6J9l95L02O7L3q4k00R9K88K41k86L4j16K96l35
$$ -174 -121 -109 -85 -30 75 59 147 -115 -19 0 -395 -93 -26 7 -77 -277 -178 110 351 65 99 -17 279 -56
2973e6J40J4Q9K7J30j17j43l7k37Q0K03k54L05l07j12J59n8K66j89L36j74j59
$$ -56 84 98 187 214 344 227 84 47 -190 -110 93 -161 144 -163 -275 -116 -174 92 -97 239 65 -94
2995i4L42m23n2J90J3J78l69K49k63J87J26j3j76J31J9J08m9q1J76j92j14J11
$$ -94 248 -175 -227 -37 -24 154 -215 34 -229 -42 84 71 -105 26 45 153 104 23 199 7 -107 4
3017Dk9m39M44J51j45j54J26J32k70K04k32L30k40j39L12k65L78Mk01k27L52k40
$$ 4 -25 -464 -20 131 -14 -168 -42 90 -180 24 -208 122 -118 -257 55 -210 168 172 -29 -256 96 -144
3039a44L01k04M7M9o3n0L72l60m6O9L3k4j80L16R7k66J49k46K6J39J35j64j37
$$ -144 157 -47 0 49 -14 -64 308 -52 -98 -29 4 -20 -200 116 213 -53 96 -150 -124 15 150 -14 -151
3062a51o8L55m25M44l88j70J93J96R4k54K73J8J33m63K23P9j23N8L3N2r9j68L21
$$ -151 -219 136 -289 155 -233 -403 -210 -14 80 -174 99 117 250 -213 10 89 -34 24 57 109 10 -158 163
3085A63n8n0r2%J43p4k28J73qL1k00O5P8J32j02M2R6k15J19L20k13l86N32m25
$$ 163 105 55 -37 -37 106 32 -196 -23 -31 0 -200 -135 -57 75 -27 15 111 -104 15 335 122 -264 268 -157
3109a57O50o86K55k39K10L0K06j75j58L6J12O8k10j7lK85j87M8j41M11m20K7p5
$$ -157 493 -193 62 -177 33 63 269 94 -64 -28 84 152 -58 -75 -78 207 20 68 -73 338 -82 -55 -130
3132a30R5j22Q1K67k43M4l1R9P2m04J89j10L33k37j08J03J12J47k62q3L91k72
$$ -130 -35 -157 -76 191 -52 -8 -39 60 132 -272 -83 -193 140 -97 -205 -102 10 157 -105 -188 203 -69
3154f9K02k33N5J58k15J65j70O5j68K73m9j57J66m06M43k22M42k78n2Mr5K59k98
$$ -69 133 -100 -45 113 -102 63 -107 -42 -210 63 14 -143 23 -383 60 -162 280 2 -50 -46 -141 118 -180
3177a80J5P2J83k13J02j11M1J46j30J69k29K95j19L04p33L80K23l34K58k23k07
$$ -180 -165 -93 90 -123 -21 -132 -91 55 -75 94 -135 160 41 345 -388 -8 215 -119 139 -84 -291
3198b91P4K04J12J62l67J4p5K18j84J53R2J9O3j22Q7l08K10N7J59p42O99p1p1
$$ -291 -217 -13 99 261 -106 -92 -167 51 -133 20 112 131 194 72 159 -149 61 118 277 -465 234 163 92
3221I2l16K85l83M14l3j20k69R4m9L28l80J90L73m99N11m34L58j71R0nj29q9K27
$$ 92 -224 61 -322 92 59 -61 -330 -236 -285 43 -337 -147 226 -273 238 -196 162 -9 81 76 -53 -142 85
3244H5P8k40O9J92l7Jj75K11l12KJ32j73J72j69J89k99L02K2j44L53n14M01M6
$$ 85 163 -77 -8 184 147 148 -27 184 -128 -126 6 -167 5 -164 25 -274 28 50 -94 259 -255 146 192
3267A92j52J39K06j67k35P5k41l1N43j88N0k69M1M3L3k9m1R0j59K18j45L51j21
$$ 192 40 179 385 218 -17 58 -183 -214 329 141 191 -78 -37 6 39 10 -31 59 -100 118 -27 324 203
3290B03j1j78J13k65K53p5k1N14o38J49k0Q2L8pm58J25J91j65O5O2J32j39L31
$$ 203 192 14 127 -138 115 40 19 533 -105 44 24 106 144 137 -321 -196 -5 -170 -105 -43 89 -50 281
3313B81o28O24l53J91m6o6K06J44r1l47LQ1j21n1j72L67j10j93J84J16k16PJ31
$$ 281 -347 277 -76 115 69 3 209 353 262 -85 -82 -1 -122 -173 -345 22 -88 -281 -97 19 -197 -190 -59
3336e9J3L94k77R1j08p8K10L7n94L55M8J35l39P8lJ08ll92N69n8k08j5j27L20
$$ -59 -46 348 71 162 54 -24 186 223 -371 -16 32 167 -172 -94 -97 11 8 -384 185 127 -81 -96 -223 97
3360I7r1O9p5j44N8K92L1n70O05m01J82J3J73q7k37K12j7k06K36N4Mm35K66M1
$$ 97 6 75 0 -144 -86 206 237 -333 272 -129 53 66 239 152 -85 127 110 -96 140 194 198 -237 29 70
3384G0JJ10l55L14k86O8r9J69r0N99j99m90K86j27k63k6J04J20K91k28O9J60j84
$$ 70 71 181 -174 140 -146 -78 -177 -8 -98 501 302 -188 98 -29 -292 -318 -214 -94 197 -31 38 198 14
3407A4j64k7L42k68m8L0M29k53n7j60J62J3K51n72N28k92r1J89m8O5J59m41M72
$$ 14 -150 -177 165 -103 -151 -121 308 55 -2 -162 0 13 264 -308 220 -72 -163 26 -22 43 202 -239 233
3430B33l65J56J7j63K10M2q3j8j26r4J78J22O8k53K92l07L42k59K63l6l16P5q9
$$ 233 -132 24 41 -122 88 130 47 29 -97 -191 -13 109 177 -76 216 -91 251 -8 255 219 -97 -22 -111
3453a11Q7j59L41m96L28J9k88N61j63l01O7j51K58J20l36K38k64K03K66k16J40
$$ -111 -24 -183 158 -338 -10 9 -279 282 119 -182 -115 -266 -8 112 -224 14 -250 -47 219 3 143
3474A43k42k56M34j6J53j21j40J30L8m18P62n29J69j80PK42k42j82L29l19K06
$$ 143 -99 -355 79 63 216 95 -45 85 123 -295 467 -62 107 -73 -66 176 -66 -248 81 -238 -32
3495c2j9L28l15O9l8J5p5N8M8l9k9K9k29J94J32j47k45K77j28l5j23K10Q7L9m8
$$ -32 -51 277 -38 31 -7 8 -67 -9 39 0 -29 0 -229 -35 97 -50 -295 -18 -146 -181 -304 -94 -7 32 -16
3520a6o0L71m83L62k39j84J12J01N0Pp2OL9m8J42j18l5K13o5K9P2m34K29k24K03
$$ -16 -76 295 -188 174 -65 -249 -137 -36 14 21 -51 -45 -6 -54 88 -30 -65 148 83 112 184 -250 -21 -245 -42
3545d2j0j33N2N4k4K51R4l34L0JP5j10K67j28j97R9q0L47k41k5J06r0k07M3M02
$$ -42 -52 -185 -133 -79 -103 148 242 -92 -62 -61 14 -96 171 43 -154 -55 -135 212 -29 -54 52 -38 -245 -202 200
3570B00K5k84L6LO5Q3j27J00j27j08J95j74P1M2q9J72k70O76o29nJ29l15M26j6
$$ 200 225 -59 -23 -20 45 128 1 101 -26 -134 61 -113 -42 0 -89 83 -187 489 -140 -145 -16 -331 95 79
3594G9L5j65j01O0J71J41m4k61K7o2L22k26q8L37l31K70O6j29m91O12k50LJ69
$$ 79 114 -51 -152 -92 79 220 176 -85 -58 -120 202 -24 -112 225 -106 164 230 101 -390 222 -28 -25 144
3617A44m5L9k77M76k25M49o44J66j4l85M80n6o4J51p9j28L3P2j27J01L13o75M24
$$ 144 99 138 -139 337 112 561 -83 83 69 -316 164 108 44 195 116 -12 21 93 -34 67 380 -295 129
3640A29P8j03q2j55K24j19m4J09j49K16j9O4q7j6J29l17K52j04J12j09R0p3K2
$$ 129 207 104 22 -133 91 -28 -72 37 -112 104 85 149 62 46 175 -142 110 6 118 9 99 26 48
3663D8k29N8L19j23m9K8j28M09j30m25K77K4j47k38L37j75Q1J06K03l5k55K32
$$ 48 -181 -123 196 73 24 52 -76 333 203 -222 55 79 -68 -306 31 -144 -63 43 246 211 -44 188
3685A88Mk43k93L21O0m4J29J01n00J04M47l60J6K88k11J0j72K18J50k49J43j65
$$ 188 192 -51 -344 -23 37 -7 122 223 -277 -173 274 -86 -70 218 7 17 -155 63 213 -36 107 -58
3707e8k9K93n7l55L45k25Q7k47J04N60l16l41J48Mm7r2K21P3k05J75Pj76K22J86
$$ -58 -87 206 149 -206 139 -86 1 -246 -142 418 102 -239 -91 -87 -134 -226 -5 68 -137 38 45 -131 91 277
3731B77l47J56j97J16j6R3l01n5M21J05m70K37J08Q1kl69L26l27K37O6j27j03
$$ 277 -70 86 -111 5 -11 82 -219 -274 147 252 -218 19 127 208 206 -163 163 -164 73 139 12 -91
3753i1R3l4J23j4j7l2o3m0l13M18K3j77J61k04K10P1k33k06K04j17L76p4J79r1
$$ -91 2 -32 91 77 60 28 -35 -75 -388 30 53 -124 37 -167 43 114 -119 -325 -121 -238 138 64 243 152
3777A52m01K99J34j90r9j6K75R3m02J14P8j0k4j22K24J3L5k89K6J96j78L10n05
$$ 152 -249 50 184 -6 -105 -121 154 247 -155 -41 37 27 3 -119 105 118 153 -136 -110 86 -92 218 -287
3800b87L35l8j37q1J46j0J8J75j34K01n92L93rO3j88R8K4J13j0j44l16L91%j32
$$ -287 48 10 -127 -208 -62 -72 -54 121 -13 188 -404 -11 -20 43 -145 -47 -23 90 80 -64 -380 11 11 -121
3824a21K06j29j93L62k27%J43j51M4LJ85R2J22k64k22j05J55k48L12J95k22K23
$$ -121 85 -44 -237 125 -102 -102 41 -110 -66 -63 122 214 336 72 -150 -255 -100 -348 -36 159 -63 160
3846A60k30n6K27j73K43m33M12k13J12K27n5k37p9o0J98K4J41j72J7M1Q6l12M32
$$ 160 -70 -126 101 -72 171 -262 150 -63 49 276 221 -16 -95 -155 43 67 208 36 53 94 180 -132 300
3869C00j75j06J4k70M5J56J4O3n2r9K72K51k65M9r6m63L26r3j4J03n4N7K8Q7n3
$$ 300 125 19 33 -237 -192 -36 -22 41 -11 -110 162 413 148 197 101 -362 -36 -129 -143 -40 -94 -37 -9 78 25
3894B5k53o9Q7J33MK1K55l83L05J47m18J63j61j23L61k26K36k23N5J67lJ24k56
$$ 25 -228 -297 -210 -77 -73 -52 203 -180 125 272 -146 17 -144 -267 94 -132 104 -119 -64 103 100 224 -32
3917c2J05mj16L78j82l45L83j65N2j55J09l79N76j94K18j50O8j00m24N28o0K36
$$ -32 73 69 -47 331 149 -196 187 22 74 -81 28 -351 225 31 249 99 167 67 -357 171 111 347
3939C47n28R9Q2o8k21L25k76L66J42k73k08J36J51k07J75j97J20j63L10L9K5k10
$$ 347 -181 -82 0 -68 -289 36 -240 126 268 -5 -213 -77 74 -133 42 -155 -35 -198 112 151 176 -34
3961c4k56K61K76j71M0k00J63J00q8P8k07L47L6m86L64o2l27L64j70M1o7j40M02
$$ -34 -290 -29 247 76 116 -84 79 179 91 169 -38 309 345 -141 223 161 -166 198 28 69 2 -138 264
3984B64j27J6j60l9j08J43l7J32j85QK30j3k38J63j5j58L03p2j25l33O32j32j81
$$ 264 137 153 -7 -46 -154 -11 -48 84 -101 -93 137 124 -114 49 34 -124 179 107 -18 -351 281 149 -32
4007c2k38N91l90R0rn5k16L86r1M3Pr8kL6L9l6J18k40R8K75k20n0k50M19q0l99
$$ -32 -270 321 -69 21 12 -43 -259 127 36 79 86 -12 -14 22 61 25 143 -97 1 276 56 6 -244 175 95 -304
4033c04N64jmk30l12Q5L28L2r4J42k95p8J81j31l0J79J89r2rk99J64P7j58J3p8
$$ -304 260 259 255 25 -287 -202 126 158 64 206 -89 -167 14 -117 -147 32 221 129 120 -179 -15 62 -96 -83 -161
4058a61J98n4m03L69J3Q2k11Q3PR5k04J15M04P3k15k5J30jk19j66k52J31L24N
$$ -161 37 -17 -420 -51 -38 44 -167 -84 -77 18 -186 -71 333 406 191 166 296 295 76 -90 -342 -211 113 118
4082A18L4l52J98j06q0P4k46M63j75j29J89q2L21m65M56k76K26l47J96M6k73J71
$$ 118 152 -200 -2 -108 -188 -114 -360 103 -72 -201 -12 -94 227 -238 218 -58 168 -179 17 63 -210 -39
4104c9P7pp4M2r5j4n5K81j77J49m02K88K14nk6o0J3k00o7M68k96l52L80k07J94
$$ -39 38 31 -43 -1 -96 -110 -165 116 -61 88 -314 -26 188 183 157 97 110 -90 -157 311 15 -337 43 -164 30
4129C0k05J57L29j0j81k30L15o4l83L42o8n5J62Nj27l11K5K98l3L5J48%j14j73
$$ 30 -175 -18 311 301 120 -110 205 141 -242 100 32 -23 139 144 17 -294 -269 29 -4 31 179 179 65 -108
4153a08j13J23o3J62J74l69P9n9K54l28J52J80J36p6k36n2O0J69l0j37j22N9m4
$$ -108 -221 -98 -161 1 175 -194 -115 -174 80 -248 -96 84 220 144 -92 -144 -84 85 55 -82 -204 -145 -189
4176a89L89l23K94j40l23M10k42K27n39K93J58j70L02l51L76j74m7L01k43K4R2
$$ -189 200 -123 171 31 -292 118 -124 103 -436 -143 15 -155 147 -204 172 -2 -49 252 9 33 125
4197A25J6l2k10o3j0K11J9k9m2N6k25M3M00k11K8r1l3M8K5L00k32k49K74J04j4
$$ 125 141 109 -101 -164 -174 37 56 27 -15 41 -184 -141 259 48 76 -15 -48 0 25 325 93 -156 118 222 208
4222B08p2m70P81n10j67K49K2J76k82J12j67K00p2L4l32K89K55j93K41l43J22
$$ 208 136 -334 447 -63 -230 19 41 217 -65 47 -120 80 8 42 -290 -1 254 61 302 -41 81
4243H1r3L4K8Q4j98M53k29J26l87j4J56l08J97P0p4J11J97k27l58L33m9J54Q5
$$ 81 -12 22 50 134 -64 389 160 286 -101 -115 41 -267 -70 0 -74 37 234 7 -351 -18 -67 87 172
4266A72j16q7j99K92n4K7L1K11l18K47l61K14j2J41j73NJ40k25J90j46L00k92
$$ 172 56 -31 -230 62 8 35 66 277 -41 206 -155 59 47 188 15 20 160 -65 125 -21 279 -13
4288a3j46Q0j33K65j93L54n62l1R6K60K6K88j00r0N1k8L71q70M72l80N31Ok83
$$ -13 -159 -79 -212 53 -140 214 -348 -379 -283 -23 3 291 191 101 152 124 495 -375 97 -283 248 254 -29
4311b9J8R5n2j31k48L44j9N7J38J04m59J89o9L38m05j68N19k29L28k30j67k7O7
$$ -29 -11 84 32 -99 -347 -3 -22 35 173 277 -182 7 -62 276 -129 -297 222 -7 321 91 -76 -103 -36
4334c6j10N08m04K8j19n3M11k30j93J64K10k09K3r8jk85K73L80j01j84R3J39J7
$$ -36 -146 362 -42 -14 -133 -186 225 -5 -198 -34 176 -33 -10 -108 -109 -394 -121 259 158 -26 67 206 223
4357B23l39J53pN9l22K10n0K41j38k13Q2R1j82L04l09J31j05N0n3Q8j67M20r6
$$ 223 -116 37 30 89 -233 -23 -73 168 30 -183 -101 -10 -192 112 -197 -66 -171 -121 -174 -86 -253 167 71
4380G1R0j43Rk74K42K86l83J13j40J14L02l75Ln6K71j0p5KO9K47l94k51J84K16
$$ 71 161 18 27 -247 -5 281 -102 11 -129 -15 287 -88 -85 -141 130 120 45 47 116 363 -31 -282 -98 118
4404A18k24MK18l15L92l68K92O1m30K40r0QK47j29J5m3O8j27M82l76k42L31l03
$$ 118 -106 -102 116 -199 193 -175 117 178 -252 -12 -102 -94 153 24 39 -4 64 -63 419 43 -199 132 -171
4427a71L35l27K65p6N4Q1M5j54j07K0K13k84P0K94l48mn5K84k31L0J53J4R6l05
$$ -171 164 -163 102 26 80 161 206 52 -55 -35 178 -106 -36 258 -90 -94 -149 135 -96 -66 87 101 197 -108
4451a08Q4l7p3J3jj56L34o3J41j46J57o1j4j34J02r0J20K28j25k79K15m7J17m5
$$ -108 -24 -61 -134 -121 -122 -278 56 -7 134 -12 145 84 70 -64 38 -52 68 296 171 -108 107 60 177 132
4475A32k14K4N0K19j88L15k04k8m9K9l9Q9j47k17K41O4l4j11K05n1j18j25q1R7
$$ 132 -82 -58 -8 211 23 338 134 106 57 86 47 136 -11 -228 13 77 43 -68 137 86 -32 -157 -238 -141
4499a41J20R6j22N4m3K6j1J9K3K07k02K7J18j16r8o9K88L9j58m18L71L6k13O7
$$ -141 -21 75 -47 7 -36 -10 -21 -2 21 228 26 53 171 55 -43 -112 176 215 57 -361 10 46 -167 -100
4523a00L46m36M83l88J14M78k20n11j71M64N0K37m77Q3L7j5J07r7o3k95L74j13
$$ -100 246 -190 293 -95 19 497 277 -234 -405 59 109 346 -131 -48 -11 -26 81 -16 -79 -374 0 -113
4545a13K59j42j07J60J5j45J05n3J7J19n7k9K71k84n3r4j72L93J74k54K4j3l54
$$ -113 146 4 -103 57 72 -73 32 -21 -4 115 58 29 300 16 -37 -131 -303 90 264 10 34 21 -333
4568c33L84m04L89P0j60N00l73J28k42N19m78n2J21m74J92K88m8q2K83j00l40
$$ -333 51 -353 36 106 -54 446 73 201 -41 478 0 -52 69 -405 -213 75 27 -55 228 128 -212
4589b12L29k9J29l87M2K93l22M25m94M63k77j75K87Rj37O5M15p41J28K52J36k59
$$ -212 117 88 217 -170 -128 165 -157 268 -226 237 -40 -215 72 81 -56 9 424 -317 -189 63 199 -60
4611f0m7k44J60O9L14j38J32k31J5K45k46k01K65j20j17K60r3J48k61M4J31j75
$$ -60 -107 -351 -191 -122 192 54 186 -45 -30 215 -31 -232 33 -87 -204 56 -37 111 -150 -106 25 -150
4633a50L21j77PJ40k00L28n22L32L8j88j11J64J71M4p1j5J72k67R3k68M15m02
$$ -150 171 -6 1 141 -59 269 -253 79 117 -71 -182 -18 153 197 126 111 283 16 109 -159 256 -146
4655a46L5O9Nj09Q4j09L38L6k29j17j3K91j25k37o0M01j24n6k71L91L6l76K74
$$ -146 -111 -42 -37 -146 -62 -171 167 203 -26 -143 -156 135 10 -227 -287 114 -10 -66 -337 54 90 -286 -12
4678a2K3jmJ21m37L46j64P6K69J30n22K69j20j58j07N81k73K86m18K65OPj05l2
$$ -12 11 10 6 127 -310 36 -128 -52 217 347 -175 94 -26 -184 -291 290 17 303 -115 150 156 163 58 26
4702B6m6nk21K86J05n5j44n6J31K94m90L86q1q0k2J31j77k49N29m09k4L53j60
$$ 26 -20 -25 -246 40 145 90 -54 -110 21 315 -175 211 130 50 28 159 -18 -267 262 -147 -171 182 22
4725B2l1K29k48o2r4p2J69l6J44r0K45k29J22o0l25N80j94j26R3j18Q8J94m22
$$ 22 -9 220 -28 -90 -184 -256 -87 -123 21 -69 176 -53 69 9 -316 264 70 -56 37 -81 7 201 -221
4748b21J85K92j65p2j7K90l78K75Jk86o5K63p4M6J47j00K8k80K94k00K09n63L89
$$ -221 -36 256 91 19 2 292 -86 189 190 -96 -161 102 28 74 221 121 149 -131 163 -37 172 -391 -2
4771bl61N92l50J25q8j51N33j89m0J16k59L6J20j39j1j07L60q8k14M1j4J0K2J32
$$ -2 -363 229 -121 4 -84 -235 298 109 69 185 -74 -38 82 -57 -68 -175 185 97 -117 -76 -90 -80 -58 74
4795G4j11m5K13o3J2j52K18l21J60q2J65j62K44K48j58k42Q5J54r0m13L01l04
$$ 74 -37 -82 131 68 80 -72 146 -175 -15 -97 68 -94 150 398 240 -2 83 237 147 -266 35 -269
4817b69J66J25l4N0n70M06m1L97j84k80K84L1o7K49l55j48M37j99k79J82J47j3
$$ -269 -103 22 -12 38 -532 -126 -167 230 46 -234 50 81 14 263 -92 -240 197 -2 -281 -99 48 35
4839C5l11L76j93J13j07K31j69k30J65j50K35J75k14k18M90k77P8J33J46m24K55
$$ 35 -276 100 -93 20 -87 144 -25 -255 -90 -240 -5 170 -44 -262 228 -49 29 162 308 -116 139
4860A39l90K71R3Q5m4j64k80K57k5N2Pp5J96j97p9Q5J05j41j1l2J84K6j69M2J82
$$ 139 -251 20 113 198 154 -10 -290 -33 -58 -6 1 -74 122 -75 -154 -69 36 -105 -116 -148 36 62 -107 -65 117
4885A17j29N3Q8k87M04j52k44J56l10J57M05J04l85n9j44J58K79j40j55K63p7
$$ 117 -12 41 129 -158 246 94 -150 6 -304 -147 258 362 -23 -82 -226 -68 211 71 -84 179 102
4906A02J23j12r2j8q2J99n5pO8N2j40r4k66L83O3l30N41l54J26Q6j56k48K76K9
$$ 102 225 113 21 3 -79 120 65 58 126 178 38 -56 -322 61 124 -206 335 -19 107 193 37 -211 65 94
4930I4r9k12M6J47O6m6l3l8Q5o5QK21j46k34M59n11J31K53R1j12J02k96k8K19
$$ 94 -5 -217 -171 -24 42 -4 -37 -75 10 -55 -47 174 28 -206 253 -258 -127 126 217 105 207 -89 -117 102
4954A02k40M45p0l45M0K25n16M18Q5j25N8j2N9n4l01K46R5k08j11K26J5m8j66
$$ 102 -138 307 237 -108 -68 157 -359 59 144 19 77 65 124 70 -231 15 110 -98 -209 17 32 -16 -182
4977a82n5K21J25k91J36n5j0L01n28L26M0m6J45J61l46PMJ9k4J9m36O20m51L41
$$ -182 -237 -16 109 -182 -46 -101 -111 190 -338 -12 28 -18 127 288 -58 -51 -47 -28 -52 -33 -469 151 -300 41
5001D1j5O0J72l94M08l40j63J75j51M18l03J25k60J79Jj32J44nr3J96J07j93M9
$$ 41 26 86 258 -136 272 -68 -231 -56 -207 211 -92 33 -227 -48 -47 -179 -35 -40 -133 63 170 -23 26
5024B6K58k90n3J60k29J74p6O1k23L87n5j66j25J47k64M07J3k07K34n5j13k84
$$ 26 284 -6 -59 101 -128 46 -30 31 -192 195 140 -26 -151 -4 -268 139 152 -55 179 124 11 -273
5046b73Q3O2j36J36nJ69J09k21K91l52j86K91N3m9L67k22k70J02jj22J67P0k44
$$ -273 -190 -128 -264 -128 -133 36 145 -76 215 -137 -323 -32 21 -28 339 117 -153 -51 -52 -174 -7 63 -181
5069a81L72O0k83K32p7Q3k63k9n4J5o6L8N29n38O0J41J91j89j58n6P9q0J89J35
$$ -181 191 251 -32 200 123 206 -57 -86 -140 -125 -191 -153 376 -162 -102 39 230 41 -117 -173 -94 -174 15 150
5093A50j41K2j46p5K3j12J53J29j86L17l56L41l86L42K27n34L78j63P8q2J02q2
$$ 150 9 31 -115 -190 -167 -279 -126 3 -183 134 -222 119 -267 75 302 -232 146 -17 61 -21 81 -1
5115aj57K9j08L76O8k90k19L08J23J63L9l90N5J2l4J01KK79l05k47L64j22K0k49
$$ -1 -158 -129 -237 139 207 -83 -302 6 129 292 331 -59 -4 8 -26 75 77 356 51 -196 168 46 66 -183
5139a83L14l12J60J26j89L08m14K74l93L94l10J26P9L5j93L04j33J51j65J79l3
$$ -183 131 -181 -21 105 -84 224 -190 84 -309 85 -225 -99 -20 15 -178 126 -7 144 -21 158 125
5160A25j41J28k14M32k56J07l15K20j04l5KK53j95J06j66K28j17K12k16J74n41
$$ 125 -16 112 -102 330 74 181 -134 86 -18 -53 -51 202 7 113 -53 175 58 270 54 228 -313
5181c13L64mpj25J9J98j44J13k19K5J28J69m39R1o5K39J41l13J18J22j99Q0j47
$$ -313 51 47 40 -85 -66 132 -12 101 -118 -93 35 204 -235 -144 -209 30 171 -142 -24 98 -101 -21 -168
5204a68l0L27K14l50j77M08J7k80r7M0J11j52k0L31j04r3J61j34K00k97J38j76
$$ -168 -198 129 343 -7 -184 224 241 -39 -136 -96 15 -137 -157 174 70 -23 138 4 204 -93 45 -131
5226a31K31j7J49m10L00n1Q5j48j03L25k25N0k41K56j54L44m51o0K02J71j27k04
$$ -131 100 83 232 -178 122 71 156 8 -95 230 5 55 -186 70 -84 260 -191 -251 -49 122 -5 -209
5248b09j85L01J06j72M87k19L8k31RJ94L5J5L1l38L38n11L51J48l31kR4J10K53
$$ -209 -394 -93 13 -159 328 109 147 -84 -75 119 154 169 200 -138 200 -311 40 188 -143 -145 -51 59 312
5271C12k96K21m29K84m12r7M39q3J31r7J12l30J29J68k67J97O8k2O2p8Ok74L93
$$ 312 16 237 -192 92 -320 -417 22 -61 70 -27 85 -245 -116 52 -215 -18 50 28 90 12 18 -256 137
5294A37m48K49r7J64M3n2J93k32J88Q3o57N34K70n24J23J36p4R7o4J07j02o0o2
$$ 137 -311 -62 -159 5 48 -4 189 -43 145 228 -429 105 375 -149 -26 110 36 133 69 176 74 14 -48
5317d8p5J2J35j06O1J28J99l49n9K68l05K48J87j04k93k8M36m24j73L14j72L76
$$ -48 -123 -111 24 -82 -21 107 306 -43 -102 166 -139 109 296 192 -101 -129 307 -117 -290 24 -148 228
5339B28j20rk80K46m9K84m96p9M87k80L09k39k7K46j85L7k16J95L4j36K05p4R9
$$ 228 108 99 -181 65 16 300 -196 -275 212 -68 241 2 -25 221 36 73 -143 52 86 -50 155 81 180
5362A80q5j92j86L67j82K90j37M0r9OM73n66l02M42qj2Q4j2K73j30j16k84%K05
$$ 180 95 -97 -283 84 -98 192 55 95 -4 2 475 -91 -393 49 41 29 113 101 374 244 128 -156 -156 49
5386D9j97j08J04M7J35l2j76K56k96N03l90L2lk5Q4K6j8j4j13P8r8K2M7j11L21
$$ 49 -148 -256 -152 -105 30 -2 -178 78 -218 285 -105 -73 -76 -101 -17 9 -9 -23 -136 -58 -156 -134 -87 -198 123
5411A23K9K21n32k09L14j47M36m21j06N57r1j07j90J23lK7N1j36Q1J76j66Q6k41
$$ 123 152 373 -159 -368 -54 -201 235 -186 -292 265 174 67 -123 0 -3 24 75 -61 20 196 30 116 -125
5434a25k2j12J84P0J03J15m67R3mr7K66O3N7j72L76m20J60j96M36n81L18k00K24
$$ -125 -147 -259 -75 -5 98 213 -254 -161 -165 -262 4 67 124 -48 328 -92 68 -128 308 -273 45 -155 69
5457F9m9q2j11K7K56j96k38K07j70K63m0N8M4L41o61K02j13K83K11o11J66J97
$$ 69 20 -62 -173 -146 110 -86 -324 -117 -287 -24 -64 -6 38 379 -282 -80 -193 90 301 -310 -144 53
5479E3r8K12k10K9q5K53k16J07L1o4Q7L7j98K70j25jj19j28M50l67N6K59p4m85
$$ 53 -45 167 -43 -14 -99 154 -62 45 76 12 99 136 -62 208 83 82 -37 -165 285 -82 -26 233 159 -326
5503c26J67K49o4K92k18L19l84p6m3j21M7L18k11j52L24o1n5l80K02L99k93k07
$$ -326 -159 90 26 318 100 419 35 -41 -84 -205 -158 160 -51 -203 121 60 5 -375 -173 226 -67 -274
5525b74L00j5l65L90l5j95J4M23k41K76k48K39l71N19m15kj5j68J29L01m37L83
$$ -274 26 11 -354 36 1 -194 -180 243 2 278 30 269 -102 417 2 0 -15 -183 -54 247 -190 193
5547A93j65o7J76l06J22M00m42K85k41q6K70N7k89N7l6J28n8n3P9j48j26J46L47
$$ 193 28 -39 137 -169 -47 353 -89 196 -45 -131 139 196 -93 -36 -72 56 -2 -55 24 -124 -250 -104 243
5570B43l77p3J01L3K35j92L43l11j10K75j35j3R7j86P5K91j42n8J37Oj44k59o3
$$ 243 -134 -207 -106 -73 162 -30 313 2 -108 167 32 19 116 -70 5 296 154 96 233 239 95 -164 -227
5593b27K01n4J61k83K42J9J25l58j56J43J28K33M1k30OM85m59J41k81k2P6O0k89
$$ -227 -26 -80 81 -202 40 59 184 -174 -330 -187 -59 174 215 -15 -9 476 17 158 -123 -145 -69 -9 -298
5616b98K53J97m17K01j66M38k70J38k63L8R7q4K67m54M07j08j49J73k5P5m5j51
$$ -298 -45 152 -265 -64 -230 208 -62 76 -187 -149 -52 -136 131 -323 84 -24 -173 0 -25 50 5 -146
5638a46N8j56rM47l03J34k62J45J87j6k03J63L48k13nk17p3rM4J9j18M08q5k9
$$ -146 -88 -244 -253 194 -109 25 -237 -92 95 79 -124 39 387 174 169 -48 -121 -130 -86 -67 -185 223 138 109
5662A09l17K1L36Mj66Rj50n7J86m28N97J59l38l23L83j34L11l28Q5K85j43l30
$$ 109 -208 -187 149 153 -13 -4 -154 -211 -25 -453 144 303 -35 -358 25 -109 202 -126 -41 244 101 -229
5684b29m3L27J9o8l7k22N00k36J42j0K4k2j30k8p7o5j6K33j62K08k11j14K58j63
$$ -229 -272 55 74 6 -31 -253 247 11 153 143 167 145 15 -13 -90 -155 -171 62 -100 108 -103 -217 41 -122
5708a22k47N50N3k21M9n2L1k51K22K9j03J17j22J55j86R6O1j12j5L74l08J0M6
$$ -122 -369 181 234 13 62 10 41 -210 12 41 -62 55 -67 88 -98 -2 59 -53 -68 306 -2 8 54
5731E4J21l38K57q0n2K82m45L16k20L3Qm9J99j19k56L61J62o6n39J97J83L97l72
$$ 54 175 -163 94 14 -38 244 -201 115 -105 -72 -64 -113 86 -33 -289 72 234 168 -371 -174 9 406 34
5754C4o0R9m3J95l28p1Q8L6k3O0o2j27N08o40J34P1J80k43J50J55k58J45J01k08
$$ 34 -26 73 30 225 -103 -174 -86 -50 -73 -13 -75 -202 306 -334 -200 -129 51 -192 -42 113 -145 0 101 -107
5778a07K0p6J71J47j50k23K31P7J00q7k68p9L40q0R5l20J83L27j37k16k5J09O1
$$ -107 -87 -163 8 155 5 -218 13 90 190 103 -165 -244 96 16 111 -209 -26 301 164 -52 -77 32 93
5801I3n3P6k18J84J29j75J77n4m4M5j74J78k43J18k20L79k86K39k33K13J0k96
$$ 93 40 116 -102 82 211 36 213 159 115 160 -14 164 -79 39 -181 198 -88 151 -82 131 141 -155
5823a55K69k27l4K57k11M09j75j37J2r1L58q9l37J37n3k04K23M1j79K33J85l10
$$ -155 114 -113 -147 110 -101 308 133 -4 8 -83 275 186 -151 -14 -67 -271 -48 -7 -186 47 232 -78
5845g8K01j85N9J03K15m05K79o4j67j3m3M13m74K85k87J63l07K65R9q3J8J83j19
$$ -78 123 -62 -3 100 315 -90 189 125 -42 -55 -98 315 -159 126 -161 2 -305 -40 59 -24 -6 177 58
5868E8j8j87K5p0O65l43j79K32m51K40Q8J23o1k6N6m10K33J51k45KK24k47k54
$$ 58 40 -147 -122 -192 473 130 -49 183 -268 -28 60 183 122 96 152 -258 -25 126 -119 -117 107 -140 -394
5891c94L44O9n8L25k83O3P2j56k81K88m8M0N8R2L23m46j89L52j54K27k34m9L37
$$ -394 -50 19 -39 286 3 66 138 -18 -299 -11 -59 -19 39 131 454 8 -181 171 17 244 10 -39 298
5914B98k58J73m22K07qK81m06K04j56K20m6O5l16J09K29q8o2j61K77P6j58K58
$$ 298 40 213 -209 -2 -10 271 -135 69 -87 133 87 152 -164 -55 174 86 24 -137 140 216 58 316
5936C16k27J92m49J42K0l5J58k50L88Mo6l25L7k73L41n6%J09k53K93K54rn33K20
$$ 316 89 281 -168 -26 -6 -41 117 -133 255 259 193 -132 -95 -368 -27 -83 -83 26 -227 66 320 311 -222 -2
5960bJ8J35m9j34P9J0k33K09j10j35j10K51M0j82N05n02K01r8j9J34k05M11O7
$$ -2 16 151 102 -32 47 57 -176 33 -77 -212 -322 -71 -31 -213 292 -210 -9 -107 -126 8 -197 214 281
5983B81n54L6K27l0K05R6m42K44M3j65J94l12J43l9oJ20K6N3k38K49J46k39L03
$$ 281 -273 -237 -10 -40 165 261 -181 63 106 -59 135 -177 -34 -73 -79 41 67 120 -118 131 277 38 341
6006C41p7j18j3j43k00K69k33O0L74j35k03P1k87K65P0o4q8J87r2j02P7j48J74
$$ 341 264 146 133 -10 -210 59 -174 -114 260 125 -78 -7 -294 -29 41 -23 -111 76 -16 -118 -41 -189 -15
6029a5j37L54l62j18K22qK05J3l09L91l42J09k73M45k73L16m7l08r5N14m89J70
$$ -15 -152 202 -160 -278 -56 -64 141 154 -155 236 -106 3 -270 175 -98 218 171 -137 -232 282 -207 -37
6051c7L19j70j72p6J81j2J42K0k29L79k39O8k65k13N90q17K63M08k16K9K48j40
$$ -37 282 112 -60 -136 45 33 175 195 -34 345 106 174 -91 -304 286 -531 -268 140 -76 -47 201 61
6073F1r1L5O3m03J80O10m21N2j9j67p7L70j03P2J56o35L95q4j69L13j92J27j98
$$ 61 -30 5 68 -335 -155 455 34 86 67 -100 -177 193 90 162 318 -317 78 -6 -175 138 -54 73 -125
6096a25J95K66j87p6k02J88k62N5J66l0k28L08j65J18j00J28J71J3k18J6K41l36
$$ -125 70 336 149 73 -129 59 -203 -148 18 -12 -240 68 -97 21 -79 49 220 233 15 31 272 -64
6118f4j3K2K80l85j19J37K16R8K4m74R4M51l44J24j2j64K01n2PJ3p1J05k3Q5k33
$$ -64 -77 -55 225 -160 -279 -142 74 172 196 -278 -184 267 -77 47 35 -129 72 20 27 40 -31 74 51 136 -97
6143i7K09No77N88j02K82J21l94L79o36K57Q1l41M77p3n1N4q6k6J98m07L46o0
$$ -97 112 117 -560 28 -74 208 329 -65 314 -322 -65 16 -325 152 79 28 82 -4 -30 168 -239 107 47
6166D7j44j30j5j91N36j74l72Q2O04k11l11M46m35K74m51O05L01l72j41l23O3
$$ 47 -97 -227 -242 -433 103 -71 -443 -361 243 32 -279 167 -268 6 -445 160 461 89 -52 -375 -312
6187c12K07J17k18L06l0k15K16j75r4J83K6L25q5j71K13l17L17l80R9k2K4j56
$$ -312 -105 12 -206 100 70 -145 71 -104 -198 -15 11 336 251 80 293 -24 293 -87 12 -10 14 -142
6209a42J44N5l86J59o5M0J24L24l72N9N4M2k28K28j84K42l89L51k1j38M6K97k55
$$ -142 2 57 -329 -170 -235 -195 -71 253 -119 -60 -6 36 -192 36 -148 94 -295 56 35 -103 -57 240 -15
6232a5K85j54k0m6j87J07J4K37k49k2j38K81J4j00O0J89k93j10n1L37m59m6L00
$$ -15 270 116 96 50 -137 -30 -16 221 -28 -50 -188 93 107 7 67 256 -37 -147 -198 139 -320 -366 -66
6255f6J55J13J22m86l4K6L51K03j89k99J35L5k25K43o1j8R6j55O0j52J7j23L35
$$ -66 89 202 324 -162 -196 -170 181 384 195 -104 31 66 -159 84 23 5 101 -54 6 -146 -129 -252 83
6278H3p6l5l7j08K14K61j26l41l5j76J07M51k2J90k59J7l34J20Qk22N83k20K36
$$ 83 7 -28 -65 -173 41 302 176 -165 -200 -376 -269 182 160 350 91 108 -226 -106 -98 -320 263 43 279
6301B79m33Q6o7PoN49j46l54j1J81j13k16L24l06L27j47M8r6K79rk56M6K49k87
$$ 279 -154 -68 -135 -128 -134 415 269 -85 -96 85 -28 -244 80 -226 101 -46 2 -94 185 176 -80 -34 215 -72
6325g2pR3p3K96k27mJ40p9N2Kk28j14J14j3L08j46j94K0J17p0O8J81l41K53l02
$$ -72 -79 14 -59 237 10 6 146 67 119 121 -107 -221 -107 -120 188 42 -152 -132 -15 -85 -17 164 -177 76 -226
6350b26K82k83M7J88K71j77l4k27K52l00L59o1l4J71m88J19J5K5R3K87k0j09R8
$$ -226 56 -227 -180 8 279 102 68 -159 93 -207 152 91 57 228 -260 -141 -126 -101 -8 279 259 150 248
6373B48j96j03J42k27N2j02K69Kj22R7J41k01J36j35Lom8l4L17l37J93j86J55
$$ 248 52 -51 91 -136 -84 -186 83 85 -37 60 201 0 136 1 4 -2 -50 -84 233 -104 89 -97 58
6396E8j68N1K8k30J65l5J31j76M60k27k51PL30r9k43J74j83J1L34l10M01n7p1
$$ 58 -110 -59 -31 -261 -96 -131 0 -176 284 57 -194 -187 143 44 -199 -25 -208 -197 137 -173 228 171 100
6419A00j50q2n3J65Q9o1J4J55r1K28o31K76J21k78R3RL41k54j0P1m73L83J60n1
$$ 100 -50 -132 -185 -20 69 8 22 177 86 314 -317 -41 80 -198 -105 -96 245 -9 -19 52 -421 -38 122 71
6443G1j57L12k01l16M57o9K09m13L07j66j49L40j83j34K88j72J15j59Q7q1R9M
$$ 71 -86 226 25 -291 166 97 306 -107 200 34 -115 225 42 -92 196 24 139 -20 67 -14 85 89
6465H9m07N32l0j27m7r7j43J89Q0j44o8J16j90K22K72m25j31J21O26l30j25k94
$$ 89 -318 214 184 57 10 -87 -230 -41 39 -105 -173 -57 -247 -25 247 -178 -309 -188 438 108 -17 -311
6487c11K93K75k46J74K3k74L30m05j82K44N1K84k92o4l5r5L40K2m63K70k06Q4
$$ -311 -18 257 11 185 208 -66 264 -141 -323 -79 -28 256 -36 -100 -135 -230 110 132 -331 -61 -267 -183
6509a83r1J81m7k8Q1k02J20j6L68n6j22J13k19K89n5j03j13L2J88J67j76m25J69
$$ -183 -274 -93 -140 -168 -87 -289 -169 -185 183 127 5 118 -101 188 133 30 -83 -51 137 304 128 -297 -128
6532a28J9Q9j87K79k46k4K8l9L28j98k8Q7k42K68j4R5l2J56m37J96l9J69K6J07
$$ -128 -109 -20 -207 72 -174 -198 -170 -209 119 -79 -107 -20 -262 6 -8 87 55 211 -226 -30 -69 100 126 233
6556B33k83J48l15K4L8Q5m6k18K2J34L94k6k81J21j37M5J09k07j27L23p0k65L83
$$ 233 -50 98 -217 -193 -155 -70 -116 -334 -312 -178 216 190 -91 30 -107 -62 47 -160 -287 36 -34 -299 84
6579H4j35J00k01K79%n7k55J20J11j9k79N16J09m15m3J1j09K1O3r1K33M0J5m6
$$ 84 -51 49 -152 127 127 70 -185 -65 46 27 -252 264 373 -42 -85 -74 -183 -162 -99 -190 43 83 98 52
6603E2j44J22M3k63L8L51j24M9J79l15M8R1k60K61l0k32K45k45K70J07k35J39
$$ 52 -92 30 73 -190 -152 199 75 124 303 -12 36 127 -133 128 98 -134 111 -134 136 243 8 147
6625A47j1j34k3K7J40o0L4l30J14pNJ96j33J29k26jJ98N0k8l5p4K62k97M5o9L0
$$ 147 136 2 -21 6 146 86 120 -210 -96 -103 -98 98 -35 94 -132 -133 65 115 87 52 -22 240 -57 -12 -81 -51
6651e1J57j75J22Q1J31K07k36k98o7m2K80m53o0Q9K76L74n05K65j59Q7p1L49l43
$$ -51 106 -69 53 134 265 472 236 -62 -129 -171 109 -344 -404 -315 -39 335 -170 95 -64 23 -48 301 -42
6674d2k4L6j73M33j30p8l21L59j45L02j39j16L40l05P1P9l57O8M1Q2J16j95J57
$$ -42 -66 -30 -203 230 100 22 -299 60 -85 217 78 -38 302 -3 68 147 -210 -142 -101 -19 97 -98 59
6697E9l46N30n3j71J54l1M64o12J06J86j30l8Q3N1l68k15Q44n20Q4j83K47K3j61
$$ 59 -287 243 190 19 173 142 606 -6 100 286 156 118 201 252 -116 -331 513 -7 77 -106 141 164 3
6720CK17k09Jl29J04M06k73J09l9M8o0k36J28L31k48J59r7j00l9l2M00k72J41
$$ 3 220 11 12 -317 -213 193 -80 29 -10 38 -22 -258 -130 201 -47 112 15 -85 -124 -156 244 -28 113
6743A13r7K07n71L58k40p5K75J58j60O0P6m50M76j34l31K29K11o0l31K93m0l25
$$ 113 16 223 -348 10 -230 -305 -30 128 -32 28 104 -346 130 -4 -335 -106 105 45 -286 7 -33 -358
6765c58J46L68k69K1J21j10L02l48qK5J00j47J87k60J29m8L27j77o4j46M11l9
$$ -358 -212 156 -113 -92 29 -81 221 -127 -135 -110 -10 -157 30 -230 -101 -149 178 1 -63 -209 202 163
6787A63j11r3j02N2Q0m7L6J6pL13k37n9j08K58k17q3j53O2K5P4J91J90j8m40K4
$$ 163 52 -41 -143 -91 -11 -58 -22 -6 -13 300 63 4 -104 154 -63 -146 -299 -237 -212 -138 53 243 225 -215 -191
6812a91J81qQ2k56K24j5O0K02j95l17N52l69L7k94M9P6J7mJ81J69l07K83m11Q
$$ -191 -10 -18 64 -192 32 17 77 279 84 -233 319 -50 -13 -307 -258 -182 -165 -169 12 181 -126 157 -254 -246
6836b46K94rk49K97k51OJ14l1J19M1j85J52k9J48j23j3j02l11j19P08M3l5j11
$$ -246 48 39 -210 87 -164 -158 -44 -75 44 85 -100 52 23 171 48 35 -67 -378 -497 211 254 219 108
6859A08j87J72k6r6K16j23j05N2K60p6j25k14J71k41J89ol0m8k50K67kJ90k32
$$ 108 -79 93 67 -29 187 64 -41 11 271 195 70 -144 27 -214 -25 -31 -61 -109 -359 -92 -94 96 -136
6882a36J45l31N53j54LK6k58P1K11o7J26o4n4j20l8K54N9k41n1J9M8K95l08J8
$$ -136 9 -322 231 77 80 106 -152 -81 130 63 189 125 71 -49 -87 167 226 -15 -66 -47 1 296 -12 6
6906FK53m38R7K90L1l10J79P7k46J19k80L38q9k29J79plMJ59k96J18j3J30k87
$$ 6 259 -179 -82 208 239 -71 108 185 -61 58 -222 116 27 -202 -23 -30 -33 -29 130 -166 -48 -61 69 -218
6930b18J53J23J8j74J08M1Q8j76L08l73K63ml78J57m9J69Q7k74K3J99l58K42j02
$$ -218 -65 58 76 -98 10 51 139 -37 271 -102 161 157 -221 -64 -113 56 143 -131 -108 91 -267 -25 -127
6953a27j22K37j34L25l25K05q3q0K88n3j95J37K48k19l02p3L13oJ39k86o3L9K75
$$ -127 -249 -12 -146 179 -146 59 -24 -104 184 131 -64 73 321 102 -200 -273 40 34 173 -113 -176 -137 138
6976A38j47K54p2m00M69r5K16n5m5j89l23M41j95j3J09J2k37R8K40k06Rm20M62
$$ 138 -9 245 173 -227 242 147 363 308 263 74 -249 192 -3 -16 93 105 -132 -34 206 0 9 -411 51
6999E1K61l70J92m9l8J81j57j03K26n36L2K63p9L14J3j07k16K40n6LO4j03%R3
$$ 51 312 -58 134 85 47 228 71 -32 194 -342 -310 -47 -126 188 201 94 -122 118 62 65 129 26 26 119
7023A19J30j87j51R6m4k68L15J57k85R9l0k03O03m16oK03j55K2j01lJ64J07l72
$$ 119 249 62 -89 7 -37 -305 10 167 -118 -19 -49 -252 351 -65 -71 132 -23 -1 -102 -105 59 166 -206
7046b06J93J54m4J40m2k68N6j8J49p7o8k0j33L11l56L71o2J69k09N9j61J38m4
$$ -206 -13 141 97 237 195 -73 -17 -35 114 37 -31 -51 -184 127 -229 142 80 249 40 99 -62 76 32
7069C2m68N08k3j63K85kj73J23j70J41p7j52O4N7J79l24L08N2j58mq2K41k87J9
$$ 32 -436 72 49 -114 171 169 -4 119 -51 90 13 -139 -75 -18 161 -163 145 197 39 35 -47 194 -93 -74
7093g4J37K50k28m99K94J69J45l79L12j66M3q4O0j38K90J2j74K62m31K36Q2k58
$$ -74 63 313 85 -414 -120 49 194 -185 127 -39 4 -80 -20 -158 132 144 -30 232 -199 37 119 -139
7115a39L37m26P4R9k03P6L3K54l40L59k26J71k40J05J40J07l40M35j01j67j81
$$ -139 198 -228 -154 -55 -258 -182 -149 105 -235 124 -102 69 -171 -66 74 181 -159 276 175 8 -173
7136a73K00k18J13p6K51M3j05k08L58q2j77R4Jj35k48L96j41K62l4R9l4k55m5
$$ -173 27 -191 -78 -154 97 140 35 -173 185 103 -74 20 21 -114 -362 34 -107 155 121 220 186 -69 -114
7159a14J68j67R3J23j41N2l05M84j9k5Kol14p4K39J7q8j43L29j76J3J67r1j24
$$ -114 54 -113 -20 103 -38 14 -291 193 174 149 151 145 -169 -243 -4 13 -75 -218 111 -65 -52 115 24 -100
7183a00K02J44j49j1P0j29O9j9%nq4J81m6k25j1K13j24J01j20%o8K12J94j54j14
$$ -100 102 246 97 86 156 27 96 77 77 72 -12 169 123 -102 -113 100 -24 77 -43 -43 -111 101 295 141 27
7208B7J26K0k50L32l46K10k64rL13j87k1P2k82R5J32J24L6O7j28J0P3k95L19j36
$$ 27 153 173 -77 255 -91 119 -145 -154 159 -28 -49 23 -259 -164 -32 92 128 195 67 77 150 -145 174 38
7232C8K9j93L01n06L42J3k0k89J63l7R1K39l29K07k2J19J27k16m16L37L4j54J61
$$ 38 67 -126 175 -331 11 24 4 -285 -122 -159 -68 171 -158 49 27 146 273 57 -359 -22 12 -142 19
7255A9K19l64r7J53J91o0j13J37l62P8K55J29K3n0k71l5K76n05M57J77l05J69
$$ 19 238 -126 -223 -70 121 61 -52 85 -277 -199 56 185 208 158 -113 -148 128 -377 80 257 -48 121
7277A21M0k31M1K02j67J52j1n1n51L90J86m18K41K25j84k40L23Oj77K34k07j01
$$ 121 161 -70 -29 173 6 158 147 96 -455 -65 121 -297 -56 169 -15 -255 68 74 -103 131 -76 -177
7299a77K61j85L43j75P2m0k3j3j55K26l16K82j70kJ95j64m9m4OJ39K64r5p0L5
$$ -177 84 -101 242 67 139 99 76 63 -92 134 -182 100 -70 -72 123 -41 -90 -134 -128 11 275 180 110 145
7323A45K8p8q8k66L48J00K2N5j83j8jm2j92N9K4J37j46j46J89K03R7m80K39M2
$$ 145 173 95 7 -259 89 189 211 266 83 65 64 22 -170 -111 -87 50 -96 -242 -53 150 247 -233 6 48
7347D8j12k9K82l63PL3J77J26J04q1l4o3k4k29J5j5k4K45q5r2K2j60n7P03l97
$$ 48 -64 -93 189 -174 -167 -134 43 169 273 192 158 95 71 -158 -143 -158 -182 63 -22 -114 -92 -252 -309 394 -3
7372cQ2M7l74J99j3J11j0p4j64J60o7K28N1K57l32j01K97l89J86R6l10K31r7j77
$$ -3 79 126 -248 -49 -62 49 39 -35 -199 -39 -106 122 173 430 98 -3 294 -95 91 187 -123 108 11 -166
7396a66K08kr0J0Q4o7p8K76J5l34J20j87J49J7J09l32K69R7J1j80KJ58l5oJ33
$$ -166 42 40 -50 -40 44 -23 -101 175 190 -144 -24 -211 -62 -45 64 -268 1 98 109 -71 -69 89 54 48 181
7421A81j90j82K84o6K31m62L73k72p6m0K86q4J16k70j53M61k67j07K81k87j15
$$ 181 -9 -191 93 27 258 -204 169 -103 -179 -219 67 -17 99 -171 -324 137 -130 -237 44 -243 -358
7442c58M61l38L36Lj18j08N9K35J1k21R5j0j50J11k03J7M66k02Jj39M8k1J46j47
$$ -358 103 -235 101 104 -14 -122 -63 172 183 -38 57 47 -103 8 -195 -178 288 86 87 -52 -4 -25 121 -26
7466b6J08j62J50j74p2Q4j7J31k5J92k71J38n7j35j7j16R1L11k36M45k90J39m
$$ -26 82 -80 70 -104 -176 -92 -109 22 -3 189 -82 56 -1 -136 -153 -269 -178 133 -103 342 52 191 187
7489A87J08l43K8JK03j79j68J73k72r8N50m97K81J0Nl1R9J4k17K56q6J08l54L28
$$ 187 295 -48 -20 -19 184 5 -163 10 -262 -360 190 -307 -26 -16 -11 -42 57 71 -146 110 24 132 -222 106
7513A06k92N57n77K97R2k37o2M42m74J49M4K33j50k26J64j02M7Q0l1j29Q8N5N2
$$ 106 -186 371 -206 91 183 -54 -116 326 -148 1 45 278 128 -98 66 -36 11 91 60 -69 19 74 126
7536A26k74R5J3j62L37R3m68J30K00r4K62k24j70P5J83j08J26m56M94l23j57L92
$$ 126 -148 -53 -40 -202 135 228 -240 -110 90 -4 258 34 -136 -61 122 14 140 -316 178 -145 -302 90
7558I0j15k50K37k46N04l8k89P8k07K40J82k80j0K45j84j67K28J72l29L38J25
$$ 90 -25 -275 -38 -284 220 182 -107 -29 -236 4 186 -94 -104 141 -43 -210 18 190 -139 199 324
7579C24l11q6k61L63K3k07q5Q9J41k30L90j41K81j87j80K18L3k66K9J93n6N7J44
$$ 324 13 -73 -334 29 52 -155 -240 -151 -10 -240 150 9 290 103 -77 141 174 -92 -63 130 74 131 275
7602B75k20K11k59j31K38j9M6k82L70q3k13K23j4j68K23j94M2k03k9J95k75M93
$$ 275 55 266 7 -124 114 95 141 -141 229 146 -67 156 142 -26 197 3 45 -158 -187 8 -267 226
7624B26q2n28N39k84L4P3m5J84j31P7k70J38k8L5j25M03k86j51K1J56j00r1N13
$$ 226 144 -384 155 -129 -95 -22 -67 117 -14 63 -207 -69 -97 -62 -187 216 -70 -221 -200 -44 -144 -235 278
7647B78m31K37l88L92k67J36L50m09pRL74k13L01n67K94l36J93O5j01J41j6j04
$$ 278 -153 84 -304 88 -179 -43 307 -102 -109 -100 274 61 362 -205 89 -247 -54 11 -90 51 35 -69
7669f9K81l65P4K77j10j3j32M2K4J74k77J85l05J97P1O9p4k10J51j16N2m1r0J31
$$ -69 212 -153 -79 198 88 75 -57 -15 9 183 -94 91 -214 -17 54 123 49 -161 -10 -126 -74 -115 -205 -74
7693g4m0j6J80j64j4l1J69m7j52K02L6k52M12o8J6j41k37J56r8j00M7K23K16k63
$$ -74 -114 -130 50 -114 -128 -159 10 -37 -189 13 49 -203 209 141 157 16 -221 -65 -163 -263 -216 7 223 -40
7717d0J28j97Jj6K3J05lrJ49j47l2rj10L06j14P1j25j8J37J05J60l84J47J4j71
$$ -40 88 -109 -108 -124 -101 4 1 -8 141 -6 -38 -47 -157 149 35 106 -19 -37 100 205 365 -19 128 142 -29
7742b9Q7M4j64K17J03k12K14j16R4m12O0L56Qm41K17m94J32J75J63M8j43R5k06
$$ -29 58 102 -62 155 258 46 260 144 238 -174 -114 242 250 -191 26 -468 -336 -161 2 50 -93 2 -204
7765b04K25N7j59O3J61l16L64m04J61l17M16R2J2p1J1k78OK13k86L48k6q9rq8
$$ -204 21 78 -81 -18 143 -173 191 -213 -52 -369 47 139 151 80 91 -187 -181 32 -254 94 68 -21 -30 -118
7789a18Q7k0L09m24K26o8j16J45L3l23K61L1j24K75j1J22mo4l58qJ34J32j56J50
$$ -118 -31 -51 258 -166 60 -8 -124 21 54 -269 -8 23 -101 174 163 285 281 217 -141 -149 -15 117 -39 111
7813A11j75J53j85K30j8j94J75j14j16LJ63J11K00m33K5J51J09l06j54N91l23
$$ 111 -64 89 -96 134 116 -78 97 -17 -133 -130 33 144 344 -89 -64 87 196 -110 -264 327 4
7834Dk4J38l35J92J37Q1k8j65k26P3N51j75j21l45J00J93j55J85j41K17j32Q9
$$ 4 -20 118 -217 -25 112 193 165 0 -226 -153 398 223 102 -243 -143 50 -105 80 -61 156 24 113
7856A13J9j7j9l27K31P3L5L29k45Rm09L37j60P7o1j4j09K71m22L43L04m03k6O7
$$ 113 132 115 96 -231 0 73 108 437 192 201 -208 129 -31 46 -15 -29 -138 133 -289 54 358 -45 -71 -4
7880dK65pj41k43L03k72K5J23m3K58m00K38r4j33K10j75o5J91J8n42L65K82j95
$$ -4 261 254 113 -130 173 -99 -74 49 6 264 -136 102 8 -125 85 -90 -155 36 54 -488 -123 159 -36
7903c6L86l64n5K6J05q9l2k38L54k46L84m08o2L24j62J49q3o1K66k27K66l70o6
$$ -36 350 -14 -69 -43 62 -27 -59 -297 57 -189 195 -213 -275 49 -113 36 -47 -108 158 -69 197 -173 -239
7926b39K06m9K6J62N1j98j52L34p1j46J79J0j1j95O3J5J32l07L99j94j13M23n80
$$ -239 -33 -82 -56 106 157 -41 -193 141 70 -76 103 113 102 -93 -30 -15 117 -190 209 15 -98 325 -255
7949b55kK80J24j88p4L4K14k73N3J76k83L12k0j80MJ79m0J59l70j66L91L5l87
$$ -255 -257 23 147 -41 -115 -81 133 -140 -87 89 -194 118 98 -82 -78 101 61 220 -150 -316 75 110 -277
7972b77N23l13k6Q7k36K3K96m6J21k92K90l2K4k77J59j57R8j24M69n35K81q2p2
$$ -277 246 -67 -93 -6 -242 -219 77 31 152 -140 150 118 142 -135 24 -133 -35 -159 310 -225 56 -26 -98
7995i8K51k14o2k40M95n5j93L01n9k52L14Kj77P5j9k62N34l19k82J58l82O87m37
$$ -98 153 -61 -123 -363 132 77 -116 185 126 -126 188 190 13 88 69 -193 341 22 -260 -102 -484 203 -234
8018b34K02p2M99m08l55N86J1j99l4j31K13l17J93nM43l55L18n79N5O51n76J43
$$ -234 -32 -104 395 -13 -368 218 229 30 -4 -135 78 -239 -46 -51 392 37 355 -224 -169 482 -94 49
8040D9j7L76n95M12l88J07kM8N0o7r7rK29j34q1L43m31J47J06Q7l05R3PJ7Q7J0
$$ 49 32 408 -187 225 -163 -56 -58 -10 40 -27 -124 -133 96 -38 -119 224 -207 -60 46 133 -172 -79 -72 -55 32 42
8066D2o8L7M6k80J66p7K95l07jJ89k18j8J13J13N3K1P0m94J28O3k49L01P7J32
$$ 42 -26 11 57 -223 -57 -134 161 -146 -147 42 -176 -194 -81 32 85 106 176 -318 -190 -127 -376 -75 2 134
8090A34j53L07N0k73o9K8k53J03Q1J05J8n2Lj46L20j80J08j12j39K48k20O4J94
$$ 134 -19 288 338 65 -4 24 -229 -126 -45 60 78 26 29 -117 203 23 131 19 -120 128 -92 -28 166
8113A66l92N1K16oJ73l36P9k0J5o2J6N33k72l56J60Q7k29L51k35O2n7J15m63M45
$$ 166 -226 -175 41 35 208 -128 -49 -69 -54 -116 -100 433 161 -195 -35 52 -177 174 -61 1 -56 59 -404 41
8137D1J6K24j12k97K13R4N6r6l73J54RJ53j39K3J05k81J35J11J48j67r0M6M0k6
$$ 41 57 281 169 -128 85 179 235 139 -234 -80 -71 82 -57 -34 71 -210 -75 36 184 17 -73 -27 13 -13
8161a3J58J42k51J92j90J92l85J55q7O5L7J6R1l83Q7K62m1K87l81p7n0k2L73k66
$$ -13 145 287 36 228 38 230 -155 0 -87 -22 15 31 122 -261 -174 88 47 334 -47 -124 -174 -196 177 -89
8185h9M7j0J01q3L1j64
$$ -89 -42 -52 49 -34 -3 -167
8191a67
$$ Imaginary data points
##PAGE= N=2
##DATA TABLE= (X++(I..I)), XYDATA
0@%%%%Qj6J6j6J6k4L2m0M8n6P2q8J04j20J41j65J92k24K63l05L49m01M58n20N88
$$ 0 0 0 0 0 8 -8 8 -8 8 -16 16 -24 24 -32 40 -48 56 -64 77 -88 104 -120 143 -162 187 -214 244 -276 312
29C12o65P51q44R46j058J182j320J468j630J809k004K220k459K721l012L336l698
$$ 312 -353 398 -446 500 -558 624 -696 772 -858 951 -1053 1167 -1292 1429 -1583 1753 -1945
46a945M108m574N106n721O442p304Q354r663J1351j3620J6841k1792L0426m9549
$$ -1945 2163 -2411 2695 -3026 3416 -3888 4466 -5197 6154 -7466 9375 -12417 18009 -31540
60c1540J59150o3760k64516L39871j17874j60648K41226p2336j43758J90949p9044
$$ -31540 127610 63850 -200666 139205 21331 -139317 101909 29573 -114185 76764 -2280
71b280o1405J34098p5224l6378R6924q2244J3200N4227q6409L8841N4766q6800
$$ -2280 -63685 70413 -4811 -41189 55735 -26509 -13309 40918 -45491 -6650 48116 -38684
83c8684L2282L2723m7008L6822j408m1112M8134k2082l3203N9346j5839m1283
$$ -38684 -6402 26321 -20687 16135 14727 -26385 21749 -333 -33536 25810 9971 -31312
95c1312L8851l47j1703J6329j5071M717Q653k7629J8724J3261l4350K2956J3062
$$ -31312 7539 7192 -4511 11818 -3253 1464 10117 -17512 1212 14473 -19877 3079 16141
108A6141m4068K9762L1931n2801R275M1839m4903j2942M6655j2936k5914J7633
$$ 16141 -27927 1835 33766 -19035 -9760 32079 -12824 -25766 20889 7953 -17961 -328
120c28M738p241L684L348m0m336N53J233j0406Q080Q302j6986Q349J1500k1725
$$ -328 4410 -2831 853 4201 4161 -175 378 1611 -8795 -715 7587 -9399 -1050 10450 -11275
135a1275J0001J6388j9948Q603L000k7602K3278J4716l2414J1308J4621j9686
$$ -11275 -1274 15114 -4834 3769 6769 -20833 2445 17161 -15253 -3945 10676 -9010
147i010Q318R436o338M27j0520N446J1966j8847O049J1269j9451J3609Q475k3899
$$ -9010 -692 8744 2406 2833 -7687 -2241 9725 -9122 -3073 8196 -11255 2354 10829 -13070
161a3070J9275O782k6679J7594J550j9310K0171m323j2397K1490j3916q320K6780
$$ -13070 6205 12987 -13692 3902 5452 -13858 6313 1990 -10407 11083 -2833 -11153 15627
174A5627j3871q022J5057j7080N447J1293j9459J4013O626k4833J7825R196k0721
$$ 15627 1756 -6266 8791 -8289 -2842 8451 -11008 3005 9631 -15202 2623 11819 -8902
187h902J4372N76j6475J3872k633p901J2513o853j734P358r310R792L335j7764
$$ -8902 5470 6046 -10429 3443 810 -7091 5422 -1431 -3165 4193 -5117 4675 8010 -9754
201i754J3845K035j8630J5440J630j4021J5676m380j0901J8505p455r110J6776
$$ -9754 4091 6126 -12504 2936 4566 -9455 6221 1841 -9060 9445 1990 -7120 9656
214I656j0375p967J4314q742K45R651j2172K831R169j0500N015N155j1980N100
$$ 9656 -719 -8686 5628 -3114 -2869 6782 -5390 -2559 6610 -3890 1125 6280 -5700 -600
228f00L638r580Q134K939j0458O072M217o612L548K057m777J619p29k845M657
$$ -600 3038 -6542 1592 4531 -5927 145 4362 -2250 1298 3355 -1422 197 -532 -3377 1280
243A280o91l465M861j032l538N352q61l746N167l778m508P290k159l654P512m408
$$ 1280 589 -2876 1985 953 -2585 2767 1906 -1840 3327 -451 -4959 2331 172 -3482 4030 -378
259c78l663R097n648j809R080r545k479J0658q134p23R295q153l7P816q157K840
$$ -378 -4041 5056 -592 -2401 6679 -2866 -5345 5313 -2821 -3544 5751 -2402 -2439 5377 -2780 60
275F0N288r610L608L856q306N556K235o652O115k13m943N886j687k992L699l421
$$ 60 5348 -4262 -654 3202 -5104 452 2687 -3965 2150 1937 -3006 2880 1193 -1799 1900 -1521
291a521q71M275l601P59L742m463J306K538k665J277jk496J682p81k39K355j723
$$ -1521 -2392 1883 -1718 -959 2783 -1680 -374 2164 -501 776 775 -1721 -39 -820 -1059 1296 -427
308d27n0J662j481P45R00j616M63q92l41J482j384Q73J337k698J914J348k995
$$ -427 -477 1185 -296 449 1349 -267 196 -696 -1037 445 -939 -66 1271 -1427 487 1835 -1160
325a160K088K93l266K562o82j974L983k055j745M393k839r17M354l750m41L266
$$ -1160 928 1221 -2045 517 -165 -2139 1844 -211 -1956 2437 -402 -1319 3035 -715 -1156 2110
341B110l979R57K706l502K314R54l206K793j25k749L252j384k608L687j430j661
$$ 2110 -1869 -912 1794 -1708 606 1560 -1646 1147 1022 -1727 1525 141 -2467 1220 -210 -1871
357a871L533j539j267L010k223k02K570k957K16J653k295R98J300j704R95O39
$$ -1871 1662 123 -1144 1866 -357 -559 2011 -946 -730 923 -1372 -374 926 -778 217 856
373H56j426J056K3n83M63q01j50M35k11J89M19J61k20k68N71k19q32Q36p24k66
$$ 856 -570 486 509 -74 389 -412 -562 -127 -338 -149 270 431 211 -57 514 295 -537 299 -425 -691
393f91R89k38n65J336m07p93J090p06k35M29j051N34K89p10J265j87r70J339n44
$$ -691 298 60 -505 831 424 -369 721 15 -220 209 -842 -308 -19 -729 536 349 -621 718 174
412A74q71J541j097m76J387j010l66J510j330N79P46j445N39J224j691J014j73
$$ 174 -697 844 -253 -729 658 -352 -718 792 -538 41 787 -658 -119 1105 -586 428 255
429B55j342J094Qq00J054K41j283J268n01l80Q44l48l76O44p15p5N95l31j24J088
$$ 255 -1087 7 15 -785 269 510 -773 495 -6 -386 458 110 -266 378 -337 -412 183 -148 -272 816
449H16r20L12j16l52j4P4K08M0m5O4OK12j45j35J34Lm98K31Nm63O96lm14Q46n86
$$ 816 -104 208 92 -260 -274 -200 8 48 3 67 73 285 140 5 139 142 -356 -125 -120 -583 113 110 -304 542 -44
474d4m81J161q46j2Q07q40k55J322j070j44J018r79M04P27j439Q76J66q76N63
$$ -44 -525 636 -210 -222 585 -255 -510 812 -258 -402 616 -363 41 768 -671 205 371 -505 58
493E8K17p47Q59mp99J066l49r48J375q02m45J094r71l6P04n16o9P60p51L02J39
$$ 58 275 -472 387 383 -416 650 301 -647 728 -74 -519 575 -396 -432 272 -244 -313 447 -304 -2 137
514A37m30M50l23m46Q35J09p09P03j04k64K5K44p10P01k69J16J82n39J32J11J38
$$ 137 -293 157 -166 -612 223 332 -377 326 222 -42 -17 227 -483 218 -51 65 247 -292 -160 -49 89
535H9k78N31m02L26j92k63K92k29J03N5q6j3O5j13J88R0m41O46m68kJ4o6J86J65
$$ 89 -189 342 -60 266 74 -189 103 -126 -23 32 -54 -67 -2 -115 73 163 -278 368 -100 -102 -88 -154 32 197
559A97k59J88L7j21j42N62l37n6j89J81k65K66l61N31k30m1L13m11J39J29k05
$$ 197 -62 126 163 42 -100 462 125 69 -120 61 -204 62 -299 232 2 -39 274 -137 2 131 -74
580g4l9K22k7j54j20K60J36l56k4K8L29k12l9j71N18o77J63K97l62K8L55k35J36
$$ -74 -113 109 82 -72 -192 68 204 -152 -176 -148 181 -31 -70 -241 277 -400 -237 60 -302 -274 81 -154 -18
603a8J71m84M19j43k63O30l06p25J290k15o25O18l32p67J042l32k98O51m15J56
$$ -18 153 -331 88 -55 -318 312 6 -719 571 356 -269 349 17 -750 292 -40 -338 313 -102 54
623E4L58r11O86P15j266N97L26r71N79Jq43J020m27m96J231m77n80J076n75l36
$$ 54 412 -499 187 902 -364 233 559 -412 167 168 -675 345 -82 -578 653 176 -404 672 97 -239
643b39O66q95p5R07k47k18M20p15K15N18o38K30P5k74J05K64p87Q98N8o02K59
$$ -239 427 -468 -543 364 117 -101 319 -396 -181 337 -301 -71 4 -270 -165 99 -688 210 268 -334 -75
664g5J69m46N27q5m92N08m93K10O13m62p9M04Po22M72j79J13l08Q7L25j38j42
$$ -75 94 -352 175 90 -402 106 -387 -177 436 -26 -105 299 306 -316 156 -23 90 -218 -131 194 56 -86
686h6L68j68l90K79L71m27m4K21l43L39N2l82K64L65o25P4L27l23N99n38k29M93
$$ -86 282 114 -276 3 374 -53 -97 124 -219 120 172 -210 54 419 -206 -132 195 -128 471 -67 -296 197
708A97l08k14O65j43k67M10k35l34O22q92L73L79m90K85L94o18m6M21j36k5P0
$$ 197 -111 -325 340 197 -70 340 105 -229 393 -499 -126 253 -237 48 442 -176 -222 199 63 38 108
729A08m06L12j79p1M27l39QK87j72Q0N33q20Q0L92j70j82j7k41N17k92q0L51j31
$$ 108 -298 14 -165 -236 191 -148 -140 147 -25 55 588 -232 -152 240 70 -112 -129 -370 147 -145 -225 126 -5
752el23M64m19m0M65m57J76L6j40M98K11p18N96j57q81J011n17k39R90m41j84
$$ -5 -328 136 -283 -323 142 -315 -139 -103 -243 255 466 -252 344 187 -694 317 -200 -439 551 110 -74
773g4R6j59J04J70k47K82L44j146N05L63p32N55k4m79M58Q2J01j64j61J64N7k67
$$ -74 22 -137 -33 137 -110 172 516 -630 -125 238 -494 61 37 -442 16 98 199 35 -126 38 95 -172
795a72N6N48o50K71M60k33k64L46l88j33M75n09Q5N5l56K96K62p66O10j78M6J7
$$ -172 -116 432 -218 53 513 280 16 362 -26 -159 316 -193 -108 -53 -409 -113 149 -617 -7 -185 -139 -122
817a22J79k50O3J19r8L47j15j02N13l24j76J78m20j58N57m36J3L47j26q8N75o58
$$ -122 57 -193 -130 -11 -109 238 123 21 534 210 34 212 -208 -366 191 -245 -232 115 -11 -99 476 -182
839a82L26o5j17kK25n22M74j98j15K14N3j34O0K04o3K5m20J19j3J62j59L00Rl91
$$ -182 144 79 -38 -40 185 -337 137 -61 -176 38 91 -43 17 221 158 183 -237 -118 -131 31 -128 172 181 -210
863b10P03m60r1N0j60J60J77m58J76L83l6K82l49l01M42k11l32K22P4k39J84m60
$$ -210 493 33 -58 -8 -168 -8 169 -289 -113 270 234 516 167 -134 308 97 -235 -13 61 -178 6 -454
885d54L89N09n31K69J6l83J58L31k99l29K6J18L59l98K69j7j43r6L94l79K3N69
$$ -454 -65 444 -87 182 198 -185 -27 304 5 -324 -298 -180 179 -219 50 33 -110 -206 188 -191 -168 401
907D01q46L30J92j50K28p7l49L70j00K3J54j47k24M55K5l49L79n70O8P57p83J68
$$ 401 -445 -115 77 -73 155 78 -271 99 -1 22 176 29 -195 260 285 -64 315 -255 -187 570 -213 -45
929d5J20l78J32J70M8K02l38oK88l04J65K0k15j47N54j74m14O36k30kK09m22K27
$$ -45 75 -303 -171 -1 47 249 -89 -95 193 -111 54 74 -141 -288 266 92 -322 314 84 82 291 -131 96
952I6J46j03k64K40J08l05M41m60L51m56K96j06k49J18L50j25m35L04L17Mk35
$$ 96 242 139 -125 115 223 -82 359 -101 250 -206 90 -16 -265 -147 203 78 -357 -53 264 268 33
973C3JK13j62M7j97K84J4m31J67L60l21J59P4l8k1l82K76Ok62j55N35n07L75R5
$$ 33 34 247 85 132 -65 219 233 -198 -31 329 8 167 241 203 182 -200 76 82 -180 -335 200 -307 68 163
997A63j76K29j1m25L96l38J10N5j02l14N77J36k52K28o4k62M48l49m68N85l53
$$ 163 -13 216 205 -220 176 -162 -52 3 -99 -413 164 300 48 276 212 -50 398 49 -419 166 -187
1018a87J38L67m63o3M66j43j10J03l40K71l5j41J24Jk24O4K2K03n4j88K2K78p6
$$ -187 -49 318 -145 -208 258 115 5 108 -232 39 4 -137 -13 -12 -236 -172 -150 53 -1 -189 -167 111 35
1041C5O5j09Kk27L28m85J91L05k35M50N0k70p0Q4J20N3m08K49p1Q5q4rk90J98
$$ 35 100 -9 -7 -234 94 -391 -200 105 -130 320 370 100 30 114 234 287 -121 128 57 142 58 49 -241 -43
1065d3j00R4J19jP0nk56L04l75o5L94k31K46N9k2k06r0R0j46K78k00j15L06Q0
$$ -43 -143 -49 70 69 139 134 -122 182 -193 -258 136 -95 151 210 188 -18 -108 -18 -164 114 -86 -201 105 185
1089A85j55J89o9j85J9j8P0q4K76k98L79j95K0q6M1j20M33l06j34J82k12J51J8
$$ 185 30 219 150 -35 -16 -34 36 -48 228 -70 309 114 134 48 89 -31 402 96 -38 144 -68 83 101
1112A01j74k12N05N2n15K84p8L3J79K0k12j4O4n7k8M1R2P6j94M53k20j96M01j51
$$ 101 -73 -285 220 272 -243 41 -37 -4 175 195 -17 -31 33 -24 -52 -11 81 157 -37 416 196 0 401 250
1136B50l71j16M3j3K23K95k61j52o9L26m64M07L27j46l49J63l37M2M52j73j01
$$ 250 -121 -237 -194 -207 16 311 50 -102 -171 155 -309 98 425 279 -70 93 -244 -202 250 77 -24
1157b4J33j14%l37L77J16l76K55J53j12O5l5J05p0J74m33j75N12J2k73J13j41
$$ -24 109 -5 -5 -342 35 151 -225 30 183 71 136 101 206 136 310 -123 -298 214 226 -47 66 -75
1179g5j08K20n0K85j70n3J4l1j14L90n42L41j91L8q7J62K53l8m44M19n9l61N0
$$ -75 -183 37 -13 272 102 49 63 32 -82 308 -234 107 -84 -46 -133 29 282 244 -200 219 160 -201 -151
1202a51K57m7j1j56J57j98M1K39j27L95k60j66L90l24K19j35j78Q2l9J31J77k23
$$ -151 106 59 48 -108 49 -149 -108 131 4 399 139 -27 363 39 258 123 -55 27 -12 119 296 73
1224G3j56K25q2k00J46j33L86k47L2j80J35Qk48N8j29J03K75j00K18k67k8K2p2
$$ 73 -83 142 60 -140 6 -127 259 12 44 -136 -1 7 -241 -183 -312 -209 66 -34 184 -83 -111 -89 -161
1247a61J50l05K92L74m40J64L17k75k79K76l59OK90k23K39O3k2K5m43J32o9j04
$$ -161 -11 -316 -24 350 -90 74 391 116 -163 113 -246 -240 50 -173 66 129 107 132 -311 -179 -248 -352
1269c52J64L39j17k9J8j70Q9K18j11n2j76K3K20R0k05L65q6k41k93J98J18j27
$$ -352 -188 151 34 5 23 -147 -58 160 49 -3 -179 -156 64 154 -51 314 228 -13 -306 -108 10 -117
1291a17L28j59l10L60j33J76k62M3J76L1j58k28K79K15k78M4l19L46K7m0M0k85
$$ -117 211 52 -258 102 -31 145 -117 -74 102 133 -25 -253 26 241 -37 7 -312 34 61 21 61 -224
1313b24K79J71J18n32K15L0l0R1PR1l13K98k67L37l32J18k53K69j58M15m53K00
$$ -224 55 226 344 -188 27 57 27 118 125 216 -97 201 -66 271 -61 57 -196 73 -85 330 -123 77
1335G7j48J07J9k04J53k93Q2N19j01o6k32K80j26k5K66r1l26j4J62j53q5M33j01
$$ 77 -71 36 55 -149 4 -289 -207 312 211 145 -87 193 67 42 308 217 -109 -123 39 -114 -199 234 133
1358A33p1q2Jj64J99J34j48l4J33q0J78o7j69K27n7n3j45J73j96J79o9J60l53
$$ 133 62 -20 -19 -183 16 150 2 -32 101 21 199 132 -37 190 133 80 -65 108 -88 91 22 182 -171
1381a71J93k5LRk09J86J48m50M04k15K33j15k5J13k57K84q6o0J52o3j93j72J95
$$ -171 22 -3 0 9 -200 -14 134 -316 88 -127 106 -9 -34 79 -178 106 20 -40 112 49 -144 -316 -121
1404a21K99j53j14J54J64l91J42J11j19q8n6J10L62k28m6k09J44n6o3J64j06M5
$$ -121 178 25 -89 65 229 -162 -20 91 -28 -116 -172 -62 300 72 26 -183 -39 -95 -158 6 -100 -55
1426e5m5K41j12l0j77K16J59r9k6K48l63j0L89m62rJ59j22J03k28J86J95r4J25
$$ -55 -100 141 29 -1 -178 38 197 98 72 320 -43 -53 336 -126 -135 24 -98 5 -223 -37 158 64 189
1449A89Nj85L19l78K42q7l1p0oJ06j67L41n25M17n1k07L62m57K64j51K60k56O
$$ 189 194 9 328 -50 192 105 74 4 -2 104 -63 278 -247 170 119 -88 274 -183 81 -70 190 -66 -60
1472f0N2K79l94M0j46K80k90K94k13J20l0L4nM0J65m61K37j87L09p1K01j45k49
$$ -60 -8 271 -123 -83 -229 51 -239 55 -158 -38 -68 -34 -39 1 166 -295 -58 -245 64 -7 194 49 -200
1495b00P8m4M80m13J51j29J86k11J05K60j68J55m91L35J59j14k54j86K84K11n11
$$ -200 -122 -166 314 -99 52 -77 109 -102 3 263 95 250 -241 94 253 139 -115 -301 -17 194 -317
1516c17L96J30r0K7K7q2l44L38p7r4J56q4K74m63K0rk4L60k20QK72k18K7k30K13
$$ -317 79 209 119 146 173 91 -253 85 8 -86 70 -14 260 -203 -183 -192 -216 144 -76 -68 204 -14 13 -217 -4
1541dl8J68l62L16j12L44l82oK38k3j95j33K62r5M0k66L45j92J72J6Jj88J2K70
$$ -4 -42 126 -236 80 -32 312 -70 -76 162 139 -56 -189 73 -22 18 -248 97 -95 77 93 94 -94 -82 188
1565A88n43M39J25j21j3J21j35J69J9k04M5L2j12k06M73j05J02k28n2J78j3l17
$$ 188 -355 84 209 88 75 196 61 230 249 45 90 122 10 -196 277 172 274 46 -6 172 159 -158
1587a58P9K54l79L37m4j30n6K2M8k85Q5K25J49l21J53K84k98K30k26r3P8k59L29
$$ -158 -79 175 -204 133 89 -41 -97 -75 -27 -312 -227 -2 147 -174 -21 263 -35 195 -31 -124 -46 -305 24
1610B4L76n70J63J03N8j53K8l34J39N8M0K86l28j01L28r8J6j63J16n3K94q6j20
$$ 24 400 -170 -7 96 154 1 29 -305 -166 -108 -68 218 -110 -211 117 19 35 -128 -12 -65 229 143 23
1633B3K58m12J52K20M7k34nm8K07m6o8j30j09J55J8J78l34N6RR0m8K9OJ00n28
$$ 23 281 -131 21 241 288 54 49 1 208 162 94 -36 -145 10 28 206 -128 -72 -63 27 -21 8 14 114 -414
1658d14O21l51n0N11l58j84Q8K51k8l24J31J62m6Q8j61j16Q5q7K72J37k53J32
$$ -414 207 -144 -194 317 -41 -225 -137 114 86 -238 -107 55 9 97 -64 -180 -95 -182 90 227 -26 106
1680A06k03J06p0J22j31M83l45j8J27j14j16q0K25n1j24J46J48l17o8L00k80J00
$$ 106 -97 9 -61 61 -70 413 68 50 177 63 -53 -133 92 41 -83 63 211 -106 -174 126 -154 -54
1702e4P6K01l94L92j47j57L94l87K3k60P7K20R7K40o10J85K08L8j67J52P3j00
$$ -54 22 223 -171 221 74 -83 311 -76 -53 -313 -236 -16 81 321 -289 -104 104 142 -25 127 200 100
1724A00J54k63k83J30mM40j70J04J9p1l04P2J57J57r3j79J09k56L11j03M8j79
$$ 100 254 -9 -292 -162 -166 274 104 208 227 156 -148 -76 81 238 145 -34 75 -181 130 27 75 -104
1746a04k8P2n7K17m2J92l48R4K29l36K08J14j86K2j96J88J04l59K02J5k6LK13
$$ -104 -132 -60 -117 100 58 250 -98 -4 225 -111 97 211 25 47 -149 39 143 -216 -14 1 -25 -22 191
1769A91p2m1j98L05k24K2K83q6j38Kj34O9m4K02k06P0q5J91R8k58k66L57l3r5
$$ 191 119 78 -120 185 -39 -17 266 180 42 44 -90 -21 -65 137 -69 1 -84 107 205 -53 -319 38 5 -90
1793i0L54j5k56K8J50j18J41N9l58K66l63J85k3J07qJ94k15j03M48n5m48M18m66
$$ -90 264 249 -7 21 171 53 194 253 -105 161 -202 -17 -40 67 59 253 38 -65 383 328 -120 298 -168
1816a68J93M2nnj91L57k49p8P7J8k16K13q1R3L77k19m24K92j97k7J99J78q7k32
$$ -168 25 67 62 57 -134 223 -26 -104 -27 -9 -225 -12 -93 0 377 158 -266 26 -171 -198 1 179 92 -140
1840a40N20q9k23jJ40l12k0L54k32K45M6n07M78K3m33L43j98J17P3m78J59K33
$$ -140 380 291 68 67 207 -105 -125 229 -3 242 288 -219 259 282 -151 192 -6 111 184 -294 -135 98
1862I8m7O4Q6m01J39R2kP5p6j1j84K85k13m2%K52j36L38m42j5J43r8L12l50O22
$$ 98 51 115 201 -200 -61 31 29 104 28 17 -167 118 -95 -137 -137 115 -21 317 -125 -140 3 -95 217 -133 489
1887D89n67j39j5l7M62p5o6k52K53l19J92J24j50o7K05m27K66Q3j20L72l36M02
$$ 489 -78 -217 -232 -269 193 118 52 -200 53 -266 -74 50 -100 -167 38 -389 -123 -40 -160 212 -124 278
1909B78k16j44J81k73L46k99j39K60l03L35j4o4K9n6oj18%J19K6M7K03n2j57J74
$$ 278 62 -82 99 -174 172 -127 -266 -6 -309 26 12 -52 -23 -79 -85 -203 -203 -84 -58 -11 192 140 -17 157
1933A57J6j51R3q2j64k4o0J34O2K51k0k22N1QPk5J18k08J42j37L21l33Q8n6J05
$$ 157 173 22 115 33 -131 -155 -215 -81 -19 232 212 -10 41 49 56 31 149 -59 83 -54 267 -66 22 -34 71
1958G1j58j6L93k67K79k32j74J97j83K06j07o2J2J73O3k49L71J6l16l4j61l7L68
$$ 71 -87 -103 290 23 302 70 -104 93 -90 116 9 -53 -41 132 195 -54 317 333 17 -17 -178 -215 153
1981A53j27Q2p5N2M0m27L62Mm8R3j90Q8K33K3k99j38L12j44J7J79j87K49o01M75
$$ 153 26 108 33 85 125 -302 60 64 16 109 -81 7 240 263 -36 -174 138 -6 11 190 3 252 -349 126
2005A26j57L40l14q8J45j58L28l04J69n04K12K05j11N6J3P9J7j23K92m12L40j87
$$ 126 -31 309 -5 -93 52 -106 222 -82 87 -417 -205 0 -111 -55 -42 37 54 -69 223 -189 151 -36
2027c6L92l59n1M0J34m72K16m6K64j21j02l6K11K49k37p4k12M74l01N66m84J51
$$ -36 356 -3 -54 -14 120 -352 -136 -182 82 -39 -141 -177 34 283 46 -28 -240 234 -67 499 15 166
2049A66K2j67J30m04L32R7k30k8K88m21M48k62L02j21j60MK82l60m5M04k32j45
$$ 166 188 21 151 -253 79 176 -54 -82 206 -215 233 -29 273 152 -8 -4 278 -82 -127 277 45 -100
2071a00L01j88l3M06n11J99k30N8J1k74K65j83J35K32q2J3Jj24P4j69K89n3p9
$$ -100 201 13 -20 386 -125 74 -156 -98 -87 -361 -96 -279 -144 88 6 19 20 -104 -30 -199 90 37 -42
2094d2J21r1L27l21o3R1j73J33O4j00o1J50P4n8k15K13j17K39p7J56j20m49L03
$$ -42 79 -12 315 -6 -69 22 -151 -18 46 -54 -115 35 109 51 -164 49 -68 171 94 250 130 -319 -16
2117a6k27L95k63j0j7M12O1l49J40j29m6ll9M4M44l15j83K44k05j30K07P2j52
$$ -16 -243 152 -111 -121 -138 274 335 -14 126 -3 -49 -52 -91 -47 397 82 -101 143 -62 -192 15 87 -65
2140f5r0J91j82M08k14J23k38J67k29J32k36J42J43j39J15j37k5L60l31J77l39
$$ -65 -155 36 -146 262 48 171 -67 100 -129 3 -233 -91 52 -87 28 -109 -134 226 -105 72 -267
2161b67j51O99k90j91Q4J41j94L76j14o8q6J74K8n3j73l6M53n67p2M34j47O7n4
$$ -267 -418 281 -9 -200 -116 25 -169 207 93 25 -61 113 141 88 -85 -121 332 -235 -307 127 -20 47 -7
2184gJ48j84j65J92r9j70j18L53Q8l0J21l00J17j28P4M8k0L05l66L12m06JK84
$$ -7 141 -43 -208 -16 -115 -285 -403 -50 38 8 129 -171 -54 -182 -108 -60 -80 225 -141 171 -235 -234 50
2207E0L5j93J49O8M1k16K09j28j44K26j63J05P0k58J08j06L06k58L28k27j7K46
$$ 50 85 -108 41 109 150 -66 143 15 -129 97 -66 39 109 -149 -41 -147 159 -99 229 2 -15 231
2229B31l35K96k95P8J20j67Q5K28j74L6J27k24j91L24k13l68N27L3K16R6q20L02
$$ 231 -104 192 -103 -25 95 -72 13 241 67 103 230 6 -185 139 -74 -442 85 118 334 430 -390 -88
2251h8j66L70l07k11K23J93k91L03J6o8kK9K9k55L16k18O22l52l78M29n9j13M4
$$ -88 -254 116 -191 -402 -179 14 -277 26 42 -26 -28 1 30 -225 91 -127 495 143 -235 194 135 22 66
2274F6k6R8K4k42L03j71k31M14j90m0J92j64k87L45k81j57O6K35J76m3p0R6k99
$$ 66 40 138 162 -80 223 52 -179 235 45 5 197 33 -254 91 -190 -347 -281 -46 130 87 17 113 -186
2297a86K23j74M7K05j17o0K9L07k31j84PL10m97K50K55j86K49p1q9n7L55m06j67
$$ -186 37 -137 -90 115 -2 -62 -33 274 43 -141 -134 176 -321 -71 184 -2 247 176 87 30 385 -21 -188
2320a88P6J43R4l60K52j93Pj35J11P5L8l4L99k35p8Pl65K22J5k07J50J55J78k15
$$ -188 -112 31 125 -235 17 -176 -169 -304 -193 -118 -80 -114 285 50 -28 -21 -386 -164 -149 -356 -206 -51 127 -88
2344h8l3M47k52k12J95p4J66j15j15K39k13k19L74P3j4j74j26K80q0o2K08q6l67
$$ -88 -121 326 74 -138 57 -17 149 34 -81 158 -55 -274 100 173 159 -15 -141 139 59 -3 205 119 -248
2367b48M41k38J69p7o5j01J04J31j98J17P3o0RJ34o7p0K46k50l01J60L31r1j03
$$ -248 193 -45 124 47 -18 -119 -15 116 -82 35 108 48 57 191 124 54 300 50 -251 -91 240 149 46
2390D6j33j39M17l93J08r6K73j74K89J97k73r0q9l7M47m65PP2r4L54q1k27m0L7
$$ 46 -87 -226 191 -202 -94 -190 83 -91 198 395 122 32 -57 -94 353 -112 -105 -33 -127 227 146 -81 -121 -84
2414h4L99p46K91J9NK9j68l4J99J87j03O1l44M6K91l47N62n2k05J11J0j60K4j12
$$ -84 315 -431 -140 -121 -116 -87 -255 -289 -90 97 -6 55 -289 -243 48 -299 263 211 6 117 127 -33 -9 -121
2438a21L48k84j66J55k26L56k20K24j55m6L33j77j67J82P0o3J48k48Q3R3P9j32
$$ -121 227 -57 -223 -68 -294 62 -158 66 -89 -135 198 21 -146 36 106 43 191 -57 26 119 198 66
2460F6O5ok33O3p6L34k76J84j17R8Q6m6k7j72k53J27J48j08j43L55q0j59M72j62
$$ 66 131 125 -108 -45 -121 213 -63 121 4 102 188 142 115 -57 -310 -183 -35 -143 -286 69 -11 -170 302 140
2484A40L80l69J20j65j51J84r4N8k14L39m14J71p7k03l4J04J08L1M3N4K83n81
$$ 140 520 151 271 106 -45 139 45 103 -111 228 -186 -15 -92 -295 -329 -225 -117 -86 -43 11 294 -287
2506b87J83j93J29NJ39r0L1p4J24J6J59j99Q6kk29J96J38m0j32M1K0l86L68k18
$$ -287 -104 -297 -168 -163 -24 -114 -83 -157 -33 -17 142 -57 29 27 -202 -6 132 92 -40 1 21 -365 3 -215
2530b15J86J85k88K47k9R6k00M0Q0o0M6O2k99K29m8j28o9K86j72j62J31q1K36
$$ -215 -29 156 -132 115 86 182 -18 22 102 42 88 150 -149 80 32 -96 -165 121 -51 -213 -82 -163 73
2553G3o9J09k9j74M0P1j11l7L74K5k27J95k3o7j04j99RK63l02K48%j67J28P7M1
$$ 73 4 113 84 -90 -50 21 -90 -127 247 272 45 240 217 150 46 -153 -144 119 -183 65 65 -102 26 103 144
2578A44l44K52k61J98R6l21K57m8l19N49l00KQJ85l1p5O8n2P6j48%J37J01R9O9
$$ 144 -200 52 -209 -11 85 -236 21 -27 -346 203 -97 -95 -87 98 67 -8 60 8 84 -64 -64 73 174 273 342
2603C42k83j71pl8K02J1j51l7r2L64m8k92K71k71L38k08N3J47L7j33K35k31l26
$$ 342 59 -112 -119 -157 45 56 -95 -132 -224 140 92 -200 71 -200 138 -70 -17 130 167 34 269 38 -288
2626b88J28L10j84L35n29M01rk66K40j76JJ07M4k52o5J05J02j27J37m4J02l32
$$ -288 -160 150 -34 301 -228 173 164 -102 138 -38 -37 70 114 -138 -203 -98 4 -123 14 -30 72 -260
2648b60o8L70K56l91q0L68k43P6J33j44J97k22j70M1M4J17m06M40K2l14L49l5
$$ -260 -328 42 298 -93 -173 195 -48 28 161 17 214 -8 -178 -137 -93 24 -382 58 80 -234 115 80
2670H0J1L2j38j03N6q2q9K94J49m70J17L40j6j12J21J00k85L48m74o7O4J67k76
$$ 80 91 123 -15 -118 -62 -144 -233 61 210 -260 -143 197 181 69 190 290 5 353 -121 -188 -124 43 -233
2693b33K54K61m22j05L15P1j75M8P4j79K50k26L56l48N11m50n0k62O14k85J29
$$ -233 21 282 -140 -245 70 141 -34 14 88 -91 159 -67 289 -59 452 2 -48 -310 304 19 148
2714A48j93O8j78J56K04O4k36l65M12K79l91j62J69J83k56J89J23j99j21L16k92
$$ 148 -45 23 -155 1 205 269 33 -332 80 359 -32 -194 -25 158 -98 91 214 15 -106 210 -82
2735h2p2M38k71K21m51J99j15P3m0K2j01K73p8KJ51l54J82m1n2J76On8j70J26
$$ -82 -154 284 13 234 -217 -18 -133 -60 -100 -78 -179 94 16 18 169 -185 -3 -44 -96 80 86 28 -142 -16
2759a6o5L30k31k06n0J37j4j19J24l4K39m8j33j80n8M31k5P3l48n7K15LL44m65
$$ -16 -81 249 18 -188 -238 -101 -115 -234 -110 -144 95 47 -86 -266 -324 107 82 155 -193 -250 -35 -32 312 -153
2783a53L97n1j66kJ1j43m9J41K22k79O2P6q6p9J41j07K79j35l88K34LQ6J28k28
$$ -153 244 193 27 25 36 -107 -156 -15 207 -72 -10 66 -20 -99 42 -65 214 79 -309 -75 -72 14 142 -86
2807h6K05l91M16k66K22p4j61J39k34K70N6K0j25j12R9L7p7n4K17p3M6N1j37L32
$$ -86 119 -272 144 -122 100 26 -135 4 -230 40 96 116 -9 -121 -22 15 -62 -116 101 28 74 125 -12 320
2831C20p00L88m8J21q8L9R1l43k2R1J8N1m7L18l17N5M4J21p5j35J67l09K91j17
$$ 320 -380 8 -40 81 -7 32 123 -220 -242 -151 -133 -82 -129 189 -128 -73 -29 92 17 -118 49 -260 31 -86
2855h6J20j83Q5J58J10J7j69j62J91l39M95m05J05Q9j3K27o6p8J42j80k19m4Q7
$$ -86 34 -149 -64 94 204 221 52 -110 81 -258 237 -168 -63 26 13 240 174 96 238 58 -161 -205 -118
2878a18Q3o7JJ67NO9j90J83j64pn8o1K08j24J45J5j30q5K51j95j19L69p9j02l07
$$ -118 -35 -102 -101 66 71 140 -50 133 -31 -38 -96 -157 51 -73 72 87 -43 -128 123 -72 -191 178 99 -3 -310
2903c10J78P6O7m0k1j02J02K68j89K73m59K80j65J73P3J7r2j96J54k09K49k73
$$ -310 -132 -56 11 -29 -50 -152 -50 218 29 302 -157 123 -42 131 204 221 129 -67 87 -122 127 -146
2925a46L72P8m86J82Jo3P9L0l7k25L38n05K89j64Q3M71p71P30k31J54m35M10O8
$$ -146 226 304 -182 0 1 -62 17 47 10 -215 123 -382 -93 -257 -174 297 -474 256 25 179 -256 154 222
2948B22j37n9K39k44j13K65j13r1Q2J30j83q4J31k0k18J76P8l20J62J92l38J01
$$ 222 85 26 265 21 -92 173 60 -31 51 181 -2 -86 45 25 -193 -17 61 -259 -97 95 -243 -142
2970a42J38N0q6R0J54m46K94j48J75o5Ln2r1j63K59N7J47l52M60j91rj28o4O6
$$ -142 -4 46 -40 50 204 -242 52 -96 79 14 17 -35 -126 -289 -30 27 174 -178 282 91 82 -46 -110 -44
2994d4KJ4N0K59k22J35p8O5l83kL24j22L0k9J93Q9j55o6J9j42j07o9M51r4j3J68
$$ -44 -42 -28 22 281 59 194 116 181 -202 -204 120 -2 28 -1 192 281 126 60 79 -63 -170 -239 212 118 105 273
3020B73j91K24n27J51R8K87j79r4q9Q2M0l07K52J99j44k11L08j61j18j95L78O1
$$ 273 82 306 -221 -70 28 315 136 42 -47 35 75 -232 20 219 75 -136 172 11 -107 -302 76 137
3042A37j35K21j63q6K64k80J0J22k10O12l99o3k00L24j54J22p9j70N0p2L73j7
$$ 137 2 223 60 -26 238 -42 -32 90 -120 492 93 30 -170 154 0 122 43 -127 -77 -149 224 207
3064B07n18L02L6j40j40M64l28K75l26O3M10j03rQ2k02l69L16P6k02n5K31m4k84
$$ 207 -311 -9 27 -113 -253 211 -117 158 -168 -105 305 202 193 275 73 -296 20 96 -106 -161 70 26 -258
3087b58K72j53P7k24L77l56L11l2l9q1J2K93J6j0q0k52J51J3L68l46j09RK01k96
$$ -258 14 -139 -62 -286 91 -265 46 14 -25 -106 -94 199 215 205 125 -127 24 37 405 59 -50 -41 160 -136
3111a36J10R7l34J79r8n6L56m14N01l16n3L48l01K65m15J96J25M1j16j08K26j82
$$ -136 -26 71 -263 -84 -182 -238 118 -296 205 -111 -164 184 -117 148 -267 -71 54 95 -21 -129 97 -85
3133h5j31O8l3j15L66n0j71K77q1R6P5k12q4K62j75K0l4j5r7o7K08k9j04R3J64
$$ -85 -216 -148 -181 -296 70 20 -151 126 45 141 216 4 -80 182 7 27 -7 -22 -119 -186 22 -7 -111 -18 146
3158A46J27j62J55m21j49R6J09K80j82j92L52J62m27J46M48m53J75j95M4N2j74
$$ 146 273 111 266 -155 -304 -208 -99 181 -1 -193 159 321 -106 40 488 35 210 15 59 111 -63
3179f3K97k8l22K36J91j06j33p1j58K46r6J23k0O7n78K85J11J87n15J82M74m24
$$ -63 234 206 -116 120 311 205 72 1 -157 89 -7 116 96 163 -415 -130 -19 168 -347 -165 309 -115
3201a15J00J9J53P6O3l85O0l16M01q4o5K40l00P4J26q1j74K33m9j83L49n4K0j40
$$ -115 -15 4 157 233 296 -89 -29 -345 56 -28 -93 147 -153 -79 47 -34 -208 25 -24 -207 142 88 108 -32
3225c2K57l38J22j61K71n38L46l90O27r9l4o3l9J68k22J88lL4n46K74n7K32k2
$$ -32 225 -113 9 -152 119 -419 -73 -463 164 65 31 -32 -71 97 -125 63 60 94 -452 -178 -235 -3 -25
3248b5j09L91l2l01p9J45l2j09m7K11J72j71J51k00K94m12r3L39Mm6K20m65Q6
$$ -25 -134 257 225 -76 -155 -10 -42 -151 -198 13 185 14 165 -35 259 -153 -246 93 97 51 271 -194 -108
3271a08O2K29r7l27K53kn0m3J91j91L8j1q1L34q8q2k5M1Q9l54J01K46q7l85qL81
$$ -108 -46 183 86 -241 12 10 -40 -83 108 -83 -45 -56 -137 197 109 27 2 43 132 -222 -121 125 38 -347 -355 26
3297B6J9r5N9J43m14J24K82l7M1K13m21O3j64L02p0l75J65M14m39L03j8Lp8j23
$$ 26 45 -50 9 152 -262 -138 144 107 148 361 -60 3 -161 141 71 -304 -139 275 -164 139 121 124 46 -77
3321g7RK91l70J71m3J79R3q6k58K75J10k55p5J10P9j90J57l23J89l5j52J99j13
$$ -77 -68 223 -147 24 -19 160 253 167 -91 184 294 39 -36 74 153 -37 120 -203 -14 -49 -201 -2 -115
3344a15l5K48r7k51M48J15j49l33k52N78n8l44N2J96J00P3l97L41n00O44n05L87
$$ -115 -150 98 1 -250 198 313 164 -169 -421 157 99 -245 -193 3 103 176 -221 120 -380 264 -241 146
3366A46j08k1P3K3k4l7Jo2R1l13L07k47M55k78k12K70k79K27j9R5q5j76M10n45
$$ 146 38 17 90 113 89 52 53 -9 82 -231 76 -171 284 6 -206 64 -215 12 -7 88 3 -173 237 -308
3390c08M12n53N81l02K51O1kl4j49J75o6q2j78L04j43m5p5L76k51j23K48k10K65
$$ -308 104 -449 132 -170 81 142 140 106 -43 132 66 -16 -194 110 -33 -78 -153 223 -28 -151 97 -113 152
3413A52J82n51K68j68m9L05R3k18j69J52N3J17q2m6n14J14M77l16L60k66M18k65
$$ 152 334 -217 51 -117 -166 139 232 14 -155 -3 50 167 85 39 -475 -361 116 -200 160 -106 312 47
3435D7q5k1m6K25j75J58k70J34j48J08M02k69m05L22J05j0p0j24J95q7p0J31K9
$$ 47 -38 -59 -105 120 -55 103 -167 -33 -181 -73 329 60 -345 -23 82 72 2 -122 73 -14 -84 47 76
3458G6k69J10q6J75L32K6l93k5J64oJ24l44J58k77L51k3j1j29j15J99j41J99R1
$$ 76 -193 -83 -169 6 338 364 -29 -54 110 104 228 -116 42 -235 116 93 82 -47 -162 37 -104 95 186
3481A86j85K24l97j0K17k29J75l07L12J08k84L62l09J86j51n5k1N05n18L77m72
$$ 186 1 225 -172 -182 35 -194 -19 -326 -14 94 -190 172 -137 49 -102 -157 -178 327 -191 186 -286
3502b86K4L02k11M20p3j45k30K50j05k0L57o88K67O4L05m6k30K20k87j20L69K6
$$ -286 -262 40 -171 249 176 31 -199 51 -54 -74 283 -405 -138 -74 231 185 -45 175 -112 -232 137 163
3524A63q0j77l0K86k38K20r3j75q9M84Mm10L36r6k87K03N5j96k9K88k07J35O9
$$ 163 83 -94 -124 162 -76 144 51 -124 -213 271 275 -135 201 105 -182 21 76 -120 -149 139 -68 67 136
3547A36j47K5P3LJ03j46Q2k74M4J03l1p0J59mj94J89K40k35K92l38l03J48j11
$$ 136 -11 14 87 90 193 47 129 -145 -101 2 -29 -99 60 56 -138 51 291 56 348 10 -293 -145 -256
3570b56K95k58K48r2L34j67n9J3j38nrJ70p1k64N5J27K87j39n8R8j48J00j8K42
$$ -256 39 -219 29 -63 271 104 45 58 -80 -85 -94 76 5 -259 -204 -77 210 71 13 111 -37 63 45 287
3594B87m19K09j62m7J74l06L11k47J02M9j26N87l16j8k46j1J53K83k58m7P4Q8
$$ 287 -132 77 -85 -132 42 -264 47 -200 -98 -49 -175 412 96 78 -168 -179 -26 257 -1 -48 26 114
3616A14j04j4K7K03m51M50m18L27l14L10j73M4j4o1nR4J14Pj45M6n5l0MK61m07
$$ 114 10 -4 23 226 -225 225 -193 134 -180 130 -43 1 -13 -74 -79 15 129 136 -9 37 -18 -48 -44 217 -190
3641a90L52k12QNj07M2J04j33p5L07J17j36k56K25Pj50L73j40lk32k0J10j10J91
$$ -190 162 -50 -42 -37 -144 -102 2 -131 -206 101 218 82 -174 51 58 -92 281 141 138 -94 -114 -4 -114 77
3665G7J09p16M30J65j7j71J30k69L36k06K90q0k11K12k67L32k07j05k2J97J50
$$ 77 186 -530 -100 65 48 -123 7 -262 74 -132 158 78 -133 79 -188 144 -63 -168 -190 7 157
3686A57q7O1l95K51M2P2N3j35j04J39k35N56m62N5K03k20p0J11J9K02j95k14J86
$$ 157 70 131 -264 -13 29 101 154 19 -85 54 -181 375 -87 -32 171 -49 -119 -8 11 213 18 -196 -10
3709a0l47J36L93k66L75o4n7l19Q0L99o02L34k04J65K3k55K76j0j40J88J6K46
$$ -10 -357 -221 172 -94 281 217 160 -159 -79 320 -282 52 -152 13 36 -219 57 47 -93 95 111 357
3731C57l14K13k02j69K90j06J14k4j71J3o8M6k5L26k32j48K33j74l5O0qP1j76
$$ 357 43 256 54 -115 175 69 183 159 -12 1 -67 -21 -46 280 48 -100 133 -41 -76 -16 -24 47 -129
3754a29L50k28l67L16J68j87K28L0m09N23o3j59L6P5k94j34J40J21j3P5j13jj7
$$ -129 221 -7 -374 -58 110 -77 151 181 -228 295 232 73 109 184 -110 -244 -104 17 4 79 -34 -35 -52
3777e2K14r9r6K16j4l31K46k91K47L3K3k84J25K33l16K4m2L13j7J57k77J42l15
$$ -52 162 63 -33 183 169 -162 84 -207 40 73 96 -188 -63 170 -146 -122 -164 149 132 289 12 154 -161
3800a61K82j42J13k40J95j92K62m4k25j79M96l71J50K51j62j88J08J94M0k6K0
$$ -161 121 -21 92 -148 47 -145 117 73 -152 -331 165 -206 -56 195 33 -155 -47 147 187 161 181
3821A81l99K96l37J02k91L71M02l85M5j53J04k00K64p30P46j91K42j5o2j00n9
$$ 181 -218 78 -259 -157 -448 -77 325 -60 -15 -168 -64 -264 0 -730 16 -175 67 52 -10 -110 -169
3842a69K50l0K49M8m31J14O3q9J50j40j1J05q6k0q0J50j05nP5j57j7K18j88O9
$$ -169 81 51 300 348 -83 31 94 5 155 15 4 109 23 3 -77 73 -32 -37 38 -119 -136 82 -106 -37
3866c7j12K0K89l54j02M37k34M32k19q4j48J07J43j0l10J83Q6O3k91M40l33J64
$$ -37 -149 -129 160 -194 -296 141 -93 339 120 36 -112 -5 138 128 -182 1 87 150 -141 299 -34 130
3888A30k9p7o3L7K50m36K21J04l59K98k29K05p5R0J37m07J06p1L15k39J90k90
$$ 130 101 24 -39 -2 248 -188 33 137 -222 76 -153 52 -23 67 204 -203 -97 -168 147 -92 98 -192
3910a92J32o0K56J59k69j04L9N6n7J78k69m3J15K48J82l16j04r2M7j26J84Q4J
$$ -192 -60 -120 136 295 26 -78 -39 17 -40 138 -131 -174 -59 189 371 55 -49 -141 -94 -220 -36 48 49
3933D9nj07L8K1lk56L53J90l83J78n31L11J98J31k33J49o6k14K55r1k32J55K78
$$ 49 44 -63 -25 -4 -7 -263 90 280 -103 75 -456 -145 53 184 -49 100 34 -180 75 -16 -248 -93 185
3956A85l58K20K36k37J48j53R5k99kK6M91j69k00K44m73J17R3J86l06K56k79J39
$$ 185 -173 47 283 46 194 41 136 -163 -165 -139 352 183 -17 227 -246 -129 -36 150 -156 100 -179 -40
3978d0k20J3J74J32m43L42j28k3L17R6k66m7mj6N8K28j52p6L80j94m08O4k25L78
$$ -40 -260 -247 -73 59 -384 -42 -170 -193 124 220 -46 -93 -97 -113 -55 173 21 -55 325 131 -277 -213 -438 -60
4002f0K76k84K4m9K39j00K8k95J84J18LJ05M3k35M5j20L98m19J83J43j67j14j26
$$ -60 216 -68 -44 -93 146 46 74 -221 -37 81 84 189 232 -3 42 -78 320 -99 84 227 60 -54 -180
4025a80L44l50K90j18J21k52J94K6rr7n6L21l91K31O7j90J41J15p0k91K36K22
$$ -180 164 -186 104 -14 107 -145 49 75 66 -31 -87 234 -157 74 141 -49 92 207 137 -154 82 304
4047C04j88Q3j99j26J09J90l10K1N12n19K17j60L14l19J55lm03L02j63K76K22
$$ 304 116 199 0 -126 -17 173 -137 -116 396 -123 94 -66 248 -71 84 81 -322 -20 -183 93 315
4068C15p23M21rq2O3K1J21K47m17J68k11K32j37M3m3J50j56J44j67J07j67pJ38
$$ 315 -408 13 4 -78 -15 6 127 374 -43 125 -86 146 9 52 9 159 3 147 -20 87 -80 -87 51
4091E1Q8k01K40l64R9K1J49j39J25n5R3l3q1j67L10k30k96L97k86K01J44N2k70
$$ 51 139 -62 178 -186 -87 -66 83 -56 69 14 107 74 -7 -174 136 -94 -390 7 -279 -78 66 118 -152
4114a52J18K56l17K49j27J16k7P1J6j30o6L7p1J82j42J91j42k68N3L7O0O7J22
$$ -152 -34 222 -95 154 27 143 116 187 203 73 7 44 -27 155 13 204 62 -206 -153 -116 -56 11 133
4137A33l96J65K05k53K55q8R4J59l28l1J80J97k8j00J9l35K25K98n37M1N2j43
$$ 133 -263 -98 107 -146 109 21 115 274 -54 -85 95 292 264 164 183 -152 73 371 -166 -125 -73 -216
4159b16j11J3J93M9K56l63k12L87jj17M3J91k0J84k80J31l93M12l36K54J4j79
$$ -216 -327 -314 -121 -72 184 -179 -391 -4 -5 -122 -79 112 92 276 -4 127 -266 146 -190 64 78 -101
4181a01N9q1J29j34J10J97k09l14L82k21J78j11o3L7L51o7r8j28j58r9M55J8o3
$$ -101 -42 -123 6 -128 -18 179 -30 -344 38 -183 -5 -116 -179 -142 209 142 44 -84 -242 -341 114 132 69
4204F9j65K24n9k4Q3k39J4j38L23o6j34K51k75J23L7l82L72K04l21L63k69j02
$$ 69 -96 128 69 45 128 -111 -97 -235 88 22 -112 139 -136 -13 24 -358 14 218 -103 260 -9 -111
4226a11R5j62P4L10l89K82P0l37K43J17n16L80l1K50k18n5J48k06J45j24J3k31
$$ -111 -16 -178 -104 206 -183 99 169 -168 75 192 -324 56 25 275 57 2 150 -56 89 -35 -22 -253
$$ [...]
8191a11
##END NTUPLES=NMR FID
##END=
