##TITLE=1H_Ser EL-3
 CDCl3
 8 sc, 
 28.11.2023
##JCAMPDX= 6.0         $$ Bruker NMR JCAMP-DX V2.0
##DATA TYPE= NMR FID
##DATA CLASS= NTUPLES
##ORIGIN= UXNMR, Bruker Analytische Messtechnik GmbH
##OWNER= root
$$ XWIN-NMR		Version 3.5
$$ Tue Nov 28 14:50:45 2023 Russian Standard Time (UT+4h)  she@DPX200
##.OBSERVE FREQUENCY= 200.1313
##.OBSERVE NUCLEUS= ^1H
##.DELAY= (6, 6)
##.ACQUISITION MODE= SIMULTANEOUS
##.ACQUISITION SCHEME= undefined
##.AVERAGES= 8
##.DIGITISER RES= 18
##SPECTROMETER/DATA SYSTEM= spect
##.PULSE SEQUENCE= zg30
##.SOLVENT NAME= Acetone
##.SHIFT REFERENCE= (INTERNAL, Acetone, 0, 15.7039)
##AUDIT TRAIL= $$ (NUMBER, WHEN, WHO, WHERE, WHAT)
$$ ##TITLE= Audit trail, XWIN-NMR		Version 3.5
$$ ##JCAMPDX= 5.01
$$ ##ORIGIN= Bruker BioSpin GmbH
$$ ##OWNER= she
$$ F:/spectra/data/she/nmr/H-F/1/audita.txt
$$ ##AUDIT TRAIL=  $$ (NUMBER, WHEN, WHO, WHERE, WHAT)
(   1,<2023-11-28 14:49:42.70 +0400>,<she>,<DPX200>,
      <created by zg, POWCHK disabled, PULCHK disabled
       configuration hash MD5:
       00 E9 B6 7A A2 85 ED C7 34 08 36 98 17 FE 4E 26
       data hash MD5: 16K
       9A 9E DC 7D B9 91 EC A4 4D 20 C8 91 94 A0 38 65>)
$$ ##END=
$$ 
$$ hash MD5
$$ 09 EB BB C9 CC 41 B2 40 6A FE 17 DE AE B4 23 BA
##$RELAX= 
##$RELAX= 
##$RELAX= 
##$RELAX= 
##$RELAX= 
##$RELAX= 
$$ Bruker specific parameters
$$ --------------------------
##$DU= <F:/spectra>
##$EXPNO= 1
##$NAME= <H-F>
##$PROCNO= 1
##$TYPE= <nmr>
##$USER= <she>
##$AMP= (0..31)
100 100 100 100 100 100 100 100 100 100 100 100 100 100 100 100 100 100 
100 100 100 100 100 100 100 100 100 100 100 100 100 100 
##$AQSEQ= 0
##$AQ_mod= 1
##$AUNM= <au_zg>
##$AUTOPOS= <>
##$BF1= 200.13
##$BF2= 200.13
##$BF3= 200.13
##$BF4= 200.13
##$BF5= 200.13
##$BF6= 200.13
##$BF7= 200.13
##$BF8= 200.13
##$BYTORDA= 1
##$CFDGTYP= 0
##$CFRGTYP= 5
##$CHEMSTR= <none>
##$CNST= (0..31)
1 1 145 1 1 1 1 1 1 1 1 1 1 1 1 1 1 1 1 1 1 1 1 1 1 1 1 1 1 1 1 1 
##$CPDPRG= <>
##$CPDPRG1= <>
##$CPDPRG2= <>
##$CPDPRG3= <>
##$CPDPRG4= <mlev>
##$CPDPRG5= <mlev>
##$CPDPRG6= <mlev>
##$CPDPRG7= <mlev>
##$CPDPRG8= <mlev>
##$CPDPRGB= <>
##$CPDPRGT= <>
##$D= (0..31)
0 1.2 0 0 0 0 0 0 0 0.06 0 0.03 0 0 0 0 0.0002 0 0 0 0 0 0 0 0 0 0 0 0 
0 0 0 
##$DATE= 1701168582
##$DBL= (0..7)
120 120 120 120 120 120 120 120 
##$DBP= (0..7)
150 150 150 150 150 150 150 150 
##$DBP07= 0
##$DBPNAM0= <>
##$DBPNAM1= <>
##$DBPNAM2= <>
##$DBPNAM3= <>
##$DBPNAM4= <>
##$DBPNAM5= <>
##$DBPNAM6= <>
##$DBPNAM7= <>
##$DBPOAL= (0..7)
0.5 0.5 0.5 0.5 0.5 0.5 0.5 0.5 
##$DBPOFFS= (0..7)
0 0 0 0 0 0 0 0 
##$DE= 6
##$DECBNUC= <off>
##$DECIM= 32
##$DECNUC= <off>
##$DECSTAT= 4
##$DIGMOD= 1
##$DIGTYP= 9
##$DL= (0..7)
0 120 120 120 120 120 120 120 
##$DP= (0..7)
150 150 150 150 150 150 150 150 
##$DP07= 0
##$DPNAME0= <>
##$DPNAME1= <>
##$DPNAME2= <>
##$DPNAME3= <>
##$DPNAME4= <>
##$DPNAME5= <>
##$DPNAME6= <>
##$DPNAME7= <>
##$DPOAL= (0..7)
0.5 0.5 0.5 0.5 0.5 0.5 0.5 0.5 
##$DPOFFS= (0..7)
0 0 0 0 0 0 0 0 
##$DQDMODE= 0
##$DR= 18
##$DS= 0
##$DSLIST= <SSSSSSSSSSSSSSS>
$$ [...]
##$SUBNAM2= <"">
##$SUBNAM3= <"">
##$SUBNAM4= <"">
##$SUBNAM5= <"">
##$SUBNAM6= <"">
##$SUBNAM7= <"">
##$SUBNAM8= <"">
##$SUBNAM9= <"">
##$SW= 18.0517328524113
##$SWIBOX= (0..15)
0 0 2 0 0 0 0 0 0 0 0 0 0 0 0 0 
##$SW_h= 3612.71676300578
##$TD= 16384
##$TD0= 1
##$TE= 0
##$TE2= 300
##$TE3= 300
##$TEG= 300
##$TL= (0..7)
0 120 120 120 120 120 120 120 
##$TP= (0..7)
150 150 150 150 150 150 150 150 
##$TP07= 0
##$TPNAME0= <>
##$TPNAME1= <>
##$TPNAME2= <>
##$TPNAME3= <>
##$TPNAME4= <>
##$TPNAME5= <>
##$TPNAME6= <>
##$TPNAME7= <>
##$TPOAL= (0..7)
0.5 0.5 0.5 0.5 0.5 0.5 0.5 0.5 
##$TPOFFS= (0..7)
0 0 0 0 0 0 0 0 
##$TUNHIN= 0
##$TUNHOUT= 0
##$TUNXOUT= 0
##$USERA1= <user>
##$USERA2= <user>
##$USERA3= <user>
##$USERA4= <user>
##$USERA5= <user>
##$V9= 5
##$VALIST= <valist>
##$VCLIST= <CCCCCCCCCCCCCCC>
##$VD= 0
##$VDLIST= <DDDDDDDDDDDDDDD>
##$VPLIST= <PPPPPPPPPPPPPPP>
##$VTLIST= <TTTTTTTTTTTTTTT>
##$WBST= 1024
##$WBSW= 4
##$XGAIN= (0..3)
0 0 0 0 
##$XL= 0
##$YL= 0
##$YMAX_a= 185881
##$YMIN_a= -216203
##$ZGOPTNS= <>
##$ZL1= 120
##$ZL2= 120
##$ZL3= 120
##$ZL4= 120
##$ABSF1= 10
##$ABSF2= 0
##$ABSG= 5
##$ABSL= 3
##$ALPHA= 0
##$AQORDER= 0
##$ASSFAC= 0
##$ASSFACI= 0
##$ASSFACX= 0
##$ASSWID= 0
##$AUNMP= <proc_1d>
##$AZFE= 0.1
##$AZFW= 0.1
##$BCFW= 1
##$BC_mod= 2
##$BYTORDP= 1
##$COROFFS= 0
##$CY= 11.3945322036743
##$DATMOD= 1
##$DC= 2
##$DFILT= <>
##$DTYPP= 0
##$F1P= 15.7292609196834
##$F2P= 12.9074282941183
##$FCOR= 0.5
##$FTSIZE= 0
##$FT_mod= 4
##$GAMMA= 1
##$GB= 0.15
##$INTBC= 1
##$INTSCL= 1
##$ISEN= 128
##$LB= 0.24
##$LEV0= 0
##$LPBIN= 0
##$MAXI= 10000
##$MC2= 0
##$MEAN= 0
##$ME_mod= 0
##$MI= 1.114404
##$NCOEF= 0
##$NC_proc= 0
##$NLEV= 6
##$NOISF1= 3.799351
##$NOISF2= 2.8
##$NSP= 1
##$NTH_PI= 0
##$NZP= 0
##$OFFSET= 15.70392
##$PC= 1
##$PHC0= -24229
##$PHC1= 10.8527
##$PH_mod= 1
##$PKNL= yes
##$PPARMOD= 0
##$PSCAL= 0
##$PSIGN= 0
##$REVERSE= no
##$SF= 200.130013532006
##$SI= 16384
##$SIGF1= 3
##$SIGF2= 2
##$SINO= 400
##$SIOLD= 16384
##$SREGLST= <1H.CDCl3>
##$SSB= 0
##$STSI= 0
##$STSR= 0
##$SW_p= 3612.71676300578
##$SYMM= 0
##$S_DEV= 0
##$TDeff= 0
##$TDoff= 0
##$TI= <>
##$TILT= no
##$TM1= 0
##$TM2= 0
##$TOPLEV= 0
##$USERP1= <user>
##$USERP2= <user>
##$USERP3= <user>
##$USERP4= <user>
##$USERP5= <user>
##$WDW= 1
##$XDIM= 8192
##$YMAX_p= 0
##$YMIN_p= 0
$$ End of Bruker specific parameters
$$ ---------------------------------
##NTUPLES= NMR FID
##VAR_NAME=  TIME,          FID/REAL,        FID/IMAG
##SYMBOL=    X,             R,               I
##VAR_TYPE=  INDEPENDENT,   DEPENDENT,       DEPENDENT
##VAR_FORM=  AFFN,          ASDF,            ASDF
##VAR_DIM=   8192,          8192,            8192
##UNITS=     SECONDS,       ARBITRARY UNITS, ARBITRARY UNITS
##FACTOR=    0.0002768,     1,               1
##FIRST=     0,             0,               0
##LAST=      2.2672688,     0,               0
##MIN=       0,             -216203,         0
##MAX=       2.2672688,     185881,          0
$$ Real data points
##PAGE= N=1
##DATA TABLE= (X++(R..R)), XYDATA
$$ plain form
0 0 0 0 0 0 0 0 0 0 0 0 0 0 0 0 0 0 0 -7 8 -8 8 -8 8 -9 15 -16 16 -19 24 -25 28 -32 36 -42 45 -51 59 -66 71 -79
40 -79 87 -96 108 -117 130 -143 157 -173 189 -209 231 -254 281 -309 343 -384 428 -483 548 -629
60 -629 726 -854 1023 -1259 1609 -2164 3156 -5249 11309 -59408 -216203 98418 128186 -141119
74 -141119 -41307 118283 -18565 -60658 60762 25462 -55956 23572 40732 -51319 -8474
85 -8474 40010 -37788 -19360 32033 -21429 -12504 21300 -15265 1141 17717 -16951 3847 24422
98 24422 -3826 -2190 14621 9063 -7788 -8403 7526 -5365 -12299 5382 -14651 -9286 22481
111 22481 -17291 -20114 32553 -394 -24357 19236 8946 -15889 6164 15669 -1342 -8173 14301
124 14301 11842 -21345 3891 19014 -28639 -4561 25577 -26178 -14086 23683 -13973 -12669
$$ packed form
0@%%%%%%%%%%%%%%%%%pJ5j6J6j6J6j7K4l1L2l5M3m9N3o0O8p8Q7r6J10j25J37j50
40g9J66j83K04k25K47k73L00l30L62l98M40m85N35n90O52p27Q12r11J031j177
60f29J355j580J877k282K868l773N320q405J6558p0717j56795L14621K9768k69305
74a41119R9812J59590j36848m2093J21420l5300q1418P9528J7160r2051M2845
85h474M8484p7798J8428N1393n3462Q925L3804l6565J6406J6576l4668K0798K0575
98B4422k8248J636J6811n558j6851o15J5929j2891o934J7681k0033N365L1767
111B2481l9772k823N2667l2947k3963M3593j0290k4835K2053R505j7011o831K2474
124A4301k459l3187K5236J5123m7653K4078L0138n1755J2092L7769l7656J304
$$ plain form
136 -12669 17884 -6339 -10054 17248 6206 -15141 8482 26314 -14989 -11646 38684 -6550
148 -6550 -36025 31311 6446 -44102 15951 15377 -35625 4341 18896 -22521 -6064 20455 -3012
161 -3012 -13326 13778 12904 -14638 5427 19707 -13209 1509 18741 -16766 -1178 16550 -22191
174 -22191 -5136 17551 -18633 -8964 14831 -7719 -8924 7177 1529 -3413 2382 8325 -574
187 -574 -1033 13421 -2961 -6327 17926 -3876 -12572 15829 -5519 -16747 11546 -5472 -15034
200 -15034 8702 -409 -10603 3019 5495 -1403 -4843 7883 9542 -10043 4948 16435 -11986
213 -11986 -912 16141 -10100 -5429 9408 -6905 -5689 1505 -4104 -3499 -2933 2178 1167 -7550
227 -7550 6425 5638 -10421 8303 8786 -9618 8140 7837 -8459 4825 3474 -5518 1665 -2531
$$ packed form
136a2669L0553k4223l715K7302j1042k1347K3623J7832m1303L343N0330m5234
148f550k9475O7336k4865n0548O0053n74n1002L9966J4555m1417J6457K6519k3467
161c012j0314K7104q74k7542K0065J4280l2916J4718J7232l5507J5588J7728l8741
174b2191J7055K2687l6184R669K3795k2550j205J6101n648m942N795N943q899
187e74m59J4454j6382l366K4253k1802q696K8401k1348j1228K8293j7018r562
200a5034K3736r111j0194J3622K476o898l440J2726J659j9585J4991J1487k8421
213a1986J1074J7053k6241M671J4837j6313J216P194n609O05N66N111j011q717
227g550J3975p87j6059J8724M83j8404J7758l03j6296J3284j351q992P183m196
$$ plain form
241 -2531 -2487 -723 -7428 409 -200 -6992 3297 254 -1929 5387 -2906 3518 7833 -7733 5830
256 5830 11894 -10976 2131 11225 -10150 -2225 5419 -6821 -3590 1254 -1747 -4523 -4796 5499
270 5499 -91 -7588 9064 2972 -7400 10413 2665 -6709 10621 1393 -5245 7577 -2085 -5193
284 -5193 2940 -3428 -2811 -1696 -4103 1682 -4020 -3886 5384 -3690 -1365 7596 -2980 2444 6465
299 6465 -3795 4856 4594 -4977 5515 1263 -6155 4137 -3466 -6733 1889 -4287 -3025 492 -5173
314 -5173 2747 597 -4897 6862 2142 -2761 6909 1183 247 5738 -3571 1335 4854 -5436 594
329 594 26 -6463 1733 -3187 -6487 3239 -3590 -2895 5214 -4603 519 6821 -3256 2463 7091 -1088
345 -1088 2311 1410 785 3266 -4828 465 4110 -8473 -1364 2139 -9074 789 2310 -7579 2826
$$ packed form
241b531M4J764o705P837o09o792J0289l043k183P316q293O424M315j5566J3563
256E830O064k2870J3107R094k1375P925P644j2240L231M844l001k776k73J0295
270E499n590p497J6652o092j0372J7813p748r374J7330r228o638J2822r662l108
284e193Q133o368O17J115k407N785n702J34R270r074K325Q961j0576N424M021
299F465j0260Q651k62r571J0492m252p418J0292p603l267Q622o176J262L517n665
314e173P920k150n494J1759m720m903R670n726r36N491r309M906L519j0290O030
329E94n68o489Q196m920l300R726o829O95Q109r817N122O302j0077N719M628q179
345a088L399r01o25K481q094N293L645j2583P109L503j1213R863J521r889J0405
$$ plain form
360 2826 2774 -3624 4250 1419 1244 5035 -770 3808 4200 -3585 3825 1160 -5503 3378 -1954 -5240
376 -5240 3044 -4970 -4143 3230 -4987 -743 3211 -3423 3608 2310 -2898 5969 2203 -1404 6002
391 6002 -756 -168 4373 -5332 -211 2891 -6537 -277 524 -6390 65 -738 -3652 1600 -411 1960
407 1960 1864 -2394 6776 3232 -5545 8392 3180 -7149 7146 1327 -8398 4312 -113 -7152 1519
422 1519 -564 -4246 -1606 -109 588 -3735 1872 6708 -5067 1343 9911 -5771 -181 10362 -6222
437 -6222 -1034 8303 -6249 -2702 4078 -4499 -3282 -259 -881 -1474 -3776 1694 730 -4267 5118 2334
453 2334 -3837 7686 2443 -4845 7875 1227 -5519 5757 -38 -4957 1600 -1991 -3061 -1251
467 -1251 -2648 633 -2823 -1682 4065 -3719 141 7742 -4332 996 8991 -3847 278 7343 -3994
$$ packed form
360B826n2o398P874k831j75L791n805M578L92p785P410k665o663Q881n332l286
376e240Q284q014Q27P373q217M244L954o634P031j298n208Q867l766l607P406
391F002o758N88M541r705N121L102r428O260Q01o914O455q03k914N252k011K371
407A960r6m258R170l544q777J3937n212j0329J4295n819r725J2710m425p039Q671
422A519k083l682K640J497O97m323N607M836j1775O410Q568j5682N590J0543j6584
437f222N188R337j4552L547O780q577J217L023o22n93k302N470r64m997R385k784
453B334o171J1523n243p288J2720o648o746J1276n795m919O557l591j070J810
467a251j397L281l456J141N747p784L860P601j2074N328P995j2838M125P065j1337
$$ plain form
482 -3994 -1460 3982 -2417 -2701 -668 559 -3172 -5830 3820 -449 -9171 6352 3445 -9497 7267
497 7267 5890 -7904 6338 6693 -5170 3074 4609 -2894 -1370 1832 402 -5335 -1187 3457 -7717
512 -7717 -3044 6618 -7789 -2841 10214 -6279 -2793 11594 -2894 -2779 9190 -528 -1904 4847
526 4847 966 -2391 -350 1502 -3012 -4713 3558 -2329 -7794 5625 -765 -9441 7142 2055 -7860
541 -7860 7886 3495 -6012 6304 4255 -3830 2054 4101 -816 -3402 1201 2883 -7651 -1779
555 -1779 5714 -7790 -3805 7086 -6467 -3513 7284 -3383 -1724 6454 166 28 3289 2153
569 2153 930 -1458 2900 1858 -5344 2268 1051 -8415 2284 1398 -8554 3007 1904 -6777 2706
584 2706 2316 -3453 2856 2843 720 1199 1542 3066 -1186 411 4804 -4514 -1995 6314 -7157 -3986
$$ packed form
482c994K534N442o399k84K033J227l731k658R650m269q722J5523k907j2942J6764
497G267j377j3794J4242L55j1863Q244J535p503J524L202j430n737M148M644j1174
512g717M673R662j4407M948J3055j6493L486J4387j4488J15J1969r718j376O751
526D847l881l357K041J852m514j701Q271n887n465J3419o390q676J6583n087r915
541g860J5746m391r507J2316k049q085N884K047m917k586M603J682j0534N872
555a779P493j3504L985J0891j3553K954J0797j0667J659Q178o288j38L261j136
569B153j223k388M358j042p202P612j217r466J0699q86r952J1561j103q681R483
584B706l90n769O309j3k123M79L43J524m252J597M393r318K519Q309j3471L171
$$ plain form
600 -3986 6811 -6844 -4712 7417 -4277 -4191 5608 -256 -2305 2681 3379 65 -824 5535 1008
615 1008 -5449 5069 1620 -8034 4524 891 -9699 3240 1009 -9307 3171 2421 -5507 1992
629 1992 3020 -1697 418 3029 2511 -1874 2149 5352 -4575 -235 6219 -6081 -2230 6389 -6641
644 -6641 -3532 5011 -5504 -3025 3597 -2598 -960 2206 92 484 762 3111 1347 -1542 5591
659 5591 1687 -4746 4411 326 -6489 3872 -603 -6877 2781 -889 -5332 1682 -340 -1590 1420
674 1420 1022 1791 -134 954 4554 -1969 441 6228 -3635 -756 5582 -5420 -2176 4208 -5246
689 -5246 -2973 2532 -2592 -1641 194 210 270 -1004 3056 2207 -2872 4762 2577 -4687 5226 3254 -5450
706 -5450 3810 1536 -5898 1119 34 -4179 -265 -881 -1353 -1062 -852 2226 -1693 270 5295 -2063
$$ packed form
600c986J0797j3655K132J2129j1694Q6R799n864k049M986O98l314q89O359m527
615A008o457J0518l449r654J2558l633j0590J2939k231j0316J2478p50p928P499
629A992J028m717K115K611n18m385M023L203r927M340O454j2300L851Q619j3030
644f641L109Q543j0515K479O622o195J638L166k114L92K78K349j764k889P133
659E591l904o433R157m085o815J0361m475o274R658l670m443P014k022j250L010
674A420l98P69j925J088L600o523K410N787r863K879O338j1002L244O384r454
689e246K273N505n124R51J835J6O0j274M060q49n079P634k185p264R913j972q704
706e450R260k274p434P017j085m213L914o16m72K91K10L078l919J963N025p358
$$ plain form
722 -2063 111 6658 -3077 -66 6221 -4050 -919 5011 -4527 -2045 2468 -4062 -2559 477 -735
737 -735 -1742 -1349 2503 -205 -2734 5403 1449 -4296 6795 1917 -5682 5885 1900 -5651 3560
752 3560 1150 -4154 492 -255 -2153 -1837 -1187 443 -3046 -953 3999 -2758 -431 5721 -2655 574
768 574 6039 -2115 453 3849 -2802 462 1302 -3402 185 -576 -2537 -423 -2279 -238 61 -2622
784 -2622 2403 1144 -3268 4171 1392 -2381 5159 1181 -2550 4160 -91 -2058 1650 -1216 -783
799 -783 -992 -2255 1137 -2373 -2822 2659 -2768 -1348 4160 -2440 -112 5224 -2036 367 3831 -843
815 -843 1399 1168 -1063 1023 -1375 -1293 531 -3659 -299 547 -4447 871 631 -3884 2778 1236 -2480
832 -2480 4179 1636 -1145 3564 602 -585 2040 -827 156 -216 -2265 913 -2711 -2739 2574 -2961
$$ packed form
722b063K174O547r735L011O287j0271L131N930r538K482M513o530J503L036j212
737g35j007L93L852k708k529Q137l954n745J1091m878p599J1567l985p551R211
752C560k410n304M646p47j898L16O50J630l489K093M952o757K327O152q376L229
768E74N465q154K568L396o651L264Q40m704L587p61j961K114j856K041K99k683
784b622N025j259m412P439k779l773P540l978l731O710m251j967L708k866M33
799g83k09j263L392l510m49N481n427J420N508o600K328N336p260K403L464m674
815h43K242k31k231K086k398Q2J824m190L360Q46m994N318k40m515O662j542l716
832b480O659k543k781M709k962j187K625k867R83l72k049L178l624k8N313n535
$$ plain form
848 -2961 -2240 2947 -2806 -722 3210 -1931 1137 3425 -896 2227 1716 -677 2113 -308 -470 1482
864 1482 -2669 -285 331 -3874 484 -505 -3799 2097 -284 -2763 3222 171 -1026 3332 -290 1111
880 1111 2901 -880 1372 1461 -1744 1537 -699 -2503 1610 -2253 -2736 1201 -2835 -1241 1478 -2064
896 -2064 1163 1409 -1427 2811 851 -429 3930 -454 -840 3406 -1794 -725 2074 -2663 -670 333
912 333 -2503 247 -1520 -1985 1725 -1797 -602 3021 -1836 1417 3178 -1967 2069 2916 -1728 2336
928 2336 862 -1892 1833 -1491 -1520 1196 -3263 -1471 586 -3042 163 281 -1697 2369 61 -775
944 -775 3373 -472 252 3316 -1649 844 2727 -2753 184 1240 -3058 232 -624 -2087 304 -2074
960 -2074 -753 1342 -2861 1337 2352 -2385 2678 2224 -1924 3092 1476 -1363 2401 67 -712 849
$$ packed form
848b961P21N187n753K084L932n141L068K288m321L123n11k393K790k421j62J952
864A482m151K384O16m205M358r89l294N896k381k479N985l051j197M358l622J401
880A111J790l781K252Q9l205L281k236j804M113l863m83L937m036J594K719l542
896b064L227K46k836M238j960j280M359m384l86M246n200J069K799m737J993J003
912C33k836K750j767m65L710l522J195L623m857L253J761n145M036Q47m644M064
928B336j474k754L725l324k9K716m459J792K057l628L205J18j978M066k308q36
944g75M148l845P24L064m965K493J883n480K937J056m298L290q56j463K391k378
960b074J321K095m203M198J015m737N063m54m148N016j616k839L764k334p79J561
$$ plain form
976 849 -2162 -283 -290 -3367 750 -855 -3140 2053 -1061 -1971 3677 -387 -512 3382 -659 873 2487
993 2487 -1335 1645 1147 -1810 1504 -916 -1998 377 -2694 -1193 543 -3116 374 1058 -2883 2015
1009 2015 1590 -2263 3118 1496 -1498 3055 519 -893 1318 -491 120 -40 -1998 1171 -1628 -2760
1025 -2760 1962 -2183 -2517 2906 -2182 -1012 3412 -1533 259 3174 -449 1216 1384 -173 1866
1040 1866 -613 -639 1697 -2293 -473 935 -3624 144 712 -3975 1077 1324 -2497 1847 1273 -822
1056 -822 2247 269 722 1999 -744 1045 430 -1981 1632 -924 -2523 2135 -2002 -2528 1945 -2115
1072 -2115 -1384 2310 -2102 -71 2546 -1024 1094 1718 27 2089 164 426 1784 -1861 736 933
1088 933 -3648 917 273 -4401 1387 453 -4109 1746 753 -2389 1673 850 240 1407 386 2170
$$ packed form
976H49l011J879pl077M117j605k285N193l114r10N648m064j25L894m041J532J614
993B487l822K980m98k957L314k420j082K375l071J501J736l659L490O84l941M898
1009B015m25l853N381j622k994M553k536j412K211j809O11j60j958L169k799j132
1025b760M722m145l34N423n088J170M424m945J792K915l623J665J68j557K039
1040A866k479k6K336l990J820J408m559L768N68m687N052K47l821M344n74k095
1056h22L069j978M53J277k743J789o15k411L613k556j599M658m137n26M473m060
1072b115P31L694m412K031K617l570K118O24j691K062j925K62J358l645K597J97
1088I33m581M565o44m674N788r34m562N855r93l142M062q23o10J167j021J784
$$ plain form
1104 2170 435 -714 2704 -898 -1748 2968 -2277 -2431 2606 -2682 -2320 1720 -2033 -837 1294 -1539
1120 -1539 652 696 87 1746 -92 934 2653 -1605 1041 2095 -2757 689 802 -2996 707 -433
1136 -433 -3059 984 -658 -1994 1095 -824 -221 1652 -497 1472 1205 -511 2780 -120 -1021 2943
1152 2943 -1431 -1713 2579 -2375 -1873 1833 -2306 -1426 440 -1128 90 -155 -284 1596 -824 769
1168 769 2359 -1739 1892 2680 -2878 1573 2067 -3081 898 594 -2517 331 -805 -1777 282 -1624
1184 -1624 -238 26 -1643 1694 427 -1127 3223 408 -967 3399 -242 -651 2867 -1352 -1044 1731
1200 1731 -2225 -1103 477 -2115 -345 -908 -1237 697 -1110 776 1848 -1130 1753 2028 -1677 2478
1216 2478 1708 -2582 2249 871 -2570 986 -160 -1728 265 -997 -598 -661 -1537 665 -629 -1338
$$ packed form
1104B170j735j149L418l602q50M716n245j54N037n288L62M040l753J196K131k833
1120a539K191M4o09J659j838J026J719m258K646J054m852L446J13l798L703j140
1136d33k626M043j642j336L089j919O03J873k149J969k67j716L291k900r01L964
1152B943m374k82M292m954N02L706m139Q80J866j568J218k45j29J880k420J593
1168G69J590m098L631P88n558M451M94n148L979l04l111K848j136r72K059j906
1184a624J386K64j669L337j267j554M350k815j375M366l641m09L518m219L08K775
1200A731l956J122J580k592J770n63l29J934j807J886J072k978K883K75l705M155
1216B478p70m290M831j378l441L556j146j568J993j262L99o3q76K202j294p09
$$ plain form
1232 -1338 2631 -871 -883 3352 -578 -531 2968 -736 -217 2053 -1241 68 281 -1620 290 -1266
1248 -1266 -1264 993 -2375 -793 1960 -1806 447 1747 -1196 1590 1667 -1192 1870 881 -661 1769
1264 1769 -653 -695 954 -1958 -133 369 -2285 204 -92 -1976 1315 -267 -1189 2486 -595 -187
1280 -187 2992 -826 138 2226 -838 497 404 -1236 617 -913 -1236 493 -1904 -442 975 -2960
1296 -2960 683 1477 -2597 1104 1737 -1296 1852 1416 -444 1731 283 -32 724 -912 427 -151
1312 -151 -2200 724 -942 -2025 1190 -1264 -1719 1818 -1139 -342 2346 -787 604 2035 -631 1057
1328 1057 1170 -784 1455 -424 -1105 760 -1417 -665 263 -2169 71 386 -2104 1164 271 -1505
1344 -1505 1910 530 -560 2689 -100 122 2086 -441 542 1055 -1210 327 -624 -1473 848 -1310
$$ packed form
1232a338L969l502j2M235l930M7L499l704N19K270l294J309K13j901J910j556
1248a266KK257l368J582K753l766K253J300k943K786P7k859L062r89j542K430
1264A769k422m2J649k912J825N02k654K489k96j884L291j582r22L675l081M08
1280a87L179l818R64K088l064J335r3j640J853j530l23J729k397J462J417l935
1296b960L643P94m074L701O33l033L148m36j860K175j448l15P56j636J339n78
1312a51k049K924j666j083L215k454m55L537k957P97K688l133J391J431k666J688
1328A057J13j954K239j879o81J865k177P52R28k432K240L15k490L268q93j776
1344a505L415j380j090L249k789K22J964k527R83N13k265J537r51q49K321k158
$$ plain form
1360 -1310 -1566 924 -1530 -637 1406 -1231 592 1578 -771 1341 651 -374 1898 -188 -346 1879
1376 1879 -1197 -697 813 -2023 -464 429 -2023 416 -50 -1555 1035 -205 -280 1542 -473 800
1392 800 1871 -1111 1038 1459 -1099 1253 74 -1301 1086 -1103 -1443 868 -1930 -967 858 -1636
1408 -1636 143 787 -1467 1053 1036 -445 1691 452 417 1391 -578 624 897 -1975 685 391 -2306
1425 -2306 891 -387 -2285 1029 -479 -1522 1282 -242 191 863 -332 1095 1269 -515 1566 432
1441 432 -964 1383 -404 -888 1142 -1269 -577 304 -1912 -13 -130 -1440 1144 -64 -1156 2111
1457 2111 167 -118 1814 56 33 1601 -430 592 217 -1273 645 -895 -1422 697 -1551 -1021
1473 -1021 1144 -1463 -413 1085 -691 868 960 -804 1630 642 -317 1728 33 -220 1360 -1041
$$ packed form
1360a310k56K490k454Q93K043k637J823R86k349K112o90j025K272k086j58K225
1376A879l076N00J510k836J559Q93k452K439m66j505K590j240p5J822k015J273
1392H00J071k982K149M21k558K352j179j375K387k189l40K311k798R63J825k494
1408a636J779O44k254K520j7j481K136j239l5R74j969J202K73k872K660k94k697
1425b306L197j278j898L314j508j043K804j524M33O72j195J427J74j784K081j134
1441D32j396K347j787m84K030k411O92Q81k216J899j17j310K584j208j092L267
1457B111j944k85J932j758k3J568k031J022l75j490J918j540n27K119k248N30
1473a021K165k607J050J498j776J559R2j764K434r88r59K045j695k53J580k401
$$ plain form
1489 -1041 -425 671 -1813 -44 -189 -1700 372 -755 -977 1313 -767 -62 1891 -580 476 1706
1505 1706 -300 1152 1092 -1045 1073 -56 -1164 641 -828 -809 714 -1540 -259 548 -1823 457
1521 457 609 -911 1487 532 -309 1652 -134 -139 1425 -595 468 579 -1695 318 -115 -1678 864
1538 864 -579 -1355 933 -827 -900 1062 -831 316 1251 -438 1171 424 -233 1527 -52 -678 1263
1555 1263 -632 -777 422 -1475 -576 163 -1628 149 104 -1124 806 -61 -658 1580 -48 34 1756
1572 1756 -103 562 830 -892 651 27 -1332 764 -1016 -1560 709 -880 -1020 766 -1124 -358
1588 -358 962 -393 623 453 -196 1528 -161 166 1906 -759 -81 1280 -1390 -64 697 -1300
1604 -1300 -40 -483 -1375 295 -327 -621 962 -508 257 1685 -579 972 1400 -509 1105 472 -794
$$ packed form
1489a041O16J096k484J769j45j511K072j127k22K290k080P05J953k471J056J230
1505A706k006J452o0k137K118j129j108J805j469J9J523k254J281Q07k371K280
1521D57J52j520K398r55q41J961j786nJ564k020J063J11k274K013m33j563K542
1538H64j443p76K288j760p3J962j893J147R35j689J609p47o57J760j579o26J941
1555A263j895j45J199j897Q99P39j791J777m5j228J930q67n97K238j628Q2J722
1572A756j859O65K68j722J543o24j359K096j780n44K269j589j40J786j890P66
1588c58J320j355J016j70o49J724j689L27J740k665O78J361k670J326P61j997
1604a300J260m43q92J670o22k94J583j470P65J428k264J551M28j909J614o33j266
$$ plain form
1621 -794 907 -575 -1015 707 -1133 -775 453 -1595 -252 393 -1009 650 225 -669 953 417 -114
1638 -114 1414 -262 388 1445 -994 471 976 -1208 673 -26 -1174 635 -893 -1039 351 -911
1654 -911 -266 577 -582 323 788 -439 1379 756 -315 1659 90 -497 1541 -719 -672 385 -1405
1671 -1405 -99 -111 -1190 395 -138 -933 1202 -241 -46 1537 -34 430 1453 -543 703 909 -663
1688 -663 675 7 -874 491 -805 -881 648 -1195 -484 432 -1094 -55 302 -816 1162 167 -206
1705 -206 1507 102 48 1319 -468 -344 1133 -1090 0 204 -1452 107 -701 -992 501 -797 -679
1722 -679 1151 -235 295 1250 -360 848 1177 -594 956 441 -600 669 -594 -590 604 -1261 -610
1739 -610 349 -1351 -84 159 -992 689 241 -536 1422 149 -163 1360 -230 361 1139 -967 309
$$ packed form
1621g94J701j482m40J722j840L58J228k048J343O45j402J659m25q94J622n36n31
1638a14J528j676O50J057k439J465N05k184J881o99j148J809j528j46J390j262
1654i11O45Q43j159R05M65j227J818o23j071J974j569n87K038k260M7J057j790
1671a405J306j2j079J585n33p95K135j443J95J583j571M64J023j996J246K06j572
1688f63J338o68q81J365j296p6J529j843P11R16j526J039L57j118J978r95l73
1705b06J713j405n4J271j787J24J477k223J090K04j656J559q08k91J493j298J18
1722f79J830j386N30R55j610J208L29j771J550n15j041J269j263MJ194j865O51
1739f10R59j700J267K43j151J681m48p77J958j273l12J523j590N91P78k106J276
$$ plain form
1756 309 402 -1109 583 -160 -1265 404 -1054 -698 283 -958 -1 732 -636 1002 704 -652 811
1773 811 676 -485 1123 30 -459 431 -1141 -291 58 -1348 91 -67 -1213 303 -182 -652 1018
1790 1018 -297 22 1525 -103 717 1141 -546 856 503 -712 824 -176 -950 249 -806 -629
1806 -629 179 -895 -128 391 -841 376 26 -755 989 510 -162 1402 -247 -212 1335 -493 -141 503
1824 503 -1297 103 11 -1374 94 -475 -979 493 -773 -229 845 -682 350 898 -202 847 794
1841 794 -350 1003 170 -962 614 -294 -770 272 -857 -174 159 -1057 380 183 -984 829 73
1858 73 -373 1118 -148 215 1258 -290 553 652 -754 426 259 -1038 511 -513 -1162 663 -873
1875 -873 -591 542 -994 171 853 -548 695 795 -487 1215 413 -224 792 -259 -156 585 -909
$$ packed form
1756C09R3j511J692p43j105J669j458L56R81j241R57P33j368J638k98j356J463
1773H11j35j161J608j093m89Q90j572Q50L49j406J439j58j146J516m85m70J670
1790A018j315L19J503j628Q20M24j687J402l53j215J536j000p74J199j055J77
1806f29Q08j074P67N19j232J217l50p81J744m79o72J564j649L5J547j828L52O44
1824E03j800J400r2j385J468n69n04J472j266N44J074j527J032N48j100J049n3
1841G94j144J353q33j132J576r08m76J042j129O83L33j216J437j97j167J813p56
1858G3m46J491j266L63J043j548Q43R9j406J180j67j297J549j024o49J825j536
1875h73K82J133j536J165O82j401J243J00j282J702q02o37J016j051J03P41j494
$$ plain form
1892 -909 208 149 -1271 288 5 -992 663 -98 -729 1054 -223 84 1047 37 714 801 -321 596
1910 596 491 -502 738 -150 -792 482 -545 -493 50 -849 -86 302 -855 514 401 -362 1111 230
1928 230 6 1409 -96 114 975 -471 7 293 -1093 228 -114 -1105 206 -658 -567 529 -620 24
1946 24 843 -578 696 777 -782 882 681 -417 1107 -97 -551 748 -819 -637 373 -1038 -403
1963 -403 184 -1049 185 74 -688 576 -316 -223 1099 -305 -42 1013 -722 371 611 -467 290
1980 290 -22 -904 287 -573 -900 547 -942 -558 540 -601 412 729 -503 799 310 -555 1022
1997 1022 149 -127 905 -525 -198 732 -666 -365 160 -847 16 -117 -921 625 -482 -359 836
2014 836 -459 249 764 -315 699 675 -499 676 279 -653 503 -574 -371 324 -893 -304 424 -621
$$ packed form
1892i09J117n9j420J559k83r97J655p61o31J783j277L07R63j010O77Q7j122R17
1910E96j05r93J240q88o42J274j027N2N43q99P63L88j157J369j13p63J473q81
1928B30k24J403j505K10Q61j446M78K86j386J321l42r91J311q64R1J096j149O44
1946B4Q19j421J274Q1j559J664k01j098J524j204m54J299j567J82J010j411O35
1963d03N87j233J234j11p62J264q92R3J322j404K63J055j735J093K40j078P57
1980B90l12q82J191q60l27J447j489L84J098j141J013L17j232J302m89q65J577
1997A022q73k76J032j430L27R30j398L01N25j007Q63j33q04J546j107J23J195
2014H36j295P08N15j079J014k4j174J175l97r32J156j077K03O95j217N89P28j045
$$ plain form
2032 -621 103 224 -647 579 249 -528 849 291 -367 942 -449 -1 759 -887 222 64 -1089 341
2050 341 -106 -927 282 -675 -715 557 -739 -41 760 -369 588 538 -509 992 273 -249 906 -285
2068 -285 -180 907 -472 -112 390 -870 -111 -60 -772 17 62 -431 636 -120 -8 893 5 467 1027
2087 1027 -631 371 186 -737 361 -313 -598 299 -617 -94 528 -1049 -220 712 -828 491 569 -590
2105 -590 763 534 -8 836 -127 -184 878 -329 -36 175 -918 -54 -155 -949 258 -467 -572 815
2123 815 -502 1 834 -267 83 735 -385 346 574 -529 613 -92 -407 390 -288 -481 574 -892
2141 -892 -424 46 -885 42 399 -618 345 117 -273 1268 -60 224 1038 -441 64 691 -614 366
2159 366 -151 -1059 516 -229 -917 350 -625 -314 524 -369 261 843 -275 496 152 -238 728 33 -2
$$ packed form
2032f21P24J21q71J226l30p77J377n58o58J309j391M48P60j646J109j58j153J430
2050C41m47q21J209r57m0J272j296O98Q01j129R57n0j047J501p19n22J155j191
2068b85J05J087j379L60N02j260P59N1p12P89M5m93J067p56J12R01q88M62N60
2087A027j658J002j85r23J098o74k85Q97r16N23O22j577Q29R32j540J319P8j159
2105e90J353k29n42Q44r63n7J062j207K93K11j093Q64j01p94J207p25j05J387
2123H15j317N03Q33j101L50O52j120P31K28j103J142p05l15P97o78j93J055j466
2141h92M68M70r31R27L57j017R63k28l90J541j328K84Q14j479N05O27j305R80
2159C66n17r08J575p45o88J267r75L11Q38q93O30N82j118P71l44l90R66o95l5
$$ plain form
2178 -2 701 -178 -26 433 -863 -192 135 -925 -49 -29 -858 337 -148 -197 561 -393 396 917 -191 416
2198 416 654 -472 411 309 -525 335 -362 -738 530 -815 -534 570 -735 -129 360 -610 226 363
2216 363 -324 565 49 -31 603 -338 360 602 -550 227 314 -824 39 -116 -917 227 -415 -420 521 -520
2236 -520 -73 723 -414 314 716 -641 751 138 -534 794 -374 -412 298 -739 -348 397 -507 -227
2254 -227 158 -579 405 34 -363 756 46 -175 942 -258 265 631 -502 423 359 -641 301 69 -754
2273 -754 215 -639 -663 95 -501 -154 471 -354 430 368 -407 611 220 -302 889 -9 -210 766 -342 -218
2293 -218 261 -605 -211 -257 -741 96 -474 -543 135 -440 -219 688 -346 41 968 -390 379 467 -615 609
2313 609 394 -682 397 -454 -408 294 -527 -39 316 -771 38 324 -390 525 195 -219 947 61 77
$$ packed form
2178bP03q79J52M59j296O71L27j060Q76K0q29J195m85m9P58r54P89N21j108O07
2198D16K38j126Q83j02q34Q60o97l76J268j345K81J104j305O06M89r70Q36J37
2216C63o87Q89n16q0O34r41O98K42j152P77Q7j138Q63j55q01J144o42nR41j041
2236e20M47P96j137P28M02j357J392o13o72J328j168l8P10j037L91P45r04K80
2254b27L85p37R84l71l97J119p10k21J117j200N23L66j133R25o4j000R42k32q23
2273g54R69q54k4P58n96L47O25q25P84o2p75J018l91n22J191q98k01R76j108J24
2293b18M79q66L94m6m84Q37n70o9O78n75K21R07j034L87R27j358P69Q8j082J224
2313F09k15j076J079q51M6P02q21M88L55j087Q09K86p14R15l30m14J166q86J6
$$ plain form
2332 77 762 -184 79 312 -599 136 129 -506 80 -212 -708 494 -335 -132 501 -540 88 508 -335 334
2352 334 640 -331 757 84 -199 545 -421 -325 339 -614 -232 -14 -945 167 -41 -944 413 -192 -576
2371 -576 715 54 41 700 5 -116 584 -444 213 145 -451 395 -150 -645 432 -332 -383 554 -711 -195
2391 -195 192 -404 332 373 -271 708 345 -209 398 -147 -210 484 -394 -432 229 -661 13 -243 -717 112 -325
2412 -325 -640 368 -235 37 793 -239 323 845 -327 272 352 -179 145 -124 -390 274 -361 -407 134 -809
2432 -809 123 235 -824 -43 441 -421 576 190 -19 723 -38 55 626 -361 -116 558 -443 5 151 -606
2452 -606 182 -142 -544 190 -481 -242 555 -218 180 345 -14 649 414 -187 437 84 -71 564 -439 -90
2472 -90 238 -664 100 -76 -496 240 -5 -659 411 -45 -196 633 -107 128 433 -205 481 547 -345 374
$$ packed form
2332G7O85r46K63K33r11P35po35N86k92m96J202q29K03O33j041O28M20q43O69
2352C34L06r71J088o73k83P44r66R6O64r53L82K18r31J112k08r03J357o05l84
2371e76J291o61j3O59o95j21P00j028O57o8n96Q46n45m95J077p64n1R37j265N16
2391a95L87n96P36M1o44R79l63n54O07n45o3O94q78l8O61q90O74k56m74Q29m37
2412c25l15J008o03K72P56j032N62N22j172N99Q0n31L24k69k66O64o35m6N41r43
2432h09R32J12j059P81M84q62R97l86k09P42p61R3N71r87K45O74j001M48J46p57
2452f06P88l24m02P34o71K39P97p73L98J65l59O63k35o01O24l53j55O35j003L49
2472i0L28r02P64j76m20P36k45o54J070m56j51Q29p40K35L05o38O86O6q92P19
$$ plain form
2492 374 11 -287 378 -492 -198 98 -686 -455 158 -391 39 417 -597 127 -29 -269 421 89 30 513
2512 513 81 247 565 -365 -5 193 -625 81 -326 -579 510 -236 -392 454 23 -231 326 -87 281 456
2532 456 -283 475 367 -225 653 -108 -385 119 -587 -146 329 -579 -181 143 -321 231 -260 -345 450 259
2552 259 -193 636 -117 102 543 -181 52 0 -612 34 -212 -602 -160 -121 -382 193 -422 -241 248 -471 14
2573 14 412 -327 397 2 -260 451 -66 -142 315 -244 -177 -102 -686 -101 -138 -247 118 -206 -516 261 -376 -288
2595 -288 688 91 -15 783 -241 497 175 -224 385 335 -436 131 -316 -526 297 -739 -338 338 -444 213
2615 213 283 -579 432 -22 -24 556 258 -225 502 -261 10 402 -528 278 -172 -698 146 83 -465 138 -495
2636 -495 -378 459 -106 236 329 -101 354 414 -163 212 -34 -46 319 -395 -81 289 -372 -169 -132 -757 39
$$ packed form
2492C74l63k98O65q70K94K96p84K31O13n49M30L78j014P24j56k40O90l32n9M83
2512E13m32J66L18r30L60J98q18P06m07k53J089p46j56Q46m31k54N57m13L68J75
2532D56p39P58j08n92Q78p61k77N04p06M41M75r08L98L24m64N52m91q5P95j91
2552B59m52Q29p53K19M41p24K33n2o12O46k46l90M42L9k61N75o15J81M89p19M85
2573A4L98p39P24l95k62P11n17p6M57n59O7P5n84N85l7j09L65l24l10P77o37Q8
2595b88R76n97j06P98j024P38l22l99O09n0p71N67m47k10Q23j036M01O76p82O57
2615B13P0q62J011m54kN80k98m83P27p63K71L92r30Q06m50n26Q44o3n48O03o33
2636d95J17Q37n65L42R3m30M55O0n77L75k46j2L65p14L14L70o61K03L7o25P96
$$ plain form
2657 39 157 -382 233 204 -46 351 -66 144 379 -40 100 256 -144 4 -17 -148 350 -200 -467 203 -280
2678 -280 -144 447 -124 56 106 -340 137 236 -172 258 177 -174 337 -183 -77 429 -557 -36 250 -622 -61
2699 -61 -214 -456 238 -184 -305 362 -230 -96 480 -300 214 437 -408 394 346 -522 102 -53 -763 342
2719 342 -76 -264 343 -378 120 53 -320 105 387 -316 512 92 -124 531 -30 58 285 -316 -90 277 -429
2740 -429 -125 149 -301 186 -198 -159 88 -334 -156 377 -202 191 203 -228 520 348 -172 512 114 -284 510
2761 510 -246 -146 -146 -572 -461 123 -494 152 16 -62 239 144 -23 269 -160 -10 484 -258 280 388 -118
2782 -118 375 122 -363 127 -23 -432 240 -248 -113 102 -215 -95 92 -401 184 54 -79 440 120 -134
2802 -134 596 -82 -341 91 -235 40 120 -625 217 214 -622 266 -133 -205 289 -321 4 558 -42 214 603
$$ packed form
2657C9J18n39O15k9k50L97m17K10K35m19J40J56m00J48k1j31M98n50k67O70m83
2678b80J36N91n71J80N0m46M77R9m08M30q1l51N11n20J06N06r86N21K86q72N61
2699f1j53k42O94m22j21O67n92J34N76p80N14K23q45Q02m8q68O24j55p10J105
2719C42m18j88O07p21M98o7l73M25K82p03Q28m20k16O55n61Q8K27o01K26L67p06
2740d29L04K74m50M87l84L9K47m22J78N33n79L93J2m31P48j72n20O84l98l98P94
2761E10p56J00%m26J11N84o17O46j36p8L01r5j67K92m29J50M94p42N38J08n06
2782a18M93k53m85M90j50m09O72m88J35K15l17J20J87m93N85j30j33N19l20k54
2802a34P30o78k59M32l26K75Q0p45Q42lq36Q88l99p2M94o10L25N54o00K56L89
$$ plain form
2823 603 -348 460 343 -386 -87 -146 -396 281 -299 -183 255 -432 -49 209 -303 274 46 -48 443 181 -384
2844 -384 313 -10 230 472 -250 188 85 -336 63 -293 -56 78 -496 -162 223 -290 127 274 -81 152
2864 152 373 107 289 88 -192 276 236 -431 151 -308 -188 59 -346 -4 -180 -397 193 54 8 86 -2
2885 -2 -153 328 48 10 434 -145 97 284 -429 97 -129 -53 -7 -139 -428 -158 -609 -76 296 -224 48 320
2907 320 -324 300 397 53 367 292 -80 323 233 -116 336 -395 79 -77 -348 -94 -208 -365 238 -295 -121
2928 -121 144 -70 144 385 -61 339 292 -130 119 85 -320 200 -361 -305 247 -113 -142 71 -371 64 83 -510
2950 -510 -1 -191 -16 147 13 44 404 -214 -35 250 -267 292 -12 -419 149 -51 -354 -20 -415 -209
2970 -209 88 -129 -175 375 -311 191 291 -95 439 131 2 336 -28 -190 327 -350 -99 137 -482 -137
$$ packed form
2823F03r51Q08j17p29K99n9k50O77n80J16M38o87L83K58n12N77k28r4M91k62n65
2844c84O97l23K40K42p22M38j03m21L99l56K37J34n74L34L85n13M17J47l55K33
2864A52K21k66J82k01k80M68m0o67N82m59J20K47m05L42j76k17N90j39m6P8q8
2885bj51M81k80l8M24n79K42J87p13N26k26P6M6j32k89K70m51N33L72n20K72K72
2907C20o44O24R7l44L14p5l72M03r0l49M52p31M74j56k71K54j14j57O03n33J74
2928a21K65k14K14K41m46M00m7m22K49l4m05N20n61N6N52l60k9K13m42M35J9n93
2950e10N09j90J75J63j34L1L60o18J79K85n17N59l04m07N68k00l03L34l95K06
2970b09K97k17m6N50o86N02J00l86N34l08j29L34l64j62N17o77K51K36o19L45
$$ plain form
2990 -137 -76 -482 135 -67 -143 299 227 119 557 193 189 193 -32 167 208 -455 219 -27 -20 50 -26 -481 129 -194
3014 -194 142 193 -185 248 128 56 140 96 -197 325 25 -69 200 -102 -200 58 -388 101 261 -312 166 169 -298
3037 -298 168 -307 -195 231 -102 93 150 -396 228 496 -224 247 -41 63 78 -236 -231 89 -468 -470 -81 -194
3059 -194 62 228 -287 42 15 -2 480 148 12 222 128 232 148 -167 -152 -99 -399 221 -283 -342 77 -222
3081 -222 -234 227 -474 -11 139 -69 50 274 69 238 -148 -130 365 50 -67 81 -491 20 100 -523 -142
3102 -142 65 -381 88 113 -240 377 -247 -223 262 -305 137 385 -87 52 87 -102 226 -50 -244 187 -292
3123 -292 -297 2 -369 -298 -23 -144 291 159 -24 342 -116 207 518 147 105 165 -201 220 134 -280 -244 25
3145 25 -411 12 -211 -473 31 -98 -188 423 -217 19 253 -163 286 124 -176 398 -178 -206 103 -208 62
$$ packed form
2990a37O1m06O17k02p6M42p2j08M38l64mMk25J99M1o63O74k46PP0p6m55O10l23
3014a94L36N1l78M33j20p2Q4m4k93N22l00r4K69l02r8K58m46M89J60n73M78Lm67
3037b98M66m75J12M26l33J95N7n46O24K68p20M71k88J04J5l14NL20n57kL89j13
3059a94K56J66n15L29k7j7M82l32j36K10r4J04q4l15J5N3l00O20n04n9M19k99
3081b22j2M61p01M63J50k08J19K24k05J69l86J8M95l15j17J48n72N11Q0o23L81
3102a42K07m46M69K5l53O17o24K4M85n67M42K48m72J39L5j89L28k76j94M31m79
3123b92nK99l71P1K75j21M35j32j83L66m58L23L11l71m2O0l66M21q6m14L6K69
3145B5m36M23k23k62N04j29r0O11o40K36K34m16M49j62l00N74n76k8L09l11K70
$$ plain form
3166 62 -21 -405 -57 67 -169 -307 -117 132 152 85 24 362 8 99 304 -71 120 225 -459 238 74 -366
3188 -366 177 -139 -285 55 -246 -108 271 -188 3 21 23 207 223 -23 366 -180 -202 272 -135 -233 242 -505
3210 -505 212 -74 -278 176 -345 -99 290 -22 260 487 -168 15 372 29 72 24 -326 278 39 -289 293
3231 293 195 -131 56 -125 -262 107 -397 -182 -51 -422 414 -52 -227 288 -125 -207 330 -286 -7 377 81
3252 81 -164 -17 -282 -149 -415 -314 273 28 26 106 -97 155 347 -57 232 277 -23 75 148 47 86 -464 25
3275 25 82 -73 -219 109 -304 -297 -348 -108 120 31 -113 177 -241 -37 344 -151 74 323 -345 46 117 -457
3297 -457 257 15 5 167 -287 -226 -43 -368 145 68 -449 -125 184 -234 37 -17 -163 -39 4 -113 342 -125
3319 -125 71 106 -323 13 -159 -369 207 17 -494 -14 -104 -59 246 -41 45 360 -282 241 169 -53 345 191
$$ packed form
3166F2q3l84L48J24k36j38J90K49K0o7o1L38l54R1K05l75J91J05o84O97j64m40
3188c66N43l16j46L40l01J38L79m59J91J8KJ84J6k46L89n46k2M74m07r8M75p47
3210e05P17k86k04M54n21K46L89l12K82K27o55J83L57l43M3m8l50O04k39l28N82
3231B93r8l26J87j81j37L69n04K15J31l71Q36m66j75N15m13q2N37o16K79L84k96
3252H1k45J47k65J33k66J01N87k45kQ0k03K52J92m04K89M5l00R8P3j01L9n50M89
3275B5N7j55j46L28m13Pn1K40K28q9j44K90m18K04L81m95K25K49o68L91P1n74
3297d57P14k42j0J62m54O1J83l25N13p7n17L24L09m18K71n4j46J24M3j17M55m67
3319a25J96L5m29L36j72k10N76j90n11M80r0M5L05k87Q6L15o42N23p2k22L98j54
$$ plain form
3341 191 -223 85 -325 -29 138 -182 -56 32 17 327 -54 -234 213 177 -457 290 120 52 224 -104 9
3362 9 231 -259 232 4 -277 224 3 -202 -109 -103 -271 202 -176 52 247 -202 81 76 -191 209 -113 28
3384 28 104 127 52 347 -116 -129 159 -205 300 -157 -167 491 -55 -91 644 201 107 251 -45 74 139 -160 248
3407 248 -274 -140 173 -248 -354 2 -430 -103 73 -260 208 52 -6 -3 126 -411 276 -127 -140 389 64
3428 64 147 209 -137 -75 286 -232 210 -246 -308 249 28 -229 52 -258 86 82 -114 216 293 -151 318 174 -304
3451 -304 361 -181 -120 140 -257 -202 115 -238 -2 -164 -240 484 148 -45 99 1 -30 302 -160 146 468 -148
3473 -148 219 -69 -268 143 176 -404 -36 50 -69 177 -57 -151 346 -287 319 125 7 263 357 -163 271
3494 271 -111 -106 181 -228 65 158 -178 -120 272 -484 -34 -61 -14 221 -86 -227 252 29 216 347 -269 169
$$ packed form
3341A91m14L08m10K96J67l20J26Q8j5L10l81j80M47l6o34P47j70o8J72l28J13
3362IK22m90M91k28k81N01k21k05R3Oj68M73l78K28J95m49K83nk67M00l22J41
3384B8P6K3p5K95m63j3K88l64N05m57j0O58n46l6P35m43r4J44k96J19O5k99M08
3407B48n22J34L13m21j06L56m32L27J76l33M68j56n8LJ29n37O87m03j3N29l25
3428F4Q3O2l46O2L61n18M42m56o2N57k21k57K81l10L44mj96L30P7m44M69j44m78
3451c04O65n42O1K60l97N5L17l53K36j62p6P24l36j93J44r8l1L32m62L06L22o16
3473a48L67k88j99M11L3n80L68Q6j19K46k34r4M97o33O06j94j18K56R4n20M34
3494B71l82NK87m09K93R3l36N8L92p56M50k7M7K35l07j41M79k23J87J31o16M38
$$ plain form
3516 169 -1 126 167 109 -311 -46 -130 -261 217 -166 -19 109 -277 -387 109 -171 253 5 50 247 -48
3537 -48 -79 178 -70 -331 316 -199 -10 9 -562 59 17 -130 77 -131 -113 274 -13 -149 404 -251 249 -15
3559 -15 -200 422 -23 -119 119 -156 -299 59 -121 -340 22 -33 -95 -108 -391 -25 21 -161 596 -4 -112 263
3581 263 78 -79 395 -131 106 13 -202 -87 14 -222 499 -296 -59 187 -171 117 400 -241 148 119 -49
3602 -49 66 286 -99 97 -170 214 270 -145 -40 161 -427 -161 -26 -361 317 -50 -307 91 -61 -285 12
3623 12 -31 63 402 -29 57 28 -262 308 -38 -273 -9 -151 -401 551 -73 285 -240 -281 112 -36 -282 240
3645 240 37 9 84 -138 -43 180 -107 -216 139 -331 99 -31 -124 -8 -150 -96 345 78 -25 211 -292 111
3667 111 295 -116 45 52 -170 261 145 -120 -127 117 452 252 -435 42 120 -189 251 -276 -84 72 15 -42
$$ packed form
3516A69j70J27M1n8m20K65q4j31M78l83J47J28l86j10M96k80M24k48M5J97k95
3537d8l1K57k48k61O47n15J89J9n71O21m2j47K07k08J8L87k87j36N53o55N00k64
3559a5j85O22m45r6K38k75j43L58j80k19L62n5o2j3k83L66M6j82P57o00j08L75
3581B63j85j57M74n26K37r3k15J15J01k36P21p95K37K46l58K88K83o41L89k9j68
3602d9J15K20l85J96k67L84N6m15J05K01n88K66J35l35O78l67k57L98j52k24K97
3623A2m3R4L39m31Q6k9k90N70l46k35K64j42k50R52o24L58n25m1L93j48k46N22
3645B40k03k8P5k22R5K23k87j09L55m70M30j30r3J16j42N4M41k67j03K36n03M03
3667A11J84m11J61Pk22M31j16k65pK44L35k00o87M77P8l09M40n27J92J56n7n7
$$ plain form
3689 -42 389 202 -11 175 -343 77 105 61 225 -111 -385 116 -81 -408 -78 -250 -191 -235 -160 -133 116 -309
3711 -309 60 -91 -71 73 38 142 227 79 -49 109 -186 40 -67 -202 66 -215 -243 120 35 -197 213 -284
3733 -284 -249 150 52 -162 50 -224 167 -108 -566 -15 -308 -112 56 218 -256 373 -267 13 -118 -99 -7
3754 -7 90 -152 194 312 -242 431 -56 -345 168 -259 130 -74 -346 43 169 -249 -327 137 -275 34 -6 43
3776 43 113 -141 144 11 -37 77 8 -104 -112 63 47 63 -112 -208 60 -189 9 20 -397 -256 -119 -209 332 -30
3800 -30 52 88 -72 243 85 -78 -146 -18 6 80 -190 -137 121 -105 -145 94 -192 -173 228 -216 -67 -8 -230
3823 -230 130 81 -419 311 -267 -126 -24 -228 -9 87 -169 -366 34 -310 56 -24 -351 3 -102 -66 232
3844 232 -191 -246 236 -144 344 300 207 252 -34 -92 344 -5 186 -55 -349 16 383 -43 -14 115 -353 231
$$ packed form
3689d2M31j87k13J86n18M20K8m4J64l36k74N01j97l27L30j72N9m4P5K7K49m25
3711c09L69j51K0J44l5J04Q5j48j28J58k95K26j07j35K68k81k8L63q5k32M10m97
3733b84L5L99r8k14K12k74L91k75m58N51k93J96J68J62m74O29o40K80j31J9R2
3754gR7k42L46J18n54O73m87k89N13m27L89k04k72L89J26m18p8M64m12L09m0M9
3776D3P0k54K85j33m8J14o9j12qJ75j6J6j75r6K68k49J98J1m17J41J37r0N41l62
3800c0Q2L6j60L15j58j63o8J28K4P4k70N3K58k26m0K39k86J9M01m44J49N9k22
3823b30L60m9n00P30n78J41J02k04K19R6k56j97M00l44L66q0l27L54j05L6K98
3844B32m23n5M82l80M88m4r3M5k86n8M36l49J91k41k94L65L67m26K9J29m68N84
$$ plain form
3866 231 214 -1 78 21 -120 129 27 -28 350 -61 21 130 -122 123 -155 -284 -13 -41 -286 47 -138 -177
3888 -177 -101 -2 105 64 -33 275 287 -261 129 72 157 320 15 -90 146 -298 -49 380 -241 115 -71 -129 234
3911 234 170 94 -45 18 -12 182 -13 269 -116 -73 107 32 -50 64 -169 -227 96 -411 102 -346 -311 24 -35
3934 -35 -145 142 -105 -174 88 29 93 -26 -5 252 41 -149 117 -28 -276 -259 96 -293 108 -138 -290 133
3956 133 -217 -17 124 -178 274 59 -127 250 307 -58 246 -187 -69 109 -383 -66 -185 -42 86 -65
3976 -65 -143 87 -23 -2 145 80 16 373 -206 37 277 -140 207 73 -80 41 -25 -196 -134 -131 -125 -183 -156 -145 -300
4001 -300 -66 63 71 -247 440 107 52 157 -126 -138 177 -43 164 -68 133 147 -162 -210 127 -74 91 462
4023 462 202 -40 235 126 -87 131 -15 55 72 -185 -2 -209 -59 -103 -76 -163 249 -298 107 -60 -84 4
$$ packed form
3866B31j7k15P9n7j41K49j02n5L78m11Q2J09k52K45k78j29K71k8k45L33j85l9
3888a77P6R9J07m1r7L08J2n48L90n7Q5J63l05j05K36m44K49M29o21L56j86n8L63
3911B34o4p6j39O3l0J94j95K82l85M3J80p5q2J14k33n8L23n07N13m48L5L35n9
3934c5j10K87k47o9K62n9O4j19K1K57k11j90K66j45k48J7L55l89M01k46j52M23
3956A33l50K00J41l02M52k15j86L77N7l65L04m33J18J78m92L17j19J43J28j51
3976f5p8K30j10K1J47o5o4L57n79K43K40m17L47j34j53J21o6j71O2LOn8K7J1j55
4001c00K34J29Ql18O87l33n5J05k83j2L15k20K07k32K01J4l09m8L37k01J65L71
4023D62k60k42K75j09k13K18j46P0J7k57J83k07J50m4K7q7M12n47M05j67k4Q8
$$ plain form
4045 4 81 -131 115 2 -57 351 -325 -103 -107 -31 -289 241 -216 178 204 -149 156 -202 13 175 104 -12 102
4068 102 -167 76 70 -76 99 78 18 142 11 -179 21 -63 -251 -42 -524 -222 29 14 132 161 4 -117
4090 -117 -63 -74 480 42 167 35 -73 77 285 -62 177 89 -68 43 -183 148 353 -152 203 9 -70
4111 -70 142 -166 -1 152 -28 -182 -1 216 117 250 -29 -91 30 -126 163 134 -192 12 -88 79 282
4132 282 -101 268 -98 95 -98 262 -100 132 27 -244 68 -81 5 219 112 -109 152 -60 136 55 -374
4153 -374 -129 -20 -17 308 -173 -25 430 144 60 272 -73 47 91 51 139 7 -281 61 -120 -119 -70 -66 -128 90
4177 90 -204 -98 284 -66 48 -186 100 111 -109 -5 255 -136 34 135 -1 2 -113 -171 -30 31 -50 27 -62
4200 -62 -261 214 -181 -100 213 -128 -43 30 176 222 8 -244 297 102 91 -16 37 -38 96 -314 -54 127 -429
$$ packed form
4045DP7k12K46j13n9M08o76K22mP6k58N30m57L94K6l53L05l58K15J62p1j16J14
4068A02k69K43oj46J75k1o0J24j31j90K00q4j88K09m82L02K51j5J18K9j57j21
4090a17N4j1N54m38J25j32j08J50K08l47K39q8j57J11k26L31K05n05L55j94p9
4111g0K12l08J65J53j80j54J81K17r9J33k79o2J21j56K89k9l26K04j00J67K03
4132B82l83L69l66J93j93L60l62K32j05k71L12j49Q6K14j07k21K61k12J96q1m29
4153c74K45J09LL25m81J48M55k86q4K12l45J20M4m0Q8j32k88L42j81JM9Mo2K18
4177I0k94J06L82l50J14k34K86J1k20J04K60l91J70J01j36Lj15n8J41O1q1P7q9
4200f2j99M75l95Q1L13l41Q5P3J46M6k14k52N41j95j1j07N3p5J34m10K60J81n56
$$ plain form
4223 -429 328 -30 -104 -38 24 173 94 -82 41 277 62 24 -103 -254 163 18 -78 51 146 -228 379 -307
4245 -307 232 33 -42 -61 220 -214 49 200 130 -108 -273 43 317 -281 -97 24 46 -23 37 -186 192 65
4267 65 -145 46 -182 56 162 -21 -29 1 -161 206 -257 -205 67 3 310 282 -311 -62 128 -216 314 360 -218
4290 -218 17 -12 -320 -85 8 151 296 -204 380 -130 -120 -154 195 -132 -50 21 -141 -193 -154 -297 50 -69 88
4313 88 162 -211 169 36 218 90 306 -133 45 -90 44 -215 4 70 106 129 -80 75 -119 -72 252 -231
4335 -231 -48 -36 -196 357 85 43 -129 137 -72 -73 -126 277 -9 -233 97 140 -236 -165 -48 -155 458 -271
4357 -271 118 351 -39 42 -148 -153 198 26 -157 116 -16 8 199 -60 235 197 -442 124 -81 -219 154 -127
4379 -127 -130 135 -99 -51 317 26 154 399 -221 115 160 -108 252 -152 2 58 19 -452 -191 1 26 -58 158
$$ packed form
4223d29P57l58p4O6O2J49p9j76J23K36k15l8j27j51M17j45r6J29R5l74O07o86
4245c07N39j99p5j9K81m34K63J51p0k38j65L16K74n98J84J21K2o9O0k23L78j27
4267F5k10J91k28K38J06j83qL0j62L67m63N2K72o4L07k8n93K49J90l44N30M6n78
4290b18K35k9l08K35R3J43J45n00N84n10J0l4L49l27Q2P1j62n2L9j43L47j19J57
4313H8P4l73L80j33J82j28K16m39J78j35J34k59K19O6L6K3k09J55j94M7L24m83
4335b31J83J2j60N53k72m2j72K66k09jn3M03k86k24L30M3l76P1J17j07O13p29
4357b71L89K33l90Q1j90nL51j72j83K73j32K4J91k59K95l8o39N66k05j38L73k81
4379a27lK65k34M8L68k91J28K45o20L36M5k68L60m04J54N6l9m71K61J92K5q4K16
$$ plain form
4402 158 -4 91 -67 57 -30 -121 181 -48 81 196 -109 -114 174 -124 65 112 -69 -79 -354 -40 262 -8
4424 -8 -88 221 72 -41 -166 -69 -2 -48 112 269 -29 -168 188 58 -275 271 -220 -30 -88 -337 -37 140
4446 140 -151 -157 -21 -253 337 45 -174 148 -20 -179 5 -260 166 150 -111 82 -264 155 113 -321 110
4467 110 206 -127 206 126 74 106 53 29 220 -88 42 56 -229 -183 37 -84 50 -92 -284 58 -19 -121 -18
4490 -18 19 -251 -50 -214 -23 140 59 59 86 -148 138 60 -113 33 -89 -42 23 -70 -66 58 -153 136 -32 -9
4514 -9 173 -93 7 259 -50 212 109 -438 52 237 -60 287 -96 17 287 -250 -122 -81 -56 133 7
4535 7 -147 69 30 -16 63 303 -47 108 87 105 89 -214 -233 5 -72 -195 322 -443 87 -173 -409 83 116 -194
4559 -194 12 37 36 140 55 153 -71 -254 100 39 -105 109 35 -203 -25 80 -97 119 83 -82 114 59 -49
$$ packed form
4402A58j62R5j58J24q7r1L02k29J29J15l05nK88k98J89M7j81j0k75L14L02k70
4424hq0L09j49j13j25R7O7m6J60J57k98j39L56j30l33N46m91J90n8k49L00J77
4446A40k91oJ36k32N90k92k19L22j68j59J84k65M26j6k61J93l46M19m2m34M31
4467A10R6l33L33q0n2L2n3k4J91l08J30J4k85M6K20j21J34j42j92L42p7j02J03
4490a8L7k70K01j64J91J63q1%K7k34K86p8j73J46j22M7O5r3MJ24k11K89j68K3
4514iJ82k66J00K52l09K62j03n47M90J85k97L47l83J13K70n37J28M1K5J89j26
4535Gj54K16l9m6P9K40l50J55k1J8j6l03j9K38p7j23N17p65N30k60k36M92L3l10
4559a94K06K5jJ04q5R8k24j83L54o1j44K14p4k38J78J05j77K16l6j65J96n5j08
$$ plain form
4582 -49 214 -141 9 -156 -87 99 -33 240 193 231 41 130 32 -149 82 -306 -41 -14 58 240 109 -17 -106
4605 -106 -118 223 67 -202 54 -40 -65 219 -75 -151 -28 -161 -169 321 -133 -77 61 -319 177 101 71 6 255
4628 255 28 -84 44 4 157 90 28 290 -32 1 -76 -201 -75 182 -130 232 -351 -89 3 -149 -234 -37
4650 -37 70 192 155 -342 253 91 54 -170 48 27 94 4 -150 185 -408 -107 85 -41 121 0 -136 30
4672 30 -221 50 206 -134 206 91 90 -6 124 -146 41 -291 -439 -82 -16 -209 7 -213 -6 -223 -108 -20
4694 -20 22 104 173 -213 -169 212 167 99 112 -269 -229 53 -292 -170 -60 -134 84 -251 -294 73 29 57 -49 -179
4718 -179 118 156 2 172 169 29 -45 -82 -47 54 -279 -40 133 46 -105 -61 -128 177 70 -232 188 -28 65
4741 65 301 296 -137 -115 -41 -203 -168 -271 -70 137 -101 -107 -203 264 224 -227 82 -84 -169 -118 -216 83 55 -107 -145
$$ packed form
4582d9K63l55J50j65O9J86j32K73m7L8j90Q9r8j81K31l88K65K7P2J82j31j26q9
4605a06j2L41j56k69K56r4k5K84k94p6J23j33qM90m54N6J38l80M96p6l0o5K49
4628B55k27j12J28m0J53o7o2K62l22L3p7j25J26K57l12L62n83K62R2j52q5J97
4650c7J07J22l7m97N95j62l7k24K18k1O7r0j54L35n93L01J92j26J62j21j36J66
4672C0k51K71J56l40L40j15jr6J30k70J87l32j48L57O6j93K16k20K07k17J15Q8
4694b0M2Q2O9l86M4L81m5o8J3l81M0K82l45J22J10p4K18l35m3L67m4K8j06j30
4718a79K97L8j54J70lj40p4l7L5J01l33K39J73q7j51M4o7L05j07l02M20k16R3
4741F5K36nm33K2P4j62L5j03K01K07k38or6M67m0m51L09j66q5N1r8K99k8j62l8
$$ plain form
4766 -145 80 2 2 263 -444 -207 185 -42 229 -141 -208 157 -92 26 187 -174 -57 348 -102 -131 230 31
4788 31 237 154 -137 146 -52 -134 252 159 -120 273 -74 97 289 -46 74 49 52 228 -7 -361 90 -93
4810 -93 19 205 187 -136 -131 -91 76 140 -365 70 -91 -184 154 81 -192 82 -137 33 387 -315 117 224 -124
4833 -124 283 74 176 145 106 -161 -213 -56 55 -139 -112 7 51 -274 10 71 313 -60 117 10 99 31 -172
4856 -172 204 66 64 107 164 254 -85 -113 -13 -27 -136 64 -45 -231 188 -59 275 16 263 217 24 181 38
4879 38 47 -194 -68 -70 -17 167 -311 124 94 -262 266 77 -105 79 27 112 194 -316 -48 155 -131 -275 58
4902 58 -328 -46 -56 -111 107 -19 -100 -183 -434 -111 -120 150 154 31 -513 245 -147 -117 82 -142 199 2 -50 70
4926 70 179 -170 -118 -206 -232 118 148 -117 118 -255 -113 104 25 -7 106 29 126 235 -4 286 -157 -157 167 -159
$$ packed form
4766a45K25p8%K61p07K37L92k27K71l70o7L65k49J18J61l61J17M05m50k9L61j99
4788C1K06q3k91K83j98q2L86r3k79L93l47J71J92l35J20k5LJ76k35l54M51j83
4810i3J12J86j8l23NM0J67O4n05M35j61r3L38p3k73K74k19J70L54p02M32J07l48
4833a24M07k09J02l1l9k67n2J57J11j94K7J19M4l25K84O1K42l73J77j07Q9o8k03
4856a72L76j38kM3N7R0l39k8J00j4j09K00j09j86M19k47L34k59K47m6j93J57j43
4879C8Rk41J26kN3J84m78M35l0l56N28j89j82J84n2Q5Q2n10K68K03k86j44L33
4902E8l86K82j0n5K18j26q1q3k51L23rK70Mj23n44P58l92L0J99k24L41j97n2J20
4926G0J09l49N2q8k6L50L0k65K35l73J42K17p9l2J13p7R7J09k39K90m43%L24l26
$$ plain form
4950 -159 -441 -3 115 -49 245 -156 52 -106 19 25 -291 -168 -127 -334 67 -108 126 195 -141 67 -118
4971 -118 98 7 263 -86 -224 134 -47 -23 63 -117 -23 49 -230 159 10 -93 291 -236 -219 -9 -179 98
4993 98 109 -365 -91 -34 -456 69 -130 87 -37 -2 -222 85 -232 -340 -48 -46 65 -126 -261 102 -104 29
5015 29 143 -1 56 192 7 -155 90 -16 196 102 -76 -157 -16 -176 5 11 41 128 -88 -58 233 -191 45
5038 45 -75 -65 -36 -52 -266 -125 172 -135 186 -26 -13 -41 90 -80 -50 -12 162 349 -42 260 -280 -297 -39
5061 -39 -13 341 9 5 -144 -28 -121 82 -44 -186 42 -309 3 295 -111 170 178 157 -98 -213 251 150 143
5084 143 239 193 63 -72 -185 23 223 -21 43 61 -151 -80 -228 -111 -245 279 57 -204 94 -68 -128 275
5106 275 -159 23 -19 -433 75 184 -224 -176 183 238 -4 -110 -90 -16 136 345 206 54 300 -103 -9 -66
$$ packed form
4950a59k82M38J18j64K94m01K08j58J25Ol16J23M1k07M01j75K34O9l36K08j85
4971a18K16r1K56l49j38L58j81K4Q6j80R4P2k79L89j49j03L84n27J7K10j70K77
4993I8J1m74K74N7m22N25j99K17j24L5k20L07l17j08K92KJ11j91j35L63k06J33
5015B9J14j44N7J36j85j62K45j06K12r4j78q1J41j60J81OL0Q7k16L0K91m24K36
5038D5j20J0K9j6k14J41K97l07L21k12J3k8J31j70L0L8J74J87l91L02n40j7K58
5061c9K6L54l32mj49J16r3K03j26j42K28l51L12K92m06K81Qk1k55j15M64j01p
5084A43R6m6j30j35j13K08K00k44O4J8k12P1j48J17j34N24k22k61K98j62o0M03
5106B75m34J82m2m14N08J09m08M8L59N5k42j06K0P4J52K09j39j52K46m03R4n7
$$ plain form
5128 -66 -162 55 156 -88 189 -42 -31 -21 52 83 78 -119 -57 154 67 -38 -161 -38 -35 119 -126 188 201 -64
5152 -64 33 -147 -56 427 19 -101 39 119 -8 40 -70 -42 -21 -292 -30 -113 -152 45 -168 -209 202 -190 -54
5175 -54 119 -376 -384 -97 -139 24 -136 -211 105 103 -18 189 69 97 302 -15 45 78 -19 31 -138 172 -90 -61
5199 -61 -23 -9 -131 -225 -50 74 -30 -96 -7 161 224 -56 -87 -171 108 -1 -24 144 95 -194 0 233 -199 50
5223 50 26 -84 -78 -75 10 102 8 262 182 -136 61 24 -3 377 13 -18 -40 -128 9 273 -195 313 5 41 -50 99
5249 99 -79 -31 88 -56 172 311 -13 119 -22 -94 -7 -106 307 101 -126 209 45 61 78 -103 -48 -202 -82
5272 -82 114 -80 101 235 -49 -309 288 284 149 58 22 185 -98 -232 -388 -98 -336 -228 -132 -196 275 -70
5294 -70 -145 314 -11 -151 140 -72 -24 -83 -195 204 87 -379 285 120 -37 -31 -77 -80 -302 88 -267 -138 -167
$$ packed form
5128f6r6K17J01k44K77k31J1J0P3L1nj97O2K11q7j05j23J23LJ54k45L14J3k65
5152f4R7j80R1M83m08j20J40Q0j27M8j10K8K1k71K62q3l9J97k13m1M11l92J36
5175e4J73m95qK87m2J63j60p5L16kj21K07j20K8K05l17O0L3r7N0j69L10k62K9
5199f1L8J4j22r4J75J24j04o6Q9J68O3k80l1q4K79j09k3J68m9k89J94K33m32K49
5223E0k4j10OLQ5R2r4K54q0l18J97l7k7L80l64l1k2q8J37K64m68N08l08L6r1J49
5249I9j78M8J19j44K28J39l24J32j41p2Q7r9M13k06k27L35j64J6J7j81N5j54J20
5272h2J96j94J81J34k84k60N97mj35r1l6J63k83j34j56K90k38J08R6o4M71l45
5294g0p5M59l25j40K91k12M8n9j12L99j17m66O64j65j57Om6lk22L90l55J29k9
$$ plain form
5317 -167 318 -208 -20 157 -88 95 7 164 400 186 -195 124 -85 -124 348 3 -354 31 2 -38 77
5338 77 -129 -81 313 62 81 -158 142 -16 84 -164 126 248 -142 13 -254 -84 -1 -62 -213 82 -27 -63
5360 -63 -191 -15 -18 -86 67 -37 321 95 205 -21 3 -150 -38 150 143 -247 264 -77 -308 -11 -180 52
5382 52 9 -318 57 385 15 -220 63 -10 140 -46 14 184 347 77 -169 -111 -156 -10 -176 158 13 -201
5404 -201 -83 -84 96 82 -131 116 -5 -20 -105 6 148 183 9 14 6 27 -97 98 75 58 -198 -153 111 -184 -166
5429 -166 84 -73 -100 160 -90 62 89 40 84 105 -25 28 208 74 -111 28 34 176 -183 94 20 -216 -122
5452 -122 -4 -189 -91 61 -276 166 -125 117 114 25 -10 -95 -122 -204 159 -273 169 29 -42 5 -40 -184 -81 -19
5476 -19 -117 19 -61 68 -6 -141 67 66 42 134 -95 49 77 -353 -176 16 -94 41 258 -197 154 -43 133
$$ packed form
5317a67M85n26J88J77k45J83q8J57K36k14l81L19k09l9M72l45l57L85k9m0J15
5338G7k06M8L94k51J9k39L00j58J00k48K90J22l90J55k67J70Q3o1j51K95j09l6
5360f3j28J76lo8J53j04L58k26J10k26K4j53J12J88pl90N11l41k31K97j69K32
5382E2m3l27L75L28l70k35K83p3J50j86O0J70J63k70k46N8m5J46j66L34j45k14
5404b01J18jJ80j4k13K47j21j5q5J11J42L5j74NqK1j24J95k3j7k56M5K64k95J8
5429a66K50j57k7K60k50J52K7m9M4K1j30N3J80j34j85J39OJ42l59K77p4k36R4
5452a22J18j85R8J52l37M42k91K42lq9l5q5k7q2L63m32M42j40p1M7m5j44J03O2
5476a9r8J36q0J29p4j35K08jk4R2k29J44K8m30J77J92j10J35K17m55L51j97J76
$$ plain form
5499 133 46 5 106 125 -128 -178 234 189 59 205 -158 210 -119 -276 -24 119 63 -223 123 -198 272 -279
5521 -279 -184 -94 153 -186 115 -53 101 2 2 -175 -215 -172 196 148 -178 224 -168 -92 -12 -123 -46 -124 -197 -101 -126
5546 -126 -7 -35 -116 214 10 -126 145 -56 -116 -58 -151 -216 -99 -177 -69 -152 -296 -14 75 48 -124 189 -76
5569 -76 275 -28 -42 167 35 42 -159 -265 -174 95 -4 -85 -219 -65 141 403 203 267 -109 -104 22 -66 -155 -16
5593 -16 -201 93 201 -284 -23 30 90 -161 -192 5 -86 -99 -119 27 144 193 133 -358 273 -100 -208 -130 -44 -47
5617 -47 7 -225 191 -69 97 -76 -298 27 196 89 -147 -15 103 -25 -155 -121 -138 125 75 -36 157 132
5639 132 71 -167 120 325 16 82 152 -139 -179 16 -259 71 -47 187 119 163 17 288 107 -147 20 376
5661 376 189 301 56 11 -103 -41 83 -212 -86 -18 -230 127 66 47 247 206 20 151 -42 20 -92 6 66
$$ packed form
5499A33q7m1J01J9k53n0M12m5j30J46l63L68l29j57K52J43n6k86L46l21M70n51
5521b79R5R0K47l39L01j68J54r9%j77m0M3L68m8l26M02l92P6Q0j11P7p8p3R6k5
5546a26J19k8q1L30k04j36K71k01o0N8r3o5J17p8J08q3j44K82Q9k7j72L13k65
5569g6L51l03j4K09j32Pk01j06R1K69r9q1j34J54K06K62k00O4l76NJ26q8q9J39
5593a6j85K94J08m85K61N3O0k51l1J97r1j3k0J46J17M9o0m91O31l73j08P8Q6l
5617d7N4k32M16k60J66j73k22L25J69j07k36J32J18j28j30L4j7K63n0j11J93k5
5639A32o1k38K87K05l09O6P0k91m0J95k75L30j18K34o8M4j46K71j81k54J67L56
5661C76j87J12k45m5j14O2J24k95J26O8k12L57o1j9K00m1j86J31j93O2j12R8O0
$$ plain form
5684 66 172 -121 97 129 -105 -91 -93 54 20 -238 -227 216 -67 -209 33 3 214 103 -240 190 125 -301 251
5707 251 167 7 -88 3 -138 26 -142 -88 -229 24 -95 26 -154 139 -222 -143 82 102 -62 57 23 171
5729 171 296 -54 254 22 -35 -37 -252 -33 205 -230 8 -195 -118 -78 -20 -134 -220 -50 -88 153 -126 -55 31
5752 31 -76 59 241 -333 -46 -113 63 53 -55 -120 240 16 218 158 -46 -111 112 51 -191 196 -17 -213
5774 -213 -88 -75 104 -11 197 86 -81 91 -111 -12 151 196 -9 190 221 -4 104 -51 127 84 -57 14
5796 14 110 -34 52 -15 5 -100 -9 -281 -194 36 174 200 -91 -305 -33 -54 -90 162 -166 -54 119 168 246 -200
5820 -200 -37 23 19 -109 -141 -185 -107 105 -212 -16 -61 104 -133 99 -129 247 -98 75 -56 50 -37 -77 63
5843 63 -175 -91 -72 -28 32 -141 -31 27 -40 14 -106 -11 -83 -244 96 -151 -145 252 162 -22 98 -69 107 130 -22
$$ packed form
5684F6J06k93K18L2k34J4kJ47l4k58J1M43k83j42K42l0K11j11l43M30o5m26N52
5707B51q4j60r5R1j41J64j68N4j41K53j19J21j80K93l61P9K25K0j64J19l4J48
5729A71J25l50L08k32n7kk15K19K38m35K38k03P7M0N8j14q6J70l8K41k79P1Q6
5752C1j07J35J82n74K87o7J76j0j08o5L60k24K02o0k04o5K23o1k42L87k13j96
5774b13J25J3J79j15K08j11j67J72k02R9J63M5k05J99L1k25J08j55J78m3j41P1
5796A4R6j44Q6o7K0j05R1k72Q7K30J38K6k91k14K72k1l6K52l28J12J73M9P8m46
5820b00J63O0mj28l2m4P8K12l17J96m5J65k37K32k28L76l45J73j31J06q7m0J40
5843F3k38Q4J9M4O0j73J10N8o7N4j20R5p2j61L40k47OL97r0j84J20j67J76K3j52
$$ plain form
5868 -22 139 204 -339 292 -142 -287 153 191 44 212 -3 111 -81 80 197 -48 101 -130 139 -238 206
5889 206 -3 53 -7 156 -30 53 -70 41 -113 61 63 -118 -80 107 137 -130 17 72 -77 -80 3 223 -68 -138
5913 -138 -161 -263 -6 -163 -237 -3 292 -68 30 -101 47 -83 238 -34 199 -136 98 1 -201 91 -240
5934 -240 -344 -203 96 -127 182 11 -48 225 -260 -196 -35 107 -40 367 14 91 -12 -3 -41 284 -51 8
5956 8 29 -50 233 266 164 141 -224 -13 -106 -125 47 137 200 143 -185 101 66 213 -48 84 69 -174 18 -81 154
5981 154 -422 24 58 139 -93 -24 -203 -171 197 -200 51 125 -56 -13 -5 -156 1 120 -152 468 -88 -57 -154
6004 -154 256 -17 160 -46 -176 116 -78 2 125 16 -101 36 225 -138 -112 -10 -22 -28 -54 5 11 121 -216
6027 -216 -154 256 11 284 -110 -70 357 -1 -122 4 -57 -88 -60 -27 -138 35 -81 13 149 -145 -63 185 -162
$$ packed form
5868b2J61O5n43O31m34j45M40L8j47J68k15J14j92J61J17k45J49k31K69l77M44
5889B06k09N6o0J63j86Q3j23J11j54J74Kj81L8J87L0k67J47N5j49lQ3K20k91p0
5913a38k3j02K57j57p4K34K95l60R8j31J48j30L21k72K33l35K34r7k02K92l31
5934b40j04J41K99k23L09j71n9K73m85O4J61J42j47M07l53P7j03Rl8L25l35N9
5956HK1p9K83L3j02k3l65K11r3j9J72R0O3n7l28K86l5J47k61J32j5k43J92r9K35
5981A54n76M46L4Q1k32O9j79L2L68l97K51P4j81M3Qj51J57J19k72O20n56L1r7
6004a54M10k73J77k06j30K92j94Q0J23j09j17J37J89l63K6J02j2ok6N9OJ10l37
6027b16O2M10k45K73l94M0M27l58j21J26o1l1K8L3j11J73j16R4J36k94Q2K48l47
$$ plain form
6050 -162 157 -14 -162 13 44 -179 -2 -84 91 128 9 204 184 -118 100 59 -138 -77 -22 -105 124 -258 36
6073 36 57 -148 6 -205 -197 57 -105 -78 158 153 40 252 52 -39 126 -14 47 74 -23 78 -129 -114 -114 -95 -167
6098 -167 228 43 -159 185 -91 172 129 -154 149 229 -78 109 -59 -58 117 111 -110 -56 -53 112 22 -87 -3 -24
6122 -24 -27 81 202 -51 -44 104 187 317 0 207 195 145 230 66 -91 12 -90 -239 125 -1 58 36 109 107 283
6147 283 -268 290 185 -13 -39 -156 218 -193 -213 -44 -138 98 72 149 -45 -37 -25 34 -150 -72 -31 -4 54 326
6171 326 143 -104 134 73 -42 -241 -196 -51 -158 -68 -133 14 -220 -17 -130 205 68 90 15 -258 11 -262
6193 -262 61 -111 -94 -22 -139 83 -97 40 -49 95 31 -11 53 -294 -98 -294 -35 -170 -78 148 35 97 -49
6216 -49 -43 -27 -45 -16 -192 -42 -104 -304 114 -28 196 -208 -56 170 109 -6 130 145 -108 -131 202 -58 3 244
$$ packed form
6050a62L19j71j48J75L1k23J77q2J75L7j19J95k0l02K18m1j97O1N5q3K29l82K94
6073C6K1k05J54k11QK54j62K7K36nj13K12k00r1J65j40O1K7r7J01k07J5%J9p2
6098a67L95j85k02L44k76K63m3k83L03Q0l07J87j68JJ75ok21N4LJ65r0j09Q4k1
6122b4lJ08J21k53PJ48Q3J30l17K07j2n0Q5j64j57J03j02j49L64j26N9k2P3kJ76
6147B83n51N58j05j98k6j17L74m11k0J69r4K36k6P7j94QJ2N9j84P8M1K7N8K72
6171C26j83k47K38o1j15j99M5J45j07R0o5J47k34K03j13L35j37K2p5k73K69k73
6193b62L23j72J7P2j17K22j80J37q9J44o4m2O4l47J96j96K59j35R2K26j13O2j46
6216d9OJ6j8K9j76J50o2k00M18j42K24m04J52K26o1j15J36J5k53k3L33k60O1K41
$$ plain form
6240 244 71 4 -218 207 33 -77 -33 453 76 131 35 103 -52 193 6 -78 -135 62 -212 -214 39 34 -32 64
6264 64 -66 29 -56 -244 32 -235 18 -10 53 40 128 -134 -240 127 -31 -93 241 -95 253 183 28 -9 -60 -5
6288 -5 50 -2 -43 230 108 -30 63 -62 -117 -297 52 136 -66 -24 131 -40 -211 14 2 21 35 214 163 -78
6312 -78 -3 127 -13 -33 41 -106 -158 66 2 120 97 11 9 61 7 112 301 17 -10 -174 126 101 -212 -168 151
6337 151 -158 -41 -206 11 190 -70 -277 97 183 -9 -209 40 315 -118 20 189 -75 199 12 -55 250
6358 250 11 83 -90 9 145 -84 -9 -160 11 141 -171 -32 483 -327 384 -78 -150 253 -389 -4 162
6379 162 11 109 -41 -170 -77 138 -189 6 -112 -13 -34 -149 223 257 -18 188 185 158 -10 338 -64 163 194
6402 194 9 64 -22 -36 -146 -292 -271 23 -251 -162 88 159 -176 -75 -229 52 -215 109 -161 151 -156 -129
$$ packed form
6240B44j73o7k22M25j74j10M4M86l77N5r6O8j55K45j87q4n7J97k74kK53no6R6
6264F4j30R5q5j88K76k67K53k8O3j3Q8k62j06L67j58o2L34l36L48p0j55l7n1N5
6288eN5n2m1K73j22j38R3j25n5j80L49Q4k02M2J55j71j71K25j2J9J4J79n1k41
6312g8P5J30j40k0P4j47n2K24o4J18k3q6kN2n4J05J89k84k7j64L00k5l13M4L19
6337A51l09J17j65K17J79k60k07L74Q6j92k00K49K75m33J38J69k64K74j87o7L05
6358B50k39P2j73R9J36k29P5j51J71J30l12J39N15q10P11m62p2M03o42L85J66
6379A62j51R8j50j29R3K15l27J95j18R9k1j15L72L4k75K06lk7j68L48m02K27L1
6402A94j85N5q6j4j10j46K1K94k74Q9K50P1l35J01j54K81k67L24k70L12l07K7
$$ plain form
6424 -129 -331 150 -184 -231 -142 -477 22 -85 -44 89 150 74 35 148 86 -163 -35 -27 443 -180 136 43 3 -48
6448 -48 118 39 -15 97 -134 126 -101 -29 -72 -131 -6 -30 44 -65 281 -89 105 -215 37 -208 -178 -189 229
6471 229 -57 -17 -33 39 52 -74 -78 16 -90 -204 87 41 -109 172 46 36 222 -70 24 110 125 -130 -22 -358
6495 -358 39 -83 71 55 50 -207 -39 131 37 -15 -102 31 200 119 -126 -33 -101 -50 95 -126 -106 114 -59 229
6519 229 -9 50 244 3 76 24 77 96 266 39 95 -18 -257 267 222 -140 -17 -7 353 216 -14 -88 39
6542 39 48 -10 -91 -64 -21 -92 -30 -19 20 15 -270 -5 14 -329 150 51 -51 -141 204 -55 83 -50 -229 92 117 2
6568 2 163 29 -36 144 -55 -59 87 172 4 -107 -129 151 -61 -96 135 -11 -53 132 -243 -79 -212 80 -6
6591 -6 248 -101 -139 89 -165 -11 114 153 120 -39 -126 41 -191 -140 -165 184 -123 39 14 18 172 37 147 -135
$$ packed form
6424a29k02M81l34m7Q9l35M99j07M1J33O1p6l9J13o2k49J28QM70o23L16r3m0n1
6448d8J66p9n4J12k31K60k27P2m3n9J25k4P4j09L46l70J94l20K52k45L0j1M18
6471B29k86M0j6P2J3j26mR4j06j14K91m6j50K81j26j0J86k92R4Q6J5k55J08l36
6495c58L97j22J54j6nk57J68J70r4n2q7J33J69q1k45R3o8N1J45k21K0K20j73K88
6519B29k38N9J94k41P3n2N3J9J70k27N6j13k39N24m5l62J23J0L60j37k30p4J27
6542C9Rn8q1K7M3p1O2J1L9nk85K65J9l43M79r9j02r0L45k59J38j33j79L21K5j15
6568BJ61j34o5J80j99mJ46Q5j68j11k2K80k12l5K31j46m2J85l75J64j33K92q6
6591fK54l49l8K28k54J54J25L9l3j59q7J67k32N1k5L49l07J62k5MJ54j35J10k82
$$ plain form
6615 -135 132 -94 -34 30 122 -179 214 66 4 257 -140 -348 -90 -147 55 146 106 -35 -57 -273 -81 44 -40
6638 -40 -10 24 105 -63 -91 -99 78 -85 -124 124 73 116 373 -123 87 32 -105 116 14 7 -15 176 75 -25 51
6663 51 -95 -180 -53 -62 3 -32 -191 17 -44 -57 -234 -39 -16 49 144 20 -130 149 95 35 -97 -3 -57 120 241
6688 241 -102 54 22 131 -114 16 -46 -137 -8 -214 -62 190 49 -165 43 -173 -59 56 -32 127 292
6709 292 5 -122 -169 -62 149 35 -41 -159 63 -168 13 -240 -234 289 -212 33 -76 133 31 196 -136
6730 -136 121 68 116 346 26 -11 -122 -84 -106 55 -54 182 -209 -74 86 129 -3 41 -65 60 -116 -28 -22
6753 -22 354 -121 -146 7 -180 232 -45 140 -136 -142 -115 33 89 -83 131 -119 202 -26 -47 128 69 219 46
6776 46 -59 186 -171 -74 47 -46 -251 -46 82 -64 104 89 -395 29 259 -162 -90 7 3 125 47 -7 -74 10
$$ packed form
6615a35K67k26O0O4R2l01L93j48o2K53l97k08K58n7K02R1m0j41k2k16J92J25q4
6638d0L0L4Q1j68k8qJ77j63l9K48n1M3K57m96K10n5j37K21j02pk2J91j01j00P6
6663E1j46q5J27rO5l5j59K08o1j3j77J95K3O5R5j24j50K79n4o0j32R4n4J77J21
6688B41l43J56l2J09k45J30o2r1J29k06J52K52j41k14K08k16J14J15q8J59J65
6709B92k87j27m7J07K11j14p6j18K22k31J81k53ON23n01K45j09K09j02J65l32
6730a36K57n3M8K30l20l7j11L8k2J61j09K36l91J35J60M3j32M4j06J25j76Q8O
6753b2L76m75k5J53j87M12k77J85k76oK7J48N6j72K14k50L21k28k1J75n9J50j73
6776D6j05K45l57R7J21r3k05K05J28j46J68j5m84M24K30m21P2R7mJ22p8n4o7Q4
$$ plain form
6800 10 -72 -104 200 -45 -64 119 -86 -125 -25 -196 44 -218 137 202 73 -291 -314 128 -75 -185 101 -3
6822 -3 -167 342 -113 -113 63 -93 -228 -49 49 -203 48 -31 -102 -215 -163 -11 -83 0 -31 88 60 88 -125 187
6846 187 242 62 253 -69 -196 -116 -63 -241 79 -300 37 10 -356 -50 -197 94 -29 44 193 -10 -120 73
6868 73 273 -4 28 42 5 -137 -15 70 51 -161 9 69 -47 -250 54 -66 -208 90 47 109 -137 268 184
6891 184 -142 125 -11 23 118 -57 -147 237 -53 210 -153 -72 7 25 147 -80 77 87 274 -10 35 210 50
6914 50 -108 -52 30 -114 87 -71 -24 31 63 -50 149 10 -121 70 108 -177 -110 145 -22 12 -161 -15 -188
6937 -188 1 109 20 -78 195 -82 194 75 136 126 176 21 -18 -10 -414 136 -105 -197 132 -49 -7 11 -96 -40
6961 -40 -232 -46 86 51 220 -18 26 -169 -114 78 -93 261 112 -23 -161 98 -267 -114 43 -97 -84 -88
$$ packed form
6800A0q2l2L04k45j9J83k05l9J00j71K40k62L55O5j29l64k3M42k03j10K86j04
6822cj64N09m55%J76j56j35J79R8k52K51p9p1j13N2J52p2Q3l1J19k8K8k13L12
6846A87N5j80J91l22j27Q0N3j78L20l79L37k7l66L06j47K91j23P3J49k03j10J93
6868G3K00k77L2J4l7j42J22Q5j9k12J70O0j16k03L04j20j42K98m3O2k46M05q4
6891A84l26K67j36L4R5j75r0L84k90K63l63Q1P9J8J22k27J57J0J87k84M5J75j60
6914E0j58N6Q2j44K01j58M7N5L2j13J99j39j31J91L8k85O7K55j67L4j73J46j73
6937a88J89J08q9r8K73k77K76j19O1j0N0j55l9Qm04N50k41r2L29j81M2J8j07N6
6961d0j92J86J32l5J69k38M4j95N5J92j71L54j49j35j38K59l65J53J57j40J3m
$$ plain form
6983 -88 164 85 170 35 101 272 131 -10 -47 8 65 12 -220 133 3 -244 163 41 -73 -208 171 15 176
7006 176 -156 49 43 37 82 -30 45 17 90 -119 139 -72 -194 -49 -202 -4 107 -65 123 -78 14 237 -36
7029 -36 -98 78 -98 -334 -36 -19 112 22 -65 75 152 270 -75 -173 -72 108 -204 -36 59 -68 28 129 207
7052 207 177 -378 -130 47 -188 267 -295 -10 -1 -60 -57 2 -49 47 62 55 -196 58 -387 -149 155 -65 -19 83
7076 83 -5 131 -18 -118 -19 -150 -133 -64 -86 -267 -135 60 -283 -209 15 54 136 -228 303 -294 8 -168 205
7099 205 125 109 33 -257 -111 -41 -9 176 -219 15 -154 -81 -117 -119 80 79 11 206 -57 -39 6 -55 -322 301 34
7124 34 51 58 -88 -67 -162 49 76 27 120 -194 -122 -54 -89 141 142 143 104 97 375 10 106 214 152 -37 74 -170 43
7151 43 74 49 -39 102 93 -13 -195 181 78 36 202 181 16 108 115 -211 7 32 -47 7 -81 17 -221 25 31 262
$$ packed form
6983h8K52p9Q5j35O6J71j41j41l7N5N7n3k32L53j30k47M07j22j14j35L79j56J61
7006A76l32K05ooM5j12P5k8P3k09K58k11j22J45j53J98J11j72J88k01R2K23k73
7029c6o2J76j76k36K98J7J31r0q7J40P7J18l45r8J01J80l12J68R5j27R6J01P8
7052B07l0n55K48J77k35M55n62K85Rn9LN9n1R6J5pk51K54m45K38L04k20M6J02
7076H3q8J36j49j00R9j31J7O9k2j81J32J95l43P4K24L9Q2l64N31n97L02j76L73
7099B05q0j6p6k90J46P0L2J85l95K34j69P3l6kJ99jo8J95k63J8M5o1k67O23k67
7124C4J7Pj46K1r5K11K7m9R3l14P2O8l5K30JJl9pK78l65R6J08o2j89J11k44K13
7151D3L1k5q8J41rj06j82L76j03m2J66k1j65R2Pl26K18K5p9N4q8R8k38K46OK31
$$ plain form
7177 262 -103 -85 -40 -68 60 -220 -133 -41 -114 -100 21 40 24 -131 -27 -193 -149 -142 352 134 71 128 163 -186 100
7202 100 -88 198 -275 -53 -123 -39 -148 29 -70 24 -62 -218 195 32 105 56 -108 -241 147 121 -52 7 -99
7225 -99 49 24 -87 -153 -110 -74 94 -178 -61 15 84 131 230 63 150 123 122 235 -41 -128 148 219 142 -43 50 56
7251 56 102 -13 -47 70 -182 120 44 300 -136 24 40 -22 16 -241 -18 -116 -39 59 111 105 115 -53 -81 29 -18
7276 -18 -59 132 44 1 26 -177 65 12 20 70 -50 363 250 221 -72 60 -70 20 101 169 226 -257 -19 -97 194
7301 194 -11 -48 -6 11 -69 37 91 -43 109 63 -50 76 35 21 100 75 138 -37 -245 107 103 -43 109 13 106
7326 106 138 27 99 -183 72 116 261 225 -22 -219 -76 16 -243 -6 197 44 70 329 140 -11 5 -5 -376
7349 -376 331 114 -50 -70 19 131 100 -25 53 -279 -83 -67 4 68 -61 -207 233 -248 234 -181 -144 -49 -190
$$ packed form
7177B62l65J8M5k8J28k80Q7R2p3J4J21J9j6j55J04j66M4PM94k18o3N7L5l49K86
7202A00j88K86m73K22p0Q4j09J77r9R4q6j56M13j63P3m9j64j33L88k6j73N9j06
7225i9J48k5j11o6M3L6J68k72J17P6O9M7R9j67Q7k7jJ13k76q7K76P1p7j85R3O
7251E6M6j15l4J17k52L02p6K56m36J60J6o2L8k57K23r8P7R8N2oJ0j68k8J10m7
7276a8m1J91q8m3K5k03K42n3QN0j20M13j13k9k93J32j30R0Q1O8N7m83K38p8K91
7301A94k05l7M2J7q0J06N4j34J52m6j13J26m1j4P9k5O3j75k08L52mj46J52r6R3
7326A06L2j11P2k82K55M4J45l6k47j97J43R2k59K37K03j53K6K59j89j51J6j0l71
7349c76P07k17j64k0Q9J12l1j25P8l32J96J6P1O4j29j46M40m81M82m15L7R5j41
$$ plain form
7372 -190 -72 227 226 -165 88 66 -64 340 -65 33 -62 -39 -210 132 -28 -77 -108 38 12 -139 -15 -242 87
7395 87 -229 -87 -9 -99 218 126 156 0 -46 25 37 -130 -138 -112 322 -72 -13 32 136 -129 140 -45 -37 105 74
7420 74 -123 -7 -106 -99 92 -112 -147 112 -11 -9 100 -11 -154 66 130 -111 156 53 -112 97 18 -26 220
7443 220 -3 232 -57 146 12 83 97 -299 246 56 21 -165 -71 -7 78 101 -217 -162 76 -55 152 325 159
7466 159 142 -104 82 -15 27 -154 -20 140 -66 -15 -168 -130 267 -115 39 -143 189 48 -182 101 38 -229
7488 -229 20 -69 -184 62 257 -65 20 -74 -105 179 187 -120 120 45 123 66 53 68 -68 -125 129 295 8 -178
7512 -178 75 134 -157 224 124 61 -100 -113 158 -95 -12 -33 -146 173 16 -9 119 33 -182 160 -371 213
7534 213 -83 198 -344 255 133 -113 -291 -121 200 140 112 118 116 40 35 -63 134 37 262 91 31 124 111 72 120
$$ packed form
7372a90J18K99jl91K53k2j30M04m05R8r5K3j71L42j60m9l1J46k6j51J24k27L29
7395H7l16J42P8r0L17r2L0j56m6P1J2j67qK6M34l94N9M5J04k65K69j85QJ42l1
7420G4j97J16r9PJ91k04l5K59j23KJ09j11j43K20O4k41K67j03j65K09p9m4K46
7443B20k23K35k89K03j34P1J4l96N45j90l5j86R4O4Q5K3l18N5K38j31K07J73j66
7466A59j7k46J86r7M2j81J34J60k06N1j53L8L97l82J54j82L32j41k30K83o3k67
7488b29K49q9j15K46J95l22Q5r4l1K84Ql07K40p5P8n7j3J5j36n7K54J66k87j86
7512a78K53N9k91L81j00o3j61j3K71k53Q3k1j13L19j57k5J28q6k15L42n31N84
7534B13k96K81n42N99j22k46j78J70L21o0k8Okp6nr8J97r7K25j71o0R3j3l9M8
$$ plain form
7559 120 56 2 27 -96 -123 41 -60 -150 -26 -1 117 30 74 138 90 21 -39 31 5 94 83 -5 -5 20 -175 39 209
7586 209 130 301 88 -152 80 -58 63 -28 -156 320 72 -142 184 190 -146 -71 -216 130 -208 -19 116 28
7608 28 -57 -47 87 -134 159 78 88 -105 47 8 -14 -18 -40 52 32 -107 69 249 134 -43 -91 -155 -22 158 -30
7633 -30 -111 -218 -214 -30 193 110 -121 206 -186 237 -55 -119 -218 128 -92 -141 65 -127 -123 13 -80 43 -84 -326
7657 -326 -106 -128 -15 13 80 92 110 -171 324 114 113 401 185 -82 167 -158 -91 -49 247 -183 -112 -56 -92 -41
7681 -41 23 -74 272 49 217 -204 -83 -20 -34 -5 -2 62 -126 84 -389 147 -58 -20 88 105 45 -35 -175 109
7705 109 166 -38 11 227 -149 216 -192 124 9 -178 -112 -63 -166 -97 42 -117 -198 192 -89 -23 -14 36 210
7728 210 22 521 -82 300 236 202 39 -100 86 -224 -86 -39 99 -225 -181 52 -207 -69 200 -12 23 -33
$$ packed form
7559A20o4n4K5j23k7J64j01r0J24K5J18q7M4O4m8o9o0P0k6Q9j1q8%K5j95K14J70
7586B09p9J71k13k40K32j38J21r1j28M76k48k14L26Ol36P5j45L46l38J89J35q8
7608B8q5J0J34k21K93q1J0j93J52l9k2mk2R2k0j39J76J80j15j77m8o4J33J80j88
7633c0q1j07MJ84K23q3k31L27l92M23k92o4r9L46k20m9K06j92MJ36r3J23j27k42
7657c26K20k2J13K8O7J2J8k81M95k10jK88k16k67K49l25O7M2K96m30P1N6l6N1
7681d1O4r7L46k23J68m21J21O3j4K9LO4j88K10m73N36k05L8J08J7o0q0j40K84
7705A09N7k04M9K16l76L65m08L16j15j87O6M9j03O9J39j59q1L90k81O6RN0J74
7728B10j88M99o03L82o4l4j63j39J86l10J38M7J38l24M4K33k59J38K69k12L5n6
$$ plain form
7750 -33 207 -11 -48 -41 -53 -118 137 -71 -277 -247 -20 50 32 -31 -157 139 -97 53 -20 39 -217 163 -35 27
7774 27 107 8 -16 132 -194 167 148 -150 -256 210 -132 -240 -89 5 182 -87 -3 48 -28 -14 -74 77 192 28
7798 28 -130 -17 -77 -30 124 131 -14 -170 36 -71 -166 -4 -75 88 -99 9 283 228 -363 -117 64 59 -162
7821 -162 -72 118 -98 -127 221 -64 -52 99 -82 150 -122 -123 62 -17 32 306 -52 158 28 233 -32 -172
7843 -172 172 84 -136 -78 94 -106 84 227 7 -96 -128 21 69 45 6 311 66 111 77 -126 -113 -66 23 -77
7867 -77 -25 245 16 -297 -129 126 77 -170 -93 -40 -185 -48 75 -22 113 28 -141 5 135 220 -106 243 54
7890 54 113 -193 104 -90 -164 1 61 103 -164 9 -99 198 202 94 99 -97 117 -99 -58 49 -113 -194 -38 -57
7914 -57 217 66 122 25 -104 -179 -81 -288 41 -79 -144 -25 -158 70 -160 -36 -175 -50 33 -14 -4 32 79 33
$$ packed form
7750c3K40k18l7Pj2o5K55k08k06L0K27P0j8o3j26K96k36J50p3N9k56L80j98O2
7774B7Q0r9k4J48l26L61j9k98j06M66l42j08J51R4J77k69Q4N1p6J4o0J51J15j64
7798B8j58J13o0M7J54Pj45j56K06j07r5J62p1J63j87J08K74n5n91K46J81nk21
7821a62R0J90k16k9L48k85J2J51j81K32k72jJ85p9M9K74l58K10j30K05k65j40
7843a72L44q8k20N8J72k00J90J43k20j03l2J49M8k4l9L05k45M5l4k03J3M7Q9j00
7867g7N2K70k29l13J68K55m9k47P7N3j45J37J23r7J35q5j69J46J30Q5l26L49j89
7890E4N9l06K97j94p4J65O0M2k67J73j08K97Mj08Nj96K14k16M1J07j62q1J56j9
7914e7K74j51N6r7j29p5R8k07L29j20o5J19j33K28k30J24j39J25Q3m7J0L6M7m6
$$ plain form
7938 33 231 154 -43 -83 -79 53 -111 -28 -54 -38 148 14 -14 177 300 -26 13 75 44 -12 21 137 -138 -282 61
7963 61 -64 186 179 -385 -106 164 101 47 70 -131 393 -123 -33 150 11 -98 40 156 -68 -106 248 157 -69
7986 -69 141 -193 88 125 140 118 27 -130 182 74 30 -47 69 6 218 50 50 -82 147 -85 -295 14 95 90
8010 90 3 113 19 128 125 196 -48 -37 167 17 55 240 39 93 52 33 -106 40 50 -4 -13 225 56 -42 -88 81
8036 81 40 -82 -22 -219 -329 192 -102 175 87 -234 -223 -113 -4 110 -260 -164 130 -113 99 33 138 103 -7
8059 -7 303 2 36 7 169 -164 -165 226 -5 115 156 -116 72 -217 -46 96 -65 10 221 -64 209 39 124
8082 124 -92 -67 -216 -97 -230 -129 66 61 8 -204 -59 -186 -71 85 -12 255 118 342 -70 -112 -58 -48 -59
8105 -59 19 138 49 -172 -111 76 101 -85 64 51 -291 64 140 72 -15 -2 134 72 -59 -39 -142 -130 76 4 95
$$ packed form
7938C3J98p7j97m0MJ32j64Q3k6J6J86j34k8J91J23l26L9O2l1n6L3J16k75j44L43
7963F1j25K50pn64K79K70o3n4K3k01N24n16R0J83j39j09J38J16k24l8L54r1k26
7986f9K10l34K81L7J5k2r1j57L12j08m4p7J16o3K12j68%j32K29k32k10L09Q1n
8010I0q7J10r4J09lP1k44J1K04j50L8J85k01N4m1j9j39J46J0n4rK38j69r8m6J69
8036H1m1j22O0j97j10N21k94K77q8l21J1J10J09J14l70R6K94k43K12o6J05l5j10
8059gL10l01L4k9J62l33jL91k31J20M1k72J88k89J71J42j61P5K11k85K73j70Q5
8082A24k16K5j49J19j33J01J95nn3k12J45j27J15J56r7K67j37K24m12m2N4J0j1
8105e9P8J19q9k21O1J87K5j86J49j3l42L55P6o8q7J3J36o2j31K0j03J2K06p2R1
$$ plain form
8130 95 236 -66 24 178 -94 -195 -72 10 139 -225 59 74 73 -214 316 178 116 -80 138 125 89 155 201 58
8154 58 55 -107 -68 -26 147 -29 115 16 183 94 8 -233 300 255 -96 0 131 -44 132 -50 243 -12 -98 -39
8178 -39 7 -5 110 -69 83 -105 -154 -115 -100 -107 -169 254 -76
$$ packed form
8130I5J41l02R0J54k72j01J23Q2J29l64K84J5jk87N30j38o2j96K18j3l6O6M6j43
8154E8lj62L9M2J73j76J44r9J67q9q6k41N33m5l51R6J31j75J76j82K93k55q6N9
8178c9M6j2J15j79J52j88m9L9J5po2M23l30
8191g6
$$ Imaginary data points
##PAGE= N=2
##DATA TABLE= (X++(I..I)), XYDATA
$$ plain form
0 0 0 0 0 0 0 0 0 0 0 0 0 -8 8 -8 8 -8 16 -16 24 -24 32 -40 48 -56 64 -72 84 -96 112 -129 148 -169 192
33 192 -217 244 -276 310 -348 389 -433 484 -535 595 -658 727 -805 888 -978 1079 -1188 1309
51 1309 -1442 1591 -1753 1937 -2144 2380 -2650 2962 -3331 3772 -4312 4989 -5866 7057 -8767
66 -8767 11445 -16261 27588 -112541 24944 185881 -146910 -77506 126931 15004 -91096
77 -91096 53586 45075 -51182 3539 59511 -37618 -19325 51709 -13416 -32964 40352 -6586
89 -6586 -26738 19784 -8143 -18160 15418 -16096 -9558 20882 -5272 -12788 12792 7011 -6887
102 -6887 -5667 12098 7205 -6561 10472 3858 -7708 21275 -4062 -26748 22582 5136 -37310
115 -37310 5300 11109 -23491 -2568 14486 -3652 -9212 9836 15332 -13341 -888 27256 -12706
$$ packed form
0@%%%%%%%%%%%qJ6j6J6j6K4l2M0m8N6p2Q8j04J20j36J56j80K08k41K77l17L61
33A92m09M61n20N86o58P37q22R17j019J130j253J385j532J693j866K057k267K497
51A309k751L033l344L690m081M524n030N612o293P103q084R301j0855J2923j5824
66h767K0212k7706M3849j40129J37485J60937l32791O9404K04437j11927j06100
77i1096J44682q511r6257N4721N5972r7129J8293P1034o5125j9548P3316m6938
89f586k0152M6522k7927j0017L3578l1514O538L0440k6154p516K5580n781j3898
102f887J220J7765m893j3766J7033o614j1566K8983k5337k2686M9330j7446m2446
115c7310M2610N809l4600K0923J7054j8138n560J9048N496k8673J2453K8144l9962
$$ plain form
128 -12706 -10089 32902 -10217 -21705 26732 -3823 -23255 14119 -2570 -19361 8939 4419
140 4419 -18847 -379 21438 -9423 -18416 30953 7731 -36855 23964 27142 -38139 8554 34055
153 34055 -28635 -5171 27349 -18418 -15431 18564 -3866 -20947 4678 10820 -16183 -5202
165 -5202 19801 -8171 -7949 22016 -6227 -7914 23232 -8663 -9585 24017 -7287 -14667 17499
178 17499 -3182 -15205 4816 330 -8827 -2696 3059 -2561 -6110 7848 1663 -9171 14787
191 14787 6046 -13749 14745 7786 -16033 12117 7147 -14965 7623 5189 -13858 -842 3283
204 3283 -6128 -7935 932 5786 -10385 -3537 15550 -7234 -6997 19162 -1642 -7864 15071 931
218 931 -5832 6574 12 -2950 -627 -499 -77 -8970 -1850 4290 -12639 -1041 9930 -10901 916
$$ packed form
128a2706K617M2991m3119j1488M8437l0555j9432L7374j6689j6791K8300m520
140D419k3266J8468K1817l0861q993M9369k3222m4586O0819L178o5281M6693K5501
153C4055o2690K3464L2520m5767K987L3995k2430j7081K5625O142k7003J0981
165e202K5003k7972K22K9965k8243j687L1146l1895r22L3602l1304p380L2166
178A7499k0681j2023K0021m486r157O131N755n620l549J3958o185j0834K3958
191A4787q741j9795K8494o959k3819K8150m970k2112K2588k434j9047J3016M125
204C283r411j807Q867M854j6171O848J9087k2784K37K6159k0804o222K2935j4140
218I31o763J2406o562k962K323J28M22q893P120O140j6929J1598J0971k0831J1817
$$ plain form
233 916 11692 -7181 2097 10017 -2585 3757 5000 -467 3469 -2433 -133 3331 -6727 -866
247 -866 875 -6971 -210 -3436 -4672 5013 -6556 -1647 12659 -7147 -3020 15937 -3902 -3642
261 -3642 12264 -895 -2654 5577 -19 -3096 -3796 1933 418 -10861 1274 2963 -12356 2151
275 2151 4910 -9789 5944 6305 -6652 7301 5362 -4027 6669 3243 -1347 3004 -1246 1274
289 1274 -640 -6281 2653 -3030 -7660 4054 -3672 -5364 4291 -4571 -853 6671 -4035 3513 7009
304 7009 -4303 5101 4486 -4826 4999 1578 -3349 2212 -3697 -1441 708 -7657 520 1643 -8075
319 -8075 1785 1409 -3912 4529 -487 -752 8036 -902 396 6475 -2576 2792 3115 -5129 3681 -89
335 -89 -6072 2702 -4230 -6009 4086 -4772 -4122 4867 -2821 -1232 3104 386 3996 -42 656 7806
$$ packed form
233I16J0776j8873R278P920j2602O342J243n467L936n902K300L464j0058N861
247h66J741p846O761l226j236R685j1569M909J4306j9806M127J8957j9839K60
261c642J5906j3159j759Q231n596l077p00N729j515j1279J2135J689j5319J4507
275B151K759j4699J5733L61j2957J3953j939r389J0696l426m590M351m250K520
289A274j914n641Q934n683m630J1714p726j692R655q862L718P524j0706P548L496
304G009j1312R404o15r312R825l421m927N561n909K256K149q365Q177J123r718
319h075R860l76n321Q441n016k65Q788q938J298O079r051N368L23q244Q810l770
335h9n983Q774o932j779J0095q858O50Q989p688J589M336k718L610m038O98P150
$$ plain form
351 7806 -3320 -1850 7511 -4498 -1813 5570 -7094 -1674 3134 -7120 -1061 497 -4094 1702
365 1702 -1295 -930 4440 -2259 2123 5712 -2616 4026 4732 -3639 4283 710 -4936 3836 -2623 -4532
381 -4532 2320 -4791 -2632 1016 -5848 1151 2678 -4194 3589 1860 -1543 6187 -63 -427 7127
396 7127 -1832 -549 5156 -4142 -912 2133 -4563 -1016 -1030 -2884 -197 -4786 612 2945 -7095
411 -7095 3582 6825 -6864 4989 7467 -6321 4486 6772 -5339 2355 3623 -4001 -1705 -404
425 -404 -1312 -4306 -2841 3473 -5310 -5468 7786 -3846 -5367 10650 -1759 -4360 11021 -517
439 -517 -3367 8824 526 -2817 2965 286 -1495 -3052 -1224 716 -6325 -668 1855 -6989 1990
454 1990 3546 -7501 4282 5070 -5863 5344 5610 -3890 3814 3074 -1473 1578 -210 338 -1008
$$ packed form
351G806j1126J470R361j2009K685P383j2664N420M808j0254O059J558m591N796
365A702k997L65N370o699M382L589q328O642P06q371P922l573n646Q772o459j909
381d532O852p111K159L648o864O999J527o872P783j729l403P730o250l64P554
396G127q959J283N705r298L230L045o696L547j4j854K687m589N398K333j0040
411g095J0677L243j3689J1853K478j3788J0807K286j2111P694J268p624K296J301
425d04r08k994J465O314q783j58J3254j1632j521J6017j2409k601J5381j1538
439e17k850J2191q298l343N782k679j781j557J828J940p041N657K523q844Q979
454A990J556j1047J1783P88j0933J1207K66r500P704p40m547L051j788N48j346
$$ plain form
469 -1008 -4063 1842 -3069 -5258 4311 -4237 -5727 6738 -3268 -4188 8023 -843 -2536 7154 1148
484 1148 -915 3324 2881 253 -3255 2529 2439 -9182 1105 4723 -11391 -149 6363 -10426 -561
499 -561 7915 -6362 -274 6851 -1349 -572 4426 3050 -1129 260 5897 -2952 -4146 7022 -4347
514 -4347 -7621 7992 -4079 -9579 8215 -2199 -8722 6728 489 -4951 4896 2645 -1302 2076
528 2076 3756 1229 -1832 4323 2653 -6829 3181 2958 -10539 1878 4040 -10833 1307 4511
542 4511 -9099 1588 5663 -5116 795 5525 107 -1218 2720 5296 -2339 -1637 8133 -3098
556 -3098 -5940 7690 -3287 -7693 5780 -2468 -7116 4335 -681 -4031 2184 1057 344 -141 2390
571 2390 4250 -2581 2094 5911 -4861 1280 6231 -6657 -117 4555 -7401 -1605 3024 -5756
$$ packed form
469a008l055N905m911k189R569q548j490J2465j0006r20J2211q866j693R690o006
484A148k063M239m43k628l508N784r0j1621J0287L618j6114J1242O512j6789R865
499e61Q476j4277O088P125q200P77M998j376m179J389N637q849j194J1168j1369
514d347l274J5613j2071n500J7794j0414o523J5450o239n440R847k251l947L378
528B076J680k527l061O155j670r482J0010k23j3497J2417K162j4873J2140L204
542D511j3610J0687M075j0779N911M730n418j325L938K576p635P02R770j1231
556c098k842J3630j0977m406J3473q248m648J1451n016l350O215j127p13m85K531
571B390J860o831M675L817j0772O141M951j2888O540M672j1956N796M629q780
$$ plain form
585 -5756 -1510 1751 -2188 -1070 131 1634 367 -528 5683 52 -1978 8107 -1216 -5185 8607
600 8607 -1617 -7227 6817 -1915 -8266 3439 -480 -5999 454 1578 -1590 -1901 3274 2466 -4623
615 -4623 3754 6497 -5210 3300 6912 -6988 1947 6094 -7685 643 4786 -6878 -1768 2107
629 2107 -4463 -2787 822 479 -2154 -260 5015 -1516 -1851 8055 -1070 -3349 9026 -1056 -4716
644 -4716 7066 -1953 -5472 4291 -1720 -4296 1099 -1867 -2588 -1182 -88 222 -2592 2671 3631 -4193
660 -4193 3406 4883 -4411 3843 4808 -5352 2538 3274 -5237 989 1327 -4056 -524 -829 -1766 -1541
676 -1541 -1832 2028 -1466 -2209 5708 -653 -2464 7369 -1018 -2407 7286 -876 -3019 4344 -875 -3236
692 -3236 242 -1191 -1356 -2393 -798 722 -4565 517 3401 -5092 2367 5748 -4682 2485 5517
$$ packed form
585e756M246L261l939J118J201J503j267q95O211n631k030J0085r323l969J3792
600H607j0224n610J4044q732o351J1705l919n519O453J124l168l11N175q08p089
615d623Q377K743j1707Q510L612j3900Q935M147j3779Q328M143j1664N110L875
629B107o570J676L609l43k633J894N275o531l35R906r125k279J2375j0082l660
644d716J1782r019l519R763o011k576N395k966p21J406J094L10k814N263R60p824
660d193P599J477r294Q254R65j0160P890P36q511O226L38n383L532l05r37K25
676a541k91L860l494p43P917o361j811R833q387j389R693q162k143P363n219k361
692c236L478j433j65j037J595J520n287N082K884q493P459L381j0430P167L032
$$ plain form
707 5517 -3817 1721 4369 -2677 577 1585 -1793 -1034 -1287 -33 -1860 -3032 2144 -2309 -3747 4439
723 4439 -1610 -3424 6578 -827 -2417 7322 -673 -2079 5361 -943 -2129 2566 -222 -2184 -1793
738 -1793 129 -701 -4869 1310 1318 -6117 2675 3377 -6177 3642 4898 -4789 3159 5294 -3111 1214
754 1214 2961 -1336 -587 -324 300 -2174 -3125 2211 -2796 -4171 3654 -2236 -3797 4730 -991 -2247
770 -2247 5110 -628 -450 4145 -675 914 2096 -987 956 -214 -975 686 -3176 -646 929 -4873
786 -4873 405 1596 -5009 1888 2077 -3762 3024 2920 -2046 2906 2212 172 1874 -328 1523 -99
802 -99 -2840 1688 -977 -4162 2309 -2439 -4109 3180 -1861 -3047 3335 -396 -461 2999 -317 1896
818 1896 1703 -278 2602 -391 -609 2627 -3113 -907 2233 -4393 -550 1634 -4812 129 1417 -3586
$$ packed form
707E517r334N538K648p046L254J008l378P59k53J254j827j172N176m453j438Q186
723D439o049j814J0002p405j590R739p995j406P440o304j186M695k788j962L91
738a793J922q30m168O179Qp435Q792P02r554R819J256r687P948K135q405M325
754A214J747m297P49K63O24k474r51N336n007j375P825n890j561Q527n721j256
770b247P357n738J78M595m820J589J182l083J943j170p61J661l862K530J575n802
786d873N278J191o605O897J89n839O786j04m966M952o94k040J702k202J851j622
802i9k741M528k665l185O471m748j670P289n041j186O382l731o5L460l316K213
818A896j93j981K880k993k18L236n740K206L140o626L843K184o446M941J288n003
$$ plain form
834 -3586 1212 1108 -1511 2655 861 252 2540 -90 2033 1325 -1799 2938 -305 -3520 2626 -1795
850 -1795 -3670 2098 -2329 -2721 2515 -2406 -1088 1936 -1091 1379 1714 -381 3391 493 114 3159
866 3159 -1658 234 1844 -3106 414 808 -4602 652 376 -4127 840 -345 -1773 2222 -782 -110
882 -110 2484 -792 1692 2413 -1125 2587 1130 -1944 2563 -523 -2296 1597 -2247 -1857 732 -3241
898 -3241 -136 456 -2727 1736 580 -2218 3292 704 -1035 4035 13 -498 2621 -1010 168 581
914 581 -2418 1029 -1087 -3172 1081 -2084 -2325 1932 -2485 -672 3033 -1899 839 2949 -1363 1947
930 1947 1803 -745 2801 -399 -1309 2373 -1812 -1172 1084 -2597 65 -193 -3298 1138 -513 -2410
946 -2410 2340 -707 -721 3697 -840 152 3851 -692 676 2306 -1274 495 -241 -1592 865 -2497
$$ packed form
834c586M798j04k619M166j794o09K288k630K123p08l124M737l243l215O146m421
850a795j875N768m427l92N236m921J318L024l027K470L35k095L772k898l79L045
866C159m817J892J610m950L520L94n410N254k76m503M967j185j428L995l004O72
882a10K594l276K484P21l538L712j457l074M507l086j773L893l844L90K589l973
898c241L105N92l183M463j156k798N510k588j739N070m022n11L119l631J178M13
914E81k999L447k116k085M253l165k41M257m417J813L705m932K738K110m312L310
930A947j44k548L546l200r10L682m185O40K256l681K662k58l105M436j651j897
946b410M750l047j4M418m537R92L699m543J368J630l580J769p36j351K457l362
$$ plain form
962 -2497 -1379 1645 -3235 -668 1886 -3604 442 2371 -2130 1807 1862 -655 1896 522 275 2331
978 2331 -1454 725 1049 -3416 793 83 -4088 1202 -114 -3338 1580 -699 -1844 2334 -660 107
994 107 2769 -801 1600 1930 -947 1855 361 -1119 2080 -1587 -1167 1676 -3284 -790 1519 -4072
1010 -4072 -175 1554 -3192 1125 1367 -1589 2139 1394 547 1961 -159 1674 1000 -2292 2124 170
1026 170 -3368 2066 -1020 -3821 1940 -1315 -2940 2037 -1080 -1590 1759 -338 1286 806 -391 2831
1042 2831 157 -389 3307 -1272 -523 2713 -3049 -716 1853 -3403 -939 890 -2920 126 296 -1347
1058 -1347 1459 -291 341 2160 -554 1935 1804 -1648 2407 795 -2544 2384 -462 -2972 1646
1073 1646 -1717 -2815 1396 -1841 -1714 1068 -945 327 648 -407 2224 -194 332 3207 -1211 483
$$ packed form
962b497J118L024m880K567K554n490M046J929m501L937N5k517K551j374k47K056
978B331l785K179L24m465M209p10m171N290j316l224M918k279j145M178k994P67
994A07K662l570K401L30k877K802j494j480L199l667M20K843m960K494K309n591
1010d072L897J729m746M317K42k956L728p45q47J414k120J833o74l292M416j954
1026A70l538N434l086k801N761l255j625M977l117n10L349k097J624m80j197L222
1042B831k674n46L696m579P49L236n762K333K569n256K464J829l810L046J70j643
1058a347K806j750O32J819k714K489j31l452M055j612l339M928k846k510M618
1073A646l363j098M211l237J27K782k013J272L21j055K631k418N26K875m418J694
$$ plain form
1089 483 3056 -2892 362 2285 -3744 13 1651 -3721 -608 498 -1734 -191 -463 206 710 -1016
1105 -1016 2218 1136 -1342 3402 1143 -2121 3982 369 -2710 2475 -771 -2331 1255 -1794 -1622
1120 -1622 57 -1770 -199 -479 -1078 1903 -696 -121 3289 -823 407 3653 -1205 652 2334 -2246
1136 -2246 796 1021 -2631 515 -295 -2133 127 -1287 -735 399 -1614 933 894 -1909 2616 892
1152 892 -1671 3356 571 -1622 3101 -188 -1470 1494 -1021 -1261 -128 -1907 -16 -1027 -1551 1328
1168 1328 -1669 -545 2895 -2146 378 3881 -1515 744 3318 -1188 560 1431 -1361 140 -588
1183 -588 -940 118 -2116 -295 131 -2927 917 647 -2542 1937 845 -1729 2517 352 -1096 3251
1199 3251 19 -739 2134 -765 -389 421 -1424 302 -1012 -1775 989 -1738 -977 1402 -2258 262
$$ packed form
1089D83K573n948L254J923o029L757J638n372L113J106k232J543k72O69N04j726
1105a016L234j082k478M744k259l264O103l613l079N185l246j560L586l049J72
1120a622J679j827J571k80n99K981k599N75L410m112J230L246m858J857J682m580
1136b246L042K25l652L146q10j838K260j414N52J134k013K547l9k803M525j724
1152H92k563N027k785k193M723l289j282K964k515k40J133j779J891j011n24K879
1168A328k997J124L440n041K524L503n396K259K574m506J748Q71k792J501p28
1183e88l52J058k234J821M26l058L844k70l189M479j092k574M246k165j448M347
1199C251l232p58K873k899L76Q10j845J726j314p63K764k727P61K379l660K520
$$ plain form
1215 262 2650 -2160 1179 2955 -1395 1370 2334 -1076 1207 782 -960 340 -950 -152 -279 -2742
1231 -2742 597 -545 -2830 1801 -187 -2421 2389 379 -1091 2723 316 -102 2122 -237 637
1246 637 709 -994 1258 -825 -1853 1451 -1671 -2229 1183 -2063 -965 1137 -1884 468 1604 -1178
1262 -1178 1608 1155 -469 2139 -38 -114 1878 -1136 -116 984 -1960 -140 121 -2298 615 -805
1278 -805 -2232 1779 -376 -1289 2262 -101 -328 1822 -553 1328 1282 -560 1477 -267 -761 1544
1294 1544 -1594 -1393 1654 -2888 -1048 1463 -2521 -225 1378 -1692 594 774 -349 1613 230
1309 230 622 1535 -711 1390 1281 -1910 1119 398 -2243 872 -610 -2522 1086 -1299 -1680 1359
1325 1359 -936 -283 1255 -560 1154 1247 -463 1944 565 -422 1548 -737 -386 1282 -2160 -252
$$ packed form
1215B62K388m810L339J776m350K765R64l410K283m25j742J300j290P98j27k463
1231b742L339j142k285M631j988k234M810k010j470L814k407m18K224k359Q74
1246F37P2j703K252k083j028L304l122n58L412l246J098K102l021K352J136k782
1262a178K786m53j624K608k177p6J992l014J020J100k944J820K61k419K913j420
1278h05j427M011k155r13L551k363k27K150k375J881m6j842K037j744m94K305
1294A544l138K01L047m542J840K511l984K296J603l070K286J80j123J962j383
1309B30L92R13k246K101j09l191L029p21k641L115j482j912L608k385l81L039
1325A359k295O53J538j815J714R3j710K407j379r87J970k285L51J668l442J908
$$ plain form
1341 -252 502 -2272 165 215 -2532 889 -67 -1229 1730 220 -328 1990 -82 699 1319 -924 1350
1358 1350 513 -1364 1160 -503 -1926 894 -1473 -1174 699 -1669 -684 799 -1338 930 636 -726
1374 -726 2113 568 -678 2192 -395 -437 1850 -1273 -365 858 -1743 -209 74 -1713 21 -756
1390 -756 -1080 977 -1119 -284 2048 -889 754 1625 -852 1342 902 -1160 1702 91 -1240 1436
1406 1436 -1237 -1045 828 -1663 -945 532 -1634 -79 315 -943 875 -109 197 2135 -605 671
1422 671 1789 -1260 765 1590 -1962 665 551 -1980 391 -539 -1787 204 -821 -653 431 -895
1438 -895 789 997 -940 1611 902 -564 1559 72 -395 1521 -932 -396 988 -1626 1 397
1454 397 -2346 151 109 -2032 822 253 -812 1283 -67 172 1356 47 923 989 -756 1210 235
$$ packed form
1341b52P54k774K437N0k747L421r56j162K959j510n48K318k072P81O20k243K274
1358A350q37j877K524j663j423K820k367K99J873k368R85J483k137K268k94j362
1374g26K839j545j246K870k587m2K287l123R08J223k601J534K83j787J734p77
1390g56l24K057k096Q35K332k937J643Q71k477K194m40k062K862j611j331K676
1406A436k673J92J873k491P18J477k166J555L94j258J818r84L06J938k740J276
1422F71J118l049K025Q25l552K627j14k531K371r30j248J991j025J68J084j326
1438h95J684K08j937K551p09j466K123j487m67J916k453N36J384k614J627L96
1454C97k743K497m2k141K854n69j065K095j350K39J184j309Q76O6j745J966r75
$$ plain form
1471 235 -1068 1353 -722 -1438 823 -1402 -1001 642 -1470 -46 563 -1198 1169 755 -814 1547
1487 1547 215 -231 1756 -420 29 1128 -1057 -211 -19 -1732 435 -430 -1947 661 -956 -982 1320
1504 1320 -768 -19 1506 -738 736 1339 -697 1272 774 -545 1271 -377 -690 1118 -1283 -683
1520 -683 456 -1864 -132 162 -1425 379 -7 -1077 1418 26 209 1787 -305 646 1383 -918
1536 -918 776 853 -1344 686 -190 -1821 512 -709 -1076 482 -1345 -209 559 -1143 1020 931 -620
1553 -620 1664 698 -337 1575 149 -313 1254 -858 -414 752 -1557 -100 -40 -1682 406 -285 -1245
1570 -1245 902 -486 -594 1220 -219 604 1306 -779 1294 730 -1123 1521 307 -1388 1118 -675
1586 -675 -1487 412 -1366 -706 481 -919 370 73 -561 1353 126 -662 2104 228 -69 1651 -427
$$ packed form
1471B35j303K421k075p16K261k225M01J643k112J424O09j761K367m14j569K361
1487A547j332m46J987k176M49J099k185Q46J92j713K167q65j517K608j617k6K302
1504A320k088P49J525k244J474O03k036J969m98j319J816j648l13J808k401O00
1520f83J139k320J732K94j587J804l86j070K495j392J83J578k092R51P37k301
1536i18J694P7k197K030q76j631K333j221l67J558j827J136P68j702K163q9j551
1553f20K284r66j035J912j426m62J567k112M44J166k309J457O0j642K088o91r60
1570a245K147j388j08J814j439Q23P02k085K073n64j853K644j214j695K506j793
1586f75q12J899j778O60J187j400J289k97o34J914j227p88K766j876k97J720k078
$$ plain form
1603 -427 -73 640 -1095 155 318 -1321 -16 -717 -1032 741 -890 -663 1134 -613 -27 1174 -599
1620 -599 1054 899 -557 1363 513 -458 930 -611 -677 623 -1243 -523 366 -1494 -249 125 -1424
1637 -1424 643 -301 -807 1087 32 -31 1503 -298 382 1107 -678 541 363 -1139 350 -275 -1088
1654 -1088 270 -1039 -785 386 -1313 96 701 -875 869 695 -349 1168 337 8 1205 119
1670 119 -235 791 -730 -8 126 -1418 137 -249 -1535 223 -457 -1004 866 -419 -93 1138 -680
1687 -680 573 1202 -443 1177 795 -507 1218 -115 -1195 686 -1029 -1202 255 -1270 -158 169
1703 169 -1073 397 30 -665 1172 121 -171 1583 -253 -48 1411 -477 312 594 -934 148 19
1720 19 -1106 470 -595 -1063 757 -813 -544 597 -637 75 1033 -198 1045 658 -200 1206 305
$$ packed form
1603d27L54P13j735J250J63j639J305p01l15J773j631K27J797j747N86J201j773
1620e99J653j55j456J920q50r71J388j541o6J300j866P20Q89j860J245L74j549
1637a424K067r44n06J894j055o3J534j801O80P25j785J219j78j502J489o25q13
1654a088J358j309K54J171j699J409O05j576J744j74j044J517q31l29J197j086
1670A19l54J026j521P22J34j544J555l86j286J758o80n47J870j285L26J231j818
1687f80J253O29j645J620l82j302J725j333j080J881j715j73J457j525J112L27
1703A69j242J470l67o95J837j051k92J754j836K05J459j888P89K82j528J082j29
1720A9j125J576j065m68J820j570K69J141j234P12R58j231J243l87q58J406r01
$$ plain form
1737 305 -424 1038 -875 -839 503 -1016 -404 -150 -1453 42 49 -878 907 -150 -308 1032 -223 310
1755 310 1448 -441 601 1029 -776 763 310 -765 392 -524 -1105 338 -939 -522 380 -1232 425
1772 425 553 -974 588 860 -348 1209 658 -186 1189 -391 -34 695 -904 203 197 -1198 103
1789 103 -360 -1303 782 -461 -809 718 -239 -37 1167 -603 763 1329 -644 847 567 -410 470
1806 470 -404 -954 472 -945 -548 308 -1205 -38 -32 -1100 803 63 -697 1125 217 -195 1437 -58
1824 -58 301 1105 -489 246 556 -802 123 -147 -1028 266 -658 -805 698 -732 -364 477 -430 537 736
1843 736 -599 1209 792 -443 1195 -176 -355 845 -1018 -400 629 -1053 -324 245 -1195 -104
1859 -104 -318 -949 821 -25 -291 1109 -49 473 1007 -441 526 654 -766 634 84 -608 749 -680
$$ packed form
1737C05p29J462j913L6J342j519O12K54j303J495Pr27J785j057j58J340j255N33
1755C10J138j889J042M28j805J539m53j075J157r16n81J443j277M17R02j612J657
1772D25J28j527J562K72j208J557n51q44J375j580L57P29j599J107oj395J301
1789A03m63r43K085j243l48J527r57K02J204j770J366N66j973J491k80r77Q80
1806D70q74n50J426j417L97Q56j513J167Oj068J903p40p60J822r08m12J632j495
1824e8L59Q04j594P35L10j358R25k70q81J294r24j47J503j430L68Q41r07R67J99
1843G36j335J808m17j235J638j371j79J200j863O18J029j682P29N69j440J091
1859a04k14o31J770q46k66J400j158N22N34j448R67J28j420J400n50o92J357j429
$$ plain form
1877 -680 -989 213 -1262 -853 501 -929 124 354 -794 749 421 174 1092 97 293 1079 -500
1894 -500 280 615 -1036 230 72 -1445 215 -197 -1224 550 -395 -433 861 -258 75 1080 -193
1911 -193 701 577 -249 1023 246 -632 773 -671 -566 494 -992 -445 55 -1145 121 330 -998
1928 -998 448 353 -407 960 33 131 1091 -277 279 760 -592 676 397 -908 367 -287 -1111 412
1946 412 -635 -738 690 -994 175 749 -563 619 696 -360 1048 370 -172 1084 -60 -245 632
1963 632 -700 -246 203 -1056 355 -96 -1200 299 -189 -572 883 -324 -420 1248 -342 500 1066
1980 1066 -406 604 584 -577 309 -189 -617 752 -1026 -591 384 -909 -214 140 -897 110 455
1997 455 -452 895 235 -299 1237 -98 62 792 -298 112 431 -914 192 -56 -996 174 -363 -839
$$ packed form
1877f80l09J202j475M09J354j430J053K30j148J543l28k47R18r95J96P86j579
1894e00P80L35j651J266j58j517J660m12j027J774r45l8J294j119L33J005j273
1911a93Q94j24q26J272p77q78J405j444J05J060j486N47N00j200J266K09j328
1928i98J446r5p60J367r27R8R60j368N56M81j352J268k79j305J275o54q24J523
1946D12j047j03J428j684J169N74j312J182P7j056J408o78n42J256j144j85Q77
1963F32j332M54M49j259J411m51j104J499m88l83J455j207r6J668j590Q42N66
1980A066j472J010k0j161Q86m98m28J369j778M35R75j293O95L54j037J007L45
1997D55r07J347o60n34J536j335J60P30j090M10L19j345J106k48r40J170n37m76
$$ plain form
2015 -839 230 -512 -333 954 -284 314 740 -207 718 327 -332 939 109 -796 665 -666 -256 330
2033 330 -1017 -318 169 -909 21 -81 -788 638 -121 -334 1036 -126 405 991 -328 417 761 -524
2051 -524 461 -156 -877 373 -718 -1193 461 -710 -606 577 -724 10 483 -550 686 596 -391 1137
2069 1137 234 -168 1093 -607 -171 796 -913 -273 22 -927 300 -616 -763 585 -295 -462 682 -291
2087 -291 -67 639 -336 440 616 -387 537 295 -268 868 -170 -361 382 -805 -501 531 -1021 11
2105 11 445 -810 440 284 -500 543 35 133 1077 -42 116 630 -547 136 258 -955 254 -257
2123 -257 -1060 599 -366 -720 701 -524 -135 752 -465 472 724 -364 685 155 -129 943 -171
2140 -171 -256 515 -961 -365 627 -816 -1 61 -979 258 -238 -520 748 -14 -279 687 -149 197 760
$$ packed form
2015h39J069p42J79J287j238N98M26r47R25l91o59J271q30r05J461j331M10N86
2033C30j347O99M87j078R30j02p07J426p59k13J370j162N31N86j319P45L44j285
2051e24R85o17p21J250j091m75J654j171J04J183j301P34M73j033J236r0r87J528
2069A137r03m02J261j700M36R67j709O40K95r49J227r16j47J348q80j67J144r73
2087b91K24P06r75P76J76j003R24k42n63J136j038j91P43j187L04J032j552J032
2105A1M34j255J250j56p84J043n08R8R44j119J58N14j177O83J22j213J209n11
2123b57q03J659r65l54J421j225L89Q87j217R37K52j088J049n30k84J072j114
2140a71q5P71j476N96R92j443Q15O2j040J237m96k82J268p62k65R66q36L46N63
$$ plain form
2159 760 -339 461 747 -857 513 70 -681 226 -528 -833 523 -840 -21 326 -592 279 466 -200
2177 -200 630 87 -77 1156 -292 -173 786 -500 -4 277 -777 35 231 -818 256 -94 -729 438
2195 438 -189 -412 800 -523 72 666 -513 533 714 -521 527 348 -523 460 -535 -605 223 -619
2213 -619 -161 206 -525 -16 53 -668 725 -97 -327 1080 112 92 781 -146 178 633 -692 178 222 -475
2233 -475 194 -205 -917 76 -507 -298 441 -616 322 578 -410 750 531 -473 848 46 -370 611 -41
2252 -41 -55 464 -381 -184 17 -910 318 -5 -714 416 82 -488 616 -189 -80 952 -54 388 775
2271 775 -329 489 373 -479 562 -280 -499 324 -208 -285 103 -594 -93 248 -549 282 272 -577 706 300
2291 300 -229 920 79 -82 750 -407 74 127 -230 262 122 -887 364 -356 -926 647 -603 -49
$$ packed form
2159G60j099Q00K86j604J370m43p51R07p54l05J356j363Q19L47r18Q71J87o66
2177b00Q30n43j64J233j448J19R59j286M96K81j054Q12J96j049J074l50o35J167
2195D38o27k23J212j323N95N94j179J046J81j235J048j79q71R83r95p0Q28q42
2213f19M58L67p31N09O9p21J393q22k30J407r68k0O89r27L24M55j325Q70M4o97
2233d75O69l99p12R93n83K09P39j057R38K56r88J160k19j004J321q02m16R81o52
2252d1j4N19q45J97K01r27J228l23p09J130l34n70J104q05J09J032j006M42L87
2271G75j104Q18j16q52J041q42k19Q23n32p7L88o97N01L41p97Q31j0q49J283m06
2291C00n29J149q41j61Q32j157M81N3l57M92j40j009J251p20n70J573j250N54
$$ plain form
2309 -49 620 -320 250 646 -295 127 353 -385 635 82 -592 607 -542 -412 161 -693 -246 -137 -763
2328 -763 563 -61 -517 265 291 -323 652 118 -138 610 -244 234 355 -566 64 -53 -820 353 -551 -772
2348 -772 406 -328 -427 477 -705 143 449 -559 321 325 -131 595 142 104 591 -270 -116 361 -795 -106
2368 -106 101 -1096 214 -57 -693 521 -302 -266 783 87 259 566 -578 487 540 -472 351 201
2386 201 -308 554 -338 -365 27 -528 -488 188 -681 -143 447 -439 394 312 -365 416 249 -138 834 -136 6
2407 6 332 -200 171 325 -749 -19 -71 -787 277 -338 -728 399 -317 -99 549 -250 313 242 -175 509
2427 509 100 -102 389 93 -259 140 -514 -227 225 -764 -221 -80 -532 385 -47 -389 389 -145 -187 747
2447 747 -170 121 460 -185 346 112 -487 184 -134 -429 127 -201 -293 162 -591 -7 252 -559 73 297
$$ packed form
2309d9O69r40N70L96r41M22K26p38J020n53o74J199j149J30N73q54M47J09o26
2328g63J326o24m56P82K6o14R75n34k56P48q54M78J21r21O30j17p67J173r04k21
2348g72J178p34r9R04j182Q48L06j008Q80Mm56P26m53l8M87q61J54M77j156O89
2368a06K07j197J310k71o36J214q23L6J049o96J72L07j144J065N3j012Q23j50
2386B01n09Q62q92k7L92n55M0O76q69N38N90q86Q33q2o77P81j67l87R72r70J42
2407FL26n32L71J54j074P30n2p16J064o15l90J127p16K18O48p99N63p1m17O84
2427E09m09k02M91k96l52L99o54K87M52r89N43J41m52R17m32l42P78n34m2R34
2447G47r17K91L39o45N31k34n99O71l18k95N56l28r2M55p53N84K59q11O32K24
$$ plain form
2467 297 -142 704 202 -238 779 197 -161 503 -193 -170 321 -918 -261 214 -650 33 -221 -610 -92 -324
2487 -324 -200 360 -118 70 717 -261 633 279 -238 685 35 -419 397 -237 -368 281 -529 -237 128 -445
2507 -445 194 106 -291 100 66 -128 674 110 237 301 -205 304 261 -548 167 305 -560 -103 47 -398 72
2528 72 -482 -392 476 -297 -80 313 -135 443 92 -89 631 154 -161 546 -267 -312 416 -377 -126 180 -805
2549 -805 90 18 -273 261 60 -431 476 81 -120 447 -288 -109 534 -399 180 76 -148 343 -42 -457
2569 -457 272 -206 -595 190 -429 225 219 -434 57 481 -490 367 345 -68 530 -266 11 513 -298 -45 206
2590 206 -427 170 13 -570 238 -352 -383 447 -234 -111 363 -154 124 274 -287 521 126 -402 289 -35
2610 -35 60 362 -558 -355 57 -398 -156 213 -506 -219 38 -187 373 180 -243 629 -58 -172 339 -232 58
$$ packed form
2467B97m39Q46n02m40J017n82l58O64o96K3M91j239O57M75q64O83k54l89N18k32
2487c24J24N60m78J88O47r78Q94l54n17R23o50m54Q16o34j31O49q10K92L65n73
2507d45O39q8l97L91l4j94Q02n64J27O4n06N09m3q09P15J38q65M57J50m45M70
2528G2n54R0Q68p73K17L93m48N78l51j81P20m77l15P07q13m5P28p93K51L06r85
2549h05Q95p2k91N34k01m91R07l95k01N67p35J79O43r33N79j04k24M91l85m15
2569d57P29m78l89P85o19O54oo53M91M24r71Q57k2m13N98p96K77N02q11K53K51
2590B06o33N97j57n83Q08n90l1Q30o81J23M74n17K78J50n61Q08l95n28O91l24
2610c5R5L02r20K03M12m55K42L69p19K87K57k25N60j93m23Q72o87j14N11n71K90
$$ plain form
2631 58 238 -405 293 239 -614 266 115 -497 201 -181 50 407 -553 233 105 -123 547 180 -72 618 -167
2652 -167 -181 565 -282 -56 22 -442 -30 -84 -521 70 174 -154 195 -249 -140 815 89 -64 426 82 360
2673 360 396 -312 270 133 -265 259 -347 -393 213 -595 -211 391 -380 11 382 -61 300 263 -242 303 366
2694 366 -113 380 -55 80 155 -309 202 98 -474 156 114 -559 90 -23 -147 290 -294 -47 512 -200 57
2715 57 538 -153 167 187 -62 219 -35 -434 228 -111 -234 170 -576 30 175 -289 279 26 -367 486 -11
2736 -11 -175 444 25 -157 512 -389 283 20 -266 61 -91 -293 38 -251 -138 261 -311 -265 461 -167 347
2757 347 109 -303 337 -114 -268 484 -229 -112 207 -180 80 180 -393 -167 238 -321 159 -27 -356 372
2777 372 -13 -139 800 27 29 392 -345 153 493 15 132 124 -196 277 -160 -185 -32 -510 -1 -41 -434 -74
$$ packed form
2631E8J80o43O98n4q53Q80j51o12O98l82K31L57r60P86j28k28O70l67k52O90p85
2652a67j4P46q47K26P8m64M12n4m37N91J04l28L49m44J09R55p26j53M90l44K78
2673C60L6p08N82j37l98N24o06m6O06q08L84O02p71L91L71m43L61l7n05N45O3
2694C66m79M93m35J35P5m64N11j04n72O30m2o73O49j13j24M37n84K47N59p12K57
2715E7M81o91L20K0k49K81k54l99O62l39j23M04p46O06J45m64N68k53l93Q53m97
2736a1j64O19m19j82O69r01O72k63k86L27j52k02L31k89J13L99n72M6P26o28N14
2757C47k38m12O40m51j54P52p13J17L19l87K60J00n73K26M05n59M80j86l29P28
2777C72l85j26R39p73KL63p37M98L40m78J17ql20M73m37k5J53m78N09m0l93L60
$$ plain form
2799 -74 31 -10 335 -28 -77 418 169 -235 321 -101 -168 334 -284 113 121 -578 45 -206 -379 84 -140 -79
2821 -79 222 -263 -102 160 -29 198 257 -80 171 -68 -58 422 135 -189 476 -382 -234 34 -298 -142 -38
2842 -38 -513 161 -23 -101 224 -197 -38 468 -149 79 179 4 268 86 -435 265 89 -294 32 -352 -278
2863 -278 259 -311 -13 236 -363 348 232 -376 464 148 -334 381 -174 -220 324 -410 35 157 -608 29
2883 29 -238 -257 269 -337 -248 199 -86 -247 231 4 -158 278 -116 144 87 -141 404 -277 -432 340 -234
2904 -234 -331 13 -344 -170 -22 -494 103 2 -256 269 383 -356 191 114 60 524 -264 100 184 -329 40
$$ packed form
2799g4J05m1L45l63m9M95k49m04N56m22o7N02o18L97Qo99O23k51j73M63k24O1
2821g9L01m85J61K62j89K27N9l37K51k39J0M80k87l24O65q58J48K68l32J56J04
2842c8m75O74j84p8L25m21J59N06o17K28J00j75K64j82n21P00j76l83L26l84P4
2863b78N37n70K98K49n99P11j16o08Q40l16m82P15n55m6N44p34M45J22p65O37
2883B9k67j9N26o06Q9M47k85j61M78k27j62M36l94K60n7k28N45o81j55P72n74
2904b34r7L44l57J74J48m72N97j01k58N25J14p39N47p7n4M64p88L64Q4n13L69
$$ [...]
8191b7
##END NTUPLES=NMR FID
##END=
