##TITLE=1H_Ser EL-27
 CDCl3
 8 sc, 
 7.11.2024
##JCAMPDX= 6.0         $$ Bruker NMR JCAMP-DX V2.0
##DATA TYPE= NMR FID
##DATA CLASS= NTUPLES
##ORIGIN= UXNMR, Bruker Analytische Messtechnik GmbH
##OWNER= root
$$ XWIN-NMR		Version 3.5
$$ Thu Nov  7 14:39:46 2024 Russian Standard Time (UT+4h)  she@DPX200
##.OBSERVE FREQUENCY= 200.1318
##.OBSERVE NUCLEUS= ^1H
##.DELAY= (6, 6)
##.ACQUISITION MODE= SIMULTANEOUS
##.ACQUISITION SCHEME= undefined
##.AVERAGES= 8
##.DIGITISER RES= 18
##SPECTROMETER/DATA SYSTEM= spect
##.PULSE SEQUENCE= zg30
##.SOLVENT NAME= D2O
##.SHIFT REFERENCE= (INTERNAL, D2O, 0, 15.7039)
##AUDIT TRAIL= $$ (NUMBER, WHEN, WHO, WHERE, WHAT)
$$ ##TITLE= Audit trail, XWIN-NMR		Version 3.5
$$ ##JCAMPDX= 5.01
$$ ##ORIGIN= Bruker BioSpin GmbH
$$ ##OWNER= she
$$ F:/spectra/data/she/nmr/H-F/1/audita.txt
$$ ##AUDIT TRAIL=  $$ (NUMBER, WHEN, WHO, WHERE, WHAT)
(   1,<2024-11-07 14:38:30.96 +0400>,<she>,<DPX200>,
      <created by zg, POWCHK disabled, PULCHK disabled
       configuration hash MD5:
       00 E9 B6 7A A2 85 ED C7 34 08 36 98 17 FE 4E 26
       data hash MD5: 16K
       E4 AC AB 42 A0 1C D7 94 64 80 39 A2 D2 D7 7A 51>)
$$ ##END=
$$ 
$$ hash MD5
$$ F2 E5 17 F9 F1 16 AF 3C CB 8D D8 29 D2 C8 F9 B9
##$RELAX= 
##$RELAX= 
##$RELAX= 
##$RELAX= 
##$RELAX= 
##$RELAX= 
$$ Bruker specific parameters
$$ --------------------------
##$DU= <F:/spectra>
##$EXPNO= 1
##$NAME= <H-F>
##$PROCNO= 1
##$TYPE= <nmr>
##$USER= <she>
##$AMP= (0..31)
100 100 100 100 100 100 100 100 100 100 100 100 100 100 100 100 100 100 
100 100 100 100 100 100 100 100 100 100 100 100 100 100 
##$AQSEQ= 0
##$AQ_mod= 1
##$AUNM= <au_zg>
##$AUTOPOS= <>
##$BF1= 200.13
##$BF2= 200.13
##$BF3= 200.13
##$BF4= 200.13
##$BF5= 200.13
##$BF6= 200.13
##$BF7= 200.13
##$BF8= 200.13
##$BYTORDA= 1
##$CFDGTYP= 0
##$CFRGTYP= 5
##$CHEMSTR= <none>
##$CNST= (0..31)
1 1 145 1 1 1 1 1 1 1 1 1 1 1 1 1 1 1 1 1 1 1 1 1 1 1 1 1 1 1 1 1 
##$CPDPRG= <>
##$CPDPRG1= <>
##$CPDPRG2= <>
##$CPDPRG3= <>
##$CPDPRG4= <mlev>
##$CPDPRG5= <mlev>
##$CPDPRG6= <mlev>
##$CPDPRG7= <mlev>
##$CPDPRG8= <mlev>
##$CPDPRGB= <>
##$CPDPRGT= <>
##$D= (0..31)
0 1.2 0 0 0 0 0 0 0 0.06 0 0.03 0 0 0 0 0.0002 0 0 0 0 0 0 0 0 0 0 0 0 
0 0 0 
##$DATE= 1730975910
##$DBL= (0..7)
120 120 120 120 120 120 120 120 
##$DBP= (0..7)
150 150 150 150 150 150 150 150 
##$DBP07= 0
##$DBPNAM0= <>
##$DBPNAM1= <>
##$DBPNAM2= <>
##$DBPNAM3= <>
##$DBPNAM4= <>
##$DBPNAM5= <>
##$DBPNAM6= <>
##$DBPNAM7= <>
##$DBPOAL= (0..7)
0.5 0.5 0.5 0.5 0.5 0.5 0.5 0.5 
##$DBPOFFS= (0..7)
0 0 0 0 0 0 0 0 
##$DE= 6
##$DECBNUC= <off>
##$DECIM= 24
##$DECNUC= <off>
##$DECSTAT= 4
##$DIGMOD= 1
##$DIGTYP= 9
##$DL= (0..7)
0 120 120 120 120 120 120 120 
##$DP= (0..7)
150 150 150 150 150 150 150 150 
##$DP07= 0
##$DPNAME0= <>
##$DPNAME1= <>
##$DPNAME2= <>
##$DPNAME3= <>
##$DPNAME4= <>
##$DPNAME5= <>
##$DPNAME6= <>
##$DPNAME7= <>
##$DPOAL= (0..7)
0.5 0.5 0.5 0.5 0.5 0.5 0.5 0.5 
##$DPOFFS= (0..7)
0 0 0 0 0 0 0 0 
##$DQDMODE= 0
##$DR= 18
##$DS= 0
##$DSLIST= <SSSSSSSSSSSSSSS>
$$ [...]
##$SUBNAM2= <"">
##$SUBNAM3= <"">
##$SUBNAM4= <"">
##$SUBNAM5= <"">
##$SUBNAM6= <"">
##$SUBNAM7= <"">
##$SUBNAM8= <"">
##$SUBNAM9= <"">
##$SW= 24.0689170037331
##$SWIBOX= (0..15)
0 0 2 0 0 0 0 0 0 0 0 0 0 0 0 0 
##$SW_h= 4816.95568400771
##$TD= 16384
##$TD0= 1
##$TE= 0
##$TE2= 300
##$TE3= 300
##$TEG= 300
##$TL= (0..7)
0 120 120 120 120 120 120 120 
##$TP= (0..7)
150 150 150 150 150 150 150 150 
##$TP07= 0
##$TPNAME0= <>
##$TPNAME1= <>
##$TPNAME2= <>
##$TPNAME3= <>
##$TPNAME4= <>
##$TPNAME5= <>
##$TPNAME6= <>
##$TPNAME7= <>
##$TPOAL= (0..7)
0.5 0.5 0.5 0.5 0.5 0.5 0.5 0.5 
##$TPOFFS= (0..7)
0 0 0 0 0 0 0 0 
##$TUNHIN= 0
##$TUNHOUT= 0
##$TUNXOUT= 0
##$USERA1= <user>
##$USERA2= <user>
##$USERA3= <user>
##$USERA4= <user>
##$USERA5= <user>
##$V9= 5
##$VALIST= <valist>
##$VCLIST= <CCCCCCCCCCCCCCC>
##$VD= 0
##$VDLIST= <DDDDDDDDDDDDDDD>
##$VPLIST= <PPPPPPPPPPPPPPP>
##$VTLIST= <TTTTTTTTTTTTTTT>
##$WBST= 1024
##$WBSW= 4
##$XGAIN= (0..3)
0 0 0 0 
##$XL= 0
##$YL= 0
##$YMAX_a= 125530
##$YMIN_a= -106606
##$ZGOPTNS= <>
##$ZL1= 120
##$ZL2= 120
##$ZL3= 120
##$ZL4= 120
##$ABSF1= 10
##$ABSF2= 0
##$ABSG= 5
##$ABSL= 3
##$ALPHA= 0
##$AQORDER= 0
##$ASSFAC= 0
##$ASSFACI= 0
##$ASSFACX= 0
##$ASSWID= 0
##$AUNMP= <proc_1d>
##$AZFE= 0.1
##$AZFW= 0.1
##$BCFW= 1
##$BC_mod= 2
##$BYTORDP= 1
##$COROFFS= 0
##$CY= 11.3945322036743
##$DATMOD= 1
##$DC= 2
##$DFILT= <>
##$DTYPP= 0
##$F1P= 15.6554695791079
##$F2P= 12.8336369535428
##$FCOR= 0.5
##$FTSIZE= 0
##$FT_mod= 4
##$GAMMA= 1
##$GB= 0.15
##$INTBC= 1
##$INTSCL= 1
##$ISEN= 128
##$LB= 0.24
##$LEV0= 0
##$LPBIN= 0
##$MAXI= 10000
##$MC2= 0
##$MEAN= 0
##$ME_mod= 0
##$MI= 1.114404
##$NCOEF= 0
##$NC_proc= 0
##$NLEV= 6
##$NOISF1= 3.799351
##$NOISF2= 2.8
##$NSP= 1
##$NTH_PI= 0
##$NZP= 0
##$OFFSET= 15.70392
##$PC= 1
##$PHC0= -26718.29
##$PHC1= 24.98744
##$PH_mod= 1
##$PKNL= yes
##$PPARMOD= 0
##$PSCAL= 0
##$PSIGN= 0
##$REVERSE= no
##$SF= 200.130013532006
##$SI= 16384
##$SIGF1= 3
##$SIGF2= 2
##$SINO= 400
##$SIOLD= 16384
##$SREGLST= <1H.CDCl3>
##$SSB= 0
##$STSI= 0
##$STSR= 0
##$SW_p= 3612.71676300578
##$SYMM= 0
##$S_DEV= 0
##$TDeff= 0
##$TDoff= 0
##$TI= <>
##$TILT= no
##$TM1= 0
##$TM2= 0
##$TOPLEV= 0
##$USERP1= <user>
##$USERP2= <user>
##$USERP3= <user>
##$USERP4= <user>
##$USERP5= <user>
##$WDW= 1
##$XDIM= 8192
##$YMAX_p= 0
##$YMIN_p= 0
$$ End of Bruker specific parameters
$$ ---------------------------------
##NTUPLES= NMR FID
##VAR_NAME=  TIME,          FID/REAL,        FID/IMAG
##SYMBOL=    X,             R,               I
##VAR_TYPE=  INDEPENDENT,   DEPENDENT,       DEPENDENT
##VAR_FORM=  AFFN,          ASDF,            ASDF
##VAR_DIM=   8192,          8192,            8192
##UNITS=     SECONDS,       ARBITRARY UNITS, ARBITRARY UNITS
##FACTOR=    0.0002076,     1,               1
##FIRST=     0,             0,               0
##LAST=      1.7004516,     0,               0
##MIN=       0,             -106606,         0
##MAX=       1.7004516,     125530,          0
$$ Real data points
##PAGE= N=1
##DATA TABLE= (X++(R..R)), XYDATA
0@%%%%%%%%%Qj6J6j6K4l2L7m5N6o9Q0r4J13j34J57j83K12k45K83l23L67m19M76
32B53n37O04o79P60q48R46j054J173j301J442j599J771j957K163k394K646k929
49a540L248l610M022m493N042n686O452p376Q490r793J0992j4371J34153k21558
63i6028J33188j4415q9252J43830j46503J10548n0474J3152p203j0790L7143n6506
75c3310P6959p2107L1332J2682n0673P6257p3017M9598r895k9908K7553j229N28
88D770j8009L6210m5753K6996N583l0508M9926m6244J7625M840j8600K3843r257
101A422k75o366P610r166J1394n63j1960K5231m0910L2615j707l0080N8323n5240
115a9672J0383L0645m4200L7202j2130j3380K7859l1088Q255K4080k6717J0210
$$ y = [0, 0, 0, 0, 0, 0, 0, 0, 0, 0, 8, -8, 8, -8, 16, -16, 21, -24, 32, -37, 43, -51, 62, -72, 85, -98, 114, -131, 152, -171, 196, -223, 253, -284, 320, -359, 401, -447, 499, -555, 618, -683, 759, -840, 931, -1026, 1137, -1257, 1389, -1540, 1708, -1902, 2120, -2373, 2669, -3017, 3435, -3941, 4549, -5244, 5748, -8623, 125530, -96028, 37160, 22745, -66507, 77323, -69180, 41368, -9106, 4046, -3157, -13947, 23196, -33310, 43649, -28458, 2874, 15556, -35117, 41140, -31877, 17721, 7826, -22082, 5471, 4242, 4770, -13239, 22971, -22782, 4214, 9797, -20711, 29215, -17029, 596, 5436, -13164, 10679, 1422, 1147, -5219, 2391, -6775, 4619, 4056, -7904, 17327, -23583, 9032, 7325, -22755, 35568, -19672, -9289, 21356, -22844, 14358, 2228, -11152, 16707, -14381, -6126, 17954, -8763, 1447]
127A447M801k0695K4750j3450J96J6795k7900J9412n613p875J5057K639j9134
140i570K359K3550l3782K8141q085j1850K6511l8394K4317Q915k0449J0898J323
153C884j2474Q981O780j6759K3791k4203R093P759k5989M2614l1588M404R703
166E996j5138J4968j0162J0915j0787R809j5880J2006O868k1052K9076k8808J2766
179E77R55m909J2716j8193J7514j5045M718K716J487J196r723J2324j7824J9163
193G672p102l796J1602j8018J3879p950M720J22N800j4711M029J3922k2464K6090
207A3795k1432R968K606k1238L1775k1928Q761K106j2723R421l62J745o185J1417
221G726j5699R179J559j3243K8518k6965N481R526j4564J4359p317L182o49m184
$$ y = [1447, 6248, -14447, 10303, -3147, -2951, 13844, -14056, 5356, -257, -8132, 6925, 9564, -9570, -7211, 16339, -17443, 10698, 2613, -9237, 17274, -21120, 3197, 12112, -8337, 2561, 3884, -8590, 391, 7171, -9588, 14203, -10000, -907, 6852, -19137, 23477, -8111, -3707, 5996, -9142, 5826, -4336, 6579, -4208, 5601, -10279, 1727, 8595, -12457, 16619, -12189, 577, 1532, -3377, 9339, -8854, 8660, -6385, -1667, 1049, 2536, 3732, -5991, 6333, -11491, 7672, 570, -3226, 8376, -9642, 4237, -3713, 1007, 1129, 6929, -7782, -3753, 10169, -12295, 13795, -7637, 2331, 4937, -16301, 15474, -6454, 2307, 4413, -8310, 1111, 749, 2494, -3691, 7726, -7973, 1206, 2765, -10478, 18040, -8925, -3444, 6082, -8482, 5877, -1440, 1742, 1093, -3091]
235c091P48M626m93l029P183j4230P824O130j2406J4251r826q90P598j3137J5098
250F356l425n480K431p1k483K188P535j3244J1322r075J77J1742j7374K1439j6321
265d283k019J3386j5754J7290j1287L558J08m965M935k163Q569j5328J4693j2773
279f033J849J4732j9664J7612j2188J329N767q885R995j805m089l165Q512q236
293d269P082J286j1245J4777j4523N818P140j0711R382n610m983P632J922p566
307c868Q808o872j779Q041j0925J2195l095p584O864k590l268J0067o761k160
321b927Q376j3555J1678k192m156R190j1749L900K775o26j299L758n339j058P024
336C800j0584J4372q565k300Q542j4302J4293m881n66J801l316l1J506L040n957
$$ y = [-3091, -2343, 2283, 1790, -1239, 5944, -8286, -462, 5668, -6738, 7513, -2313, -3203, 4395, -8742, 6356, 2931, -2549, -118, -189, -2672, -484, 7051, -6193, 5129, -3946, -3769, 7973, -9401, 12038, -4283, -6302, 7084, -8670, 8620, -2667, 891, 999, -3966, 969, -1194, 7375, -7953, 6740, -6033, -4184, 10548, -9116, 8496, -3692, -2363, 3404, -5481, 4514, 2709, -1380, -4545, 3967, -4269, 2813, 4099, -7146, 7631, -6892, -1074, 6066, -4645, 4737, -873, -5856, 1776, 3698, -3868, 4940, -1932, -3711, 4330, -6595, 5600, 2505, -5079, 1785, -805, -4073, 5994, -767, -2927, 5449, -8106, 3572, 1380, -2776, 6414, -5335, -1435, 1340, 714, -585, 3173, -2166, -3224, 3800, -6784, 7588, -977, -3277, 5265, -9037, 5256, 375, -191, 1610, -1706, -1737, -231, 2809, -3148]
351c148J0588j4629P121L834j0151J5344j3340M188J948o493P652k339M13j468
365d80J024n500Q148r18o001J0077j2241N844K559o319R753o390l042N295l786
380a977J449N908q587L061J211n198O713j531k500L776m413j851R264q046M305
395A584J099q583R037m803J012N308o776R97K069m100M050L532r215Q299n148
410a638k368J0494j1574R633m778m405P501m836L919j755J100n164N896l886J003
425h58P473j3009J0907p849M00R211r494O256l963j441K500J188k129K774o92
440A274o546R479p240L793M099j0522Q644m912j4N736m527O25P20l619K519L684
456C193m590L611k642l334N903k541n1M698p243K015K720n877R396o083n87L053
$$ y = [-3148, 7440, -7189, -68, 3766, -6385, 8959, -4381, -193, 1755, -4738, 2914, 575, 988, -480, 544, -4956, 3192, 2274, -3727, 6350, -5891, -47, 2512, -3807, 5946, -444, -3486, 1809, -1977, -528, 5380, -3207, -146, 1065, -4133, 2580, 1049, -1451, 2325, -2088, -3939, 5325, -2721, 1584, 2683, -5900, 3137, -1666, -654, 4654, -2122, -1125, 944, -3156, 894, 4426, -4789, 3510, -1638, -4006, 6488, -5086, 4547, -231, -4636, 2865, -1971, 1948, 193, 1293, -3871, 2025, -1861, -858, 6615, -6394, 4513, -3336, -2936, 6275, -3219, 3037, -926, -2367, 133, 1321, -808, 1966, 1274, -5272, 4207, -3033, 760, 4859, -5663, 2981, -1931, -1945, 3791, -736, -111, 609, -3010, -491, 3193, -1397, 2214, -428, -3762, 2141, -400, -451, 4247, -2996, -981, 1739, -4138, 5258, -825, -1412, 1641]
472A641n620N412m60k87p52Q17m218L171L153o844R793j0191L562L954q533J2132
488F730r341K735M9k542L629o21J756n682O766q965P568K34o710J1273j3238P301
504I42J59l593O904n989J413j602K511k477N089l391k782O623j0530J0927l833
519C71k116N360q237N449q29P02J82J83l165R54K718m069O839o010K82K541m461
536c306N071j37k568J950k049j509N231k905K66K095o011M792p79j085M435m787
552a296K19J668j738J043L382n885L465p07m059Q114n358R67K478o079M181J406
568A801l591M625l165k832N281l767K228K439n793L288p25k195N528k619k045
583a542L951n384K645L026m446L978k815j695L011r65J4K386k706k214N532n977
$$ y = [1641, -3979, 1433, 973, 686, -66, 751, -3467, -296, 2857, -3987, 5806, -4385, -823, 3131, -5402, 6730, -2611, 124, 173, -2369, 1260, 639, 2395, -3287, 3479, -5486, 2082, 2316, -4394, 6879, -6359, 942, 1101, -2492, 4412, -1577, -164, -1766, 745, -1732, 3357, -34, -2816, 3807, -6723, 4204, 371, -1745, 3615, -4622, 827, -2, 700, 882, 1065, -2100, -1146, 1572, -2497, 4342, -1668, -1386, 1155, -3306, 1765, 1628, -940, 1010, -1039, -2548, 2683, -222, 44, 2139, -3872, 920, 141, -944, 3491, -1296, -1077, 591, -1147, -104, 3278, -2607, 858, 151, -3908, 4206, -1152, -185, 2293, -3786, 395, 1801, -1790, 2835, -330, -3162, 2119, -1648, 580, 3019, -2774, 514, -211, -2406, 3122, 503, -1542, 2409, -2975, -330, 2696, -1750, 2228, -587, -2282, 729, -236, -222, 2164, -542, -2756, 2776, -3201]
599c201N888q25n184P247q826O032M23k664K918k607o70J85N095p386P778n505
615a302k468Q998j1282J1763n790k524N351o705O189k555K759m540L633l651P86
630a338P040j2039J3127j0567J436O626r436J0363o954J908j764J529L89o09M255
645C966r266R613p682K248O132r654R329q009K514K346k703L436l002J775m627
660c584O881n661L671K337r628J0871q603M006L318p157O369m740O61K573p75
675E39O7n86k39k045M591l777L269m83n516P405n683K295L262n776L799k415N47
692g46J560K51j097J10J68l483O705m150J54M304q431O859l198M15L508n247L229
709I11j512L05k50L927n095J833R98n917R718o752K213K242p289O947k967N84
$$ y = [-3201, 2687, 1862, -3322, 3925, -4901, 1131, 1554, -1110, 1808, -799, -1469, -1284, 3811, -3575, 4203, -1302, -3770, 5228, -6054, 5709, -81, -2605, 2746, -3959, 2230, -325, 2434, -2106, 1527, -2124, -1338, 5702, -6337, 6790, -3777, -2341, 4285, -5151, 5212, -1742, 166, -1598, -69, 320, -289, 3966, -5300, 4313, -3369, -1121, 5011, -4643, 4686, -3323, -809, 1537, -1166, 2270, -732, 1043, -3584, 3297, -2364, 1307, 3644, -5984, 4887, -3716, 290, 3608, -3549, 2820, -1920, -1259, 1314, 539, 606, 20, -219, -2264, 2327, -1450, 1819, 1336, -4180, 3225, -2458, -163, 3099, -2677, 1122, -1293, -746, 814, 1065, -32, 78, 246, -3237, 3468, -682, -528, 3776, -4655, 2204, -994, -579, 2929, -2318, 911, -601, -296, -546, 3381, -1714, 119, 1117, -4800, 4918, -1834, 379, 2621, -4668, 2279, -688, -104]
725a04J657r84k259R82J994k790M602n203L008r00k917O591n250K888k047j03
741h35M31L11J707k645K648n072M922j577o68L908n120J950j195J708o42J163
757I94m16j876J300k214N755n031K870m76m442O393n329M387j356k368L170k615
773a254J235L99K372n369L712j685j169N074n581N021m469Q2L731l627L102j349
789B25l57j717K258k68K30J153m225M569l855J671L244m551K455j773M06l23J803
806I45l05j534J617k880L590k540J629J791n099L498r62l52L081m012K757j128
822I6j820L046r29m68M27j72k304L340q95J13N52l354L827k299N03L148m556J975
840B30j070O45Q44o52Q68j352L14k465N350l712N79L145o671N335k002R46J062
$$ y = [-104, 1553, 569, -1690, -708, 1286, -1504, 3098, -2105, 903, 3, -2914, 3677, -1573, 1315, -732, -835, -404, -93, 1614, -1031, 1617, -3455, 1467, -110, -778, 3130, -1990, -40, -1235, 473, -169, 994, 578, -1298, 2, -2212, 3543, -1488, 1382, 906, -3536, 2857, -2472, 1915, 559, -1809, 1361, -1254, -19, 380, 2752, -2617, 1095, -590, -1759, 3315, -2266, 2755, -1714, -1632, 2099, -1528, 1574, 225, -132, -1849, 409, 141, 371, 1524, -2701, 1868, -1987, -316, 2928, -1623, 832, -941, -535, -858, 945, 640, -894, 723, -2157, 1433, -1107, 522, 2313, -2786, 712, -250, -602, 2479, -1533, 1224, 96, -1724, 1322, 393, -75, 352, 180, -2124, 1216, 321, 434, 986, -2368, 1459, -840, -337, 2811, -1745, 230, -840, -195, 649, -3, 865, -487, -173, -2638, 2712, -1000, -421, 2724, -3947, 1388, -614, 332, 1394]
857A394k532J331r26Q52q86L396m210J391J425m721O559m122J638K71l659L957
873A158j100j27P38N82l930L191K69k786N675o434L641j249j783M886l530J227
889D28p37P4j318L173p65j913K590m028L935j936K63K690m302K090n30N68n85
906c03J932k140k91J439k666N019m363J967N67m083M046j294J553j524K4l53L60
923a10J03K89J751n010M387j544j535M519m108K116j293j058K743j420M41L26
939E97m10k585L470p84o52K758m862L303r72o80L276l637R26J087k269J631J267
956A464j496k72M79k100K621o3j804L969n178J728K056k919L680k213j05j77l18
973f48P00J10J40j429K330l587L207P46l478M028m050K232j36q12K730l502J752
$$ y = [1394, -1138, 193, -733, 119, -767, 2629, -1581, -190, 1235, -3486, 3073, -1049, 589, 860, -2799, 1158, 58, -69, 669, 1251, -2679, 512, 781, -2005, 3670, -2764, 877, -372, -2155, 2731, -799, 428, -309, -235, -1553, 1620, 855, -1058, 1532, -2496, 1439, -497, -234, 2456, -1846, 244, -286, 282, -303, 1629, -511, -802, 637, -2029, 2990, -1373, 594, 1161, -2922, 1124, -170, 1383, -141, -117, -470, -110, -7, 282, 2033, -2977, 1410, -134, -1669, 2850, -1258, 858, -435, -1493, 1250, -170, 271, 597, 187, -2398, 1072, 288, -364, 2394, -2468, 835, -137, -817, 2459, -1178, -252, 835, -1434, 197, 1464, -32, -304, 175, -1925, 696, 633, -1171, 2798, -2380, -652, 1404, -1515, 2165, -48, -153, -330, -648, 52, 162, 302, -1127, 1203, -2384, 823, 1569, -1909, 2119, -1931, 301, 165, -647, 2083, -1419, 333]
990C33j452J996j970K334P3l748M222m321M227j715o69L136n365L624j101J305
1006I09m56r57P86j770K846k538L612l337k10L087n253N707k405j45J108k365
1022a381J762p28J377j314J238k513J297J682l493M348k727m72J471j725K441
1037A263q84r22O26k81j008K454n39j599K022k408J110J427j846J662j453o44
1053a020J657q32k89K271k604L60N92j061K099j513q9P07j435J034J385j577O24
1070C09K26j808J676m76P24J13j446N06m9n51J416L29k117J560q26J40J421j678
1088e31J219r03j089J891q32P7N70n41p07J387j027J078N02k429K156j910Q38
1105b51J660j477j7K74j008N09J452j890J478j394o04K816k747K206k01j893J279
$$ y = [333, -1119, 877, -1093, 1241, 1314, -2434, 1788, -2533, 1694, -21, -690, 2446, -2919, 705, -396, 909, 453, -504, 282, -1488, 1358, -1180, 2432, -905, -1115, 1972, -3281, 2426, 21, -124, 984, -1381, 381, -347, 1030, -284, 954, -1559, -262, 1420, -2073, 2275, -452, -924, 547, -1178, 1263, 379, -543, 83, -198, -1206, 1248, 709, -890, 1132, -1276, -166, 1261, -585, 1077, -376, -1020, 637, -195, -484, 1787, -817, -457, 135, -926, 1173, -340, -429, 278, -1157, -123, 1262, -315, 309, 535, -1273, 403, -73, 651, 764, -682, -176, -225, -776, 640, 969, -1148, 412, -414, -274, 1147, -531, 688, -215, -1304, 587, -245, -168, 402, -139, -846, 541, -486, 592, 1094, -1335, 821, -1089, -251, 1409, -68, -85, 189, -819, -310, 1142, -748, 730, -664, -1268, 1548, -1199, 1007, 806, -1087, 192]
1122A92j60Q8M18j20j155J219j385R96J212k450K215k196O98J270j021R95o76
1139A40o97j34J291j320J738r24j110J704j655J556J78j171O13j017L51Q15N3
1156D11o52Q41j197k88J925j454J699j339p40J468j379J280K57j027j26P72j650
1173a199J931m34r60J206j992J385O68j196J535o52j148J261n99P0J338j913L37
1190c62N71j463J884m32n91P27j067m5J395j82p92Q97k300K309l14m49J574k553
1208a193J245k64k06J045J98j269o4Q55j579K638j801O5J281k807K647q73J67
1225H5J125j876L54J52L41j02P20j353L14N13j620K984j828J16O79j895J731j19
1243C21L7j07m61o82R09K86l74Q84j493K28O77j051J599k65j497J571j172N07
$$ y = [192, 32, 120, 538, 418, -737, 482, -903, 93, 1305, -1145, 1070, -1126, -428, 842, -179, 816, 140, -557, -691, 600, -720, 1018, 94, -1016, 688, -967, 589, 767, -404, 209, -808, -457, 358, 411, -241, 600, -597, -885, 1040, -414, 1285, -54, -794, 674, -705, 575, 832, -195, -321, 451, -1199, 732, 298, -662, 544, -1448, -63, 605, -591, 944, 292, -856, 405, -194, -124, 1214, -699, -362, 209, -1254, 630, 198, -393, 334, -733, -778, 617, 435, -357, 540, -1760, 549, 235, -214, 1360, -1193, 52, -212, -418, 627, 825, -444, -508, 347, -1232, 1406, -395, -330, 951, -1856, 791, -82, 85, 1210, -666, -312, -160, 181, 79, 799, -554, -240, 273, -1347, 1637, -191, -75, 604, -1291, 440, 321, 358, 251, -210, -892, 17, 303, -71, 813, -680, -452, 225, -826, 773, 508, -989, 582, -590, -83]
1261h3J208j225M54o57l75R35J12p80R14j142k65J400j025J516l09j911J817j185
1279f01N22P26q86L49l09j54R7R44r80J215j776j55K054j827J667o08j100J083
1297B61p26J071k46j41o40O53n62J51J337k005J512j127r1J117p59R70r40l21
1315d86Q8P76n39O64k32p90Q46j279J323K53q27N12j021J87P59J86p61M25n18
1334d34J37R19j228J871j554oO42q15J208m31l6q44O11n60O52K45j102J303j655
1353a077J100M09q30J017j108K29k44P76l27K09N0q87J373r71J035n05o49Q74
1371D74j366J366k73j65N83q60m87P76N39n52P57j283L24M00r36J752q42l35L53
1390B25q38Q50R6l95K68j94p82R02J68l19L99p87J44N25q52J191m00p32R12r27
$$ y = [-83, 1125, -100, 354, -303, -678, 257, 369, -411, 503, -639, -904, 496, -529, 987, 678, -1233, 584, -601, -79, 647, -239, 110, -199, -353, -256, 688, -292, 923, -853, -1008, 1046, -781, 886, 278, -822, 261, -465, 606, 360, 219, -421, 232, -330, -179, 1158, -847, 665, -462, -553, 564, -195, 775, -165, -486, -398, 378, -161, 503, 271, -519, 327, -952, 371, 624, -203, 309, -712, -525, 234, 420, -341, 84, -434, -297, 622, -606, 1265, -289, -295, 347, -468, 740, 309, 273, -571, 40, -520, 132, 377, -725, 578, -1077, 23, 432, -398, 619, -489, -260, -504, 272, -55, 154, 204, -683, 690, -281, 754, 249, -400, 474, -892, 474, 201, 36, 619, -241, -728, 48, 587, 35, 792, -491, -167, 233, -703, 1049, 207, -128, 225, -613, 237, 333, -62, 206, 12, -770, 132, 300, -19, 380, -407, -263, 262, -590, 601, 201, -531, 381, -546]
1410e46P89R8m79N77m87J08rQ93j289Q37k83j145J935j825J612n52j030J327j160
1429f29Q84k59M45r72P88p81K11J433k209J978j745J75J277j349J900j362J25
1446i0J37jN9o7N14j269J159j138M98J375k149J761j435P89Q4j94N50n79j08o41
1466g45J484j320J255l7j649J591j449J193L03j182N22l37R1N13L00p78P79r70
1484d36L7J167j558J447m54p20Q31n55O38l55l60L81M0l33J71O73r66Q78j205
1503f79J23J452j328R03l95n89M82M15j55L92n46o66Q32o50K23P73j065P48o60
1522c90P6R11p71L21p3o61O34m1l1j60K35p26R31o63N73J006j890Q89l61r1P11
1543D29p89N52p05J33J53P59l87k70M33j538J659n57j5R34j787J431r21M25L89
$$ y = [-546, 243, 341, -138, 439, -48, 60, 51, 944, -345, 492, 209, -936, 999, -826, 786, 234, -796, 531, -629, 255, -4, 441, -531, 257, -524, -313, 1120, -1089, 889, -856, -681, 596, -753, 1147, -215, -90, 47, 46, 105, 38, 552, -717, 442, -696, -198, 1177, -972, 789, -646, 143, 227, 33, 583, 4, -104, -745, 739, -581, 674, 637, -1012, 579, -870, 323, 626, -556, -34, -371, -280, 233, 533, -245, 534, -436, -399, 768, -790, 657, 203, -517, 314, -241, 397, 42, -318, 63, 103, -230, -59, 614, -352, 526, -679, -556, 896, -432, 471, 76, -513, -31, 384, 229, 621, 75, -591, 241, -409, -186, 587, -478, 270, -390, -314, 597, -174, 147, 74, -587, 47, 6, -25, -185, 50, -676, 255, -408, 165, 1171, -719, 170, -191, -282, 429, -360, 192, -513, -380, -227, 532, 145, -125, 308, -1230, 429, -128, -143, 791, -996, 435, -486, -61, 328]
1562C28r4l78l09P78p33J398j008P0M87j925K406j505J003l71o64O45m19O08l73
1581e6L89j004M09N34q07J669j814J040k44p13J430j107J015q65j4k38K94K39
1599A57k45J025j989J300m37L7J002j465R39o98j0O62k7j86k90K31l28L47L23
1618C48j47P3r22Q77l50K88L49p29k75P09l60Q4N88m59l68J10j17O67n23M4M86
1639C73j035Q40j28p9O38r40N19k91j14K50j05j66j9J15m08R48j48n32L42o09
1659e49N34O86l33J84j065J81N01N59q27N05k64o13O97o30J039m61j43L26q41
1678e14O27O7Q1k61r5k05J90J17j69P23q84N80j43l91P53j17m35K02j97k40N75
1699B64j49l91Q01j442J262m70l09P23q91M74N3M8J31p5j87k57O76l33P49o72
$$ y = [328, 234, -144, -453, 325, -408, 990, -18, 52, 539, -1386, 1020, -485, 518, 147, -517, 128, -291, 317, -56, 333, -671, -262, 272, -535, 1134, -680, 360, 116, -597, 833, -274, 741, -124, -138, -376, -82, 157, -88, 937, -1052, 248, -189, -152, 850, -615, 324, -374, -384, 278, 251, 65, -225, 6, -322, 25, 348, 201, 274, -648, 229, -121, 167, 516, -213, -488, 221, -139, -55, 533, 74, -294, -184, -301, 366, -157, -113, 373, -662, 178, 50, -29, 609, -331, 188, -103, -217, 33, -72, -238, -257, -142, -550, 398, 250, -282, 60, -549, -15, 671, 338, 522, -543, -362, 139, 698, -129, 376, 112, -501, 196, -434, 605, 144, 1, 327, -514, 113, 180, 261, 0, -95, -300, -110, 7, -162, 561, -323, 257, 114, -277, 476, 359, -76, 126, -71, -311, 264, 115, -276, 525, -917, 345, -125, -434, 289, -602, -128, -75, -27, 104, 29, -158, -415, 261, -72, 677, 5]
1719Ek70L48n60R91n57M39j50m06K89j74L47p22R06o30k2K02l34N69l70K70m63
1740b92k33O72J05l33L77o85l4N60j62O2J68o25K46K21n28P58j95k65P7k60N18
1761A52R4j71j78k77J0O27j73k42K33k04l47P08k28K92j31p14Q93o57L65M72n86
1782f2JK05l42K01N00o94M99n91K29L52l08K80l11l67L84J05O7J7j3l39L77k78
1804h8K86J22r01P97m53J68J40k28J31j38j60L06j43K96J70l31j68J44O4J43J55
1825C12j76k62k27M54L17m18Q2O8l99o0J88Q1Q04j155L51J96p7P2j85j15m52R75
1847C74l84K53l49k09K48k65N52m58l8N35j6o40K70M42j43J3l47j12M08l24M30
1868B40m92pK75K5j84K9j3P0O8l43K91J16k66J84m89J53N8R5K76j26q6q9K58k75
$$ y = [5, -265, 83, -477, 514, -43, 396, 246, -160, 129, -45, 302, -420, 486, -144, -166, 36, -298, 271, -99, 171, -292, -525, 147, 252, -81, 296, -389, -423, 137, -25, 37, 205, -420, -174, 47, -481, 277, 82, -183, -106, -366, 152, 246, 75, -103, -380, -370, 257, 84, -158, 75, -129, -476, 232, 4, 296, 165, -549, 344, -313, 52, 524, -62, -61, 144, -198, 3, 503, -191, 308, -283, -54, 298, -10, 270, -41, -408, -24, 81, 148, 165, 152, -187, 190, -88, 198, 320, -581, 216, -237, -69, 71, -157, -26, -164, -324, -18, -161, 135, 305, -26, -194, -50, 14, 157, 312, 136, -126, -353, 101, 418, 0, 82, 150, -249, -309, -121, -40, 764, -391, -40, 156, 79, 151, -34, -149, -601, 374, -10, 243, -106, -315, -67, -332, 220, -238, -276, 259, 243, -397, -127, 315, 172, 185, -162, -274, 134, -190, 240, -252, -259, 16, 41, -143, -114, -127, -57, 11, -332, -41, 75, -191, -7, -496, -343, -285, -190, 86, -40, -126, -215, 43, -232]
1892b32R05p64m6K6j80L68M30k43l04m0J48l58L22r4J26m16M4K36j1M07l28Q3
1914G9j38M6K82r4m92Q3J16o29J016l35L38kq02M46o8J41M90n68k69M07k84J45
1936i2O94l81j18j41p5M05m85K63j84J12j08L25r2K16k22n10N32q1o1J43l48K26
1958A8n28L26L20J1J43k75K92m57L69o5Rm74j1M17j52r9P8o7l8L47m08K99R0l15
1982a70l8j5rM69l99K68j03m28L00L93k45p2k10K73L42j49j3j85q4J88O0l11K9
2005a09M97l37p3PK7J49n60L55k77K54k01N76J96k79j98j32J96KL38j98j06Rl52
2028b16L28J02k83K56p15K97J22J96Lj42j12L02j12m7M81l82J2k53rM58J01k64
2050A23k76j84M39j57M82m73L81l07r4M12l88M83n79O9J44k95J70K72l11J66p9
$$ y = [-232, 673, -91, -137, -111, -291, 77, 507, 264, -40, -80, 68, -290, 32, -62, 64, -352, -308, -72, -83, 324, -4, 79, -59, -13, 269, 175, -317, -234, -118, -747, 269, -66, 272, 270, -532, -86, -154, -13, 477, -91, -360, 47, -237, -92, 602, 221, 103, -38, -113, 292, -193, 70, -114, -2, -110, 215, 123, 339, 117, -393, 139, 58, -3, 140, -208, 18, -510, -184, 136, 147, 290, 15, 307, -150, 219, 154, 163, -311, -322, 95, -57, -156, -78, -145, -183, 164, -244, 55, 145, -170, -208, -223, -232, 237, -162, 106, 3, -425, -125, 268, 23, -49, -259, 14, 356, 207, 194, 9, -75, 113, 173, -138, -109, 388, 51, -22, -15, 12, 161, -399, -44, -321, -67, -268, 308, 504, 225, 27, -105, 91, 93, 431, 233, 127, 136, -216, 112, 214, -69, 187, -528, -231, -109, 87, 90, -52, -164, 138, 26, -21, 460, 78, 90, -163, -172, 286, 387, 123, -153, -337, 102, -55, 427, -46, 335, 28, -66, 346, -42, 441, -138, -69, 75, -220, -50, 222, -89, 77, -2]
2071br1L48j77J74l40q1l55M94J98k70K07l49L03J54j03P4m16P8J30l12L99j51
2093h8J66n2m37K05M80n08R2J22j4J03m2jJ45k04k86M46J08k47J69m00JQ6l50
2116e06N78N5J90m62l03K90J16P4N02n70j74L46j67K68N5n70M81m31j23Q56m59
2137D6j32K66j86j81L96m60K42j01p4M31m25L12K21l65M5J61k10K39j89j90J95
2158D1m40K23L81p2R3n64JJ79O7J64k5J7J19r7K3K60k01l22L19l13O7J49n1m7
2182b9l09J99R4K32J3J15k54l61N47k93J50J79n71M80r7o0L07k00ML0k09j54Q3
2205a04m3J90j45p8M22ln18K83k8j48J17K72l49j85M19l03K47J21j61m6j13n4
2227b07L65M2J00j38m8m39M43j78J04K86q51M82r3K51K98j59j44K6k47k79O16
$$ y = [-2, -93, 255, 78, 252, -88, -169, -524, -30, 168, -102, 105, -244, 59, 213, 110, 184, -232, -154, -24, -336, 63, -88, 78, 26, -411, -206, 274, -234, -142, -20, -34, 69, 27, 26, 171, -33, -319, 127, 235, -12, 157, -243, -242, -156, -506, 72, 127, 317, -145, -448, -158, -42, 32, 534, -36, -210, 136, -31, 237, 292, -278, 203, -228, -351, 505, 46, -86, 180, -6, -187, 209, -251, -9, -110, -184, 247, -178, 134, 355, -10, 35, 196, -14, 225, 36, -154, 41, -399, -176, 205, 133, 226, -338, -337, -158, -91, 73, 48, 65, 184, 87, 110, 370, 169, -153, 166, -147, -80, 69, 18, -29, -338, -139, -45, 187, 200, 315, 61, -300, 247, -46, 104, 283, -288, 192, 95, 35, 342, 142, 146, 176, -33, -187, -104, -147, 43, -102, -180, 242, 239, -279, 4, -24, -172, -55, 217, -132, -317, 102, -201, 46, 167, 6, -40, -153, -207, 158, 200, 300, 162, 114, -325, 118, -60, 44, 330, -521, -39, -132, 119, 417, 258, 114, 140, -107, -386, 230]
2248B30j50j38N6M2R5j26j1J14K45o33L31N4j41N4m9p7N7k50N03l14J84k91J11
2271a04j4NL18k14K6j96J28j5j54L24j96J58j83R6K16J88n79L19n8q2K77j66j14
2294b0r6j24L20R3j62J72j10n10P01l02K25q1k58K79m48m9Q85l53q8o4p3J3O3
2317A3m66N04l80j57L00J59L76m10K33m9j02J32j55Q2N6M7k8k00M0pJ24j11o1
2340f0J89p7N29o09J2J20Q4j27L1JJ32m10Q5L4P3J50j70P3j30K15jk20J15p2k95
2365c28K43j06M69j69q2M21n67J52Q5m37L46j87k65M74K77n58L09p5j57k43M32
2386C4J6j70K03j23K2J80m7m07K35j79k56O04k49J22k22K48K7J73k69L8P2k72
2408b20L54k6j94J66R3m9j17p2M80j29m69Q6L40n6j31m09M48k23K60j5k51k69
$$ y = [230, 80, -58, -2, 40, 135, 9, -2, 112, 357, -276, 55, 109, -32, 22, -27, -104, -47, -297, 206, -108, 76, -215, -104, -118, -113, 205, -9, 17, -179, -51, -66, -220, 104, -92, 66, -117, -21, 195, 383, -196, 123, 65, -17, 260, 94, -20, -116, -240, 80, 173, 11, 183, 73, -437, 264, -38, 187, 106, -152, 127, -321, -370, 515, 162, 74, 10, -63, -50, 13, -453, 51, -329, -486, -186, -27, 349, -61, 172, 123, 21, 153, -2, 80, 136, 183, 155, -45, -5, -12, 112, 1, -60, 129, 52, 581, -28, -16, 104, 188, 61, 92, 93, 225, -185, -100, -66, 7, 157, -13, 60, -70, 145, 144, -76, 39, -33, -328, -85, -191, 278, 109, 27, 448, -119, 33, 118, -319, 27, -160, -425, 49, 326, -232, 77, 2, -155, -398, 34, 50, -120, 83, -40, -18, 162, 115, -292, -57, -236, -492, 112, -137, -15, -237, 11, 38, 211, -58, -20, 52, -220, 134, 108, -86, 80, 173, 124, 7, -65, 415, 286, -183, -97, 243, 187, 56, -353, 95, -128, 132, 117, -134, -403]
2430d03L17L4o3M24k11J11k68j90R8j40J94Q8K79k36j7K6l29N84l7M8j74P7j92
2453B0O1J52l07L14m37J99L5J77k90j62P8J92M9P7n04J01M64k78k55N02l7j56
2475em8j30R5J22j70P8R5R9m02L04M94m20j20j39J77J52k29j90K79j31J18N8J46
2498B33j41k43m0L33O1m43K71rp9o7J97J36j22j67n6K22m28M01k15L07j48P7j18
2521c8J26k37M02k97J97j52j62J18K09j76M7k33r2L82k63j86K68L2L78k10l3J9
2543I9l32p8K29L6N5J87k73k23L08j26J64Q3l7K12n88j10O21l33j0j25L82j92
2565e1m70O39M3j40J37l98J31K84r3l03N5K53K9m9O0j76j47r5M17j10j02J6m1
2588a11K81l90O3N18l95j12o2P9K88K51o80L50k40J60m2l7O1j82K45l23J44J72
$$ y = [-403, -86, -52, -115, 309, 98, 209, -59, -249, -151, -291, -97, -9, 270, 34, 17, 43, -286, 298, 261, 309, 135, 212, 20, 81, 233, -74, 240, -197, 2, 37, 214, -76, -238, -160, 32, 81, 158, -346, -245, 219, -59, -314, 188, 151, -5, -53, -183, -88, 34, -136, -58, 37, 136, -266, 38, 532, 112, -8, -147, 30, 182, -47, -237, 42, -89, 29, 87, 233, 92, -151, -191, 142, 203, -240, 31, 22, -57, -124, 73, 209, 87, -80, -136, 86, -342, 59, -156, 151, 3, 80, -38, 88, -149, 253, -44, 153, 1, -161, -43, 166, -10, 37, -196, -288, 94, -169, -355, -87, -55, 323, 113, 80, 99, -233, -311, -82, -46, 9, 196, -77, -300, 8, -118, 46, 129, 92, 304, -284, -394, 227, -106, -116, -241, 141, -51, -521, 118, 161, 21, 158, -240, -109, 175, 82, -221, -166, 87, 116, 67, 127, -49, -196, -291, 126, 16, -86, -70, -111, 170, -220, -157, 361, -34, -146, -208, -129, 159, 410, -270, 80, -160, 0, -42, -79, -18, -200, 45, -278, -134, 38]
2610C8n9J63j39j78J19J44m7j02L26l09k54M59L30p84L89l05M30j73K42j35k26
2631g1m4N59m06j49M76l75K21Q9j13m1j58j9q3oj10J5K95J99l79NK58j80j03K18
2655I8j52j92M13K0K5J48l16k44M5l2L04k16K93j97j12O8M28k49K3J14n37L21
2677E3o3K22j26k94j57J52J01L16l65j52M05j38k07J94j50L44J79l96j24L13k92
2698a85N62l09k2K65o76M59j01lk85K85K64l6L4m41j75J34LM24k62K16p6O7j45
2721cq6M5Kk22k83L87J01k02M33l22L60j72P5j44r2K46J27m00L72l12j8N11k05
2744A98k43k1P9N2K51k31p6N0j21n2J95j37J1M4r4M58r3k38j34Q4k39Q0L58r1
2768I0J40m36L05J88J12l32j8J52k43Qk29L93K3m26K62J87j88KL53m02m9OL92
$$ y = [38, -21, 142, 3, -175, -56, 88, 41, -61, 265, -44, -298, 161, 491, -293, 96, -209, 221, 48, 290, 155, -71, -115, 444, 38, -111, 365, -10, 211, 300, 187, 146, -12, -31, -114, -120, -230, -215, 80, 279, -100, -95, 163, -17, -120, 98, -54, -246, 167, 187, 212, 360, 44, -200, -155, -187, 117, -99, 194, -3, -115, -47, 381, 132, 155, 269, -268, 53, -10, 212, 86, -208, -365, -213, -112, 204, -161, -313, 92, -46, -253, -59, -209, 135, 314, -82, -206, 107, -185, 377, 68, 46, 311, -365, 94, -7, -10, -295, -10, 254, 218, 252, -189, -364, -230, -227, 197, -65, 151, 75, 142, -3, -89, -44, -42, -264, -547, -160, -59, -261, 172, -150, 210, 38, 113, -31, -123, 123, 250, -150, 222, -90, -108, 403, 198, -45, -66, 13, 65, 316, 85, 9, 59, -62, -114, 81, -56, -45, -1, -95, 363, 270, 32, -102, -18, -257, -177, 181, 90, 230, -206, 99, 287, 399, 67, 49, 201, -42, -34, -263, 130, 153, -273, -11, 176, -12, -10, 343, -59, -108, -102, 290]
2791B90n53J32M4K39o52P17Q2l93p5P9J14K60j80r6J14k84K90k32K41k43J08J8
2813B0J20j24QJ53j04j45K37n13L15j15k0K55j96J84l03K63k52L54j37k47K39
2834hJ72m3j28j00k55K29P8P8j17j3K33N7j87J63l66J54o0P2K11k60J04M1m7L56
2858C64m91J77n6J84l96R2k45M71m0j5L37n95L26P6r9N4j96r2K16j91K16j17n4
2881g4R1L68k7j54l77K22j47J53j23J38o2R6m85M23R0l06R5q7J09J04M73l33m68
2904b81J34L14j15j81L05K22n74L74m36J83K71j24j20K7j30L65m58J52K48k58
2924h2J63j17qK63k49j30J55O8r8L4J09k16L51l91j38M68l03j5J58m3k31J75j47
2947b24M4J12M43k98p4r1K49k35J44l51L59l64O3N25K3l48q6m7P37l14Q1m78j13
$$ y = [290, -263, -131, -87, 152, -500, 217, 299, -94, -169, -90, 24, 284, 104, 8, 122, -162, 128, -104, 137, -106, 2, 20, 140, 16, 24, 177, 73, -72, 165, -348, -33, -148, -168, 87, -109, 75, -228, 35, -217, 137, 0, -247, -8, 164, 121, -7, -107, -362, -133, -55, 23, -94, -107, 126, 183, -4, 159, -207, -53, -113, -41, 170, -90, 14, 55, 8, 364, -127, 50, -6, 178, -218, -126, -371, 100, 60, 45, 382, -213, 113, 189, 90, 144, -52, -144, 72, -119, 97, -20, -74, 17, 385, 358, 204, -173, 49, -98, 55, -68, 70, 8, 104, -381, 42, 132, -174, -79, -166, -57, 47, 520, 187, -281, -147, 167, 52, -129, 176, 398, -176, 198, -238, -55, 216, 92, -28, -1, -131, 234, -224, -72, 176, -82, 81, -36, -44, 219, -30, -160, -5, 63, -35, -1, 108, -108, 243, -148, -286, 182, -121, -136, 22, -21, -252, -77, -224, -180, -68, 375, 77, 3, -88, 161, -74, 70, -281, 78, -286, -223, 302, 325, -23, -109, -156, 581, 267, 348, -130, -243]
2970b43N83k55J99l44p1Q4P1K68K2j31K0l05Q3N4j15J52j94R3R6j25k7R5J02q0
2994C2j76J66M58o20J65j06K00j04K3K51k61J61O8j13m13M00o7j73K90l55J55
3015a9m9k10j35L87R3J11k81J51j48k6RM40q07N69j74j32j33K31j18M42l4j34
3037C3Q0k7j29K6j26L55l02J21pj92Q1J73J9j88J58j81L76k22K00l28j29K88n1
3060B8P5k26q0K95j00j32K24j92J90k01N43n38M30m55J60P4k80N01m33L05l51
3081a63P5K72o5j37K0Nn8J82Oj10r4j52J18j88L69k99M62j05K33n61K31K21K0
3104B82l55O6o5K7J26j63K77m34K84K7j52Q8j11K60o4n4MM9K48m8k29l45j8M09
3128A09l4j66J14Ln3j83N08k36r1N%r9L09j15j75r5M02K7j39J39l10r9R6J63k78
$$ y = [-243, 340, 85, 284, -60, -131, -47, 24, 292, 314, 183, 203, -102, -19, 35, -80, 72, -122, -29, 67, -58, -85, 10, 112, 32, -144, 22, 480, -140, 25, -81, 119, 15, 38, 289, 28, 189, 257, 144, -269, 131, 64, -109, 181, -174, -19, -68, -278, -413, -26, 67, 178, -103, 48, -100, -126, -117, 323, -484, 85, -89, -221, -354, -123, -241, 201, 167, 33, 113, 86, -43, -17, -143, 212, -90, 31, 24, -168, -87, 86, 105, -83, 75, -106, 270, 48, 248, -80, -209, 79, 28, 103, -123, -203, 92, -8, -140, 84, -108, 82, -119, 424, -114, 316, -139, 21, 95, -185, 316, -117, 188, -163, -88, 184, 119, -18, 2, 7, -51, 131, 137, 27, -67, -219, -101, -289, 80, -219, 243, 138, 371, -190, 41, 262, 282, -73, -7, -72, -45, 81, -82, 195, -239, 45, 72, -80, 8, -103, 157, 93, 39, 43, 92, 340, 292, 63, -282, -300, 109, 75, -91, 23, 26, -27, -210, 298, 62, -29, -24, -24, -123, 186, 71, -104, -199, 203, 230, 91, 230, -80, -179, -83, 80, -198]
3153a98L41n1K9j65n2K40k2K05l63N9K7j26L73j73r5q9L9J27j91K59q0p1j20J18
3177B1J31k10K91k61J0O8K22j00j59K0j7l7J74j71J14J16m30Q5O6o7J86P4q9j96
3201a59K30j99j78L42o7q8L6J28J70k62M8l24J97K11J58m03J93%J39j59j98J46
3223c9Q8m08K60M5j93M08k07J62k02k08L51j70p1k93N58P0l25qJ55L03k23O8P8
3246A99o27N54k75j11L34q3J66k50K09J22J05j92K31q6l06l2J7m7K57k13k13J73
3268f8j2L17l33J39l00K79l5r5O1JJ28j28j60L52l11M11j37Lj17M8Ko1J88l83
3292b11Q9k25M31j09Q6J06qj9n14N22o6l01M91m70O5L03j13k15K42m61M54K34
3314C11l77J28J25k25L15l59m2K15nq7l84M86o0R6l67O4J06j12N1J11j31K37P2
$$ y = [-198, 143, 92, 121, -44, -96, 144, 122, 327, -36, 23, 50, -76, 297, 124, 29, -60, -21, 106, -85, 174, 94, 23, -97, 21, 152, -58, 233, -28, -18, 50, 272, 172, 13, 33, 16, -21, 153, -18, 96, 212, -218, -133, -67, -134, 52, 126, 37, -159, 71, -128, -306, 36, -31, -119, -83, 45, 215, -47, 1, -323, -126, 85, 243, -160, 33, 33, 172, 13, -185, -39, 49, -359, -99, -54, -247, 161, -46, 116, -86, -294, 57, -113, -184, -477, 81, 151, -174, -182, -27, 276, 53, 121, 199, -428, 126, -149, -260, 74, -9, 157, -93, 116, 238, 343, 151, 382, 296, -10, -42, -25, -72, 185, -28, -241, -68, -80, 237, -96, 43, -257, 22, -13, -108, -47, -46, 82, -46, -206, 146, -165, 246, 109, 112, -5, 43, 45, -16, 172, -211, -122, -347, 84, -25, 61, 167, 159, 140, -374, 148, 82, -219, 272, -198, -133, 170, 57, -158, 84, -377, 77, 311, -66, 62, 187, -38, 277, -82, -124, 91, 86, -1, -385, 101, 41, 137, -230, -166, -60, -172, -121, -10, -141, 96, 168]
3337A68n37L83k09M49m85K38O3p0j13J75k98K90o8J52j96K15n4P2k65n6l8J16
3359f8m6J10K94K1m6k59J75j23M5LJ04l25L64J80l78Pk09N41o72K00J02l9K18
3382A99l70Q3M12p67L70Q2J23l95M59m82M14P8l43M1p7p9K32j18K88pM5j81Q9
3405I6J8j59k12R0L00k86Qj46K40P3O2j36o0J12j66K33k82K41j94o9N97m33J91
3428A18j67J38r0k79K95L03l60J85Kk37l4L2LO8m0k02K19j15J74j17n9m2J89%
3452a6R5J7J14j67K8k42O4J72K9k01K14J54k51o9K12q3k05J71J7j03L0k0p0J13
3476CJ0r9K44m12K39k3J05K0p8J43m0k14J06P0Q2j25k05J62j40J17o8M6j2kj66
3501b37K44jm4J17l48J79K18n1J6p3k79M62J75k06l6l97K17k08K08K34j17J91
$$ y = [168, -369, 14, -195, 254, -231, 7, 70, 0, -113, 62, -236, 54, -14, 138, -58, 157, 103, 175, -90, -146, -184, -68, -114, -4, 290, 311, 265, 6, 181, 58, 103, 106, 210, -115, 249, 429, 51, 58, -151, 390, -282, -82, 20, -19, 199, -171, -88, 324, -443, -73, 9, 132, -263, 196, -286, 128, 206, -137, -96, -173, -252, -20, -138, 150, 143, 188, 7, 96, 114, -45, -257, -167, 133, -153, -145, -291, -51, 22, 84, -52, -112, 0, -166, 67, -215, 26, -168, -237, 360, -73, 118, -49, 89, -1, -280, 15, 318, -42, 143, 145, -92, -126, -94, -91, -23, -63, -265, -46, -161, 13, -104, -163, -205, -16, -16, 79, 96, 210, 43, 71, -171, -107, 65, 94, -107, 107, 261, 10, -59, 153, 70, -135, 36, 53, -50, -20, -40, -110, 3, 13, -86, 158, -254, -15, -38, 67, 87, 9, 152, 112, -102, 4, 74, 156, 31, -174, -12, -152, -35, -103, -57, -69, -71, -237, 7, 6, -38, 79, -269, -90, 128, 77, 93, 20, -259, 203, 378, 172, 136, -261, -44, -252, -44, 190, 73, 264]
3523B64%m08J85l31K05K08j60n0J21j96M9j08M05r3k01j97K77Q6J22l70K55j14
3545e1j04K80j54O0L4M2j78nL0K60j67k0m32M82j30j61L0K89k80K0M18l86R6q5
3569a12L10o15L46p1O8P8j0j76J65J52j88k9j09J02J52j09L8P7m6J50R4q3l0o8
3593H6k01l7M1J0K15k75K65K27l67j52M1O2jO6j00N3K76p3l3q1J50j12K18m06
3617a28k11L30J42j39P4p4N1J04k10k67J74O7K79j00l17M16m24K83j10%J19k19
3639a60K60k58J92j64K2R9J60J79k69r4j18L55j94J46j2k77j6L59k80J47Pk82
3661a98M84n56Q1O2J35M0K23k60k6j70J87M76p09R5j53M89l58K48q4K67l44j5
3683h6K06j82K39j64m9KR3P3k76qK50n37M20j0J57l14K36p7j82L54k09r4K36j54
$$ y = [264, 264, -144, 41, -290, -85, 123, -37, -87, 34, -162, -113, -221, 184, 91, -110, -307, -30, 56, 178, -192, 63, -51, -155, 125, -29, 31, 65, 107, -71, -76, -46, 214, 47, 27, -405, 77, -53, -214, -184, 105, -175, -155, 263, -123, -27, -112, 198, -417, -71, -142, -74, 4, -6, -182, -17, 135, -53, -82, -191, -89, 63, -46, -8, 69, 23, 173, 267, 184, 154, 86, -115, -152, -111, -101, 114, -161, 104, 331, -36, -188, -147, -85, -86, -20, -120, -67, 209, 136, 103, 22, 172, 60, 278, -128, -339, -9, 133, -6, 68, -6, 45, 149, -61, -328, -154, -87, 192, 92, -225, 191, -233, 50, -60, -60, 59, -160, 100, -158, 34, -130, -108, -9, 151, 330, 61, -33, -151, 204, 10, 156, 144, -133, -149, 210, -70, 77, 84, -198, 286, -270, -189, -127, 8, 48, 271, 11, -15, -185, 2, 478, -231, -136, -289, 200, -158, 90, 6, 273, -71, -86, 120, -62, 177, 13, -36, -34, 59, 132, -144, -152, 98, -439, -19, -29, 128, -186, 50, -27, -209, 145, -64, -158, 78, -76]
3707g6K15k76K2K97K4K8l15K78j89k24K21K37j74m5p8NJ69l83J46M02l47o0J02
3730b1J15J82l46k7j06M43l93J47L94k96J26n0j86k12K49J36m42K00j50L56l31
3751b12K74P1k33n5J16k85jK70J38Q5k81k34M41l04K83j38K30nl3J76l79K40k53
3774h9J52k19M5JP6Q0M5k68K66j73K28L3l29M55o1m97J18K04k26K07L05m37j97
3797b81J78J27r5K88l38n4J60n7K49Ok48K87j01k78K25k11L40k08m3J64l19M18
3819B09k37M04j70l70L57p2p0j75J3J63J72j80j58k13M00j48J66l1j87J41J89
3840B03J47n05M3J53K20k00ql5m7J43o1Q1J49l95J50p1L46Nl18J95m44N14l08
3863d3R1L61m98k52M58k46J15m6J08nm9j3q0k5K89n8k36N2j7J71n7k9K05j89J63
$$ y = [-76, 139, -137, -115, 182, 206, 234, -81, 197, 8, -216, 5, 242, 68, 23, -55, -50, 119, -264, -118, 284, -63, -123, -21, 94, 276, -70, -97, -203, 240, -153, -6, 388, 92, 218, 168, -18, -230, 19, 155, -287, -87, -237, 119, -212, 62, 133, -100, -155, -39, -324, -325, -55, 83, 168, -113, -347, 94, -210, 73, -65, 165, 160, 127, 303, -76, 164, -89, 63, -156, -111, -110, -34, 46, 91, -177, 89, -84, 144, 177, -152, 303, 242, -255, -137, 67, -159, 48, 353, -84, -281, -103, 24, -71, 217, -121, -175, -15, -72, 177, 183, -65, 222, 121, -157, 68, -143, 197, -11, -54, 110, -209, 209, -28, 376, 206, -164, 193, 121, 51, -124, -111, 52, 224, 44, -114, -327, 73, -75, 91, 60, -127, 14, 203, 350, -155, -112, 41, 261, 61, 53, 18, -29, 114, 53, 134, 283, -112, 38, -33, 313, 318, 0, 195, -249, 265, -43, 48, 409, -89, -341, 117, -129, -14, -60, 48, 43, -6, -19, -99, -124, 165, 107, -129, -77, -94, 77, 20, -9, 196, 7, 170]
3888A70l36J40j89kL74l70N2N5K52q1j47j08N1J16J7J64k43R6L6J88j61K3k20
3911a23J76J05l15K52J33m37K14j39J26J80j2l13K35j72J34L54m30lR7l53J06
3932a85R0N8L78l60j71K36J27m5q0J49m37k56L61j10J41k78J23L75l94L32K69
3953C23o78K28o1J23K4Q6p9j68L49J44l93n9J03J11j21j08M48k88k4J76m11K48
3975b7J55k21R2j16j5L62R9k07m26J70J4k70K98j26K33O2o8j73N1K32j81K92l59
3998a29j23j79P03j09k69K36P7n46L10rK93l45N3j14r9L86m0o0K4k71M5N32k82
4021H4K6J17k29K35j65l79K16j3Q6P7K70m99N63n53K2M8J55J8j21j75Q4k2M7J69
4045F1O8pk08j44M50L5j66j43L06m08L22M9l09L26j77J73l41m2j2M14n6j37k30
$$ y = [170, -166, -26, -215, -217, 157, -213, -161, -106, 146, 65, -82, -190, -139, -23, -6, 158, -85, 11, 47, 235, 74, 97, -123, 53, 158, -157, 95, 228, -209, 5, -134, -8, 172, 160, -153, 82, -90, 44, 398, -32, -35, 62, -291, -185, -95, -37, 341, -19, -190, 46, 173, 128, 48, 197, -240, -496, -135, -245, -104, -382, -259, 116, -278, 54, 323, -355, -127, -188, -65, -41, 45, -34, -202, 147, 291, -102, -161, -58, 53, -68, -176, 272, -16, -40, 136, -275, -27, 128, -93, -1, -117, -132, 230, 329, 122, -304, -134, -120, -390, -92, -218, 15, 77, 9, -164, -113, 119, -62, 230, -129, -252, -431, 272, 163, -106, 130, 207, -339, -29, -38, 255, -90, -37, -151, -250, 136, 96, 36, 60, -211, -166, 366, 84, 110, 227, -2, 233, 68, -311, -95, -108, -22, 55, 325, -174, 389, -164, -142, -94, 61, 79, -42, -217, -133, -155, -108, 61, 129, 122, -86, -230, 220, 255, 89, -54, 252, -156, 166, 215, -94, 232, 55, 228, -113, -155, -167, 247, 191, 54, -176]
4068a76K95l79M10l04KM71l48O3l58J29J54J46j85K55p4k39K45j03O4j14oJ57
4090A05j88K13n3K1l5J34j29j87j01J70J78Q7k52j04L54k23o2J59Mk22L54l08
4112h5k52K21K80rk2l93J75O3N9J41l29K77K0L2r1j03O9j67J27M4k96J23J10l91
4136c97L74K24j90K89l33J59M1l76K84O5j49K58k53j86J88l93L40K97k40L4j25
4157h9mJ22J02k37k71L39K31k82p8M4J66qJ97k81m2K4K74k07P7Q6m2l85K99j50
4181a15J26P5j45J96k65J40J22j8O4k59nK08k77L03n8q0J2J73m55J15j83M15K16
4204C05m15M8K6L8j74L25J7j51k8o2R0J47l62K45N7n5Q2j11r2R8m5Nm2L4J29k24
4230a15L72j16J2l81J61k75K93%kJ44K0P2j78j87J72M56n92m4L74k85J94n1j13
$$ y = [-176, 119, -260, 150, -154, -152, 319, -29, 34, -324, -195, -41, 105, -80, 175, 101, -138, 107, 4, 68, -46, -52, 105, -83, 130, 77, 98, 63, 197, 68, -119, -220, -50, 128, 215, -37, -141, 213, -10, -72, 87, 91, -131, 223, -85, -337, -116, 164, 155, 133, -260, -85, -22, 37, 178, -151, 126, 146, 178, 87, -16, 53, -114, 13, 57, -239, -116, -6, -397, -23, 201, 11, 300, -33, 126, 167, -209, 75, 140, -9, 249, -4, -190, -2, -395, -55, 242, 2, 36, -89, -93, 29, 131, -106, -377, -38, 193, -89, -167, -123, 43, 35, 232, -49, -91, -67, 207, 0, 77, 163, 121, -264, 35, -115, 11, 86, -59, 137, -128, 12, 134, 116, 180, -79, -84, 124, -153, 150, 92, 12, 24, 197, -258, -143, -326, 89, 305, -110, -62, -36, 2, -172, 153, 170, 19, -9, -71, 19, 166, -196, 49, 106, 51, 133, 22, -70, 28, -17, -12, -54, -20, 109, -115, 257, 141, 153, -228, -67, -342, -49, -49, -51, 93, 113, 185, 7, -180, -8, 448, -144, -188, 186, -99, 95, 44, -69]
4253f9j1J65K22j83k02j47m3K69P5j48q4j30L70k71J24N2Q6j73L90n71O06l77
4275e0R4J02O4j02p6p8P7O7k06L4J36l20Q8n5J06q6K80l17K00j08K49L3l28j0
4299b06j5l4M37o6l70M76k79K18k78O8M19m73p6L2Q8k78K68J60j24L13o01N52
4321B31k42j39k20M72oj15j36R5q8K8L44j80J84j24j89J94j44K47j10j74J76k59
4343a55L48m07L04l63N51k61k80K29j1j67J38K32m11N07l46K06j49J92j58o8r4
4364a63N8J69r8no4p1J58J57k17J08k87L58L6L8j59j26P7K59p7l00J83j39Q2J17
4388I4q8R2l05J47j56L23J63j74j34n4L25l17Q6j87J32J43j32j12K5K29m6pn2
4411eN4o1N6J02l10M31k58K39k33q6j57J06p5K01J48J22k55Q3Pk98K85j08J18
$$ y = [-69, -80, 85, 307, 124, -78, -225, -268, 1, 76, -72, -156, -286, 84, -187, -63, -11, 75, -98, 292, -279, 327, -50, 44, 146, 210, 108, 32, -46, 31, 98, -108, -74, 62, -258, -170, -225, -119, -205, 75, -242, -42, -150, 99, 132, -196, -206, -221, -255, 182, 116, -254, 222, -57, 161, -117, -49, 370, -103, -179, -147, -59, -337, -69, 91, -33, 280, -321, 231, -11, -150, -370, 102, 96, -19, -155, -60, -148, -120, 224, 44, 228, 104, -85, 109, -35, 212, 102, -72, 104, -155, 193, -214, 90, -273, 278, 17, -263, -34, -45, -212, -74, 158, -253, 254, -92, 114, -35, 157, -1, -69, -163, -105, 64, -34, -39, -103, -174, -16, 141, -76, 32, -255, 103, 139, 177, 18, -108, -31, 228, 151, -149, 34, -105, -23, 94, 6, 98, -207, -60, -216, 107, 270, 96, -38, -92, 233, -84, 2, -185, -53, 90, -42, -154, -129, 100, 54, 47, -5, 49, -12, 44, 146, -164, 267, 9, 248, 15, -71, -228, -122, -197, 4, 152, 274, 19, 102, 109, -189, 96, -12, 106]
4434A06o6K21n45K85K27k05j46j6K05k5J83m77K67J44m04K54j83l5O7L02k26L45
4456B78On55J79J09l98O1M00Q7Nk79J03J47k01P8j90K21pr8J42K89j90j64L8k21
4480a60J34k43L2M43l46m4K81J06j55L9j91L51q8KJ8j98J12k62L49J6l18N4L5
4503c3l9P%l0K61k61J30K8n7Q4j21Q7j50L65l40P6j87K59M65o20q7Q2P7J18j59
4528d5j4P2K2K22m14J50P7M6o1j67k25K89l3K45n4k42K50J45r3K7k73J96k11%
4552i1N6N4k3k4N4J84l53K13j44LJ1R8L72l84k6K7K4q6Q0j61N48o82N53l69L57
4577B91m45m8K65l96L9P5M27n4l01J89J82k05M6rj77J94j07q2R5K28p9Ll47J64
4601e2p9j89M01j03k9k1l4N3j42O5J84l04N65k62j08P5M5J27j04R5m62K80n7J03
$$ y = [106, 40, 261, -284, 1, 228, 23, -123, -139, 66, 41, 224, -253, 14, 158, -246, 8, -175, -210, -143, 159, -67, 278, 284, -271, -92, 17, -381, -320, 80, 167, 172, -107, -4, 143, -58, 20, -170, 51, 44, -54, 88, 377, 187, 23, 61, -160, -26, -269, -237, 206, -140, -184, 97, 203, 48, 87, -104, 247, 159, 161, 179, -19, 93, -169, 180, 196, -122, -68, -33, -72, -65, -65, -95, 166, -95, 35, 63, 6, 90, -31, 56, -94, 271, -69, 7, -180, 79, 544, -76, -163, -81, -4, 114, -45, -59, 13, 35, 257, -157, -7, 70, 116, 55, -112, -337, -48, -81, 164, 110, -132, 118, 263, 170, 197, -76, 120, -91, -91, -35, 19, -4, -28, 26, 210, -143, 70, -74, -71, -60, 38, 410, 26, 0, 27, 51, -35, 45, -116, 432, -250, 303, -66, 291, -154, -202, 63, -333, -294, -219, 208, 154, -147, 42, 224, 19, 65, 56, -121, 73, -34, -116, -21, 207, 128, 131, -216, -52, -131, -320, 81, -22, -51, -72, -106, -53, -195, -130, 54, -250, 315, 53, -55, 20, 65, 192, 88, 183, -279, 1, -56, 47]
4625D7j76J92J61k53p9J19j80m2K02K81j38k15L74o4l73J92j80K8M5P4j69J56
4647BJ11k39N7L05l82K20j53K18k60M7K82l35J11O4K60j37j86J90k93J07m9J58
4669I8j77l4o4K3K33k7j17J29k6K42O1l45N6k4q4J98R9j56K4o3J47j82J54l12
4693a47K51L08m72pJ05J42k24J85j0K1m15K97oj39K0q0J70n2r8L15o2J89k03k88
4717b00M0O9J9m7L16J03m45L06j43J77j22j4j00P8N8j79L27l12K0j70J90J38J7
4740A26N4m78L96J92k98k02J63N5n1J04j15N3n1J07m3J13o5q1L86m05J11Q6p6
4763H1k4o5K3j37R1J38q4J77l75J81j11P8N3nj28q1O4J63n6J21o3m00M01j38J05
4788Iq4j75M31l57K49k74q1L45j19KnM06m78R8j61l5O12q40M84o0L0P3j92n6N48
$$ y = [47, -129, 63, 224, -29, -108, 11, -169, -211, -9, 272, 134, -81, 293, 229, -144, 48, -132, -104, -59, 15, -154, 2, 113, -126, -69, 236, -146, 74, -79, 139, -121, -74, 208, -127, -16, 48, 308, 171, -15, 175, -118, -11, -60, 98, -79, -113, -177, -154, 79, 52, -65, 64, 38, 280, 341, -4, 52, 28, -56, 142, 241, 85, 109, 46, 193, 11, 165, -147, 104, 412, -60, -67, 38, 180, -44, 141, 131, 152, -263, 34, 28, -111, -91, -171, -1, -53, -151, 164, 102, 291, 88, -200, -160, -91, -72, -119, 197, 300, -145, 161, 18, 195, 73, 59, -41, 37, 95, -84, 243, -69, -49, -219, -29, 109, 126, 180, -298, 98, 290, -8, -210, -47, 8, -43, 61, -54, -1, -52, 55, 12, 125, 60, -21, 365, -40, 71, 157, 81, 57, -8, 15, -122, -31, 107, 23, 200, -175, 6, -105, -27, 26, 21, -107, -188, -124, 39, -17, 104, 41, -359, 42, -96, 9, -75, -250, 181, -176, 73, -201, -282, 63, -56, -54, -59, 347, -131, -33, -194, -229, 383, -457, 27, -33, -3, 70, -122, -178, 370]
4813C70m19J94j74Q0L17m24J94j64J3k24J24N5pO3j29K59j9j88K95L3j3k12j09
4836h5l16Q56l29m04KK96k14K52oJ13l50L67m38L36l8L5l0r2j23J04P3p4M01m47
4860a11m1L14q6k27j21J78K86j26j78K66k37L44q7k79LK68J64k08j22o5N6j23
4882a32J01K96m32p8L14n85N02K59j88j06J05k36M13l89L99J15l68m05N19K3l43
4903b16K56k2J97l00J28l68M89l20n9L61r4O9Q7k44J92J34j96j09j80N1L01l91
4925b34R8J43pm47M17qM0jj09R5r5M7L51m78J73m1l8R4J47l09Q8J58j19R8L57
4950D20l50l18K82j79K10K31k77J69k86j08J61KJ87J60m10J29%O8j29K66l22K82
4972A88Pj48r5K71k70k67L53k66N44n33O4J97m4K16l88O7nJ48J52j60K72k95k6
$$ y = [370, -49, 145, -29, 51, 368, -56, 138, -26, -13, -237, -113, -58, -65, -2, -131, 128, 109, -79, 216, 249, 236, 24, -85, -401, 455, 126, -278, -276, 20, -194, 58, 52, 165, -185, 182, -256, 80, 42, 77, 47, -45, -168, -64, 9, -65, 336, -111, -152, 162, 76, -151, -272, -94, 192, 66, -112, 154, -83, 261, 174, -105, -102, 166, 330, 122, 0, -65, -9, -132, -31, 265, -167, -245, 69, -516, -14, 245, 57, -49, 56, -180, 233, -156, 243, 358, -10, -415, 104, 127, -216, 40, 18, 215, -85, 43, -325, 164, -156, -215, 146, 52, 121, 208, -36, 156, 290, 94, -15, -195, -144, 157, -234, -136, 7, 0, -447, -30, -38, 2, 1, -108, -13, -108, -61, 290, -188, -15, -56, -94, 0, 147, -162, -74, 84, -35, 63, 420, 70, -248, 34, -145, 65, 296, 19, 188, -98, -206, -45, -43, 144, 304, -106, 23, 23, 91, -38, 228, -94, 188, 195, 47, -48, 223, -47, -314, 39, -227, 317, -216, -152, 45, 1, 217, -171, -104, -109, 39, 191, 31, 303, 8, -18]
4995a8O8rm5n5J39o7N6k34K36j94K44k05K5j66M58l84L02m20j9L78n2L6k07NJ77
5020D9K64l69q2J90j80L67l97M26k01m4K8l79J32O4m6P5J61j3Q6j82J1k0J32j20
5044d8l2K39l65N16o0J36m5j46k22j69J23l70K23R4J98l53K92M8K16l57k8l01
5066d11J12K06k17L09j79m3L71k61K10k11M65l02j58L06n01L54n8j21J60k54K91
5087F8J26j25j39Q4j45L92k38rM5l5j8p0m42L80K89k14j83L38k85M11k51R7k95
5110b19jL30m94K62%J97k38Q1J51K6p2L1j44j23L09k38K83K13n71L15L08m46M9
5133IK45k01l17K90q9J14m3K0J08k28M16m54j23K12j08Q7J03K58l90N0k51N6R1
5156a45J21O5j58K55k49L4J20K18m07J30L7l10M86j48q2p7m8r5K79l16L72j52
$$ y = [-18, 50, 41, -4, -59, 80, 13, 69, -165, 71, -123, 121, -84, -59, -225, 233, -151, 151, -269, -288, 90, 38, 74, -133, -128, 49, 313, -56, -138, 52, -128, 239, -158, 268, 67, 23, 51, -328, -196, -132, -178, -103, 58, 45, 131, -51, -40, -60, 72, -48, -80, 159, -206, 310, 250, 386, 341, 195, -27, -196, -73, -443, -220, -126, 72, -281, 11, 59, 275, -82, -110, -411, -299, -93, -310, -1, -180, -223, 148, -113, 97, -114, 351, 49, -109, 197, -304, 50, -8, -129, 31, -223, 68, 194, 69, -70, 14, -131, 261, 23, 14, 59, 24, 6, -64, -506, -126, 163, -51, -234, 104, -181, 230, -21, 76, -219, -220, 110, -384, -122, -122, 75, -163, -82, 69, 95, 23, 54, -90, -213, 96, -142, 141, 354, -217, 98, 406, -40, 9, 254, 53, -264, 26, -63, 51, 8, 28, 136, -92, 324, -130, -253, -41, -149, -62, 41, 299, -91, -41, -292, -236, -145, -24, 41, -117, 138, -111, -77, 43, 261, -146, -16, 21, -289, 197, 49, -33, -110, -158, -253, 26, -290, 82, -70]
5178g0r6K11o3j64L14l70L73k80m0n6K47Q8N4l62L86j73P5l80K88Nj79M08r4J26
5202B48k31J30j65nJ45k37j55L11j38K4p0K86j56j95K98LL1q5k14J93J05j11J42
5225A54l15K51J28k85k45M98j31q1L8n7j4J03K05k39r5j00P8j3L16j18j04J47
5247A21j27n5L57p0l85M6j54R6L20k44m1l5J36K16j1j68K28j82r2q1K04j9j22
5270f2k45J78O3J14no4P5k10J14J37j20K30l82J41j65K74J6o2PK3K53k75K8K61
5294C24m97L8O6l8L58j44j38m2J47L7J62k91J83j73m8o0j21M9M63k67l07K24j08
5317a83N86m68R2k90M69k27R1Q8K28l58M2Lk21M91k41L6n51L52J73n4j84j86K05
5340a07J94m4k14J65J72j91M0R7k21K16l82J70J00k27K50n6j08K83l63J07K23
$$ y = [-70, -166, 45, -18, -182, 132, -238, 135, -145, -185, -241, 6, 94, 148, -214, 172, -1, 74, -306, -18, -13, -192, 216, 122, 248, 17, 147, -18, -23, 122, -115, -270, 41, -97, -73, -143, 143, -13, -208, 90, 93, 124, 39, -175, 18, 123, 12, 154, -161, 90, 218, -67, -312, 186, 55, -26, 12, -45, -59, 44, 249, 10, -85, -185, -107, -120, 196, 78, -26, 121, -6, -61, 296, 226, -159, -113, -267, -171, 149, -95, -136, -171, -35, 181, 170, 2, 230, 48, -44, -125, 79, 60, -62, -307, -129, -66, 48, 43, -21, 54, -156, -42, 95, -25, 205, -177, -36, -201, 73, 89, 27, 34, 57, 310, 35, 63, 324, -173, -135, -69, -107, 251, 107, -31, -73, 74, 111, 273, -18, 165, -8, -56, -116, -237, -188, 275, 8, -299, -75, -183, 403, -65, 27, -263, 206, -21, 70, 158, 386, 28, 70, 73, -148, 343, 102, 138, -413, -61, 112, 58, -126, -312, -107, 87, 43, -171, -6, 166, -25, 15, 112, -109, 107, -275, -105, -5, -232, 18, -38, -146, 137, -226, -119, 104]
5361A04j82K07N6Kj49K36n08N2K39J55M7l99L8P3r4K45k83J99J98k72j31K35j03
5384c5k02P1M0J14J39k13J83m01J87J91j79J78j79j63N0J32J37j49K67j16j42
5405i0L17l53K43j10J79m9Q0L7j59K08l34j22K01J67j14k80L08k32L18j20p1j68
5427a44J48M1q7J80J72n50J49J49K48n13J94l32J04J05J64P4m2k5k11N1K04L65
5449D44m27k7j92M58Kk92Jj13K12m07pj0K65J87j4m2k79N6L9K39k61J32J0K35
5473B09k69j52K44LK71m63J59l5R8R4J38n49K76j70M5J16j19K08k39J41O5j28
5495e7k58N00j74Nq0J15Oq8l0jJ16j0j83M62l00j6o5q3Q4j84M08J70j78J45j11
5520A93l20K43j58N5J69j33Q0k03K13q6k63O1%R7j63j00L84q2j09J82r9Q1J8K8
$$ y = [104, -78, 129, 185, 187, 38, 274, -234, -182, 57, 212, 259, -140, -102, -29, -123, 122, -161, 38, 236, -36, -167, 68, -35, -237, -166, -126, -12, 127, -86, 97, -304, -117, 74, -105, 73, -106, -269, -219, -87, 50, -99, 168, 52, -90, 227, -126, 117, 7, 186, 137, 217, 254, 95, 303, -31, -153, 48, 215, 101, -179, 129, -103, 215, 95, 24, -144, 4, 45, -42, 138, 310, -240, -91, 58, 306, -207, -13, -345, -241, -136, 28, 102, 60, 35, -176, -125, 79, 444, 17, -10, -202, 256, 258, -34, -33, -146, 66, -341, -348, -358, -93, 94, 80, 38, -241, -185, -146, 93, -168, -36, -26, 209, -60, -212, 32, 35, 306, -157, 2, -33, 65, 159, 297, -252, 24, -146, -101, 15, -104, 104, -135, 6, 71, -57, -315, 185, 11, 16, -64, 51, 57, -31, -61, -62, 54, 44, -139, 323, 23, 7, -58, -141, -57, -241, 167, 337, 159, 304, 193, -127, 116, -42, 13, 182, 49, 129, -74, 139, 53, -210, -149, -149, -52, -215, -315, 69, -13, -122, 60, -39, 42, 60, 88]
5544H8N8r3j1M5L3N2r2j22j46J06j38M78j93J23n98L09K24J24K0j17j13j7j08
5567h8J75O0q8l27L02K33p0k92k18R8M39o26O59l98k98M51j18P1r4K16k40J81
5589B8J28K7k88P6M1j86K85l99K25O3J46j5M5j46j23R2J12o5N7k38J82p8k00M80
5613B49k13j71K78j59L31k84l3J91k66n8pK40j64k33L87M6p1K80n14K41J85j23
5635A32p2j78K91l7j92J92p4J1M0N2k12l09K62%J45J34k35K99k65K80l54J19o3
5658c4M4j41KJ61q7j60k0O8j5J76K06j59j69k31K29n0M31p5l40J79j5l2K09m06
5682b29L04R2l34K77j0k94K7M9o4J00l5R3j42K61k28K69Q0m45J53L49l58K41m7
5705A09oK3O9n97N19l38L5K63q7j54K84J80r6K7m02J74k63L24j46R5j43L30k01
$$ y = [88, 146, 53, 42, 87, 120, 172, 80, -42, -188, -82, -220, 258, 65, 188, -410, -101, 123, 247, 267, 150, 37, 20, -88, 87, 147, 59, -268, 34, 267, 197, -95, -313, -215, 224, -402, 257, -141, -439, 12, -106, -35, -129, 87, -153, 28, 156, 183, -105, -29, 12, -174, 111, -288, -63, 0, 146, 131, 176, 30, -93, -1, 111, 46, 103, -135, 47, -31, -231, 249, 36, -135, 143, -16, 315, 31, -2, 189, -77, -135, -142, 98, -66, -299, 88, 134, 63, 343, -171, 70, 255, 132, 60, -118, 173, 136, -56, 136, 62, 73, 113, 165, -47, -356, -94, -94, 51, 185, -50, 249, -16, 264, -90, 29, -34, 10, -131, -129, 32, -55, -215, -235, -167, -182, -6, 200, 41, -128, -359, -130, -180, 251, 176, -164, 15, 0, -32, 177, -229, 75, 167, -167, 110, 100, -194, -167, -118, -182, -82, -117, -24, -166, 95, -133, 136, 216, -229, -76, 273, -85, 156, 109, 103, 126, 195, -402, 117, -221, -186, 77, -10, -164, 120, 300, 204, 231, -171, 3, -260, 64, -82, 13, -130, 200, -1]
5728aj3J31k45J90j78N0M22j89j84j93K20j50M87k08o9L8j76O3q1L65m23L76j92
5751D0k06Q9j10K93j79j37N42K2l42o5J8K34l30L15j18j14kM38l42k00J75j37
5773a16J49j03O4k3l1J64J3k1j60j87J79J81j52J5J91j21q5p7K60j00k28Q0K03
5796I5l05o7L65k17K42k69J11J94m10m2J87L76j62j7J06K6J16m59O5K22j86jJ17
5819H7k75L72j96j37J44K46j52l8M11o72N16k94m01J26O04l09N7j94L12n3j96
5840d2K65k10j85J1l7m2R8n5R1K71j74k39K47K07n43K61J78m75M10k49l6O0K43
5863E5J37l23k5J11l5Q6k47J74j0J18j31J96j13Qk01Q3j82M51k20lL70j85q7l12
5887b85M38k47K16k10J55K27j09K72o71K20N6k4q3l7L17l79J34r7K04N4o3j01
$$ y = [-1, -14, 117, -128, 62, -116, -66, 356, 167, -17, -210, 10, -140, 347, 139, 70, 108, -68, -5, -86, 279, -144, 232, 40, -166, -77, -187, 106, -73, -210, 332, 354, 12, -53, -35, 199, -131, 184, 66, -48, -50, 388, 46, -154, 21, -116, 33, -70, -6, -29, -60, 104, 117, 96, -64, -251, -72, 109, -43, -28, 163, 42, -43, -120, 140, 40, -188, -108, 95, -210, -277, 88, -129, 113, -156, -45, 149, -261, -303, -116, 260, 98, 81, 187, 213, 329, -130, -65, 157, -29, -30, 87, -188, 184, -12, -149, -5, 241, 89, 51, 462, -210, 306, 12, -389, -263, 341, 32, 89, -105, 207, 154, -42, 223, 13, -172, -161, -198, -240, -142, -197, -106, 165, -9, -248, -1, 206, -337, -76, 102, -373, 37, -212, -248, -188, 55, 192, -131, -156, -45, -80, 6, -241, -67, -77, 41, -90, 106, -7, 1, -200, -117, -299, 152, -68, -71, 299, 114, 27, -285, 153, -94, 122, -88, 67, 294, 185, 457, -214, 6, 62, 38, -45, -82, 235, -144, -10, -107, 97, 151, 88, -13]
5909a3j02M15k8k23J05n3k45K92j52j94P8Q6N0L40l37p3j85L10J7j04q7LL67K4
5933B91m14l6L32Q9k30L0j71L89j87j20J7k5N4r2O7p3K14j32%j49J15K18k26J46
5957A07N2k30O4LP5J29j96KR1O6k07N2R2k40J02k47R0N49k46J79K1m17K43K6k14
5982e4p0J1L44l27J41j12R6l23J69N31k60j66J32o3j79r9j94L22K54k19J76k60
6004a50J49N1l34K07J86k11J73j64q2n6M61k04l7j3l4N3l97L99OJ73m68J79J1
6027a02K32k45M28m4k07j17R6J70j85M8L3l85N5J44k56L97J4k02K01j34k22J92
6049h9J97n9R8k07J68N9m71K00J85K32o24J58L74j09j91j97L36l4O5L96l29l7
6071A21J2J07k03J03Q8m40J84J42r4L39j46j73J25k92J67K50k05k14L28m87L59
$$ y = [-13, -115, 300, 272, 49, 154, 101, -144, 148, -4, -198, -120, -34, 16, 356, 19, -54, -239, 71, 88, -16, -103, -100, 267, 291, -123, -159, 173, 262, 32, 62, -109, 280, 93, -27, -10, -35, 19, -73, -6, -79, 135, 3, 3, -146, -31, 187, -39, 107, 159, -71, -7, -4, 71, 200, 4, 6, 97, 163, -44, 8, 100, -140, -38, -285, -195, 354, 108, 287, 308, -109, 134, 160, -54, -124, -113, 231, -96, 45, -67, 29, -294, -125, 406, 146, -20, 112, 49, -130, -229, -423, -101, 153, -66, 110, -150, -1, 50, -284, -77, 109, -102, 71, -93, -175, -231, 230, 26, -11, -24, -58, -5, -402, -3, 3, 176, -292, -113, -102, 130, -115, 313, 269, 62, -55, 41, 211, 26, 74, 107, -278, -223, -79, -335, 62, 76, -126, 75, -59, -281, -89, 108, 49, 147, -60, 108, 167, -304, -104, 81, 313, -311, -153, 221, 112, -79, -276, 60, 26, 91, 487, 158, 121, 133, 240, 37, 140, 228, -212, -28, 114, 20, 359, 213, 40, 165, -127, 40, 290, 85, -129, 199, -288, 71]
6092G1o0k5O8q3r4M30j24n8O3l68L5M2J32O8K2k60j9N09O1l51M5m5l78J63M94
6117C38j9m01J5K00o8k50K16l16r9O35p0j80L28k24r0k58J99%Q9o5j89K77j51
6140h3L06Q5k72J04k41P0k32K27P8l23K65p0L15l1k34K64m03L7K20k0J45j57J85
6163B35j27k78K93j78J92l41O6J45J6j9q7J51k91K11K8q3K85l09j94K28q9m2M48
6186B60k34j26J97j01k32J28M07k78p0k44N16l67M07m10K80k19L5J28q5j62j20
6207b90J3K68K07l43J18k0Q3k88J68n0K6m8R4P2o4p3K36k98K64k35J07n2J53j3
6231C5l82J05K01OJ79j91J87l73J93j73L40r7l0K71j4k66J69k3L6O7j04k54M7
6254g1Km3P9n9K72N4k32q6J47j30K15l90P0J30j43P4J39k3r8L47M0o35N22j54
$$ y = [71, 11, -14, 54, -29, -123, 307, 183, 125, 188, -180, -145, -103, 29, 97, 119, -141, -160, 349, 410, 59, 104, 59, -319, -156, 338, 319, -82, -67, 133, 65, -185, 31, -285, -384, 251, 181, 1, 329, 105, 15, -243, -44, -44, 45, -20, -209, 68, -83, 223, 308, 36, 140, -101, -31, -263, -36, 42, -281, -16, -86, 229, 198, -36, 228, -175, -138, 82, 62, 207, 50, 235, 108, -170, 123, -55, 137, -204, -138, 7, 23, 4, -83, 68, -223, -12, 16, -67, 218, -91, -285, -57, -146, -188, 260, 26, -100, 97, -4, -236, -108, 299, 21, -49, -293, 223, -144, 263, -147, 133, -86, -51, 77, -8, -170, -290, -277, -9, 198, -145, -27, -47, 36, -252, -84, -134, -108, -156, -62, 10, -54, -127, 109, -189, 75, -160, -53, -105, 48, 35, -347, -242, -41, -35, 144, -47, 140, -233, -40, -213, 127, 30, 0, 271, 257, -9, 160, 137, 173, 240, 136, -118, -71, -69, -112, -33, -92, 180, 234, 2, -84, 63, -67, 148, -242, -172, -42, -185, -111, 28, 5, -93, 254, 294, -341, 181, 27]
6278B7K93l66P0k85L03j94M5J80k13K92l48j26K60l1N9O3j21J52m20L65q6L25
6300B44k81Rj84K47k1L5l13L35k54J93K18j48Q5l31L10l59J45j32R9R8k40J84
6322f1J26N03l96j06j20J22j30J41j1l39M21r0m1j38Op5J94J17q9K02k44J11j13
6345a0k6N4r3k9J07K18k41K24l9k15L1j95L44m8j41J89J9k88j66L07o7L70l06
6368aO6J5j83J06K17m87J87J68R0l18%n6j12K35J49m1K22k62k03L92M6l53K40
6391A17r6P0j91j55L16j17L92k47q5rl37M74k07R7R4l16J68J24j76K85l39p1N9
6414a50N9J83j82o4K58J11n44K36K37k86j11J88J05k44L9J22N17n26J85j0r5Q
6436C6k64K11J34J5n30M41l48L53r1n0J71l06O4L74m34J79K24k80L01j71j80k85
$$ y = [27, 320, -46, 24, -261, 42, -152, -107, 73, -140, 152, -196, -322, -62, -93, -34, 29, -92, 60, -360, 5, -81, 244, -37, -28, -212, 35, 14, 49, -264, 71, -183, 10, 228, 80, 165, -166, 144, -215, -70, -202, -103, -5, -245, -61, 65, 568, 172, 66, -54, 68, -62, 79, 68, -271, 150, 60, 19, -119, -113, -188, 6, 123, 34, 236, -8, 103, -10, -36, 18, -75, -104, 3, 221, -20, 204, 165, -50, -19, -214, 130, 82, -59, 130, 149, -139, -305, 2, -65, 305, -1, 65, 80, -103, 3, 220, -267, -80, 88, 178, -140, -140, -196, -308, -73, 76, 35, 257, -5, -208, 184, 230, -123, 117, 21, 91, -100, -255, 61, -56, 336, 89, 4, -5, -342, 132, -75, 22, 116, -200, -32, 92, -84, 201, -138, -209, -150, -91, 92, -90, -154, 104, 215, -329, -93, 144, -142, -253, -65, 40, -204, -165, -43, 474, -52, 133, 123, 28, 36, -228, -17, 117, 132, -398, 43, -305, 48, -43, -93, 78, -228, -164, 210, -224, -45, 179, -101, 200, 29, -151, -436]
6458d36K76K71k63N5l0L4M1J20K17k89k74K27Mj1k84K39m4K23j7k96J56mk17K17
6482h5r7J97q4k71M21J94k62l34M01NJ35kk17o4K7Q8k26J83l2PJ37K4j13J17o83
6507e34M44Q7l11J66L9O0Q3l99J76J0K70j03P8j3jJ07j67%L33k27L1k57K0K66
6531A58J03l14j05L42k99K70j57K1L2jl06L52k0j67m23N62j70q4k2L14j01n0K08
6554A43Q1k56R3J01K21j92j15ok6J86m17L35k08J81L9k05L7R7j64L97k13R6m94
6577b89J92J34L25l2o05Q3J20l2J08L08k36R3j47j76K31m9M6%j52j56P2J75j67
6600a54K06K95m09r1K87j14L41l71q8J31K1O7j30K6K9k77L7K80p0J10p7M2Mk16
6624a21L2J49j51j55L27Q2l93K01p4J14l23K90l1j78l10P29j35M7P6q0P9k88J78
$$ y = [-436, -160, 111, -152, -97, -127, -93, -52, 68, 285, -4, -278, -51, -47, -58, -342, -103, -147, 76, 59, -237, -81, -85, -302, -85, -182, 15, -69, -340, 81, 275, 13, -321, 80, 85, 220, 218, 1, -63, -36, 52, -174, 9, -23, -16, 121, 145, 32, 149, -534, -90, -3, -314, -148, -109, -49, 34, -365, -189, -179, 91, -12, 66, 53, 52, 159, -8, -8, 325, 98, 129, -128, -108, 158, 261, -53, -158, 184, -115, 155, -2, 19, 51, 50, -256, 96, 76, -91, -514, 48, -122, -206, -228, 86, -15, -65, 143, 224, -32, 61, 162, 383, 191, 76, 70, 44, 230, -187, 148, -60, 121, 160, -45, -8, 89, -75, 322, 109, 205, -289, -97, 37, 362, 330, -275, -192, -72, -104, 4, 312, 76, 169, 22, -154, 77, 28, 74, 74, -78, -234, -162, 13, -154, 52, 347, -62, -153, 134, 20, 361, -10, -98, 33, 54, 121, -9, 17, 46, -231, -194, 86, 16, 126, 49, 91, 95, -121, -89, 60, -91, -246, 81, 163, -230, -29, -103, 11, -312, -22, -53, -231, -541, 188, 53, 100, 176, 96, 175, -113, 65]
6647F5L28l78rmj84K97O1l21L53k87%J73J55j37jj82L1L39l39j0j37L34j05j7
6671B5k74N28k46J07r0K34l36J95j94J27j04q0J75k37M8M64o32J94R0L9l7R0J0
6694I6l7j74J00J7K4j52L76n43K53l1L86j54j6Q4l37k41L70j36n3L12J74p23L31
6717g4P0j30o1L9J30J61J10k01j77O4M17l26N8P0j08k23K18j53J77J29Q8n00J99
6740b3lK22j64J23k9n3j66K94j49j42j01k40M17L57l81j88K6r0P3K65l24K63K70
6763B57k82m1l4K44k45K16l6l23K69K40l07k52L40M7k10j55K23L8n9j10Q7J12
6785A9j25N78o21K46k47J20o3k7K42k50J71N4j26J46m13K55j57J42J88j44k10
6806b22P3J74k15J53J20j17M3j89J01k13O1qK26r4j92J28l4O7n5J79J26j1j24
$$ y = [65, 393, 15, 6, 2, -182, 115, 176, -145, 208, -79, -79, 94, 249, 112, 111, -71, -40, 299, -40, -50, -187, 147, 42, 25, -249, 279, 33, 140, 50, 284, -52, 143, -51, 76, -28, -108, 67, -170, -122, 342, -290, -96, -6, 33, -4, 86, 96, 59, -115, -15, 2, 26, -126, 250, -293, -40, -71, 315, 161, 145, 229, -108, -349, 21, -115, -168, 144, 318, -405, -74, -4, -134, -195, -156, -26, 135, 245, 44, -133, -69, 348, 22, 80, 150, 42, -181, 37, -116, 61, 190, 278, -222, -23, -26, 196, 32, 155, 126, 73, -93, 201, 52, -90, -191, -431, -14, 343, -38, -226, -200, -290, -217, 48, -276, -13, 257, -25, -66, -100, 144, -101, 115, 79, -244, 25, 265, -42, -294, 46, 93, -117, -272, -49, -11, -70, -180, -93, 19, -106, 472, -149, 97, -150, -30, -93, -120, 122, -128, 43, 97, -29, 117, -296, -41, -198, -56, 132, -12, -222, -149, 25, -190, -37, 83, -34, 9, -180, -79, -292, -231, -239, -13, -107, -299, -171, -205, -138, -193, -14, 112, 101, -23]
6829b3Pl6k07J61O4q9j05K45J2K64l52j4L5k97N71l08J7L67l97J49k23J62K27
6852B30k46j06j36J84M1P5J40k06J35k90L2M1M87o90J79nO6K85j41l81L47j61
6874a20P7J95k50J06N2k7K4Lj65J7J89j13j60K80l11J37J89l72L76j35m5J48k48
6897a53L03j72OQ5O4o1j77J85j82K61k16k50L44r3O6l39J6J54n3J57K26N3l06
6920h2j50P4qK80k83K22j04j19J77j54L30l1j90K45o6k69L24MN1m16M63m16J2
6943a06J73k47L09k52J20K07n71M6M71k36P3j5M59l45n4j21J38Mq4k3l3J00N2
6966F5L93j26l51J47n3l22M78l90M7O8K53pJ29k09N5j32p8K41j03k01K20l5p8
6989A1K15l90L97J47n64l8M26n2k02O0k40L83j77lJ06n5j80J17L3m0L82l53N4
$$ y = [-23, -16, -52, -259, -98, -34, -123, -228, 17, 29, 293, -59, -73, -38, -335, 236, -72, -55, 312, -85, 64, -159, 3, 230, -16, -122, -258, -74, -33, 42, 182, -24, 111, -179, -147, -106, 381, -309, -130, -135, -69, 216, 75, -306, 41, -120, -43, 152, -98, 8, 60, 33, 57, 60, -105, -88, 101, -12, -172, 108, -203, -66, 123, -249, 127, -8, -53, 95, -153, 150, -22, -16, 69, 133, 72, -105, 80, -102, 159, -57, -307, 37, -56, 10, -329, -313, -159, -212, -55, 171, 224, -82, -232, -158, -166, 114, -169, 53, -51, -170, 7, -147, 183, 152, -38, 207, 141, -128, 196, 200, 251, -165, 298, -118, -106, 67, -180, 129, -123, -3, 204, -367, -321, 150, -86, -13, -28, 431, 86, 32, -89, 49, 53, -31, -54, -87, 13, 65, 458, 332, -19, 128, 75, -247, 231, -159, -112, -44, 209, 202, 331, 122, 177, 45, -33, 208, 105, -96, 124, 89, 11, 226, -164, 233, 380, -184, -222, 204, 152, -50, 10, -230, 153, -24, -27, 79, 24, -156, -39, -6, -46, 336, -17, 37]
7012C7m50M31n8K74k71L6O0q2J33j79R1k48L32r8J00l29K37L62l37o8j88L64O5
7035B14j19k25J46on9j42M87j10j8k53k51K18K22J47m48J95o0J58k56L66m11J97
7057hj64m3M61k32l49K79n4j52K64o1jJ44l5J47m11K88j65j7K2L2J32m1M7j09
7081b6k80M70m3j43j64MJ07l11J20K15K05j10kK70n15J03L7M19n75K59nM4J08
7104A87m21J51l2j5J87m7p8L02k83j79K42j59K6L10k17j65J68M0p7j15L97k30
7126hK82k44KR3o9P1l9l9j56R8l25L36K9o0J07L3j85M8k56M09j8k55K76ol4K5
7152A15r3m77L36M07j96mj34o9J60j85j0J27k10M01j21j08j75N8K64J31l56k07
7174c46M84r9Ml45L88L5j24l54J97j03K12O0J31k83J82J78m50K89k12L8P9OJ30
$$ y = [37, -413, 18, -40, 234, -37, -1, 59, -23, 110, -69, 22, -226, 106, 8, 108, -221, 16, 378, 41, -27, -215, 149, 214, 95, -130, 16, 10, -49, -191, 296, 186, 168, -85, -336, -118, 104, 251, -197, -2, -62, 96, -160, 206, -205, -8, -172, -215, 246, 14, -335, -56, -110, -262, 2, -59, -60, 84, 49, 196, -215, 73, -92, -109, -87, -55, 77, 36, 83, -26, -306, 164, 121, -22, -186, -182, -75, -386, -266, -51, 154, 44, 42, 312, -203, -100, -63, 356, -219, 40, 35, 79, 187, -234, -83, -115, -130, 57, 10, -68, 234, -49, -228, 14, -145, -119, 191, -26, -191, -23, 17, -60, -175, 222, -8, 274, 30, 32, 125, 56, 127, 88, 49, -107, -9, -334, 2, 31, -29, 78, 111, -74, -26, -282, 127, 109, -146, 130, 124, 90, 115, 22, -455, -119, 288, 92, 88, -46, -115, 45, -140, -150, -23, -233, 168, 47, -61, -236, -178, 86, 217, -139, -346, 138, 39, 43, -302, 86, 121, -3, -357, -160, -263, -51, 9, 140, -143, 39, 217, -233, 56, -156, -118, -39, -33, 97]
7197I7j38r0M1J15N8j36K8oj30l6J7K95o56J96J10nJ32L04n6j56L94m96Q2k78
7221c14K05L5k5K88M1j92J54j87m5j36K05J52k87o5J65L41k79M3l94J56J87j51
7243a03J69L4k37J45j8NL56m26K32j16O3L5m5j06J62j08j21M29k13k19kK23q8
7266E1j27M3P2p1K8K5L49j62j21j34J14l75M13R8k51m0J68Q6m8k24N0L60q5k33
7290a4K22k13k73L66j2k05J2K57p0j28n4p4K03J63k82L00j83k05M25m18L57j91
7312a7k45J50J65j18j48L38L7l81K15M7o7Q4J00m03M94l35M4o9L06k55pK0M9K49
7336B53l04j66JK67O1o0j21J76m61M99j76K18R4m53J82k10M02k15j18J85J30m76
7358b92R9L51j82L4j52j86N94l65n4kj21K93j32L01J09j98J09j11q8j58K73j86
$$ y = [97, -41, -131, -90, 25, 83, -53, -25, -31, -161, -197, -180, 115, -541, -345, -235, -240, -108, 196, 140, -16, 378, -118, -36, -314, -109, -74, -99, 189, 230, 38, 192, 5, -40, -176, 29, 181, -106, -171, -6, 335, 56, 99, -295, -139, 48, -103, 66, 100, -137, 8, -10, -5, 351, -75, 157, 41, 104, 139, 94, -12, 150, 42, -79, 350, 137, -82, -84, 139, 51, -76, -33, 39, -32, -4, 21, 370, 208, 87, -47, 67, -308, 105, 203, -48, -88, 80, 166, 118, -106, -56, 304, 219, -14, 208, -5, -278, 88, 76, -129, -117, 140, 70, -58, -112, -186, 17, 180, -102, 198, 15, -190, 235, -183, 174, -17, -262, -112, 53, -65, -213, 125, 162, -219, -4, 43, -24, 60, 160, -243, 251, -84, -40, -109, 197, -58, -65, -45, 4, 253, -51, -217, -216, 51, 112, 52, -69, 107, -354, 145, -31, 187, 281, -172, 10, -200, 202, -13, -131, 54, 184, -292, -193, 158, -24, 10, -142, -328, 266, -99, -153, -155, -276, 17, -115, 186, 295, 97, 206, 95, 7, -151, 122, -64]
7380f4j57K46k56L4M22k95k28K10R2N9R5j46j09J03j92J12L03j95j06J00J41k89
7402a20K17Q0j79J12K32k70kj53Ml3J78J74j08j12J78O0l11j40O46o48j6K27j65
7425a49N3M5K41r7J60q7Mm4l82K79J02M5j57N9j01M0j79k4J75J36l23K25k27J34
7449g2K12k4o6k01n5L41j48K08m04J79L36j93j00L02k83L6R3j49j23j8J94j17
7471e2M1oj44L20k06K43M0k11n9L33l23N1J24k3m57K05L98m18K5J74N6l36J00
7494a25J5O4j51J14J2J08l6O5j9M9J37k05K48k54K88n32J14M25k43j01J04m9J78
7517B06n22M59j91k57O1K31M38m68L8j0q7J59j10l58P14k71j03k04K43J52k59
7538a39J82J26l26l5o7K31J74l26M03Jj76j01J5m5k60L87m79M32O5j44J63p3j50
$$ y = [-64, -221, 25, -231, -197, 225, -70, -298, -88, 4, 63, 158, 12, -97, 6, -186, -74, 229, 34, -72, 28, 169, -120, 97, 177, -2, 110, 342, 72, 70, -83, -79, -112, 66, 240, 132, 20, 198, 258, -53, -193, 453, -195, -211, 16, -149, -96, -51, 190, 93, 253, 166, 170, 126, -256, 23, 125, 170, 13, 72, -29, 11, -168, -192, -17, 119, -204, 21, -206, -72, 140, 116, 50, -151, -206, 135, -13, 195, -209, -30, 306, 113, 13, 315, 32, 68, 161, 12, -111, -129, 65, -52, -11, -17, -161, 159, -47, 196, 236, 25, -34, 299, -24, 27, 151, 128, -329, -124, 274, -144, -119, 55, 111, -225, -125, -110, -46, -197, -83, -71, 37, 1, 66, 47, 96, 233, 28, 276, 22, 310, -222, -108, 317, 74, -27, 77, 28, 206, -316, 143, -48, -305, -244, -13, 425, -43, -5, -15, -102, 57, -53, -411, 303, 32, -71, -275, -32, 120, -139, 43, 169, -157, -192, -259, -28, 146, -180, 223, 224, 48, -53, -38, -83, -343, 44, -435, -3, 62, -82, 81, 8, -142]
7561a42k35M03R7J13n8n7J90j71l15K34m7q3K69j53J47l58N37n10K93k08j01J26
7583b9J78l96L43L13m90J26J99j24J56m05K71K2n7q2j05J33o9L66k21j81J29l9
7605C8kK10l46l8R6J81k66J33J17m06L93j98J33j98K26J08l54mR6JJ3k03K19Q5
7629C4j20J21J4O7k50K09m5O5j18j02J99J05j31o5Q2J5j20j18L8K83k7l43L23
7652A16j1L3j71J22l9k17J02J54j30J02l16K36o9l5L02R3k08n5j56j17J69M84
7674C89j07L2l97j21K20K41k89j40O7M3J00K07k5r4q5k20K60k11L08j00j63J82
7696I7l0J91j58M4k25Q0p4P8J31J41k37j05L33J4j63r9l63N22k58K5n6J59P1k24
7720a06j55N53l42m9R5M54o30J5L32m44M66n49K75L13n19L47P7m92K50Q3J45k55
$$ y = [-142, -377, 26, 123, 236, 178, 121, 311, 140, -175, 59, 12, -71, 198, 45, 192, -166, 371, -139, 154, -54, -155, -29, 149, -247, 96, 409, -81, 45, 244, 120, 276, -129, 142, 164, 107, 25, -80, 53, -16, 350, 129, -52, 77, 38, 36, 246, -100, -138, -42, 139, -127, 6, 123, -283, 110, -88, 45, -153, 73, 181, -173, -177, -81, -80, -67, -270, -51, 34, -86, 35, 49, 116, -134, 75, 30, 95, -23, -125, 74, 179, 48, -17, 65, 80, -40, -158, -120, 163, 136, -207, 116, 105, 138, -33, 89, 50, -167, -65, 89, -41, 61, -255, -19, -88, -123, 179, 272, 64, 9, -147, -264, -95, 389, 282, 314, -83, -204, 16, 257, -32, -172, -105, -62, 38, 245, 220, 126, 41, -179, 81, -130, 178, 78, -85, 97, 67, 258, 100, 144, -81, -1, -75, 3, 134, 275, 38, -67, 266, 280, 117, 18, -345, 177, -81, -56, -112, 47, 118, -106, -261, 292, -50, -99, -4, 450, -180, -165, 167, -277, 189, -360, -85, 228, -291, 56, 133, -359, -109, -26, 119, -136]
7742a36K88On15L66K24l15J81k85K64J4n9J87k53nJ38J61k77N6r9K68n6l53L22
7765A22J91j40k65p3J97n7K64k52j43K19J4j50m9o3K0J17l6R4M0N1Q0k00k0m5
7789h4j68K46n7P6J60oj44o6L9L0J17j87j30L56K8k24N65l86k69K27l27L67m7
7812A16J36m09r7r9K59K78p5n9K13k61M10k80j3J84l46J19J70k54j48J07m5L21
7834B27j70J57j96J71j50q2j01J90l88M24k64J63Q3J31m14M16J40m52J13Nq6j07
7856a90J80l83N90l67L51l88N01o6k59J4j63M68l85N5J54k74K33j53O0N3J9p3
7878b3J42O2l36RK61l95L23J23r9l25J95L33j87j56K89k90L05M9l26M4K8Q6Op
7902A11k02M8Mj65pK06J37J7k48J82p6oO0K9k39K05j40K61o7l47K05Q5PJ39j40
$$ y = [-136, 152, 158, -357, 9, 233, -82, 99, -186, 78, 92, 33, 220, -33, -38, 100, 261, -16, 40, -59, 209, 153, -200, 122, 313, 173, -92, -165, 32, -25, 239, -13, -156, 63, 77, -73, -122, -185, -165, -48, -84, 10, 50, 101, 181, -19, -39, -84, -252, -6, -63, 13, 173, 167, 23, -43, -4, 26, 143, -44, -174, 182, 210, -14, 551, 165, -104, 123, -204, 163, 116, 252, -157, -254, -353, -94, 184, 109, 50, 263, 2, 412, 132, 119, 303, -43, 76, 246, -8, -156, -49, -94, 227, 57, 214, 18, 189, 39, -43, -144, 46, -342, 82, -182, -19, 64, 195, -219, 197, 337, -115, -2, 3, -83, -190, -10, -393, 197, -170, 181, -207, 294, 228, -31, -17, -180, 288, -97, -42, 112, -162, 71, -82, -22, 31, 50, -23, 119, 181, -155, -146, 115, -280, 43, 166, 67, -258, -63, 270, 83, -73, 216, -74, 231, 280, -46, -2, 26, 112, 118, 111, -91, -43, -39, -204, -211, -5, 132, 149, -99, 83, 7, 1, 61, 90, -149, 56, -84, 177, 110, -237, -32, 53, 60, 199, 59]
7927E9j30L95k72Q8m72L88J03l12J30m1pj51L76k71J01Pj41J54K91j58LJ29m76
7950b07l4L5M20m9j41K34m09J65J6K31k32K60m63K83k09K14j10k6J43j20Q7K5
7972A13R8J44l98J46j29Q7L2p4k26J93J19K55n07l7L25k49m9j28M59q0l8ol8J17
7996A29l0j3Q0J75J2m54J29m5qR4R3k08m7R9p3k4M3K34k22k0K49k39l03P29j52
8021B28m21n3L41l47K86J4J23j36J79m00K43k42N59m82mR3r6J38j37N14n38J1
8043a27L9K76m19L84j3j29M1Lq2J5P4j3q1Q6j34j36J7K25P1j78%o4J90K0K91l72
8069a6L4j5O4j23J7j01L72Nl96J93N1o0j65L66j52k33N80l78j07j26R1O6j34L30
8093A63l32M8L52K4m35J96L27n75J1L45K6j76P7P2N5J23j59Lj50O6k18J43K79
$$ y = [59, -71, 324, 52, 140, -332, 56, 159, -153, -23, -64, -71, -222, 154, -117, -16, -9, -150, 4, 295, 137, 140, 269, -207, -241, -206, 214, 165, 24, 258, -151, 14, 30, 261, 29, 289, -174, 109, -100, 114, 4, -22, 121, 1, 88, 113, 211, 355, -43, 103, -26, 61, 93, 19, -207, -14, 105, 360, -147, -184, 141, -108, -157, -285, 174, 94, 56, 50, 12, 129, 99, 86, 166, 341, 353, -101, 28, -17, -25, 69, 162, -46, -93, 6, -67, -91, -48, 186, -36, -56, 193, -46, -349, 380, 228, -193, -246, 95, -252, 34, 48, 171, 35, 214, -186, 57, -185, 374, -108, -112, -19, -115, 23, -114, 400, -138, -127, -88, 188, -231, 153, 140, 11, 52, 55, -27, -12, 62, 49, -32, 54, -80, -216, -199, 26, 97, -81, -81, -145, 45, 65, 356, -16, 18, 3, 67, -56, -39, -140, 232, 237, -159, 34, 85, 25, -140, 226, 74, -159, 421, 43, -64, -190, -99, -33, -167, 163, -169, -121, 231, 255, -180, 16, 343, -232, -221, 124, 150, -26, 51, 123, 178, 301, 142, 145, -5, 61, -157, -14, 265]
8116B65m18j9N0m8J85j35j27L16j61J94j49k3P2k0j28P3Q7l70L78M16l41l9J8
8139G6r4RN6k20J17l4l3J21K22j53P4j45k17L22L4j89K13L9n05M11J14j01M4o1
8163A00j16k52K31j45K64j11J23j17k20K48O7j55oJ43N7Kj60P8j4m1K25n5K2l71
8187b03P7M58p03N11
$$ y = [265, -153, -172, -122, -170, 15, -120, -247, 69, -92, 102, -47, -70, 2, -18, -146, -73, 14, -356, 22, 438, 97, 58, 76, -18, -9, 47, -173, -56, -90, -123, -2, 220, 67, 141, -4, -221, 101, 135, -54, 159, 198, -307, 104, 218, 117, 161, 100, -16, -268, -37, -182, 82, -29, 94, -23, -243, 5, 72, -83, -89, 54, 111, 113, -47, 31, 17, -24, 201, 146, 168, -203, -126, 332, -371, 140]
8191A40
$$ Imaginary data points
##PAGE= N=2
##DATA TABLE= (X++(I..I)), XYDATA
0@%%%%%qJ6j6J6k4L2l8M6n6P2q8J04j20J38j62J92k24K58k99L46l95M51n14N80
29C07o53P37q30R29j038J160j290J432j592J766j955K163k394K647k927L241l590
46a887L984m431M942n535O229p053Q054r299J0888j2997J5941k0350K7727m2972
60b6759J16221r4092p2359J86340k15957J77274r6138J3802N0758p4455N6892
71B1527m9017N5562m6610L0060j54m9948Q2216q3426O6831k8820j5114M6941o2540
84c2492M0589j013k136j6935K1338j1052j6397M6178n0889L9733j5912k0550L7470
97A7932l1627K1326j852j0610J592K128K680l553J2645k2000K1137j7034k783
110a0019L4852m9297M3730j6136l3901O0881m3256J1059J9111l6124L0270j3517
$$ y = [0, 0, 0, 0, 0, 0, -8, 8, -8, 8, -16, 16, -22, 24, -32, 40, -48, 56, -64, 74, -88, 104, -120, 138, -161, 185, -210, 241, -273, 307, -346, 391, -439, 490, -548, 612, -678, 754, -838, 928, -1027, 1136, -1258, 1389, -1538, 1703, -1887, 2097, -2334, 2608, -2927, 3302, -3751, 4303, -4996, 5892, -7105, 8836, -11514, 16213, -26759, 89462, -4630, -76989, 109351, -106606, 70668, -25470, -11668, 39090, -35365, 21527, -27490, 28072, -18538, 11522, 11368, -38580, 43636, -39790, 27041, -1779, -16893, 30048, -32492, 8097, 7084, 4948, -11987, 9351, -1701, -18098, 28080, -22809, 16924, 1012, -19538, 17932, -13695, 7631, 5779, -4831, -3239, -1111, 1569, -1984, 10661, -11339, 9798, -7236, -10019, 24833, -24464, 19266, 3130, -30771, 30110, -13146, -2087, 17024, -19100, 11170, -2347]
122b347j1463L3567k1899p568K0287k1712J3390O935k0314K4439k1467K993J4788
135I629j9566J6726J32j2978o129K8192k2081Q75K1894l4539L0879k0796j308
148i070L0286l0940P556P267j0343J879J4652j8517J1032j237j6514K9965l1237
161a5221K6292l327k7417L3705k3258J3745l955N86r17l210L466p629K3545k9154
175a2749J9715o438j2714K4733k0467J6915j4618N704K098j0292J5738r083O770
188E312j3195J1410o617J906J1571k0352J8202j4817N367M580o081P428m506j512
202a304q607K3893k1205R928K673j7350K5030k8728K4312l150j4999J8729j8706
215i484J0658J521j03n349N404l191o425J7168k0226K0373q608j6713K7190j8738
$$ y = [-2347, -13810, 19757, -2142, -9710, 10577, -11135, 2255, 9190, -11124, 13315, -8152, -5159, 9629, -9937, 6789, 6921, -6057, -12186, 16006, -6075, -5200, 16694, -17845, 13034, -7762, -9070, 21216, -9724, -2168, 5099, -5244, -3365, 11287, -7230, 3802, 2565, -13949, 16016, -15221, 11071, 7744, -19673, 14032, -9226, 4519, 564, 1150, 233, -2977, 489, -7140, 16405, -12749, 6966, 528, -12186, 12547, -7920, 8995, -5623, 81, 2179, -8113, 7625, -1458, 5312, -7883, 3527, -3090, -1184, 10387, -9965, 8237, -6580, -1213, 3367, -2714, 4714, 208, -1304, -9911, 13982, -7223, 2705, 5378, -11972, 13058, -15670, 8642, 5492, -9507, 9222, -9484, 1174, 2695, 2592, -2757, 2647, -544, -6969, 10199, -10027, 10346, 1738, -14975, 12215, -6523]
229f523Q811J271o456N298o364L346K592J704p049N988n428k219J4349j3838O118
244A600J652j1421J3895j0496N947O337j3775O137Q9L14j314P134r461J290O196
259D124j2880J8608j4633O496L958j9676K4540j4862O277K418j1037J1359j0184
272e492Q331l328N485q481J526O078j4237K3287j8492M834M537j2802J5398j0359
286c715N651J587o290r22O164j359l433R957j5331J0507j945p281J6264j4103
300d249M529J768q104Q025L123q083L665J436r283J2570p690L042M860j2538P090
315A61J839m716O114m05r478J1505q603J561R337j2833R860o258k565Q674l793
330D00n55P11j75n960J0639p695M099L844j4398J5529j1571N855N086j0402O866
$$ y = [-6523, 2288, 3559, -2897, 2401, -3963, -617, 1975, 3679, -3370, 2618, -2810, -5029, 9320, -4518, 1600, 3252, -8169, 5726, -4770, 1177, 7514, -6261, -124, -35, 279, -1035, 6099, -3362, -2072, 4124, -8756, 9852, -4781, 1715, 5673, -14003, 10537, -4325, 1952, 4370, -6667, 4692, -5492, 2839, -489, 4996, -3485, -1959, 4119, -10118, 13169, -5323, -489, 4048, -8754, 6644, -3715, 1936, 3523, -2767, -3689, 2475, 1116, -2317, 7640, -7691, 2816, 871, -6410, 9854, -4249, 280, 2048, -6056, 1969, 5092, -2991, 674, 2110, -7173, 5397, -2293, 749, 5609, -6929, 161, 2000, -2716, 3398, 2993, -6485, 5020, -3583, -2022, 7315, -5518, 4342, -1916, -4481, 4193, 400, -155, 556, 381, -5579, 5060, -2635, 1464, 5308, -9090, 6439, -5132, 723, 5809, -4593, 2273]
345B273m733K320m88M399o234N083l882n097J4823j4436J0970l778p849J1908
359E279r837O865M09l676N70j46j200J730N743j1024Q393m178l457J0768j0028
374c789O465o44p473P137j183j845O005o085k028O447o381M814J934n610K566
389C30n48l792Q565l681m006P580j0238O676J800n837P890n989j506M436k538
404h58P08M688q087J895M965r223J2293p096j101O029j1374J0532l249M01P99
419A322k201j116J314L550o360J0198j0924L224L847r012J3284q662K8L467n814
434c855N072L97j250j222K470o638O572O75n435R295j1262M786L045o378P875
449D147l941k032K552k222Q4N240m672L34J714n055N515L06l535M105l586k551
$$ y = [2273, -2460, -140, -628, 3771, -2463, 2620, -1262, -6359, 8464, -5972, 4998, 1220, -6629, 5279, -4558, 2307, 2716, -960, -390, -536, -1736, -6, 5737, -5287, 3106, -1072, -4529, 6239, -3789, 2676, 2032, -5441, 1696, 513, -1332, 4673, -1412, -3440, 3007, -3374, 1440, 3374, -2236, 330, -218, -4010, 4555, 874, -3132, 4448, -5790, 886, 2686, -3151, 4739, -1250, -2756, 1680, -858, -150, 4538, -3549, -1654, 3311, -5912, 6381, -715, -1816, 4213, -7161, 3371, 122, 523, 1322, -879, -1995, -681, 2869, -3491, 6707, -4217, -993, 2854, -6158, 7126, -1536, -1508, 1959, -3855, 1217, 1614, 364, -858, 1612, -5026, 1546, 2221, -3214, 6081, -5181, -395, 2650, -3728, 4147, 206, -1826, 726, -1496, -1412, 3828, -844, -510, 1204, -3851, 1664, 1970, -1565, 2540, -1046, -3597]
465c597P352o261M734M2o879P153m875K760K156k880j31l40J32o92N777p432M446
482A465j009o014J2349j1053P448j749o325Q062o518N480j479J088m219L076j064
497d62j654Q754j2617R775n300k972J0466j0239P710l925j609K029j8P04n52K783
513B873q009Q306n606J516O313j0492Q656o497J655M162l431J335j022n59j446
528b246N166m176K970o69n296O719m021J966K608n150K039K51k053M068k79l590
544a693L804m779J506M113m838M324k945k395M427j453m7K698m190j72L992n638
560c286O142j314m424N439n298J820M100m328J607R13n464N864r63k362N182o164
576b536J169L118m096M288j83m820M572k552j054O344n389R43O19l419M259j03
$$ y = [-3597, 3755, -2506, 2228, 2270, -4609, 2544, -2331, 429, 2585, -295, -426, -766, -634, -1326, 4451, -2981, 1465, 456, -5558, 6791, -4262, 3186, 1437, -4888, 3174, -3344, 2136, 657, 1745, -2474, 602, -462, -2116, 6638, -5979, 3796, -1504, -4476, 5990, -4249, 3461, -464, -2073, -44, -62, 642, 90, 2873, -5136, 3170, -2436, -920, 5393, -5099, 3557, -2940, -1285, 2877, -554, 781, -241, -800, -2246, 2920, -1256, 1714, 1045, -4251, 2468, -1553, 413, 3021, -2129, -90, 161, -1892, 2176, 1897, -1693, 2111, -2668, -1162, 2951, -1887, 2437, -508, -2903, 1524, 71, 24, 2722, -1468, -1640, 2352, -3286, 2856, 1542, -2882, 2557, -2741, -921, 3179, -1149, 458, 1371, -4093, 1771, 808, -1554, 3628, -2536, -1367, 1751, -2345, 1943, 1760, -3060, 1512, -1040, -2094, 4250, -1139, -196, 423, -2996, 1263, 1160]
592A160j250R31n38l566N445k277p01N179r700P505l252n16O398p482L945k331
608a050L83l99M427m052j73L784r942J2301p262J904M922j1363J0437o181K708
623D44J481j926k73j332L455n655R994r879M133K837j0962J5069j1158N163O24
638B015n774N251l631N043m625N310p183L402K711p564J2277j1174M243P54n722
653d667Q980o119L466k221M01k131L313Q13n023Q390j1004P119L53n313R595r773
669c821M106M14l876N422j640o38l14J63j393K807n72j822L765o739N211N59m020
686b388O579o202J164J471k122L235j020j086o86J820k968L903O25n480O337o113
702b931K327L252m830N757n847J470J528j130O63J241j514l310O481o481N463
$$ y = [1160, -90, 841, 303, -3263, 2182, -95, -796, 4383, -5317, 2188, -1064, -1580, 4818, -2664, 1281, -1050, -667, -1066, 3361, -691, -864, 2920, -7022, 5279, -1983, -79, 4843, -6520, 3917, -2264, 444, 1925, -1, -274, -1606, 1849, -3806, 6188, -3691, 442, 3279, -7683, 7386, -3772, 1391, 2015, -3759, 1492, -2139, 2904, -1721, 3589, -3594, -192, 2519, -5045, 7232, -3942, 301, 1055, -4667, 4313, -1806, 1660, -561, -160, -2291, 1022, 1835, -3188, 5202, -5802, 1317, 1670, -3643, 5952, -3821, 285, 699, -3177, 2245, 605, -33, -347, -184, -1577, 1230, 658, -1164, 2601, -4138, 1073, 1632, -2388, 4191, -2011, -847, 624, -1498, 1737, 717, -369, -1055, 765, -2203, 1700, 2325, -3155, 3182, -2931, -604, 2648, -2182, 3575, -2272, -802, 726, -404, 259, 1500, -14, -3324, 3157, -3324, 2139]
717B139l9n585P552q172M493J978l852L107k384m49n0L489k989K207j804j548
733a907M367n869O589k504j926K200l156L359j766K474k809J169j230L59L286
748B636m700M929m507J69J965o94J484j722J231k278J794j192K965j112l224N022
764B766o524N915j609j498L623n828L917j170M03M92J151k497o01L854n312O393
780C475m354L69J573m661O625l812J367L44k196L30N98J861k117K239l653J976
796c6J319l782O078m610M74P12j067J781m14N97k857K109j423J571Q01k853M154
813B554m806J292K349k633L459l395N4J895l094L982m20j774M77L54j600J748
829D42J466k774J703k713J700J420k997M307l856J89J899j625K329j945J026j450
$$ y = [2139, 2100, -3485, 4067, -4105, 388, 2366, -1486, 1621, -763, -1212, -1262, 2227, -762, 1445, -359, -1907, 2460, -3409, 3180, 676, -1250, 950, -2206, 1153, -613, 1861, -948, 221, -1009, -650, 2636, -2064, 2865, -1642, -1473, 492, -202, 1282, -440, 791, -1487, 307, -885, 2080, 968, -2256, 2766, -3758, 2157, 548, -950, 2673, -3155, 762, -408, -5, 487, 1638, -859, -1460, 2394, -2918, 3475, -879, -510, 1063, -3598, 3027, -785, 582, 926, -1270, -940, -342, 1519, -598, 1641, -2012, -36, 1283, -2499, 3579, -1031, -557, 155, -912, 869, 455, 1052, -1805, 304, -1119, 452, 1253, -1600, 2554, -2252, -960, 1389, -1244, 2215, -1180, -1126, 769, -2325, 1657, 1237, -537, -60, 294, -1306, 442, 1908, -866, 837, -1876, -176, 1244, -1753, 2554, -1302, -1113, 786, -839, 1490, -455, 571, -879]
845h79N29p83K347L47m066N302n679K122L085l791L862m065J239j56P82k47J329
862A278j005k796M941m971M002K38m082M463m755L475P55k453J667l35k023Q43
878g58L568m860M732l106j836M799n090M867k159j187J423j008K89O90J663m027
894b000K973k014Q14J824l212L931l784K57K184j234P05L3l15j903L056k270K476
911A521q89k678M515n235L622L47j550J206j878J202m80R74q43J931l858R04L156
928A967m695N394k810j102K162k749L315j042j022O69k31j095J689J388l492L314
944A660k907J15K604l118L862k395j679L214k207N01K036j458r26Q71r73Q91J478
961A569l244L064k075j584M997m111K237m41j829J753j005J617r29L77j877J967
$$ y = [-879, -350, -1133, 1214, 1561, -2505, 2797, -2882, -760, 2325, -1466, 2396, -1669, -430, -586, 196, -51, 1278, 273, -2523, 2418, -2553, 1449, 1687, -2395, 2068, -2687, 788, 1543, -910, 757, 422, -1601, -758, 2810, -2050, 2682, -424, -2260, 2539, -2551, 2316, 157, -1030, 393, -615, -326, 364, 2027, -2000, 973, -1041, -227, 1597, -1615, 2316, -1468, -1211, 973, -261, 444, 477, 162, -1741, 1315, -955, 1521, 632, -2046, 2469, -2766, 856, 1203, -347, 859, -1019, 183, -297, 677, -166, 1765, -2093, -1189, 1967, -2728, 2666, -144, -1246, 916, -1833, 1482, 440, -582, 87, -144, -1239, 450, 1838, -1654, 1660, -1247, -1132, 1472, -1646, 2216, -179, -1858, 1356, -851, -350, 1686, 228, -698, 173, -800, 91, 1569, -1675, 1389, -686, -2270, 2727, -1384, 853, 412, -1417, 336, -669, 948, 19, 396, -1481, 486]
977D86j162l80M077n224K701p31j069L239l042L123k636k74Q39J17Q19j375K708
994B216m770L396r52l6K495n209M856l838J511J939k010J401k305J952j944K241
1010I43n48l87R58l888M905l817K016K298n102L742k688J879J51l6n15k68J83
1027a74j456M173l922K204J7k855L206j642J065J78j936R56N11j000J243J015
1043A583k979J428k42j082K965j777K40o8j132J474Q0q95J377j177j183K100j093
1060c81J104R9j811R97m56m8J714j084n96Q94j916J811R7n29R85j937M44J203
1078E90p84O62L47j658N95k8l35J706r77n89P56j544J978j22p40O15n80q92J284
1097B84K40q59J522k685J778R7j246K228j224p26O60m10R3J230j318K13k0j417
$$ y = [486, -676, -1056, 3021, -2203, 498, -233, -1302, 1937, -1105, 2018, -618, -892, -53, 64, 883, -492, 2216, -2554, 842, -110, -146, 2349, -2860, 1996, -1842, -331, 1608, -402, 999, -1306, 646, -1298, 943, 395, 8, 966, -2922, 1983, -1834, 182, 2480, -2622, 1120, -1568, 311, 462, 426, -89, -357, -174, -1630, 2543, -1379, 825, 842, -2013, 1193, -449, 616, 794, -1142, -186, 325, -675, 568, 1583, -1396, 32, -210, -1292, 1673, -104, 136, 68, -1064, 410, 490, -405, 972, -205, -1388, 712, -381, 723, 822, -989, 8, -448, -496, 1218, 134, -462, 432, -1484, 327, 424, -105, 880, -1057, -613, 590, -194, 468, 815, -843, -248, -276, -611, 1095, 118, -471, 285, -1259, 719, 597, -143, 472, -108, -1000, 284, 524, -335, 1187, -1498, 280, 377, -869, 1359, 135, -591, 69, -341, -248, 982, -336, -123, -143, -1560]
1115a560L137j526l24J575k710J550J76m49M25J57j174Q43K31j040K424k803Q99
1132a69N01j628K531j188M84n41r02P69P42o81J75O84k388K323q22l33J971k201
1150f73Q20k90l73J113Q5p34k99M23q31J941j316J19N47k179K422r07L67Q85j435
1169c15r0O61m54K10J214k110J102p91R0J661j697N09N32j391P22N77p38J460
1187A152j132o93J095q34R30K52j391N70n51J70J098j6j352J386j651L48K209
1204A590k653K168j617n63K069j265R59j40o77n28J289j340J167L68k341K176
1220F62j978J126J432k124J734j766L57Q12r9k40O02n40q21J852j751J381j00
1237E39k092K335j902J604J61q14K14j2m99O15P71j281O29l93q65J667j046O80
$$ y = [-1560, 1577, 51, -273, 1302, -1408, 142, 318, -131, 294, 451, -723, 120, 351, -689, 1735, -1068, -169, 332, -1296, 1235, 47, 531, -10, -912, -143, 599, -82, 93, 777, -1611, 712, -110, -443, 1528, -673, 147, -143, -516, 597, 682, -52, -351, 72, -759, 1182, -134, -15, 532, -1647, 775, -132, 235, 1120, -315, -405, 256, -198, 12, 1226, -884, 218, -573, -483, 1178, -519, -10, 522, -869, -147, 430, -308, 1152, 20, -673, 422, -412, 518, 770, -621, -51, -602, -432, 666, 650, -702, 684, -967, -619, 1590, -1063, 1105, -512, -1075, 994, -271, 688, 548, -129, -657, 632, -708, 459, 827, -1514, 662, -1316, -190, 1242, -882, 852, -914, -557, 255, 156, -84, 518, -22, -843, 1009, -742, 639, 539, -1553, 782, -1120, 484, 645, -169, 45, 33, -466, 149, 920, -361, 268, -125, -990, 677, -369, 311]
1255C11N21j894J400k70l50J285j156l39L31n87R76L25q71N32o04p17J741n81
1273E3k31R58j751R71K45p91J493j437N09k1r4K04P15r79l25P21j491K284r19
1292A14k07Q11j635J255n80M82K4j25o91K18O84p14J673j822K31N78j126J789
1310I59p71j63J74r23Q54P0L08p50Q25j599J203N3p42J365j560Q34r5k53O56K9
1330D74l88j77j13l75J243o74J98J37j503J731r43N84R6n53J0J4N56k53P37j571
1350g70Q89l30k58J421j192P91q41jM11k30Q24p91K25r22J033o6j37Q57j950J438
1370D01o78o9J189j204P54p25o7M79K06n45L48j16o48J256q31Q45k55j039J095
1389C96q98N00Q51j209N42m81j52R38j57j39l87R7p83J358j13k73N90j585Q94
$$ y = [311, 832, -1062, 338, 68, -282, 1003, -153, -492, -161, -748, 228, 553, -318, 214, -390, -1107, 634, 53, -178, 780, -971, 0, 245, -546, 947, -490, 19, -2, -96, 108, 823, -156, -481, 240, -1251, 1033, 114, -93, 718, -917, 338, -242, 240, 264, 139, -552, -334, 350, -364, 1309, -513, -282, 296, -830, 959, 188, 25, 199, -724, 130, 200, 508, -242, 583, -1016, 187, 240, -502, 863, -697, 137, 42, -211, 445, 474, 86, -91, -204, -579, 664, -10, 188, 325, -1178, 553, -390, 194, 290, -263, -253, -239, 317, 64, 801, -770, 119, -211, -469, 952, -240, 551, -290, -291, 120, -110, 714, -77, 148, -774, 259, 193, 56, 913, -1037, 401, -277, -346, 843, -361, 393, -332, -399, 80, 286, -259, 89, -27, -675, 581, -250, 595, 340, -699, 396, -502, -2, 849, -360, 182, -299, -451, 487, 330, 191, -196, -99, -882, 476, 363, 90, 680, -905, -11]
1408a1j84J56P56q70j47J55J71k08J138q77n35R71j494J712p15k24J132k293J641
1427B74n18L28K98k52m29O0K33m56J500j646K66P78j818K443j410K47L04j623
1445a421J886p18N14k30M32j206K78J138j324J863j998N50M41q95J573j076J83
1462a0j50Q4l86Q11J87r29J224k351J665K85r43J355j626N96L8J64L62J06q06
1481c24J76M94j254J844j070l34J107j978J637j8l52N48q30O4M54j80j55R93j525
1500g03P55m2n36J346p99j90L52r91J079R0j31J14m53o85R55L22o42J152j667
1519f74M48O20r51J201o17n04Q07j028P61M71m56m4k9r16N37J026j060J128j455
1538g35R4J261r95J033m72l87k73M8N35J51mo78R47j197Q37M52j115J273j381
$$ y = [-11, -195, -39, 717, -153, -300, -145, 26, -182, 956, 79, -456, 515, -979, 733, 18, -206, 926, -1367, 274, -244, 84, 382, 130, -299, -239, -6, -462, 1038, -608, -342, 436, -1382, 1061, -349, -102, 202, -1421, 465, -253, 261, 31, 463, -743, -465, 673, -651, 1212, -786, -236, 205, -690, 883, -193, -10, -160, -76, -462, 349, 536, -393, 831, -1520, 145, 430, -513, 842, -784, -188, -150, 14, 376, 482, -324, -148, 346, -908, 936, -134, -468, 639, -1339, 298, 280, -72, 476, -354, -290, 164, -16, -171, 822, -703, 52, 10, -526, 820, 21, -169, 183, -808, 271, 361, 230, 344, -109, -794, 161, 483, -159, 993, -674, -226, 394, -557, 644, 27, -477, 330, -698, 63, 534, 78, 34, 5, -911, -374, 652, -408, 720, -735, -641, 620, -375, 658, 186, -201, -474, -426, 109, 260, 256, -422, 525, -672, 165, 617, -498, 775, -606]
1557f06M28Q16r94J278j259M62o59J034n79J55M79j698J841j358R18K95p54P58
1575E57j161P51J11m3l26j46L91o07J235j366J090k53j077J473j335J553n54l50
1593e7K13o57Q29n06Q02r50N47m91k71J243j327J417j077j51P39p95O79j85k17
1612b15J05oj86N03J57n51Q22q18p1Q36o83N88j102J17N43k75M74J02l98o29N38
1633a49j08N82l0n51L36l69M3R54o28m7%n36N99j14L72l09j41l83P48n93N71P0
1655C17q63O60m91K65M64r13R08n80K1M06J69k67K97m07n03Q46l47M45j6p69R92
1676F34j346P41O01o64l02J37Q6j87Q74n51J94j48p04R35n72P12k27p72M95P0
1696FN34m72Q7n75M16J7P2P83j241N31n18L07N50l17J20n31j09j03P10l28L69
$$ y = [-606, -178, 638, -356, 922, -337, 125, -534, 500, -79, 76, 555, -1143, 698, -660, 258, 553, -201, 557, -604, 147, 258, 215, -111, -257, 134, -473, 762, -604, 486, 233, -844, 629, -706, 847, 293, -57, 156, -501, 328, -178, 624, -326, 221, -270, -541, 702, -625, 792, -285, -436, 303, -492, 187, 2, -215, -110, -116, -302, 201, 358, -193, 629, -189, -260, 576, -107, 481, -621, -504, 39, -236, 238, 340, -58, -687, -149, -257, 325, 295, -256, 80, -289, -246, 708, 80, 33, 33, -503, 96, -18, 354, 45, -96, -479, 269, -324, 247, 317, -546, 114, -377, -112, 352, -561, 347, -233, -212, 194, 363, 96, 393, -14, -517, 329, -18, 427, 411, -358, 634, -712, 29, 630, -34, -336, -199, -113, -300, 574, 23, 217, 69, -635, 300, -272, 440, 213, -559, -64, 6, 540, 68, 155, -420, -4, 13, 85, 868, -373, 158, -360, -53, 497, 180, 300, -231, -340, -443, 267, -61, 308]
1717C08j5o35N72m85L62L97p46L67m68NM86k56J95p4J48n49O13l87K94J6n55M98
1739I1l31L64K10n14p3K59j17R3L18m44L41m26p2O88p77P67k45r03J079l93J7
1760f8N75p00J30l8l25N87J79p15M52j72K4L30j63l20K95m95L79K39m20K03l27
1781c50JM55m72K80N81n50k95M88l80P68l94J5Jm55K68Q1o6J92j77n4Q5J3j08
1804g3M63o41L05j55k26J164r80q4N8j51J43K94k14j64M29m79N09l6k96N50m69
1825e3K6K1l34O43m21QJ5J33j76N56k79J33m41mM58n42N77k62m13J91N05n42K21
1848B0L7j50K5k78P18j7l67j43K95m43L08M44p10N92o74J77J90j48L66p5n73L17
1870h9J12j04L66k71m18J35L07J0M56p04P04n20m73P05O0j39j77k09J57J88l9
$$ y = [308, 293, -342, 230, -255, 107, 504, -242, 125, -343, -338, 148, -108, 87, 13, 161, -388, 225, -162, 132, 148, -407, 91, -240, 124, 334, -180, -253, 6, -111, -18, 300, -144, 197, -229, -301, 387, -390, 377, 132, -771, 308, -85, -68, 507, -193, -63, -101, -426, 161, 340, -375, 77, -95, -71, 259, 96, -224, 71, -424, -45, 194, -226, -23, -350, -349, 106, -366, -86, 495, -55, -350, 138, -242, 526, 132, 147, 148, -307, -39, 42, -24, 168, -9, -63, 22, 35, -73, 390, -251, 54, -101, -327, 837, -143, -227, -169, -320, -177, 117, -97, -261, 168, -311, 198, 162, -134, 416, -53, -27, -6, -340, 303, -118, -110, -95, 38, -138, 418, 139, 272, -169, -173, 285, -257, 320, 58, -355, -164, 341, -201, 20, 57, -93, -68, -346, 372, 355, -12, -155, 140, -303, 5, 449, -261, 331, -343, -166, 24, -124, 242, 167, -406, -89, 23, -81, 285, 14, -404, -269, 38, 48, 504, -200, 504, -16, -489, 216, 276, 137, -40, -249, -92, 96, 57]
1891E7L5L6n43M29j31K78j31p7j63K3j95M08q7K2J77q00P70L11o82M53k25l80
1913d15O95l36L66m72J09K36l79p6O43o9l62P4l76O33k94L14r4l80K16j19K21
1934A35Q8J9j40m81K93k29J73m5L44J8m54L15k2K30k57R4l44K79M26m03L61o46
1956b46K73Q8l15J93K90m40J75k20j07O05l78M12j77o53L68L90k84j21K69o28
1976e06O91j71O5K54o73J66K30L09j2n37j8J59K4k07M09k89l6j82p4P65m06K71
1998B32j21l58J90K2K86j86K0n39O22m59J69M73m76K96m30k43M99n2K32j69j93
2019a85K01N34n98K48q0k16J86k14r7L95l52M32l46k72P83l74j06J53k17L5K3
2040f7p5M86j92m42N39j22J5J86m31L34k17j61j4L30k54J06l08KM20j21P0J7m01
$$ y = [57, 92, 128, -415, 14, -117, 161, 30, -47, -210, -187, -382, 26, -61, -39, 138, -662, 108, 419, -263, 190, -35, -415, 280, -56, 310, -162, -53, 183, -196, -272, 371, 302, -60, 14, -362, 271, -23, 291, 197, -183, 33, -86, 135, 223, 242, 102, -379, -86, -315, -142, -187, 157, 175, -279, 36, 14, 244, -13, 81, -263, 16, 442, 39, 400, -246, 27, 115, -200, -7, 283, -157, 18, -202, -309, 296, -82, 330, 153, -500, -132, 258, -26, -147, 122, -506, 185, 14, 79, 333, -340, -174, 56, 365, 353, -184, -202, -43, -19, -226, 183, -106, -142, -324, -398, 367, -39, 232, 111, -247, -57, -35, 251, 65, 85, -454, 168, -291, -122, 351, -125, 171, -259, -502, -3, -55, 177, 8, -185, 16, 550, -48, 200, 120, -96, 90, -124, -221, 174, -178, 254, -92, -364, 419, 45, -61, 92, -125, -90, -67, -142, 344, 152, -290, 249, 127, 142, 328, -103, 231, 14, -147, -161, 169, -85, 21, -287, -285, 135, 14, 84, 101, -300]
2063c00J75q3j34K96j21j63J87N0L40N3l01Jj31r0L85n1k47K13l19J88M40m81
2085i3j21K47n2o6N4L70n2k82K91l60k30M83j0l29l1K1O8R4P5j6R8m40M28j15
2109C2l1N98p72JPN41m9k85k7p4j4q9L11k25k77L75J15M9q6J3J96p17K96L7q7
2134a62N91l99q6K70j18j94N12m24m54N78k77M33m74Q1M11p33M51J81K08J69m79
2155H5j89J98J25n50M83k55L6N07q19M57l8j05P7l27J58oJ39J06J53m39J86Q0
2177F2Jr8K60l39J10j00J9N67k61j58j08j30N9J28M9K23m16K99j3k33J15j18p
2200h9o2R0R2L88j89m77K21j20J92j26K51m32l08P15j4r3J65j92k63K85n1j10
2222a27J29mk30M76n34K83j39K40j43m5l08M86j44M67l18l31N0J9L72m37J28n1
$$ y = [-300, -125, -208, -342, -46, -167, -330, -143, -93, 247, 300, -1, 0, -131, -221, 164, 113, -134, 79, -240, -52, 388, -93, -214, 33, -19, -85, -31, 339, 287, 5, 296, -64, -294, 189, 179, -150, -181, -160, -92, 2, 77, 61, 159, -281, 147, 32, 1, 599, -173, -172, -165, 376, 327, 42, 15, -59, -73, -162, 149, -76, -353, 22, 137, 186, 100, 113, 309, -408, -112, -75, -162, 429, 30, -56, 214, 96, -98, 414, -10, -464, 114, -163, 270, -204, -123, 288, -445, 6, 187, 395, 564, 85, -104, 94, 219, -331, 152, -103, -67, 440, -379, 78, 40, -65, 12, -315, -157, -163, -24, 82, 235, -204, -18, 62, 63, -35, 225, -114, -4, -104, -85, 482, 221, 63, -45, -175, -116, 12, 61, 284, -132, 167, 154, -79, 36, -82, -89, -151, -61, 31, 419, 230, -247, -26, -146, 46, -80, 171, -261, -569, 146, 132, 39, 204, 12, -251, 34, -17, -127, 2, -2, -232, 244, -290, -7, -146, 94, -49, -94, -402, 84, -60, 407, 89, -242, -192, -173, 199, -238, -110, -161]
2244a61K64k86N26j78j72j59l1oJ79J7K99m86KK64J35o0m1j16p6K92k13M52k19
2267B26m44JM94m81M77o3m85K69k29K81J5j44m4k37J99J73k41J45K92m85J95J94
2289A08rj01K68j94m8k58K36K16l78M92m89j00K61L33m12N77o18J71K95n57O19
2310D12j30k28rJ61n74N80j71L7q0k84M19k28L06R7l70J84k05K82j03m42J89J82
2332B5R8k62J11j43J84m11L91j57L66P9m40q7K69K77k45j31j27j67N11j67K04
2353A78l12M25m33J66j30L48k82j1N6rl42N68J25m32p8L2K68j32J43j35j88r4
2375b69L20l4J1J33l03k01R5O64l06k00J50l77M80j19p9J73K3k19p4J40J0N9N
2398H2j41l0r8N9J23K30k96O2l79K04N45j52k18L46k90o5j52O2L45k13J47o0j20
$$ y = [-161, 103, -183, 343, 165, -7, -166, -197, -203, -24, -7, 292, -194, -192, 72, 207, 147, 106, -10, -86, 206, -7, 445, 226, -218, -217, 277, -204, 273, 210, -275, -6, -235, 46, 61, -83, -127, -364, -165, 8, -233, -88, 204, -281, -86, 108, 99, -2, 266, 72, 24, -234, 2, 218, -160, 332, -157, -257, 4, 337, -75, 502, -116, 55, 350, -207, 412, 282, 54, 45, 206, -368, 212, 41, 78, -2, -286, 133, -95, 211, 308, -62, 122, -83, 199, 96, -346, -157, 25, 123, -139, -28, -171, 13, -398, -7, -164, 202, 281, -159, -246, 23, 300, 55, -76, -203, -370, 141, -26, 178, -134, 291, -142, 24, -106, 242, -40, -51, 5, -4, -346, 222, 347, -85, -163, -131, 137, 5, 148, 13, -175, -269, 51, 17, 28, 161, -142, -343, -248, 416, 110, -90, 60, -317, 163, 44, -35, 138, 161, -58, -132, 8, 18, 77, 82, -59, -89, -187, -128, -5, 225, -71, -9, -388, -184, 361, 209, -9, 337, 47, -18, -170, -108, 237, 24, 171, 111, -9]
2421iL38m67O4J70j06K34j29o9Q7j93j13J63R1r4j77K49N0J4j02K22j80k92J23
2444a26J25j56J76rj71K88j02Q1J67n34J96K1k7Qr6K44K0j73k02M39L46p94K74
2467eK51j30o7J2l42L29l7o3J48mj7j2J82l40NK44Q1n8K8k89N7k6K04Qq2k09l7
2494a69L32Q0r4J90j66r9m5j70L33j44j19M9o2J50k00L60l90J71r8L83J53m50
2516ej08J46j33n4M38j21k96o6q0p3M53R9l0j98K73l50K39k04J38O9j04j37K56
2539A52j25p5K32m45M19r3k58R4J02L28n50j6K08J09J0K00k13k17O6L66n37L75
2561A32l76K27J49l66K54k2J05k78M02l79J29K39n50M3K14N6K70k57q9k84L53
2582b8j01M2K74p7k43J6K53l42K21J18m6L3j79K90k62J17k70K49j16P1L46k63
$$ y = [-9, 329, -138, -74, 96, -10, 224, 95, 26, 113, -80, -193, -30, 61, -33, -210, 39, 89, 103, 1, 223, 43, -249, -126, -1, -157, 19, 10, -161, 127, 25, 106, 273, -261, -65, -44, -71, -63, -159, 85, 105, -68, -270, 169, 515, -279, -5, 246, 116, 49, 61, -281, 48, 11, -52, 96, 92, 75, 63, 245, -95, -90, 154, 235, 177, 205, -84, -27, -53, 151, 159, 77, -132, -169, 163, 243, 149, 339, 173, 74, 29, -141, 192, 48, -71, -22, -84, 66, -134, 226, -164, 7, -91, 292, 445, -5, -113, 33, -100, -154, 284, 163, -133, -199, -279, -352, 101, 200, 170, -28, 245, -105, 134, -70, 68, 137, 33, -104, 152, 27, -48, 184, -261, 158, 65, -193, -99, 3, 331, -219, -235, -27, 82, 92, 292, 79, -138, -72, 294, -243, 132, -244, -17, 132, -234, 20, -2, 103, -175, 227, -152, -23, 216, -334, -291, -77, -21, 249, -8, -97, -381, -28, -129, -87, 187, 110, -133, -117, 136, -206, 15, 133, 87, 120, -59, 231, -31, 86, -184, 65, -51, 20, 366, 103]
2604A03r6Q6L24l13P2l95K22L33n43Q2m8L14j34J27j75j33M38j57l63J38k57M54
2626G9n4k85K73pm8J63j89j46L31l14J02j27J24p0o6J31J00OmK66l18Qj7r6K42
2651H4l28J65jJ46k22N3j06K80k12J82m9Q0OJ64k78k38J06op0J42K70m69L78m68
2675c91M74n14M74j22K52k24j0pJ46j27j60M0O7j14L4Q7M9j96K75j50O7J20j19
2698d9K61k87k0j68M05J46k78k64L76Lm6l24K08M9l8j04J69k31M09l46p9R7j66
2721b77L59k7k60j6M60j26J83n79N0J66k9m9N3J88j24p8p4K3L16j39M46m58Q0
2744H8k33O7M07n77L27k9J8o6L59m03j03L14j28k8J67l44J18j23l82N00O4jk16
2767b04M51r6lj99m3L32k20K82k03M8Q2k4k51p2oN40k28j74r4mm7J61k05M35L4
$$ y = [103, 7, 93, 417, 104, 176, -219, 3, 336, -207, -125, -173, 141, 7, 134, -41, -174, 264, 107, -256, -118, -375, 79, 25, -260, 13, 6, -42, 121, -68, -214, 117, -197, -95, -222, -98, -168, -234, -103, -3, 3, -1, 265, -53, -45, -62, -158, 84, -244, -79, -80, 66, -156, -103, -209, 71, -141, 41, -8, 72, 78, 242, -36, -274, -168, -174, -244, -102, 168, -301, 77, -391, 83, -431, 43, -79, 173, -51, -61, -68, 78, -49, -209, -169, -102, -216, -182, -95, -46, -242, 33, -117, -50, 70, -49, 212, -75, -95, -263, 142, 288, 10, -254, 122, 125, 79, -245, -37, 12, -26, -130, 39, -192, 217, -129, -208, -111, -277, 82, 55, -205, -221, 239, 113, 296, -283, -233, -67, -96, -145, -92, 96, -28, -106, -180, -157, 159, 20, 466, 8, 88, -145, -78, 329, -248, 79, 50, 68, 2, 361, -42, -145, 169, 41, 13, 180, -164, -46, -169, -551, -51, 13, 12, -204, 247, 151, 148, -51, -94, 238, 18, 300, 97, 145, 227, 203, -48, -120, -126, 414, 186, 12, -82, -86, -133, 28, -177, 258, 292]
2792B92l59o3j70K6L96J72m90j21M76K9k2k44p4L6M81k66J02k34K40m17k1K87
2814E6k09m16P74k56O1j85K18l5J51m04J83K56k36K08j46n4m0M8M11l79k7K36
2836B15k57Q6j79J38K7J08k0k28J68j80R4K3m4r9NL05j67j5j49K33q4j70M3qM28
2861B73o28J72J96J27J22k2j31l47N1N9J78k7o4l5L5J83N5l44k6K71k58L78l47
2884a29p3l8J71Ro1J96J48l49j19K97K2m8K79m25J44k23j01K97J64k79J68J32
2906A82k19J9K5l79M70j65LJ7j24L71k19Pk5K80j01j55k88j96M96J19k3l81K18
2929f8K14k9R9lj00l88M70q7M2j8R8j16j94P6p0pL44j79j33m74Q37l56j03J87
2953D2J79p5j0m4j54J21m9N9l59J77N0J85k06Mq6K70K51J01n4n58K06J31K9k25
$$ y = [292, -67, -130, -300, -274, 122, 294, -196, -317, 159, 188, 166, -78, -152, -116, 365, 99, 201, -33, 207, -210, -231, 56, -153, -569, 205, -51, 10, -175, 43, 8, 159, -245, -62, 194, -42, 166, 20, -34, -74, -26, 385, 6, -21, 215, -42, 44, -135, 3, 30, 138, 118, -110, 58, -122, -28, -5, -49, -148, -143, 162, -5, -20, -169, 64, -20, -190, -147, -155, 273, -355, -183, 13, 140, 262, 240, 109, -238, -187, -128, 50, 23, -41, -76, -41, 142, 197, -147, -173, 98, -160, 218, -129, -202, -240, -69, -60, -121, 75, 223, -126, -245, 52, 74, 26, 305, -120, 24, -199, -300, -3, 161, -118, 50, 182, -37, -18, 7, -372, 98, -67, -64, -47, -171, 200, -19, -12, -37, 243, 142, -13, -301, -497, -1, 118, 95, -286, -68, 146, 117, 216, 213, 113, -275, 195, 108, 150, 132, 230, 114, -80, -4, -74, -81, 263, 84, -49, -523, 314, -42, -145, 42, 221, 146, 136, 92, -62, 59, 10, 69, -290, -113, -63, 122, -84, -80, -166, 104, 355, 456, 402, -156, 50, 181, 210, -15]
2977a5j85L58j13k54m5K12J26j03k36M00j72R5J54p3m24K29K39k1j26Rp4J81m6
3000A16L86n97Q7p5J0J35J40j39k39Q7M3K96j63k11P6LJM9Pj64q1O09j46l72L68
3025B26k64R1P3k18J53j37L14j74q6J23L6l07K41NJ37l49J28J01l11R3M52k72
3047E5K97n27O4J63j36L9j37J2m6m5L65o3o3n6L18j70m6j1L13l47J09j27j32K73
3071A02n0Q9l98j43K10L76l03K36O7j65%j21N24m80R0J03p1n9J21j29j28J30k6
3094b5l1j7J48P7j42k07J55K22l09n9NJ33q4K58j00J41l44l1L10lJ68J50m12J82
3118A85K1m07J12m0k84L06j56K62M3j12K88l13J98O5k74j52L44m13K05j17L34
3139I5QJ47l84M5M3r8M22k51r8jJ59k40L56l76L81l18q9K05M22p13M37k06k7N44
$$ y = [-15, -200, 158, 45, -209, -254, -42, 84, -19, -255, 145, -27, 68, 222, 149, -275, -46, 193, 172, 46, 55, -19, 162, 116, 502, -95, -8, -83, -73, 62, 202, 63, -176, -89, -46, 250, 87, -124, -48, -45, -44, 5, 12, -152, -233, 376, 230, -142, 226, -38, 53, 126, -92, 61, -76, 238, 64, -22, 101, 137, -170, 71, 76, 213, -136, -8, 93, -218, -125, 327, 55, 352, -175, -111, 52, -84, -45, -182, -170, -216, -261, 104, 41, -22, -78, 240, 70, 24, 13, 326, -21, 88, -39, -171, 102, 52, 141, -257, -400, -190, 186, -117, 119, 186, 21, 21, -100, 424, -56, 34, 137, 66, 7, 128, -1, -129, 1, -25, -56, -73, 75, 152, 10, -197, -42, 180, -129, -188, -183, -50, -134, 124, 24, 165, -179, -210, 100, 97, 265, 415, 3, 185, 206, -201, -89, -129, -413, -107, -263, -1, 42, -70, 218, -95, 103, 168, -106, -258, 86, -327, -122, -239, 95, 103, 250, -134, -89, -46, -144, 278, 27, -71, -72, 87, -153, 203, -173, 208, -110, -199, 6, 428, -285, 152, -54, -81, 463]
3163D63l22Lj60K0M9N2k16J67j49n8J53Jm6J05j20R4k19N3K44k87K70L51n25J52
3187G5%J95n1l97J00m1m4J07N1R5j35j03P3L03j66k44M3J89k11K25J8j02k91L43
3211C2k98K85N9j15K01k39L05n07M88j81RJ18j02j26J75j18K66l25K2j83L91j6
3233A41j34l0n25K82N23O3l32l8N8n8K40K53m92R3o2J73m32L58r2K02j36J04j92
3256c3m5m6P8K64j64j44k43K24L35l83L11Ql57K15j83K07MQ7Pj75Q7l57L00k17
3280b20K36j62L07J10l03lK8oJ49m38O12n34K0M77l82j18L44k35l01N38K3l66
3302b24K13K04k66j19O3L47k70M4j3O4k41L21j64J3k82J48n0j52J46J65J29k82
3324b06o1J67J36K30j85n5R9j81K78L0l10j97N91r2k00l77R3J37K4J06Q0r0j25
$$ y = [463, 141, 144, -16, 4, 53, 105, -111, 56, -93, -151, 2, 3, -43, 62, -58, 36, -183, -130, 114, -173, 97, 448, -77, 75, 75, 270, 219, -178, -78, -119, -163, -56, -5, 90, -45, -148, -75, 228, 62, -182, -139, 50, -161, 64, 82, -20, -311, 32, -266, 19, 78, -37, 164, -75, 230, -277, 211, 30, 39, 157, 55, -71, 104, -14, 252, -73, -51, -234, 157, 141, 7, -23, -548, -266, 257, 320, -12, -50, 8, -50, 190, 443, -49, 44, -18, 155, -277, 81, -11, 191, 55, 159, -33, -78, -124, -46, 218, 54, -90, -333, -109, 226, -157, 154, 162, -195, 20, -163, 44, 48, 135, 142, -33, 54, -303, -3, -220, 16, -146, 161, 271, -32, -35, -7, -13, 136, -302, 310, -224, -204, 273, -109, -227, 117, -118, -419, 119, 142, -224, -11, 193, -73, -192, -129, 218, -52, -8, -21, 43, -198, 123, -41, -28, -310, -162, -212, -364, -218, -53, 76, -206, -267, -100, 36, 266, 81, 26, 125, -56, 222, 252, -58, -255, 336, 244, 44, -333, -240, -103, -79, 27, 107, 17, -108]
3347a08k50K71J34j69m5K40l68P0J09j8l6J65j33k40K74k6J20J84j28O2k6r6n6
3370g0p2Q8j26N5M84l70pj66K67j85K32j79J92j35L04o1j89n4K82l83R5M52l48
3393A06q2k6K6o8k43N44m52K35K97k46L8K57p04K1L84J71l48L1J16Q2k56L18k18
3416a7k17L34l89K90J39k67q3r6N53j49M8k31m0M24Ln22K52pJ03o2l35N23o3j80
3440A1k52M45J25m85J54J21m6J22j50l1m6K2R6k48K41j75K73j22m26M49K27n03
3462a98J75j82M5J13R9k47J05J05N8j6k30J02K09r4P0j12k1J9m8K0K10k49M55
$$ y = [-108, -358, -87, 47, -122, -167, 73, -295, -225, -116, -134, -170, -5, -138, -378, -104, -130, -10, 174, 46, 108, 82, -14, -70, -142, -54, -180, -125, 359, -11, -18, -184, 83, -102, 130, -49, 143, 8, 312, 251, 62, 8, 290, -93, 2, 454, 106, 24, -2, 24, -44, -287, 257, -195, 40, 337, 91, 129, 386, -318, -297, 87, 258, -90, -59, 57, 139, -117, 201, -17, -234, 100, -289, 1, 140, -127, -210, -306, 247, 98, 146, -85, -125, 299, 302, -220, 32, 25, 128, 66, -269, 254, 191, 11, -241, 204, 329, -156, -2, 119, 73, 195, 45, 14, -32, -10, 86, -162, 79, -96, 177, 55, -371, 78, 305, -198, -23, -205, -160, -47, 52, -195, -90, 15, 73, 57, -173, -71, 138, 44, 114, 2, -19, 0, -48, -28, 182, -67, 388]
$$ [...]
8191h1
##END NTUPLES=NMR FID
##END=
