##TITLE=1H_Ser EL-2
 CDCl3
 8 sc, 
 28.11.2023
##JCAMPDX= 6.0         $$ Bruker NMR JCAMP-DX V2.0
##DATA TYPE= NMR FID
##DATA CLASS= NTUPLES
##ORIGIN= UXNMR, Bruker Analytische Messtechnik GmbH
##OWNER= root
$$ XWIN-NMR		Version 3.5
$$ Tue Nov 28 15:26:33 2023 Russian Standard Time (UT+4h)  she@DPX200
##.OBSERVE FREQUENCY= 200.1313
##.OBSERVE NUCLEUS= ^1H
##.DELAY= (6, 6)
##.ACQUISITION MODE= SIMULTANEOUS
##.ACQUISITION SCHEME= undefined
##.AVERAGES= 8
##.DIGITISER RES= 18
##SPECTROMETER/DATA SYSTEM= spect
##.PULSE SEQUENCE= zg30
##.SOLVENT NAME= Acetone
##.SHIFT REFERENCE= (INTERNAL, Acetone, 0, 15.7039)
##AUDIT TRAIL= $$ (NUMBER, WHEN, WHO, WHERE, WHAT)
$$ ##TITLE= Audit trail, XWIN-NMR		Version 3.5
$$ ##JCAMPDX= 5.01
$$ ##ORIGIN= Bruker BioSpin GmbH
$$ ##OWNER= she
$$ F:/spectra/data/she/nmr/H-F/1/audita.txt
$$ ##AUDIT TRAIL=  $$ (NUMBER, WHEN, WHO, WHERE, WHAT)
(   1,<2023-11-28 15:25:25.67 +0400>,<she>,<DPX200>,
      <created by zg, POWCHK disabled, PULCHK disabled
       configuration hash MD5:
       00 E9 B6 7A A2 85 ED C7 34 08 36 98 17 FE 4E 26
       data hash MD5: 16K
       3F 06 FE B2 D5 D9 5E 7A 1E 47 60 8A BA 08 3F CE>)
$$ ##END=
$$ 
$$ hash MD5
$$ 13 39 2E 10 2F 3E 77 97 60 E7 A5 E0 EA C9 AE 4D
##$RELAX= 
##$RELAX= 
##$RELAX= 
##$RELAX= 
##$RELAX= 
##$RELAX= 
$$ Bruker specific parameters
$$ --------------------------
##$DU= <F:/spectra>
##$EXPNO= 1
##$NAME= <H-F>
##$PROCNO= 1
##$TYPE= <nmr>
##$USER= <she>
##$AMP= (0..31)
100 100 100 100 100 100 100 100 100 100 100 100 100 100 100 100 100 100 
100 100 100 100 100 100 100 100 100 100 100 100 100 100 
##$AQSEQ= 0
##$AQ_mod= 1
##$AUNM= <au_zg>
##$AUTOPOS= <>
##$BF1= 200.13
##$BF2= 200.13
##$BF3= 200.13
##$BF4= 200.13
##$BF5= 200.13
##$BF6= 200.13
##$BF7= 200.13
##$BF8= 200.13
##$BYTORDA= 1
##$CFDGTYP= 0
##$CFRGTYP= 5
##$CHEMSTR= <none>
##$CNST= (0..31)
1 1 145 1 1 1 1 1 1 1 1 1 1 1 1 1 1 1 1 1 1 1 1 1 1 1 1 1 1 1 1 1 
##$CPDPRG= <>
##$CPDPRG1= <>
##$CPDPRG2= <>
##$CPDPRG3= <>
##$CPDPRG4= <mlev>
##$CPDPRG5= <mlev>
##$CPDPRG6= <mlev>
##$CPDPRG7= <mlev>
##$CPDPRG8= <mlev>
##$CPDPRGB= <>
##$CPDPRGT= <>
##$D= (0..31)
0 1.2 0 0 0 0 0 0 0 0.06 0 0.03 0 0 0 0 0.0002 0 0 0 0 0 0 0 0 0 0 0 0 
0 0 0 
##$DATE= 1701170725
##$DBL= (0..7)
120 120 120 120 120 120 120 120 
##$DBP= (0..7)
150 150 150 150 150 150 150 150 
##$DBP07= 0
##$DBPNAM0= <>
##$DBPNAM1= <>
##$DBPNAM2= <>
##$DBPNAM3= <>
##$DBPNAM4= <>
##$DBPNAM5= <>
##$DBPNAM6= <>
##$DBPNAM7= <>
##$DBPOAL= (0..7)
0.5 0.5 0.5 0.5 0.5 0.5 0.5 0.5 
##$DBPOFFS= (0..7)
0 0 0 0 0 0 0 0 
##$DE= 6
##$DECBNUC= <off>
##$DECIM= 32
##$DECNUC= <off>
##$DECSTAT= 4
##$DIGMOD= 1
##$DIGTYP= 9
##$DL= (0..7)
0 120 120 120 120 120 120 120 
##$DP= (0..7)
150 150 150 150 150 150 150 150 
##$DP07= 0
##$DPNAME0= <>
##$DPNAME1= <>
##$DPNAME2= <>
##$DPNAME3= <>
##$DPNAME4= <>
##$DPNAME5= <>
##$DPNAME6= <>
##$DPNAME7= <>
##$DPOAL= (0..7)
0.5 0.5 0.5 0.5 0.5 0.5 0.5 0.5 
##$DPOFFS= (0..7)
0 0 0 0 0 0 0 0 
##$DQDMODE= 0
##$DR= 18
##$DS= 0
##$DSLIST= <SSSSSSSSSSSSSSS>
$$ [...]
##$SUBNAM2= <"">
##$SUBNAM3= <"">
##$SUBNAM4= <"">
##$SUBNAM5= <"">
##$SUBNAM6= <"">
##$SUBNAM7= <"">
##$SUBNAM8= <"">
##$SUBNAM9= <"">
##$SW= 18.0517328524113
##$SWIBOX= (0..15)
0 0 2 0 0 0 0 0 0 0 0 0 0 0 0 0 
##$SW_h= 3612.71676300578
##$TD= 16384
##$TD0= 1
##$TE= 0
##$TE2= 300
##$TE3= 300
##$TEG= 300
##$TL= (0..7)
0 120 120 120 120 120 120 120 
##$TP= (0..7)
150 150 150 150 150 150 150 150 
##$TP07= 0
##$TPNAME0= <>
##$TPNAME1= <>
##$TPNAME2= <>
##$TPNAME3= <>
##$TPNAME4= <>
##$TPNAME5= <>
##$TPNAME6= <>
##$TPNAME7= <>
##$TPOAL= (0..7)
0.5 0.5 0.5 0.5 0.5 0.5 0.5 0.5 
##$TPOFFS= (0..7)
0 0 0 0 0 0 0 0 
##$TUNHIN= 0
##$TUNHOUT= 0
##$TUNXOUT= 0
##$USERA1= <user>
##$USERA2= <user>
##$USERA3= <user>
##$USERA4= <user>
##$USERA5= <user>
##$V9= 5
##$VALIST= <valist>
##$VCLIST= <CCCCCCCCCCCCCCC>
##$VD= 0
##$VDLIST= <DDDDDDDDDDDDDDD>
##$VPLIST= <PPPPPPPPPPPPPPP>
##$VTLIST= <TTTTTTTTTTTTTTT>
##$WBST= 1024
##$WBSW= 4
##$XGAIN= (0..3)
0 0 0 0 
##$XL= 0
##$YL= 0
##$YMAX_a= 148721
##$YMIN_a= -187191
##$ZGOPTNS= <>
##$ZL1= 120
##$ZL2= 120
##$ZL3= 120
##$ZL4= 120
##$ABSF1= 10
##$ABSF2= 0
##$ABSG= 5
##$ABSL= 3
##$ALPHA= 0
##$AQORDER= 0
##$ASSFAC= 0
##$ASSFACI= 0
##$ASSFACX= 0
##$ASSWID= 0
##$AUNMP= <proc_1d>
##$AZFE= 0.1
##$AZFW= 0.1
##$BCFW= 1
##$BC_mod= 2
##$BYTORDP= 1
##$COROFFS= 0
##$CY= 11.3945322036743
##$DATMOD= 1
##$DC= 2
##$DFILT= <>
##$DTYPP= 0
##$F1P= 15.7292609196834
##$F2P= 12.9074282941183
##$FCOR= 0.5
##$FTSIZE= 0
##$FT_mod= 4
##$GAMMA= 1
##$GB= 0.15
##$INTBC= 1
##$INTSCL= 1
##$ISEN= 128
##$LB= 0.24
##$LEV0= 0
##$LPBIN= 0
##$MAXI= 10000
##$MC2= 0
##$MEAN= 0
##$ME_mod= 0
##$MI= 1.114404
##$NCOEF= 0
##$NC_proc= 0
##$NLEV= 6
##$NOISF1= 3.799351
##$NOISF2= 2.8
##$NSP= 1
##$NTH_PI= 0
##$NZP= 0
##$OFFSET= 15.70392
##$PC= 1
##$PHC0= -24224.7
##$PHC1= 5.8527
##$PH_mod= 1
##$PKNL= yes
##$PPARMOD= 0
##$PSCAL= 0
##$PSIGN= 0
##$REVERSE= no
##$SF= 200.130013532006
##$SI= 16384
##$SIGF1= 3
##$SIGF2= 2
##$SINO= 400
##$SIOLD= 16384
##$SREGLST= <1H.CDCl3>
##$SSB= 0
##$STSI= 0
##$STSR= 0
##$SW_p= 3612.71676300578
##$SYMM= 0
##$S_DEV= 0
##$TDeff= 0
##$TDoff= 0
##$TI= <>
##$TILT= no
##$TM1= 0
##$TM2= 0
##$TOPLEV= 0
##$USERP1= <user>
##$USERP2= <user>
##$USERP3= <user>
##$USERP4= <user>
##$USERP5= <user>
##$WDW= 1
##$XDIM= 8192
##$YMAX_p= 0
##$YMIN_p= 0
$$ End of Bruker specific parameters
$$ ---------------------------------
##NTUPLES= NMR FID
##VAR_NAME=  TIME,          FID/REAL,        FID/IMAG
##SYMBOL=    X,             R,               I
##VAR_TYPE=  INDEPENDENT,   DEPENDENT,       DEPENDENT
##VAR_FORM=  AFFN,          ASDF,            ASDF
##VAR_DIM=   8192,          8192,            8192
##UNITS=     SECONDS,       ARBITRARY UNITS, ARBITRARY UNITS
##FACTOR=    0.0002768,     1,               1
##FIRST=     0,             0,               0
##LAST=      2.2672688,     0,               0
##MIN=       0,             -187191,         0
##MAX=       2.2672688,     148721,          0
$$ Real data points
##PAGE= N=1
##DATA TABLE= (X++(R..R)), XYDATA
0@%%%%%%%%%%%%%%%%%%Qj6J6j6J6j6J8k6L2l2L6m4M8n4O2o8P8q8R7j10J24j36
40g1J49j65J84k02K23k46K70k98L29l62L96m36M82n33N91o58P34q23R28j056J214
61F50j413J677k034K545l337M683p347J4366o2332j34649K48326K4113j92472
74a07224R6697J14434j21659l8021R5944j5326o1963N5677J0574p7214M3710N0831
86D6460p3803J0874M6746n5517L536M0902k8029Q420J7535k0418R563K276j7269
99h724P267N440q79q101K481K5798k4768k5885M3650q592l8637K7442P357r719
113e870J8619j0142l252J5685j6675r268J0273R005j032k3149J4251K5008l8379
126a4926K715L5493l6501j880L6552k6423m689K3148j6948l608Q171o660N087
$$ y = [0, 0, 0, 0, 0, 0, 0, 0, 0, 0, 0, 0, 0, 0, 0, 0, 0, 0, 0, 8, -8, 8, -8, 8, -8, 10, -16, 16, -16, 20, -24, 24, -30, 32, -36, 42, -46, 51, -59, 65, -71, 78, -87, 97, -105, 118, -128, 142, -156, 173, -189, 207, -229, 253, -280, 311, -347, 387, -436, 492, -564, 650, -763, 914, -1120, 1425, -1912, 2771, -4576, 9790, -52542, -187191, 61135, 85248, -107224, -10527, 103907, -17752, -55773, 40171, 24845, -37118, 18559, 29133, -48081, -4371, 46460, -27343, -16469, 30277, -25240, -21704, 19198, -8831, -411, 17124, -3294, 6269, 8545, -8724, -1457, 3983, 3104, -4997, -2516, 23282, -1486, -27371, 16279, 7687, -30950, -3508, 3849, -5870, 12749, 2607, -645, 15040, -1635, -10903, -630, 8375, 7343, -15806, -1555, 23453, -14926, -12211, 23282, -13219, -15099, 21453, -4970, -9659, 13489, -3459, -7067, 1104, -5556, -469]
139d69J069k613N625K697L699j4705l223K4894k0935j1479L7617k5692j9726M6162
153B2921k0140k8460L9887j3844k9175L4352J0126k0909N316J1083j1457j1465
165a1765K1566N754k7143J3809R541k8380J8514J1977k9845J6336N074k7030K5508
178C916R869k5780J4388O119j6834P988N931m553k338K397N490j1747L110J6780
192A4736k2032k312K4838k1686n755K4693j5329m903J5770j1408k739N918j401
205a610M808n748M884Q199j8555P269J5303k2289N785J5628k2014L580J4909j2982
219b833l073O554p12n860k240J3873m018j3559K2008j795k2395K3722P95k3315
233a2848J9534K321j7612J2202r39r077Q452k729k772K376k116M378l189m0Q176
$$ y = [-469, 600, -2013, 3612, 6309, 10008, -4697, -7920, 16974, -3961, -15440, 22177, -3515, -23241, 22921, 2781, -25679, 14208, 364, -28811, 5541, 15667, -5242, 74, 11157, -300, -11765, 9801, 15555, -11588, 2221, 11762, -16618, 1896, 13873, -15972, 364, 5438, -21592, 3916, 13785, -11995, 2393, 8512, -8322, -334, 5597, 1044, -1294, 1103, 6593, -5154, -2044, 14736, -7296, -9608, 15230, -6456, -12211, 12482, -2847, -7750, 8020, -3388, -6127, -209, -1610, 3198, -2550, 2334, 10533, -8022, -753, 14550, -7739, -1954, 13674, -8340, -4760, 10149, -2833, -5906, 648, -64, -5924, -8164, 5709, 1691, -11868, 10140, 8345, -14050, 9672, 10467, -12848, 6686, 9007, -8605, 3597, 2658, -6419, 2033, -696, -3468, -1092, -3208, 1170, -2019, -2059, 6117]
248F117j0823J778R988j2941P416R276j7889Q658P049j6877J1318K190j3242J0679
262B697j875q149J2079m376n191P223n884J071M415l601L371k221M28O009r683
277c687M804Q476j6750P508Q927j8257R975P674j9620J0095O627j5658P936N889
291C939p833L450J139P96r23k968Q849m458p529J3728o280q876J3760o738n679
306e623J0277q601Q3O899q486N724J777q530J0680k367q592J3082k837p643Q948
321D791m054j064L683o156M160M74o063O088k447k909P071p594K016O331j1516
336g189P332N846j4765J1545N091j5791J0385N622j2679O093L065o141J639n79
350e26J842k610l631Q964n889o321J4286o699p365J4146o284m180J0739o800o43
$$ y = [6117, -4706, -2928, 7060, -5881, 1535, 10811, -7078, 1580, 8629, -8248, 3070, 5260, -7982, 2697, 822, -7327, 4752, 376, -4815, 2408, -3476, -2405, 2010, -1591, 1780, -441, -13, 5996, -3687, 1117, 9593, -7157, 351, 9278, -8979, 996, 8670, -10950, -855, 5772, -9886, -1950, 3939, -3894, -444, 695, 1491, 568, -2400, 6449, 1991, -5538, 8190, 1910, -6966, 6794, 56, -5623, 4654, -3947, -3864, 3035, -5451, 273, 2050, -6480, 4200, 1833, -6759, 6323, 3486, -4157, 4791, 737, -327, 3356, -2800, 1360, 1834, -4229, 1859, -588, -3497, 3574, -4020, -2004, 4327, -7189, 143, 5989, -8776, 2769, 7860, -7931, 2454, 8076, -4603, 1490, 4555, -1586, 53, -526, 1316, -1294, -4925, 4039, -1850, -8171, 6115, -584, -7949, 6197, -87, -4267, 6472, -328, -971]
365i71N850o574M320o25o332R554n301o668J2188o311n678J0284m913k939N703
380A587k463R98j214R77N445q982K310J0345j3492K801J0874j4057L478Q711j3555
395f237N383O381j2168N485M405p796L285K095j452j70n62N023m178l012J1621
410H103q547n489J6145j0148q082J6402q457p723J3330o148m306O777l014J90
424i67J45j388M868m176j79O905p057J429O071q339L897K831p873O843j772o180
440d942Q885m935m849R846o023k696P727n462J277L129m746N396r64m141P478
455D980m838k412Q204p425r24P524p616K21M161m913K361l4j463M041m987K187
471i33N748j0046N946O495j3341P180O603j3449O662N757j1186M392M185o712
$$ y = [-971, 4879, -1695, 2625, 2000, -4332, 5222, -79, -6747, 5441, -870, -6548, 3736, -1177, -4116, 1587, -876, 122, -1092, -115, 5330, -3652, -1342, 9003, -4489, -1688, 9186, -4871, -1393, 7318, -6237, -854, 5527, -6641, -1156, 3249, -4547, -1262, 833, -619, -789, -1351, 3672, -506, -3518, 8103, -444, -5933, 10212, 64, -8018, 8384, -73, -7796, 5534, -614, -4920, 1857, -1157, -967, -822, -2210, 2658, -1518, -1697, 5208, -1849, -420, 5651, -2688, 1209, 4040, -3833, 3010, 1238, -4942, 3943, -992, -5841, 4005, -2018, -4714, 3013, -2449, -1172, 1957, -2789, 2607, 1643, -2498, 4980, 142, -2270, 5934, -1491, -2415, 5109, -2507, -2286, 1875, -3038, -677, -711, -2174, 1867, -3120, -933, 4815, -5231, 715, 7210, -6131, 1049, 7652, -5797, 865, 6622, -4564, -172, 4013, -2699]
485b699J007K464o62k808M65O446p507j565J2689j0695l670J6863j1944n797J8476
500A1063j0987p532J6070o818q006R640q27o784J809N613l868o415J0193J90j3089
515i748J2278M742j6937J2017O960j6578Q352P506j3141L320N805n200j049J672
529aK031l940k884Q566m690n886J1553m118p179J1407m038n773R410l769k571
544a882N621l484K12R78j996K642m007O33N207q986K969P464j1468M179Q617j2660
560e961M062P992j0170K446N945m902N67K074L71j859l047O263l556o370J0770
575D625l961q593J2609l816q667J2029l482o103R764l881l486O473l308o83K954
590B474k270N48p14N35R09m604N365j75r459R287J292j1907J1287K421j3183J0027
$$ y = [-2699, -1692, 772, 110, -2698, -2233, 4213, -3294, -4859, 7830, -2865, -6535, 10328, -1616, -7413, 11063, 76, -7456, 8614, 1796, -6210, 3430, 2603, -4181, -2372, 3241, -627, -7042, 3151, 3341, -9748, 2530, 7272, -9665, 2352, 9312, -7266, 1086, 8592, -4549, -1229, 4576, -624, -1673, -1, 2030, -1910, -4794, 3772, -918, -6804, 4749, 631, -6548, 4859, 821, -4952, 4458, 689, -1882, 3739, 255, 467, 1445, -551, 2091, -1916, -1283, 3924, -5062, -2093, 5371, -6097, -1918, 6699, -5961, -1899, 6093, -4077, -1631, 4314, -588, -21, 2053, 2424, 565, -2482, 3781, 225, -6145, 4625, 664, -7929, 4680, 864, -7803, 4226, 744, -5359, 4405, 524, -2962, 3511, 203, -480, 2474, 204, 752, 38, 573, 1482, -3122, 2243, 2068, -7391, 1896, 3188, -8719, 2568, 4989, -8194, 1833]
606A833L874j0993O573L307o302R56K014J202k723j100N404n079l349R027o229
621a585l186R125o898j772Q473o826M54N840n673K057K800l914L006q96j270L275
637C010m861J860K683p349M982L091q685N639K163q243N935J785m809L359J31
652F91n14Q33j510M229k734m208Q615m826n974J1200n140p274J0094l844n010
667e372P870l072k031M112k323R08p4o70L018l392J066L637o036L530K873p733
683c689O030L66r600Q610J080r005P915N00p591N990R22l350K087J70K71j400
699f94L04M689m688j159O276o950l81Q015p733P8O260q053K107M931o707L046
715f59K222m676L860P81j629J851j867J398L08l651N388k084m933P881l673n917
$$ y = [1833, 5707, -5286, 1287, 4594, -1708, -752, 1262, 2464, -259, -1359, 4045, -1034, -4383, 4644, -1585, -4771, 4354, -2544, -4316, 4157, -2669, -2215, 3625, -2048, 9, 2809, -1105, 1901, 1005, -265, 3010, -1851, 9, 2692, -4657, 325, 3416, -5269, 370, 2533, -5710, 225, 2010, -2799, 560, 691, 177, 1010, -500, 3729, 995, -3213, 5402, 576, -5398, 5802, 662, -6612, 3482, -362, -5372, 2498, -574, -2605, 1507, -816, 92, 18, -652, 2366, -1026, 40, 3677, -2359, 1171, 4044, -3689, 2341, 2707, -6893, 1717, 2797, -6208, 1707, 2207, -5384, 606, 1528, -1822, 265, 435, 706, -694, -390, 4299, -389, -1548, 4728, -2222, -2603, 5412, -2321, -2243, 4017, -4036, -1929, 3002, -3705, -659, 1563, -3113, 747, 1528, -101, 1750, -117, 1281, 1589, -2062, 3326, 1242, -3691, 4190, 517, -5400]
731e400Q342l443m659P802k584k549L575j468L61J15j176L911m178m89P009o263
747a094n72P621p925j346O896n465n3M233l833J39R89j76J255l348L012J514n763
764c916N884J925q151P441Q29q785P163Q69p823O731M76n966L426N9k317M90J158
781e07K338l804K81N963o674M83Q444q453r54Q566p756j68P843o868n94L916m113
798b057J351P84j076J584l205K019K676m675L667J541o192N066N83m270N549j952
814A393l429N230l600j272M277m602J233K756n194L447L90l948M378j064k189
829b194M249l135N74L967m320J763J729m554L190K09l103L976k944j624M019m624
845b822J500M140n976K656K891n929M936R17m906M254l28k989M371k067o81K178
$$ y = [-5400, 2942, -501, -5160, 2642, 58, -2491, 1084, -384, -23, 92, -1084, 2827, -1351, -1840, 5169, -1094, -1666, 5955, -1970, -3316, 3580, -1885, -1938, 2295, -1538, -1399, -410, -586, 669, -2679, 333, 1847, -3916, 1968, 3893, -4258, 3183, 4012, -4773, 2390, 3259, -4564, 2167, 2643, -3323, 103, 162, -2155, -1665, -507, 1831, -1973, -1692, 4271, -2403, -1920, 6524, -1929, -2883, 5683, -2073, -2241, 5602, -1266, -1860, 2056, -2057, -706, 78, -998, 586, -2619, -600, 2076, -2599, 1068, 2609, -3583, 1483, 2066, -2204, 3345, 1393, -2036, 3194, -406, -1678, 2599, -2003, -770, 1986, -3208, 239, 629, -3319, 1059, -5, -2194, 2055, -1080, -506, 3461, -859, 904, 2633, -1921, 1269, 1478, -1625, 2351, -593, -2217, 1802, -2822, -1322, 2818, -3158, -502, 2389, -3540, 1396, 2313, -2593, 1661, 1333, -1656, 2715, 648, -33, 2145]
861B145l637J868P72l532L729j431k721M500l553o12N626n508J289M859o622K312
877e16M416n819K568K505m538K047J82j600J817k479J196Q88m359M599K36n006
893c863N448o50m453N699j548k359M730l364q1L180m382K832J265m926L534Qm123
910c053M293j134k539L344k201M58J604k838L025K61l838N037j663k848O006l697
926B17j474M695n173K4M813n513J290L421n000J947J263k584K492p30J05J676
942A469l193L343Q95n359N206j20n800N748j6n176M862j096l427L812k273J07
958a018J668k685K785k76l181M938j660k895N408k733j716M436l349j6K157l431
974a568K121l96k102L646k650j701M939m156j91M928n056J239M130n097K280K485
$$ y = [2145, -1492, 376, 1148, -2384, 1345, -86, -2807, 1693, -1860, -2472, 3154, -2354, -1065, 3794, -2828, -516, 3900, -1919, 649, 3154, -1384, 663, 845, -755, 1062, -1417, -221, 667, -3692, 907, 1143, -3863, 1585, 935, -3518, 2181, 633, -1726, 3004, -360, -441, 2739, -1643, 1189, 2454, -2472, 1062, 1070, -3053, 1240, 106, -2433, 911, -1290, -832, 772, -2066, 959, 1220, -2618, 2419, 756, -2092, 3914, 217, -1257, 3438, -1735, -1711, 3102, -2411, -1121, 2300, -2700, -753, 510, -2074, 418, -312, -207, 1469, -1724, 1619, 2514, -2845, 2361, 2241, -3559, 2189, 2173, -3003, 1859, 763, -2664, 1148, -1125, -1018, 650, -2035, 750, 474, -2707, 2231, 571, -2324, 3084, 351, -1365, 3071, -278, -294, 1863, -1568, 553, 157, -1945, 1701, -949, -2650, 2289, -1867, -2058, 2870, -2186, -947, 3183, -1914, 366, 2851]
990B851m388K725N60k696K276j401j97J378k853K023L16l938M703j064l975O067
1006B387k549l156O513l069k202N551l670p78L310k985R38R02k188J863j159j169
1022a461K602l060J045K354m305K955J493m634M508q7m009N296j375l733N282
1037B871k169k212L989k748r30J605j767J808q52j251L389l429r9M579m825J011
1053a030M556n371J506L339m432K223J089k975K580j582p72K823l395P64K452
1068A775m761K708K133m982L318J451l891L456j26k439L223j761q9J600k884K485
1084A216l58k655L756k349k525N499l975j970O292m522j238N519l586o17L657
1099B144k150J6Q78n17R05k250J672J547m922L170J871o009L872J980o162M549
$$ y = [2851, -1537, 1188, 1748, -948, 1328, -73, -270, 1108, -1745, 278, 594, -3344, 1359, 295, -3680, 2387, -162, -3318, 3195, 126, -2076, 3475, -195, -973, 2337, -648, 290, 1192, -996, 867, -292, -1461, 1141, -1919, -874, 1480, -2825, 130, 1623, -3011, 1497, 1410, -2599, 2697, 1322, -2411, 2871, 702, -1510, 2479, -269, -1199, 406, -1361, 447, -405, -1656, 1733, -1696, -1795, 2784, -2041, -1030, 3526, -1845, -339, 3000, -1432, 791, 1880, -1095, 1485, -97, -869, 1954, -1441, -677, 1775, -2986, -278, 1855, -3127, 191, 1642, -2249, 1207, 1081, -1358, 1865, 104, 15, 1615, -1269, 1216, 858, -1797, 1959, -390, -2915, 2584, -1391, -3361, 2931, -1591, -2829, 2690, -896, -1513, 2144, -6, 10, 888, 371, 1276, -974, 698, 2245, -2677, 493, 2364, -3645, 227, 2207, -3955, 594]
1115E94R40m586M206p06k133L316j595n06K333k436J346N33k266K455j427j061
1131i93K669k938j04L714m660J173L282m852K012L039m375K155J389k561K410
1146A360q27p30J980k942J804J189m160K926L40l759L479l99k660L848j995j071
1162a617L231k733O72K380l155J872P02k373K801j153j736L443l471j94L776m884
1178b439J139L849n204J413L004l366Q39J604j228P57o43J635P3l534M177p1n112
1195c107M793O29n991N052N31n505M196J06k969K580m69k94M01o33K101j250r45
1212g74L446l407l47M231m487N17M279n464J010L936n139P84L414l812J198J148
1228E33j298Q20j166J574Q07l102L528J33m548M713j1m629M071k66l212K968j405
$$ y = [594, 1534, -3052, 1154, 448, -1685, 1631, 36, -470, 1863, -573, 773, 1306, -960, 1495, 68, -993, 1676, -1262, -1366, 2348, -2312, -1139, 2143, -2709, -697, 2342, -2033, 122, 1511, -1050, 1360, 533, -197, 1783, -1159, 645, 1834, -2326, 600, 940, -2819, 660, 261, -2399, 1449, -546, -1617, 1614, -1119, -447, 1933, -1222, 650, 1352, -1021, 1780, 627, -1109, 2334, -1137, -1331, 2445, -2439, -1300, 2549, -2655, -1242, 1762, -1604, -765, 839, -389, 368, -275, 1360, 1433, -2101, 2076, 2005, -3107, 1686, 2315, -3676, 1376, 1907, -3598, 598, 704, -2265, 315, -154, -448, -47, -680, 1421, 171, -774, 2672, -735, -1082, 3149, -1338, -821, 3458, -2006, -996, 2940, -2199, -1415, 1999, -1813, -615, 533, -765, 55, -1111, 463, 1270, -1832, 1696, 1829, -2719, 1994, 1983, -2646, 1425, 1159, -2053, 915, -490]
1245d90p03J594j737J207P55k758K993m64k333L765j611j822M180k670p40L137
1261B303l082N75J898l079J676M21k448K071j037p29K094k109J201J933l758K866
1277G96R18m266L680R27m309L851m25k761K974j102j139J527j533Q68j6j673K767
1294A084j566j205L557k915N8L587l916P69L439m375J815K355m243K023Q69k674
1310a338J578k65j026J284j202R15N31k635L119L2l400M108r34k686M180j628
1326F33j952L129j909n34K169k454J244R6k053K246r33j700L280k085p90L315
1342A702k771L59K715k961J518J086k491J796n03j201K156k030K09J795l031J031
1358f21K048l792K187J405l427K566N12k271K181k67q54J768j855J105M49k353
$$ y = [-490, -1193, 401, -1336, -129, 626, -2132, 861, 397, -1936, 1829, 218, -1604, 2576, -94, -834, 2303, -779, -204, 1694, -1385, 291, 712, -1736, 335, -702, -1431, 663, -1446, -245, 1688, -2070, 796, 1714, -2552, 1128, 2055, -2254, 1597, 1172, -1589, 1385, 283, -856, 671, -862, 6, -10, -1683, 1084, -482, -1687, 1870, -1045, -987, 2600, -1316, -547, 2892, -1483, 332, 2687, -1556, 467, 1336, -1338, 240, -25, -1051, 233, -969, -54, 477, -2158, 961, 993, -2407, 1701, 767, -1919, 2261, 633, -1319, 1810, -99, -633, 1536, -918, 326, 422, -1631, 615, -318, -2018, 1262, -823, -1613, 1702, -1069, -710, 2005, -956, 562, 1648, -843, 953, 450, -751, 1405, -625, -416, 1379, -1652, -621, 1427, -2365, -178, 1227, -2200, 366, 878, -1393, 788, 521, -333, 1435, -420, 685, 1134, -1219]
1374a219K428m76k739L294j312j926L314k089j244L215k382K05K034k246J255
1389A12J043j867J746o00r61K184j994l62K328k713P66J351k405J524K73k385
1405a960K824j248r96K847k143l0K624k798P29K122k949J402R80k540J985m57
1421C92j347J913j781K99J418k315J262J144l097K594J51k263L069q71j948L075
1437A695j689o69K434k274M75J301k264J434J02k201K172p11j326K280j882M04
1453g19K257k783J441J151k510J857L24j857K440j196j443K494k019l14K364k949
1469a462O56J631k397J655M04j739J970j013j26J607j845P94J552k874J826R61
1485A600l122K256K19k515K386m99j749J936j059k59J731k370J456O80k249K527
$$ y = [-1219, 1209, 733, -2006, 1288, -24, -1950, 1364, -725, -1969, 1246, -1136, -931, 1103, -1143, 112, 1155, -712, 1034, 434, -527, 1657, -337, -699, 1629, -1084, -318, 1033, -1372, 152, 425, -1960, 864, -384, -1380, 1467, -676, -706, 1918, -880, -151, 1971, -978, 424, 1404, -1136, 849, 392, -955, 958, -823, -524, 894, -1421, -159, 985, -2112, 482, 633, -1630, 1439, 568, -1380, 1695, 6, -663, 1771, -503, -28, 1273, -991, 443, 545, -1656, 516, -195, -1521, 759, -1123, -719, 1538, -1245, 196, 1347, -1163, 694, 1018, -839, 1601, 405, -1038, 1456, -563, -877, 1487, -1462, -806, 825, -1572, 83, 487, -1252, 718, -295, -421, 1186, -659, 135, 1687, -1187, 639, 1600, -1522, 734, 953, -1562, 824, 325, -1424, 512, -547, -806, 925, -1445, 11, 691, -1558, 969]
1501I69j34k183K821r78j088K162j784L8J279k142R75M78j905J970o97j508K523
1518G96j082j174L155k426K05K004k132L53J655j767R66O3j068J465j433l3J327
1535H74k312J215J089k954K033Q00k649K412J10k118K546p53j131K546j708j14
1551a14J088j556J065K62j719J735r73j101K154j642n87K294k132R43J432k155
1567a006J408O25k166K061q7j584K335j927k99J620j496P6J134j808R87N03j772
1584a396J989n68j383K497j634q2J861j978P95J493k385J282M44j594J963j205
1600I9j278K081j443n11K078k118N11J347k086J402M21j528J964n78q94J864j439
1617a08j04J630k025M87R83k250J856J8k010K235n35j948K599j069o28J812r20
$$ y = [969, 835, -1348, 1473, 495, -593, 1569, -215, -177, 1102, -1040, -65, 413, -1492, 478, -219, -1727, 796, -286, -1460, 1695, -731, -526, 1478, -654, -301, 1354, -413, 553, 616, -452, 1013, -420, -453, 874, -1438, -223, 866, -2088, -55, 745, -1904, 508, 618, -1500, 1046, 293, -838, 1708, 0, -114, 974, -582, 483, 745, -974, 761, -212, -1313, 841, -801, -1388, 906, -1226, -283, 1149, -1006, 402, 1027, -1139, 922, 835, -749, 1586, -341, -640, 980, -516, -440, 694, -1114, -127, 376, -1396, 593, 25, -1358, 1139, -495, -577, 1284, -694, 101, 1594, -791, 491, 935, -659, 1304, 99, -1179, 902, -541, -1052, 1026, -1092, -581, 766, -1320, 82, 503, -1025, 939, 361, -533, 1331, -108, -212, 1418, -607, -120, 863, -1387, 469, 487, -1523, 712, 177, -1771, 828, -241, -869, 943, 23]
1634B3q4N98r61J101j67j099J897j589l72K302k480j93K634k919M35J707k308
1651a475J220P46j533J489m5o02J181j194K76J144k110J635N37k493J675l98j337
1668a284K093p23j493K599j920j37J617j619N38J275j628J332n2j226J909j096
1684A85p34J939j481n55J878j590mP64j524J249k94q67J723j421K9K019k142O14
1702b12J586k361J195J244k220J236J02j259J611j104p40J689j458j57J267j613
1718a194J124K41j134J518o14q22K177j383k0J434j936J08J894k167P55J210k046
1735h55R66O9r93J014l02l51R41j329P65P74j850J155P96j590J834n24j248K045
1753A317j648k25J742j783J46J383k163R53P77j705J253Q2j257J919j126j34J883
$$ y = [23, -61, 537, -424, 677, 510, -589, 1308, -281, -653, 1649, -831, -1024, 1610, -1309, -874, 833, -1475, -255, 491, -1042, 447, 402, -200, 981, -213, 63, 1207, -903, 732, 1269, -1224, 451, 53, -1284, 809, 86, -1407, 1192, -728, -865, 752, -867, -329, 946, -682, 650, 598, -628, 1281, 185, -549, 1390, -91, -646, 1232, -358, -362, 402, -1122, 127, -167, -1034, 689, -732, -703, 1316, -826, -212, 1374, -987, 208, 1452, -768, 468, 570, -689, 922, -182, -922, 767, -691, -848, 419, -1194, -70, 171, -963, 555, -59, -881, 1296, -87, -107, 1327, -609, -501, 1393, -774, -19, 1191, -855, 111, 180, -813, 201, -101, -452, 489, -840, -75, 699, -1151, 4, 800, -790, 1044, 520, -728, 1317, -331, -556, 1186, -597, -451, 932, -1231, -278, 499, -1206, 47, 129, -1128, 791, -335, -469, 1414]
1770A414k069P44J236j799Q63O17j459R00k21q65J253j371mJ736j982O72J192
1787H57j752J185L98j381J672l19j162R63m10l29J124j229M50P27j714J306j80
1804B06j172J351q39n28J669j248q9J492j438M15J486j721O75P01j483J243k53
1821D67q15J325j674K59J304j936R20R26k074J291L24j414J537m43l45J535j251
1838f4K64J118j844O05J089j776J041J7j350J489o13p08J035r10J05Q82j050O34
1856c6P37j560J354K65j376J605q30o78J326r93K0R86j634L83J009j568J119N1
1874A80j236J323n47k73J460j414N20J027j661Q32O77j644J214K80j641J542m88
1891A51r01J273j162L6J169j701Q75R75j574J216rj183J583p02k82J361j219K95
$$ y = [1414, -655, 89, 1325, -474, 389, 1006, -453, 447, 226, -639, 614, -757, -761, 975, -1007, -335, 857, -895, 290, 688, -693, 979, 660, -502, 461, 51, -278, 846, -383, 67, 794, -920, 386, 206, -966, 385, -454, -982, 687, -561, -650, 842, -596, -181, 1305, -416, 259, 960, -523, 720, 467, -348, 977, -697, -438, 866, -1070, -150, 776, -1298, -7, 317, -1097, 440, -3, -348, 1187, -64, 200, 1318, -526, 79, 1168, -608, 433, 450, -900, 589, -24, -732, 303, -607, -502, 380, -670, -36, 701, -859, 495, 760, -616, 989, 159, -519, 807, -186, -166, 820, -814, -431, 578, -990, 129, 180, -1056, 267, -280, -553, 907, -507, 13, 1040, -621, 211, 888, -756, 458, 738, -903, 639, 151, -750, 523, -639, -603, 566, -1135, -260, 715, -859, 357, 348, -835, 748, 46, -236, 1125, -94, 201]
1909B01P66j725J126K43j413R96k04j091J602o83n50J479j540L23J379j159L97
1926A47Q16j440J165j47j039J425r37m39J214j331J92J112j870P41P58j271J221
1943C17k10r81J353n45m02J537j317J35J363j689N50O51j315Q53m38n14J134q98
1961d16k18J459j710L93J163j817J342L19j279J353Q9j234J444q70l71J411j479
1978d21K76P60j592R89P6r25N81K27r02J396o41k53J256j120K19J043j426R01
1996D44K84j520J438n00j040J601j117m70J622j509Q8J309j408Q13M35j193J101
2013C78p18J2J250j235K39P79j132N17R41j967R26N65j506J289m47p76J520j105
2031d70J1R88j253N34R33j367R03M07j192J041k14o29J105j044j50J218j647N90
$$ y = [201, 967, -758, 368, 611, -802, 194, -10, -1101, 501, -182, -732, 747, -793, -470, 909, -250, 147, 963, -477, 688, 541, -498, 927, -10, -449, 765, -566, -374, 738, -1132, -391, 367, -904, 317, 107, -874, 479, -66, -468, 1069, -248, -113, 1250, -439, 111, 762, -553, 300, -138, -652, 482, -416, -634, 825, -885, -492, 671, -1146, 196, 515, -764, 589, 678, -556, 888, 18, -353, 1058, -421, -145, 615, -977, 12, 88, -837, -256, -29, -931, 465, -176, -429, 827, -293, -74, 969, -457, 444, 728, -792, 646, 146, -894, 707, -410, -880, 742, -767, -679, 630, -778, 35, 470, -723, 378, -340, -328, 922, -313, -74, 705, -427, 90, 1031, -936, -10, 555, -951, 338, -109, -885, 635, -470, -459, 529, -724, -190, 743, -624, 279, 686, -506, 535, 321, -308, 797, -247, -397, 821, -826, -236]
2049b36Q86j580J052N2r62J268n45n05J523j173p0J087p36N7R23j514J013Q3j409
2068g86J507p21n02J232j631N84J080j600Q55N35j283R25M00j173J507n43o55
2085b69J220q60j72O92j191O82O34j479Q96M6j657J882n40l72J206j171K4J212
2103G83j189P12M84j370R94J59j335J472o59n40J058q53k18J059j444Q97L0p87
2121g47J204k54p14J170q00r7J006r46J75Q47j372J039K25j350R81k26j161J470
2139D50n10o78J330j194J0J440j592Q49K98j149J506l69p54J072l82q82J406j132
2157b81J10J065j414M92M19j489J358l30q55J469q20l97J594j117J51R94j210
2174b61N99K09j091J209q63n55J724j316m69J350j344O44P49j291O88M63j293
$$ y = [-236, 650, -930, 122, 174, -788, 480, -65, -570, 953, -220, -290, 797, 61, 118, 1041, -473, 540, 623, -786, 721, 0, -502, 730, -901, -317, 763, -837, 18, 553, -730, 195, 595, -578, 929, 386, -269, 951, 91, -81, 611, -580, 102, 736, -743, 153, 199, -1458, 424, -116, -488, 718, -453, -429, 783, -406, 306, 790, -580, 414, 573, -762, 710, 51, -489, 569, -284, -502, 557, -887, 10, 40, -747, 457, 203, -511, 659, -141, -238, 768, -178, -3, 844, -528, 511, 736, -614, 367, 141, -1020, 450, -60, -738, 592, -602, -592, 848, -744, 105, 403, -746, 760, 391, -363, 709, 327, -555, 851, -281, -171, 894, -520, -28, 391, -1098, 260, -70, -925, 544, -276, -673, 921, -196, -45, 949, -261, 338, 547, -544, 665, -198, -753, 971, -345, -814, 536, -808, -164, 585, -706, -18, 445, -848]
2191h48J258j24o21J219p04m98J035j298N11R39j426O15j37p22J095k19r63J469
2209E81p43p97J480q32J10P45j090P86J98o85Q64l03n95R42p28k72R32j312N49
2228a70M58r96Q50op79J293m82o14J167q05L3O56o54J27L12o69N12m1q21R86p19
2249c62m48J356r94l56J493j218J59R62j122J006m8q08J056n01m83J014q79N0
2267a23P40j225O52K23j003P56J80r72J093n47n22J436r07j08Q26j009O46L10
2285D46o63N56r4o01J391j086m82J482j544k41J594j491L36P87r87N34l5k24P79
2304D57n75J9R40j090K60R34j558N81N26j312J195l75r44J446p42l83R96r13K58
2323b80N55n04L17L82r45P84j17m17J090r63j81J046j117K01Q92j302L78M45r20
$$ y = [-848, 410, 286, -335, 884, 180, -318, 717, -581, -70, 869, -557, 58, -79, -801, 294, 75, -888, 581, -162, -959, 521, -311, -201, 544, -546, 240, 438, -247, 617, 314, -281, 661, -67, -339, 593, -719, -170, 288, -708, 142, 136, -643, 650, 168, -446, 721, -84, -51, 605, -49, 78, 390, -279, 233, 192, -629, 357, -362, -810, 546, -448, -804, 689, -529, -370, 592, -530, 476, 428, -380, 676, 175, -308, 706, -173, -123, 617, -608, 44, 267, -736, 20, 200, -772, 321, -226, -748, 688, -219, -327, 499, -510, 136, 446, -217, 339, 245, -356, 1035, -51, -533, 949, -595, -836, 758, -733, -397, 390, -597, -63, -98, -322, 457, -118, -99, 841, -249, 11, 945, -613, -32, 494, -818, 377, 2, -942, 504, -238, -621, 375, -538, -280, 275, -229, 88, 470, -475, 309, 192, -225, 865, -98, -279, 767, -350, -149, 743, -559, -181, 264, -656]
2342f56R87n33n07J078m72k18R51p80l2R15j166M38O89j342J098l13p24J166r45
2361c66q4R53r46J06Q71j053Q63l94m25P93j82l06R87p94l10Q70r59K41J056j205
2381b84K31M30q70P29j96o58J113n71j29P73j108P81K23q78Q74J91j184J309m07
2400C69p03J010n54m53J071j326K70P39r54M42o1l69Q18k63p68J419j035J17J136
2419I05j342O22O80j098M29j93n59Q40n75k47P98n49m68J346j295N19O28p26O67
2438C82j6o69P71k87n46R80n25l54P06q83M83N26j202P43k01n50N86j45n16J235
2458E18o32N2N34q64K92O20r07Q12k63o26J024l62o63Q41o62l5R27j173N07L12
2478B52p71K97M96q32J136m59l13P03o21k4O97o55p1O61q45N09K39p59O46p73
$$ y = [-656, 331, -202, -709, 369, -103, -321, 630, -150, -182, 733, -433, 5, 694, -648, 450, 137, -587, 579, -366, -450, 503, -443, -337, 534, -519, 344, -50, -475, 318, 136, -170, 817, 23, -287, 583, -376, -135, 921, -284, -53, 377, -493, 236, 40, -618, 495, -76, -205, 568, -540, 241, 464, -414, 460, 651, -533, 776, 369, -334, 676, 122, -331, 740, -586, -316, 423, -531, -89, -150, -519, 299, 36, -732, 687, -348, -231, 905, -437, 185, 865, -233, 196, 3, -556, 284, -291, -538, 260, -289, -757, 589, -706, -187, 441, -285, 382, 366, -303, 468, 181, -365, 615, 90, -264, 442, -441, 42, 568, -634, 109, -92, -642, -56, -201, -717, 518, -114, -62, 472, -392, -100, 520, -387, 425, 162, -464, 560, 198, -465, 376, -286, -321, 606, -567, -60, 252, -519, -222, 274, -558, 578, 119, -194, 509, -112, -136, 561, -94, -165, 496, -349, 160, 399, -360, 286, -487]
2498d87K3Q65o15J51O27q35L82L36q12O81L30j035P25k65l40P37o48k50P99o20
2518b51K03M07q55O32k23o08Q87j85l71J134j073K09P99r99L92K13o24Q65k75
2537B77p29R77n76m77R46q30l3P47o99N49J15o66O27o7n23R98n62l98P16o29K75
2558C8P68j358N09J14p84Q39j27l47O69m37m22R20m86K15L09o55M13J32q88J140
2578E62l94o28Q13k14l41O21n84O1K90r06Q40mm48O72l77l09P67l74N7N34o56
2599a8r5N90o40L65J13p13O29k34m80Q65p73K33R25j292M26N08r40O32K88p71
2619c82Q20k38o73Q84n07m2N20n95N1N39p54M91k75o54J076j59q28J175p70K2
2639b99P49q50N65L52r69P01J72q48Q25l08o49Q90p95L35L96n87J73O28j064N94
$$ y = [-487, -464, 401, -214, -63, 564, -271, 111, 447, -365, 316, 646, -389, 336, 71, -269, 468, -180, -430, 369, -251, -48, 359, -496, 136, -87, -695, 192, 7, -364, 770, -303, -94, 705, -294, 98, 311, -313, 552, 277, -452, 525, -51, -528, 418, -412, -445, 302, -397, 152, 267, -399, 228, 161, -362, 636, 74, -324, 392, -237, 38, 806, -552, -43, 71, -713, 126, -1, -348, 321, -116, -538, 382, -104, 111, 420, -235, 178, 310, -578, 562, 168, -460, 353, 139, -202, 419, -165, -104, 186, -720, 120, 116, -332, 340, -37, -346, 421, 47, 104, 638, -18, -113, 477, -163, 202, 315, -398, 231, -3, -483, 382, -391, -158, 767, -525, -99, 409, -531, 101, 389, -382, 438, 200, -473, 411, -96, -138, 382, -213, -162, 377, -377, 114, -161, -815, 261, 102, -726, 449, -321, -299, 450, -400, 165, 517, -452, 249, 421, -427, 398, 90, -559, 331, -464, -129, 267, -320, -147, 481, -583, 11]
2659A1J80r47J012k07k20M80k20k58R66j051M96j2n10N77l88m24R91q83L9P31
2679C63n89l01R04p48M92M19p65M84j22m10O77k76k21M82o00j44P40r88Q16l8
2699A75r15Q07n2m86Q92l41l69N97o22K66M60n99M96K09q64M96J42p42P13k18
2719D5p44R67n46K25K28q37N52M07o50N57P4n65Q11n51K9N62p68J52P95j128K65
2740a20J20o18P63j32m28N02j70k88O52l81m9M88n77M39J04n05P22l19o42R98
2760E59o71l13P86o64Q9L56o93N00L17o00N50l91k66O00k67P8L84n35J08Q26j026
2781b73N76j69n52Q58m86n17P08k77j41N16n85K34K81p15P26k46o5N44l25l7M25
2802D80m47k14M94m80J59P32r83K96J34n20K30K69o22O13l06r1Q23o37J82M90
$$ y = [11, 191, -756, 256, 49, -171, 309, 89, -169, 797, -254, 242, 230, -280, 297, -91, -515, 476, -407, -368, 363, -226, -527, 377, -371, 121, 540, -225, 259, 137, -273, 404, 128, -93, 389, -211, -355, 385, -603, 213, 175, -740, 67, 15, -471, 421, 80, -289, 308, -314, -48, 412, -187, 309, 518, -346, 150, 292, -450, 263, 45, -699, 268, -278, -53, 175, -662, -110, 297, -353, 204, 278, -287, 524, -27, 2, 564, -204, -52, 743, -385, -120, 0, -618, 145, 13, -415, 87, -83, -371, 281, -100, -149, 339, -238, 201, 305, -200, 522, 203, -439, 559, -112, -425, 361, -303, -214, 142, -551, -51, 266, -334, 216, -175, -441, 159, -108, -30, 354, -181, -73, 753, -273, 303, 134, -418, 440, -46, -563, 145, -132, -273, 243, -342, -108, 173, -542, 184, -62, -127, 417, 92, 55, 480, 33, -181, 313, -167, -8, 724, -259, 37, 171, -349, -119, 150, -472, 141, -165, -256, 567, -70, 112, 602]
2822F02p27M06r8l60N40k43n96O86j8n21M43n0m60O95n42K67O1n45R68l53l51
2843a96O94o16l2O86m51k38L65m55L61J42q48P26o1o05P64l28q5L74l22M46r4
2864B27n84R55k10n48N48m96k47N80k26o7K70n51L08J06o89P48j57j7O27o59m77
2885e59O07l44k1P37m69k27O72o66M89j33k52N44n42M3L61k29j84M01m40K13L33
2906C34n46M37N7m26M13j10k29O61m53o2J75l35K22O7m90L07j44j45N45m98j08
2927c28Q13o98m8N96n92N14J54n90M19k5p08Q07n85k12O36l37K01P0l87L89J78
2948B67o53O27k39m74R79m57j57L24l24K08J09l53J07K84l19L33j51l42M56l67
2968a42l37Q64m36k64O53o45N33l4l26L61p2l39M20k63k94O74n70P3L48p09N85
$$ y = [602, -125, 281, 183, -177, 363, 120, -476, 210, 192, -329, 114, 64, -396, 299, -243, 24, 85, -460, 508, 155, -196, 498, -118, -150, 536, 85, -153, 212, -243, 118, 260, -588, 138, 77, -528, 236, -92, -177, 197, -125, 321, 227, -357, 598, 388, -160, 388, -108, -355, 225, -1, -68, 202, -349, -41, 65, -624, 124, -33, -50, 577, -82, -559, 48, -296, -317, 420, -49, -276, 396, -270, 219, 86, -166, 378, -164, -121, 240, 11, -173, 228, -212, 1, 334, -212, 225, 282, -144, 269, 159, -70, 591, 138, 76, 251, -84, 138, 205, -285, 22, -122, -267, 278, -220, -328, 485, -213, -261, 335, -257, 257, 411, -179, 240, 215, -493, 314, -271, -483, 153, -184, 17, 87, -300, 89, 267, -386, 241, 2, -472, 507, 50, -107, 217, -107, 101, 210, -143, -36, 248, -71, 262, 111, -231, 225, -142, -479, 385, -51, -315, 338, -307, 226, 192, -134, 227, 155, -184, 236, -27, -321, 353, -217, -144, 204, -505, 80]
2989H0L9n81M85J55n33Q80o59J0L03n29L76K59n36M99j38m25N57n41pN48l06k01
3011b65M05n63J96M45p48Q21j40m67N88K9l97N76k65m99O62n66L7K35k46L58k39
3032d3j94J72j28j84O84k09k31M94o81M50L35n05K42k27l44O82l84j82Q30o99
3052a22J8L61o31L58J54l99L55K42n31M66j56l47P54m88j24M11q07Q46k44m85
3072c69L76J63m27M63k69k03N02m71q4O51n26K39rp1M9J26n08Q66l36l53O26l95
3094D0m2O4l47M05O7m36J49J06m80P70l10l33R17p14K01K10m41K53L87o66N45
3115C45k89m24O49k63j69L14l87Q7M56o77M44J61o59P05j20n06O24m63p5Q67q23
3136b03O9M87n21K76K17o29O71k18o14Q02n14O3L27j20j21L00m89L77j0m05P17
$$ y = [80, 119, -462, 23, 178, -355, 525, -134, -124, 179, -350, 26, 285, -251, 248, 110, -315, 242, -299, -306, 242, -64, -265, 140, -423, -227, 218, -530, 291, 151, -316, 272, 301, -96, 480, 215, -284, 378, -188, -151, 84, -162, 196, -43, -237, -65, -193, -377, 307, 98, -133, 361, -320, 130, 465, -40, 202, -25, -369, 313, -71, -253, 577, -122, -104, 257, -374, -16, 138, -261, 94, 336, -195, 271, 115, -232, 522, 34, -90, 321, -486, 360, 116, -369, 7, 170, -257, 206, -63, -266, 236, -235, -319, 332, -194, 45, 36, -35, 14, 140, -368, 498, 162, -191, 435, 40, -2, 62, -285, 120, 187, -249, -100, 6, -474, 296, -14, -347, 570, -144, 57, 267, -174, 79, 466, -200, 345, 56, -368, 281, 18, -151, 163, -224, -137, 319, -358, 86, 247, -412, 293, 173, -333, 291, -172, -247, 620, -203, -134, 353, -168, 108, 325, -304, 367, 149, -465, 337, -177, -114, 213, 93, -28, 272, -217, 160, 150, -255, 462]
3157D62q9l22K73j03o48O71n77L41J69n86K72L82n15N69k34k77O24n48p0L25p0
3178D9N7J43o54L90L23o02L88l00L44K1k12p8M40n38L42Q4n62L63K53n57M96k21
3200c1J12K47k11j45L73o2l31K99o24O61j5p89P69j37m80P45m59k6L76l56K74
3221A90K16o20M66n9o06Q17l95l0K76l86J02M87p14K10L58o97K80R7l90Q79l56
3242A25j91L09l18n5K12l40M64Q1n43M04J4n39M66j63k78M66k67j31N10m88K16
3263d6K95k30K80k84Q8J99l25j54L56k53Q5K66m38m1M58p86M49J23m60N23O4l98
3285b29K61j60j16N05l82J68L28m69M52j42l41L48m31J13Q5l0k28L39j45r7J40
3306c1k42K93K09m22L86k7m20L48r6J31J33m01j28L79o85O59j78k24M56n36M76
$$ y = [462, 373, 51, 324, 221, -427, 244, -333, 8, 177, -409, -137, 245, -270, 299, 65, -212, 412, -136, -206, 119, 49, 106, 249, -405, -15, 308, -294, 94, -206, 138, 159, -53, -131, 309, -229, 113, 197, -365, -2, 251, -306, 190, -31, 81, 328, 117, -28, 345, 283, -48, 251, -373, 288, 273, -516, 253, 116, -364, 381, -78, -104, 272, -84, 190, 406, -214, 252, 193, -413, 404, 9, -21, 255, -131, -29, 458, -256, -46, 312, -385, -105, -8, -398, 481, 125, -66, 243, -75, -130, 82, -258, 206, 287, -256, 148, 162, -377, 89, -74, -352, 114, -153, -284, 226, -262, -46, 249, 19, 299, 15, 103, 302, -23, -177, 179, -74, 11, 277, -161, -202, 256, -530, -81, 42, -418, 105, 169, -229, 32, -128, -244, 261, -121, 47, 375, -94, 358, 216, -125, 223, -208, -95, -10, -40, -268, 71, -74, -171, -31, -273, 20, 229, -193, 193, 166, -254, 94, -2, 129, 262, -139, -267, 112, -573, 86, -92, -316, 140, -396, 80]
3327H0M59p11K27K47l10M26k74m18O10k62k78O14m66K5J24j34K76q6l41K55J02
3348A65l48K35N0l65N97k5n13O64q19L52L27o34M65p3l55M28l50J01M67l58N5
3369F6K23m18k85Q97p58M28j9l59L02o1j06M08l77j60N84m66M2K9J16k09J89P9
3391A45j96Q0l04L38k54K9O25p42M59J18n92N30Mk94M26m11k03M96j46j53J77
3412A32k84j7J89l28J31J92m11L96J07l36L81j07k19L39k09L48p9m74M72j23m22
3433c22M31l10M5L57l95m0N52n30J80M7n6k17N88p54L57J84k15K34k63O8J56l46
3455b49J56K51l85M78K8o27M12o2m22P58k76l46M41k96J6N36o13M17k06j79M53
3476B85m83J9M30m02l9M60p73P13J2o08M29J48m77N96k25j52J3J29j10K51l44
$$ y = [80, 539, -172, 55, 302, -8, 418, 144, -274, 336, 74, -204, 410, -56, -31, 93, -41, 235, 149, -192, 63, 165, -183, 52, 102, -263, 334, 309, -204, 460, -359, -7, 320, -314, 151, 78, -277, 151, -199, -98, 369, 11, 66, 289, -129, -414, 483, -275, 153, 134, -225, 77, 16, -90, 318, -59, -219, 365, -101, -59, -30, 86, -123, 66, 145, -51, 29, -275, 63, -191, -162, 463, -279, 180, 298, -294, 236, 240, -54, 372, -39, -242, 254, 108, -45, 132, -152, -169, 20, -308, -177, 15, -396, 0, 107, -229, 152, 45, -174, 165, -44, 304, 225, -249, 223, 100, -322, 109, -201, -156, 201, -194, -234, 318, -212, -32, 15, -41, -258, 330, -424, -67, 117, -98, 136, -127, -59, 97, -249, -93, 158, -227, 251, 279, -348, 64, 2, -420, 338, 62, -284, 157, -139, -123, 413, -200, 217, 11, -168, 285, -198, -179, 251, -151, -190, 270, -503, 210, 222, -386, 43, 191, -286, 310, 85, -67, -54, 75, -35, 216, -128]
3497a28K27Mn44O49m16l24P36k22l20L95k03J74L30l74J80J39n07O00j61m32K48
3518E1J32m26M08m05J02L79n16K62J0k84K97M6j16L61j62j33K40l86L45p4Nl8
3540I8r3j86M48Po40L98k17J29Q0l60L58J86l12j4M63k61n5J92k07P0j10m2J80
3563A12l78L85P6k01j11J70m8k6K38n67M98n8l51N90m00q6M39j75Q3k4l62L63
3585A67k1LJ7l58K7L94l13j71K79k85L66J38m96K83j8M5K05k56R1K45l91J33K8
3608A12l58KL01k42K3R4k14K92K36l46L07k45j28K87k50JK22l65P54m67o1M44
3630C99m02j08J01j83k51L25j31M22j49k53M57j74l91O18m87M34M5l91O06n04
3650a7n1J04Jm05N47j40k89M75k68J50k9j53J49qk20k7K29l43L45j37n4J30K41
$$ y = [-128, 99, 103, -441, 208, -208, -532, 204, -18, -338, 57, -146, 28, 358, -16, 164, 303, -204, 396, 235, -197, 51, 183, -243, 165, -240, -138, 241, -275, -13, -3, -287, 10, 56, -60, 301, 139, 6, 246, -140, 205, 131, 136, 98, 5, -181, 267, 274, -366, 32, -185, -56, 24, -336, 22, 208, -104, -118, 345, 84, 29, 221, 14, 84, -26, -68, 112, -266, 119, 195, -6, -117, 53, 5, -21, 217, -350, 148, 90, -261, 329, -71, -157, 282, 107, 190, 166, -196, 167, 146, 149, 166, -192, -165, 229, -84, -255, 24, -261, 105, 243, -253, 30, 12, 57, 262, 6, 97, 342, -49, 84, 112, -246, -244, 57, -185, -162, -68, -282, 10, 246, -100, 207, -38, -166, 121, -129, -128, 94, -271, 483, 16, -45, 399, -3, -111, -10, -193, -444, -119, -250, 172, 23, -230, 227, 53, -338, 280, -207, 227, 272, -119, 487, -17, -68, 36, 37, -368, 179, 39, -250, 225, -43, 107, 78, -75, 74, 66, -154, -181, 48, -295, 50, -87, -141, -11, 230]
3673B30n48M97l24L26j59j91K93l0j07N7l00J80K44m29K53K62m45L64l45J9J98
3694D5J84k23K71l97k3M86m49j4L06Q2m54K48k39K00k48K46Q7O3j23o6J33j44
3716b9K25k84K42r7l40L74k66k32N62k34l71O39k34O1K53k39RM5l58q5K99J5J96
3739A51n4j36J66j81K20R4o97R9L74m3j52K28l09K94J14o2k8j23r0J22j87M34
3761B34l92O0P0J14j32L40l16k71K67Ko7K20k80K84j39Q7J41q9o6J83k70m23N80
3784A37l75K95M84n70L8K2k17K97j02o0j16l4J14M32m59J95J50l14O1K6J9N73
3806E96o90m7L16k12l56O21k1j80K0j10J61l99M26k4j16k16J88R9k98L88j03l66
3828c23N67n30K48n8j28L23J54m63M80l02n1J66p2K03o7k63J45J60l29L60j6l62
$$ y = [230, -318, 179, -145, 181, 22, -169, 124, 94, -13, 44, -256, -76, 168, -261, -8, 254, -191, 173, -172, -153, 45, 229, 6, 277, -120, -143, 343, -106, -120, 186, 268, -186, 62, -177, 23, -225, 21, 108, 171, 48, -18, 115, -29, 196, -88, 154, 57, -283, 91, -175, -407, 155, -79, -450, 189, -45, 16, 269, 30, 39, 84, -274, -359, -60, -45, 151, 97, -39, 127, -54, 166, 260, -437, -338, 36, -7, -159, 69, -240, 54, 168, 106, 78, -45, -135, -13, -200, 234, -158, -98, -28, 86, -46, 294, -22, -293, -26, -24, -91, 129, -151, 133, -6, 81, 222, 133, 67, 250, -20, -443, 137, -238, 57, 541, -29, 9, 31, -186, 111, 9, -51, -167, -201, -87, 345, -114, 81, 231, -83, -22, 4, 23, 596, -94, -141, 175, -37, -393, 228, 207, 27, 47, -63, 98, -301, 125, 101, -15, -231, -43, 56, -242, 146, 43, -323, 244, -286, -38, -96, -224, 99, 253, -210, 270, -32, -83, 83, 11, 214, 147, -116, 29, 189, -140, 220, 204, -158]
3850a58M85j29l69K83j78J20N0m15M27p1l53J87J46J04K54m27J71Nj12l0M9j49
3872a10R8R1j88K34k27j29P8J03K19j85j78m3L95l47K63J1m66M32K16m19M61k29
3894H0k41M80l53j48L89l62O8L3L1j18o0p9M83m56L25K03l20ok3P9J68j5m14R7
3918a59qj6O75n17P4q1j00K08j65J11j49J02l62P67n06Q6L14m16K26k02l1M41
3940B92k88j43K88j01k20M75j05l04L84k56j6L81m34j63K49q0J67j9r3J14P6l94
3962a90L97j67j6J36l12k4J27j00q0J37j65M47m10J6L18k75J3K10M7qJ6n7K97
3985C57m07R2p0j19J61l8k51M79j53k52L23q0j61Q7K03k8n4k34O9K43J70l17j4
4008Fp3K34j24j23N9j2k37j2J45J21K5p2K4P1j11n5M7L9J05j16K76j30r4J0J15
$$ y = [-158, 327, 198, -171, 112, -66, 54, 104, -311, 116, 45, -308, -121, 25, 129, 383, -44, 127, 132, 20, -10, 39, -110, -12, 79, -109, 125, -102, -231, -153, -50, 169, -16, -194, -237, 158, -189, 74, 85, -381, 51, 267, -152, 309, 80, -161, 319, -34, -182, 207, -155, -87, -54, -23, -141, -201, -280, 203, -253, 72, 275, -45, -51, -74, 5, 173, 158, -256, -159, -167, -183, 492, -25, 49, -32, -132, 76, -89, 22, -127, -25, -387, 380, -126, -40, 274, -142, 84, -118, -149, 292, 4, -139, 149, 48, -172, 303, 198, -106, 278, 22, 6, 387, -47, -210, 39, -41, 126, 107, 14, 128, 204, -190, 207, 40, 24, 160, -152, -176, -49, -149, -229, -92, -257, 190, -220, -204, 114, -161, -148, 62, 109, 101, 117, 60, 357, -50, 42, -28, -147, 14, -24, -275, 204, 51, -201, 122, 42, -119, -32, 171, 143, 89, -145, -76, 167, 337, 20, 6, -67, 167, 43, -80, -21, -33, -270, -282, -137, -16, 9, -63, -39, 32, -79, -134, -87, -48, 57, -59, 217, 87, -7, 3, 118]
4033A18p9qJ2k58L20K18m00L82k60j44J77J3j73M83l72o6K39l21K59k53OM01j74
4056A20k17J26p0j86L35k57J93M28p79J67K85j95J03k39J38K35k74J04J02j83
4076f4K44k84qM7J51j92K54m20K20K43m57J73J88Jl30O70n84K93J91k24Jl2j58
4099g7K84k76N8K08k38O9K33l60J17k8K90j38l43L90m6k88L33j70j65J00J48m02
4121c01L96j42L7J71k0m39J25N0J0J15j68K80J13m89M70m43J94K6J70J92n31n8
4143b42L10m3m50M55j08l36J41O52n99Q7K13k28K18j60L4K76k27P5r8l33L33K23
4165A93k07M9Q0k34J77j96K14R6j92r1M09n11L01J9j82J60j3J94j48j10k27L87
4187A68m09K52L5l30L90k21p8K68j3l58L01J3K6j7J4k47L71k78J24m1J26J12k44
$$ y = [118, 39, 31, 43, -215, 105, 323, -77, 305, 45, -99, 78, 91, -82, 401, 29, -37, 202, -119, 140, -113, -107, 294, 120, -97, 29, -41, -227, 108, -149, 44, 472, -307, -140, 145, -50, 53, -186, -48, 187, -87, 17, 119, -64, 180, -104, -112, -65, 86, -106, 148, -272, -52, 191, -266, -93, 95, 96, -234, 436, -148, 145, 336, 112, 113, 81, -77, 207, -69, -11, 197, -41, 28, 261, -99, 18, -10, 280, 142, -201, 189, 143, -145, 188, 18, -147, -47, 101, -301, 95, -47, -10, 161, 141, -298, -173, -123, -113, 2, -166, 114, 227, -262, 208, -235, -41, -15, 155, 347, -184, -242, 68, 25, -425, 30, -78, -414, -273, 379, -220, -133, 80, -148, 70, -90, -56, 220, -7, 68, -30, -363, -30, 193, -14, 35, 115, -119, 58, -138, 76, 172, -20, -111, 298, -213, 88, 107, -75, 85, 72, 266, 118, 8, -219, 168, -241, 11, 46, -284, 106, -115, -193, 75, 62, -296, 5, 18, 44, 27, 41, -206, 165, -113, 11, -30, 96, 208, -36]
4210c6m8R4j8J54j89m72L33M31m22K16J34l93j2K62JJ14k99M2L94k23J14k08k87
4233c18K41L10k97L16m93k3L62j14K04p0l79J97J03p8K24M7l23J09j64J94Q0l34
4255b06K84q1j07O4N8J43k44l7j11N44k76n6K99r8j00J91m30oK39J3j06J75j39
4278A3Q1j80J43J17l57N2J64m18N68l12J42K14m17m6M29l0k18m8K9N20m06j01
4300f1j04M50k45J25j02k95J85n8lK42m82L84J97l97L65Kk31m0j96K71J69k71
4322i5j13L47k93L40k28j36M13m25j55M97j86j92K98k5J83N9j41j99L5k45N33
4343B72j63l77L3K68j77J78p3k2J19k27L00m11J13J60K84m80M57m01M32j19l97
4364b31K47J04j25K92n9l43J72p2j38M4J04r1K69j29r2J54k23Q5K08k5k45j11
$$ y = [-36, -84, 10, -8, 146, -43, -515, -182, 249, -173, 43, 177, -216, -228, 34, 35, 149, -150, -108, 286, 63, 177, -31, -318, -77, 233, -64, 252, -241, -264, 98, -16, 188, 118, -261, -64, 39, -39, 185, 232, -91, 18, -146, 48, 128, -206, 78, -3, -110, -46, 12, 155, -89, -126, -237, 307, 31, -25, 274, 176, 76, 267, -163, -169, 70, 83, -23, 152, 13, 94, -86, 57, 174, -183, -131, 33, -385, 183, -129, 13, 227, -190, -236, 193, 163, -55, -103, -74, 446, 40, -61, -165, 285, 40, 165, 63, -232, -47, -105, -108, 134, -348, 36, 233, -164, 201, 203, -28, -68, -264, 7, 176, -95, -208, 139, -154, 186, -42, -178, 235, -190, -345, 152, -34, -226, 72, 47, 230, 289, 148, -51, -16, -261, 272, 109, -268, -235, 33, -144, 34, -39, -61, 58, -169, 131, -280, -167, -7, 277, -203, 254, -147, 285, 166, -231, 16, 120, -5, 287, 228, -115, 57, -15, -153, -109, -5, -96, 173, 44, -48, 106, -117, -32, 176, 151, -94, -205]
4386b05K11q0J0K3J05j34n1J02J14o9k92L59l5k9Qq8M2j83R0j08N4L04p6j04n2
4411h4q9N24k42o9N8k33OO0j6O2j29n2M8K33k1J60n5m65M09l16l6J73L11m51K47
4436C3l2m6j46o2K82Nl26O12k81k9M06n78K19j2r6O5L3j12j54K22L1o0Q1m86M99
4461F8l7Nn6k9J50k14o0o4M33m59L38qj80L27j99r3L24l31K12qk60J75J97k19
4485A2K22k60J90k8k59K85l13L8L06R0n80J98O7n4M24l12M8L06l96L5J57m17L34
4508I3J29n2m9l41K29qK32k41J22j27J22k1k13J00j4o2J03l7J48k32o0K6K76q5
4532C8j42R0j26L5K07m0L2j53j26K04j13N6L07m38N4q0K26l3r2M0j61J20J01k13
4556b07K93m2R0m9r7K10l32L13ll89M00k97j2K88j84k36J88q4K16j94R9L05l60
$$ y = [-205, 6, -74, -64, -41, 64, -70, -121, -19, 95, 26, -266, 93, 58, 29, 37, -51, -9, -192, -102, -210, -156, 148, 72, -32, -84, -173, 351, 109, 40, 98, -135, -129, -69, -85, -23, -152, -204, -156, 77, 56, 216, 161, -304, 105, -211, -247, -74, 237, -214, 33, 1, -45, -191, -253, 29, 34, -292, 320, 39, 10, 416, -162, 57, 45, -51, 14, 47, -65, -219, 3, 34, -26, 55, -431, 68, 31, 36, -20, -49, 101, -113, -173, -237, 196, -263, 75, 67, -113, 214, 15, -78, 246, -85, 127, 119, -141, 34, 231, 12, 234, -26, 164, 136, -123, 162, -151, -113, 193, 283, -297, -99, -32, -86, 338, 26, 74, 380, -16, 19, 176, -241, 93, 222, 170, 121, -220, 9, 1, 233, -8, 114, -13, 109, 88, -125, -25, -39, -101, 2, -35, 113, -119, -179, -153, 123, 38, -104, -14, -140, -105, 102, 62, 94, -59, -185, 19, -94, -38, 269, -169, -115, -195, 31, -2, -94, -54, -215, -95, 6, -207, 86, 44, 134, 85, -12, 198, -134, 179, 176, -213, 187, -110, -122, 166, -18, -254, -66, -150, 66, -128, -29, 276, -84]
4579h4K08o8J9J20j25j26J84j38J26l92J80j35L33P3l45qK36k04Q2J99j98L0q4
4602a17J84j95L9N6J18m19J88n8m3N60m95M42k07j00o7J58l4k62O5K87m0j16k11
4625b67M01k44J54J13K0j97M7k67K50K86k64L70m53J40J3K41n45M33n67K70R6
4646C0OO5r1M4O5j64L97j80j53K8L02m17j78L08j52L52l66k8J20j01K01N25m54
4669A59m01L55l41K71M9j92k4J08Q5j6k09L2P8l40M47K10k02k57K09j97J21J62
4691A07l29N1R6j8p0NL56j94J60j93Lj23J48j51j10K92l31K15L52m05L04L0k00
4714ek20L97j52K37l68K63P3l06j6J40J0K6J2j66L51n52K60o2L13l11Q2j64J5
4737a43K99R4k81j4j02J09K08j91k3k62N93l20J40k25j09o2K11N8Jk16L83j95
$$ y = [-84, 124, 56, 75, 195, 70, -56, 128, -10, 116, -276, -96, -231, 102, 175, -170, -178, 58, -146, -64, 135, -63, -33, -117, 67, -128, -89, -33, 85, -334, -146, -204, -247, 313, -182, 260, 53, -47, -114, 44, 10, -252, -187, 100, 60, -56, -267, 134, -110, 44, 157, 177, -20, 27, -240, 10, 296, 32, 402, -51, 89, 102, 343, -202, 231, -336, -66, 30, 36, 101, 10, 54, 119, -45, 352, 172, 19, 47, 349, -68, -246, 62, -90, 262, -104, -132, -12, -113, 88, 613, 159, -242, 113, -228, 43, 92, -100, -124, -16, 69, 53, -156, -124, -46, -386, 61, 271, 69, -188, 21, -176, -55, 107, -222, -171, -75, -93, -163, -158, 198, 4, 164, -29, -26, -149, -1, -152, -262, 30, -301, -86, 266, -139, 165, 195, -5, -225, 172, 20, 257, -111, 152, 225, -81, -97, 43, 53, 79, 91, -75, 276, -276, -16, -78, 235, -76, 6, -158, -143, 156, 250, -31, -45, -147, -38, 170, -21, -44, -306, 287, -33, 107, -118, -227, -289, -78, -20, -19, -235, 148, -47]
4759d7J96j25r0j32j07K00K50k6j78J83k21L71l51j11J16J13k30k7K04J1m4L3
4781a2o5M81k77M1q1n1J35m19K47L8L64m89K22l53K55k48J73J91n2k14L63j56
4803I3k17Q9K72o1j90l0jJ20k60K35j5p6L2K16k97J89L0M7j54L4m1J39j29J64
4827A89k17Q5j22NP6J46l17J13J73k03p8N4M1m8J97K6N1j04k44K87j92K79k84
4850h7r6K85M4n6J63j05k47L44k75m2J39k83L05j31l1L20k52L5p3m5J02l2m9j55
4874b22L58l36L27l65J44L4J90k38L8j5J4L4K6J27l9p8J23l52J76o3L62j38K86
4897C93j95k13O1k43j4K2K65p7k1j18K08O0j61J88j04L2l29J96o8K17k91JK50
4920E9k24Q2K16k70O8L12k89j2j92P7L50j51p8nK9K3J24l40L22M7p3j40m3O7J03
$$ y = [-47, 149, 24, -66, -198, -305, -105, 145, 119, -59, 124, -97, 274, -77, -188, -72, 41, -189, -216, -12, -1, -45, -12, -77, 404, 127, 168, 87, 36, 171, -248, -1, 37, 401, -88, 134, -219, 36, -212, -39, 152, 100, -114, 249, 93, -124, -35, 237, 176, -14, -44, -45, 75, -185, 50, 35, -41, -9, 207, -90, 99, 129, 176, 22, 56, 15, 154, 25, 189, -28, 57, -65, -60, 16, 162, -155, -42, 131, -72, -150, -96, -55, -103, 94, 120, 171, 67, -177, 110, -82, 197, -87, -183, 102, 146, 90, 253, 148, -99, 245, -30, -72, 67, -216, 89, -42, -73, 247, -5, 30, -43, -88, 14, -18, -67, -222, 136, -200, 127, -238, -94, -60, 130, -108, -70, -85, -71, -37, -11, 116, 77, -1, 122, -230, -54, -117, 245, 107, 393, 198, -15, 46, -197, -211, -189, 76, -1, -22, -140, 68, 128, -33, 155, 51, 83, -246, -50, -118, 99, -192, -191, 59, -165, -83, 133, -137, -69, 243, -46, -58, -250, -173, 177, 26, -52, -57, -28, -5, 119, -221, 101, 148, 75, -65, -108, -41, 62]
4945F2o8J80j96n2q6j58J74J13mj64M61l80j0O4k93L70M16k71P5l30R3j74K83
4968A05q5K2n8j03O9j9K02m02J08K30j82J87j12p6k1J66K1M2o2P1o6j48J39l1
4992cpq2J8j98J70L05m07J8J42j09P1n9l9K38j0P5j29mj36L39k53K5m2J37k62
5017b02L73k90k63O26k04m2j87N6L76k11J34j87J97r9L4KJ24j7o6j12K38m80K33
5040C3j85n5L06j58Q0K80l50m2J8J69k25j17K37j56J55R1J63k54k46K22K84l99
5062a49Oo3L44k30K4o4j17L36o8Q0l02K77j49k8p2J43M6j80N2L98n22J03M37l37
5086c5K46k64k0oR9O2Jj87J74o6j50K98Ol48L7N06l90J45j59K15n0o4j59j39J91
5111e7mJ57j24o1O1M5K02l63k06L08O7r3J8n7L60j34m28L21J89M6o2k78j11J81
$$ y = [62, -6, 174, -22, -74, -160, -318, -144, -31, -35, -199, 262, -118, -128, -64, -357, 13, 429, 158, 233, -97, -4, -178, 105, 20, 42, -16, -119, -50, -69, 133, -269, -161, 69, -113, 74, -38, -114, -135, 31, 52, 94, 32, 103, 37, -111, 28, -3, -10, -92, -74, -272, -102, 203, -204, -186, -44, -153, -82, -141, -180, 58, 48, 123, -6, -10, -146, 193, -60, -35, -77, 60, -202, 171, -119, -382, 244, 40, -2, -189, -133, 243, 32, 166, -21, 176, 77, 111, 113, 237, 220, 154, 42, 280, -200, 33, -152, -207, 99, -59, 21, 301, -49, -91, -73, 96, -129, -246, -9, -165, -10, 81, 244, -10, -256, -34, 250, -149, -143, -206, 138, -92, -68, -132, -249, 87, 19, 99, -203, 74, -75, -103, -175, -32, 14, -166, -114, 284, -238, -135, 302, -35, 211, -53, -73, -79, 20, 82, 83, -104, 70, 4, -146, 152, 158, -190, -153, 353, -37, 108, -51, 164, 114, 50, -109, -248, -57, -61, 96, -28, -89, -28, 17, 219, -144, -350, -42, 25, -68, -50, -107, 253, 119, -309, 12, 201, 247, 185, -93, -204, -23]
5135b3Q9k05O7n7J50K2k82L47j07j67QM3P3J96k20N8j9J64l49K23K08l07J19j06
5159g5j5K07j88O0J4r8p5J66k37O9M7K28P1k36P7k42K88rk20K17r3j54Q4J09j3
5184a8J91j01j4n1nQJ00k06q9J46J29k76J11L6K03m7k15J46m7Rl5k02J96J60K2
5209A51pj94J2j95R9N0N7K32r0j7j77J62k0p3n8K32o3j19M6l13L06k0l4n8j4J93
5235H8J22k54J49k11m9Q8J26k59K7L32k31J24k51J18J79l43L03J11j16R6k11l1
5257i3R8J92j05j05j01J20j01P8K31j62p9j89K79j01r2K63k25n0Q4j49K25p7K11
5280A52j4j49N4J1j21J44P9k05L12j59k47R6J47k10M8l8K39m3J17J6m90L76l09
5303a94J80K17pj88k7P8j10Q0k11K78j10j2r3K97J89k97k31L25p0r8k84J20J78
$$ y = [-23, 66, -139, -72, -129, 21, 43, -239, 108, 1, -166, -158, -115, -42, 154, -66, -8, -27, 137, -212, 11, 219, -88, 31, -75, -90, 117, -71, -11, 3, -95, -170, -4, -241, -172, -125, 103, 174, -62, 15, -227, 61, 52, -168, 49, -44, -198, -114, -5, -18, 173, 72, 58, 7, 2, 10, 110, -96, -185, -39, 90, -186, -75, -39, 164, 117, -98, 48, 1, 10, -25, -227, -31, 129, 151, 144, -50, -38, -233, -134, -84, -27, 205, 115, 98, -79, 83, 63, -10, -68, 164, 101, -18, 28, -285, 21, 1, -33, -91, -105, 88, 210, -44, 105, -106, -155, -67, 59, -200, -173, 159, -72, 52, -199, -81, 98, -245, 58, 169, 53, 149, -62, -93, 5, 197, 92, -13, -114, 6, -95, -17, 214, 52, -27, -216, 63, -38, -130, 133, -92, -142, -58, -207, 18, -59, 152, 138, -11, 43, 54, -67, 77, 156, -49, 263, 104, -143, -47, 100, -110, -62, -100, 139, 96, 213, 229, -261, 115, -194, -14, 203, 196, 8, -19, 59, -51, 29, -182, 96, -14, -26, -119, 178, 367, 70, -161, 164, 94, -4, -288, -168, 10]
5326A0pk09J85L73m10J2p7J18M26n20L04j37j78K8K26j14K05k40P6l5L6o4j0j29
5350a31j18L14p4J3j86J41K8MK51l58k17N82l28o1K07r1J11K9r0k3q4N6J01LK
5375H1%K6m0m8q1Q2J95J92j83m07J72J6p8J71r0K4R5k2j10j1j2k24L33j82J93
5400I2kP2k88N4L1P5P1k46o2K26l18M10j96L08j51Q0r0l27j6L07k8J7Q0j06j67
5425a74R2l1J58l1j15K84j70j8j6k00K42rK28l49M33n8l93K13k49N0L63l88J96
5448E8P2l4j98r5J92M1k10N5K33j65P7p9J38r8l9P8j31J09k51j52L50K23j62k0
5472hM6j3r1k5J8J45K32k20j80J3j45J96k10K00K15m90L24J24J92m11K53l0p8
5495E7k04j5N0J80j77L30j31j12K19j89L4r5R1J8j13P5q6J4R0N2J9l32K40J86
$$ y = [10, 3, -206, -21, 352, -58, -46, -123, -5, 421, -99, 205, 68, -110, -82, 144, 30, 235, -5, 71, 36, 72, 8, -2, -131, -249, 65, -9, 4, -182, -41, -13, -9, 242, -116, -333, 249, -79, -140, 67, -24, 87, 116, 26, 3, -81, -25, 76, 79, 81, 81, 107, 67, 19, -62, 20, 215, 407, 224, -183, -11, 5, -73, 98, 8, 32, 127, 105, -5, -16, -28, -252, 81, -101, 92, 90, 162, -126, -72, -41, 34, 105, -141, -203, 23, -295, 115, -81, 227, 76, 156, 66, -261, -277, 30, 2, 19, 99, -7, -174, -82, -113, 45, 14, -101, 183, 13, -5, -21, -221, 21, 12, 240, -109, 324, 266, -127, 86, -163, -113, 250, -138, 58, 130, 96, -102, -197, -5, 36, -174, -119, 114, -51, 26, -53, 85, -13, -52, 26, -105, 4, -247, -399, -49, 174, 12, -8, 38, 25, -66, -91, -73, 72, 304, 84, -96, -83, -228, -32, -242, -42, 173, -317, 7, 131, 323, -88, 165, 135, 57, -147, -162, -112, 68, -109, 221, 90, -22, 197, 8, 42, -53, 38, 56, -57, 18, -68, -54, 36, 88, 107, -225, 15, 201]
5519B01l02J50o0J77j80j69K66k48K70N7k70o1J74R2j58O0J02J15k95L22k87Q5
5541D1j2L3j82J97j22J46m2j29p2Q4L9K42k52j2j25J76l47M44Jk11k4K23n8NM6
5566H9l12K38n6K57k51r9o3K29j2k5qp4j61L97k85K41j17j04K02j10J58L8k68
5589i6J54r9J20k96J28RJ21j27J4J93j06q1m9J09J57k97J28j63J47k4J08j16J80
5612A14k39r5J32r3K01m5k1J9k1j44j37M47Mj18k3m5K07m6k51J35M7n6o9M31l80
5637d6q5K72j94K98l53J44l62K45r5j30N8L84j90K63m23J97m7J93k58J10n8J48
5659G1j08ok03L24K13l36J60q0J02k38q8J65n0K44k12L8P9k47J77N5j86R4l5K04
5683A37j67j56K69k24J44k4J47l11r7J54K19k15R1k00L24p8m7j04J78J23j72O
$$ y = [201, -101, 49, -11, 166, -14, -183, 83, -165, 105, 162, -108, -169, 5, 97, -61, -1, 101, 216, -79, 243, -44, 41, 29, 62, -120, 77, -45, 101, 59, -70, -142, -58, -19, 223, -29, -41, -166, 10, -337, 107, 108, -103, -127, 96, 38, 43, 89, -223, 15, -41, 216, -35, -134, -197, 32, 20, -5, -13, -87, -248, 149, -136, 105, -12, -116, 86, -24, 134, 172, -96, 58, -41, 79, -217, -89, -80, 41, -86, -72, 121, 15, -66, -115, -6, 151, -146, -18, -181, -34, -58, 50, -66, 114, -125, -220, -88, -181, 20, -25, -46, -27, -48, -192, -329, 118, 122, 4, -19, -64, 143, 97, -154, -19, 28, -28, -97, 334, -46, -131, 141, -53, 245, -108, 36, -326, -81, -176, -306, -248, 136, -54, 209, -214, -17, -64, 129, -129, -19, -77, 71, -37, -43, -246, 78, 291, -45, 115, 35, 137, -101, -189, -24, -74, 170, -42, -4, 75, -172, 5, 60, -126, -32, -67, 137, -30, -186, 83, -141, 3, -21, 126, -185, -282, -128, 91, -124, -33, -233, 91, 13, -34, -138, 40, 163, -9, -3]
5705cj61K82k75O0O2L47m8l59J04o4K0J29q9l07N99l96J33J41l64Q8n3K28j46
5728g2K98j98M7k23K21P8l16Kp8L92R3m71J82K5K50k34J38j21j12J08J00M4J58
5751C11n24K82k87j1K63l0PN9o8Nj76L0K84k09l5M5j50J47J62j0j68P6j8L3q4
5776f6j00j04L80J47k82n9K26k76j34L38o0q7p5J01l4j26L09J9j15J49k98K33
5798H6r7rP3L8RJ95k67K55q7k04L9NJ87j47k30J1K53j55R7q7l1J5R0j6K4l02K28
5825b7j49R3m3K22j66R3l8k13J67p0J95o3N1p9J1n4P7n7J81j67rj9Pl6m3J50K69
5852B83k83N4J49k28mM0L53m78J44o6O2k11J6J77j36Q7K16j85j30P5n6J0M0r6
5876a67K27K05j53k05j6J73p5p5L55k52J25l74K76K2n3K3l07K46l0J6O4o4R8k7
$$ y = [-3, -164, 118, -157, -97, -35, 312, 264, -95, 9, -55, -35, 94, 5, -302, 297, -99, 34, 175, -189, -101, -154, 74, -72, 226, 28, 75, -148, 73, 151, -165, -163, -241, 151, 244, -227, -45, -20, 230, -4, 134, 13, -99, 9, 109, 153, 311, -213, 69, -218, -229, 34, 4, 11, 70, 2, 7, -169, -139, 145, -64, -99, -54, -204, -57, 105, 95, -73, 3, -15, 18, -66, -166, -270, 110, 257, -25, -84, 142, -134, -268, 70, 10, -77, -152, -51, -85, -211, 98, 117, 2, 151, -147, 86, -11, -20, 53, 91, 100, 295, 28, 283, 196, -8, 31, 36, 223, 76, -154, -143, 110, -45, 52, -35, -66, -51, 39, 23, 47, -255, -27, -176, -83, -126, 96, -70, 23, -15, -228, -61, -131, 64, 1, 52, -27, -16, -70, 7, -50, 131, -36, -45, -64, -57, -93, -136, 14, 283, 0, 54, 203, -25, -29, 11, 364, -114, 30, -36, 26, -185, -169, 8, -128, -41, 175, -10, -140, -65, -121, -111, -71, -167, 60, 265, 112, -93, -109, 64, -11, -86, 269, 17, 142, -232, 44, 66, 13, 36, -271, -25, -55, -39, 25, -39, 59, 32]
5900C2K27m15K27K4k54K87l37L26k33k1p5J82J34j70K14r8j43K59j35R7k50L1
5922i1j02j37M88j19J93l93K71J9m5k83K32l3q9J36o4r1J52Q6k76R8q6J63J63
5945A92j96Q8n8p7n1J58j02J84k42k6M1j90K85r3K44k22J56o5j32J26k30L24k03
5968h9q0J64K90j99j97L6p5M2Q6j47J61j64R3J87j29J34j98K55j31q7Q7J86k41
5991a6k8k87J79J47Pj22P4M22k58l28K98k9J35q4q0j44J00M3o7P1J1l8J68J34
6015C08m57L68j19n6K1k51P2L20n58M84j22Oj64k0K44k44M8K25j85j43L72k01
6037e2J04j22l2R8l5j6K69l17J80j75l86K04J54J68j59J48k43J97j47K31r6j3
6059d0l1rj98K28J01j17J82k68R1M3n9P0r7j91L82j81J23r2N3K35J12k23k01K62
$$ y = [32, 259, -156, 71, 95, -159, 128, -209, 117, -116, -137, -212, -30, 104, -66, 148, 50, -93, 166, 31, 128, -122, -91, -193, -330, 158, 39, 232, -161, 110, 129, 84, -199, 33, 0, -89, 47, -17, -108, 44, 130, -146, -48, -134, 29, 192, -4, 84, 26, -51, -102, 56, -46, 138, -104, -130, -89, -279, 6, -87, 157, -65, 91, 26, -106, 20, -210, 114, -89, -169, -5, 285, 86, -111, -75, -150, -108, -22, -169, -8, -172, -79, 108, -21, 113, -85, 170, 39, -48, 39, 225, -16, -44, -331, -152, -5, 2, -120, -46, 376, 118, -210, 88, 59, 194, 110, 30, -114, -14, 29, -38, 33, 44, 6, 174, 308, -149, 219, 100, 44, 65, -186, -114, 206, -352, 132, 10, 16, -148, -168, 76, -168, -120, 105, -80, -223, 149, -52, 52, -70, -102, -4, -39, -55, 214, -103, 77, -98, -484, -280, -126, 42, -117, 31, -212, -15, -162, 69, -27, -40, -71, -80, -278, -50, 51, -66, 116, -152, -61, -18, -77, -7, -104, -295, 87, -94, 29, -63, -10, 225, 337, 114, -87, 175]
6083A75k89J48l9k79L62j70J99j21n1R8J40Ok84K88l34K39n7K8j72M6J69j31j49
6106a78K87J3k50R7j94J16K32j17k9k01J21n4J00j96L93j81n5J29O1j66J26J05
6128A59j26j58K41m14K47r2K91n11M14n4j84K98m32L80j10L6p4O5J80l13J01J86
6150A30j81O1J50N4k92J9j03L55l09M7k8l5K40l57K41j91K27P2j76K8j48L10k1
6173I3r1k50K23J21L7j96Q4K01l21o3K39j62K24m0J3j07n6L79l39N7Mnj7j18k15
6198c05K83j0K1j46L7R1J03j79K39j08J7O3k57L86k90Q5j11j01K50k7J92k90r1
6221a48J93NP8M2j70LJ56k61KK9M3j29K95o3j42J2J30l7j35J72k29J69K53j68
6245A00r1l35L85j02N9p8L5N7j66K32k62q3K36P3j23j35J21L3J37P8l03K40l28
$$ y = [175, -114, 34, -5, -284, 78, -92, 107, -14, -65, 33, 173, 179, -105, 183, -151, 88, 31, 59, -113, -67, 102, -29, -178, 109, 122, -128, -31, -225, -109, 123, 6, -23, -224, -103, -157, -57, -253, 140, -41, -96, 33, 94, -72, 54, 159, 33, -125, 116, -298, -51, -143, 148, -363, 51, -3, -187, 111, -321, 59, -51, -15, -89, -24, 156, -157, -56, 130, -51, 10, 160, 214, -78, -59, -162, 193, -116, -69, -97, -132, 108, -249, -8, -199, 28, 100, -76, -48, -196, 114, 93, 2, -248, -25, 96, 133, -63, 21, 222, -99, -162, 77, -85, 139, 99, 112, 5, -51, 328, -11, 46, 50, 45, 28, -90, -305, -22, -32, -11, -157, -120, -29, 74, -105, 134, 26, 43, 106, -151, 235, -55, 30, -81, -182, 68, 41, 233, -57, -148, 45, 50, 128, 170, 0, 3, 159, -102, -100, -71, -28, -157, 138, 75, -67, -55, 75, 38, -97, 75, -154, 15, 268, 100, 9, -326, 59, -43, 16, -62, -27, 30, -136, 96, -166, -249, -13, 60, -63, -198, -77, -44, 93, 171, -132, 108, -220]
6268b20J04J28n7J44J67k13o7N4k60M70l26M8P4j08J94j11J01o7q3J11k00M1L2
6291d4K60k68K44p8k48K37K48k34k77J1N0L45j67j66J66j17K0N1KJ6j41Q7j00
6314a03N1O7n2j78K63J94j40J0k2j21J03k0L2k2j24J11j16O1L14o18J99O3L88
6337C40m15N1J87j81L2j14J35N1r2j66Q8K5J85j54J80j22j00o2L96k29L59j83
6359B11l03J45L37l35K59j62m16L46k37J91NK06k49p3n0J18QL11m59J79J19p0
6381H1j5q4J23j6j87L14l87L33k37j25L9K23j6k31J37q7M1J30K00P2j38l63J86
6404gO0k09J42j13R5O7j56K63j98P0m1R1r7j25K57K14k83k46N42l12r0J61N8k58
6428a15K0n4l4K9L20q3l72L32K54l07K44l38n0J72l70L32k4j00J68oM5J5kJ02
$$ y = [-220, -116, 12, -45, 99, 266, 53, -14, 40, -220, 250, -76, -28, 46, -62, 132, 21, 122, 55, -28, 83, -117, -76, -44, 216, -52, 192, 114, -134, 103, 351, 117, -160, -149, -99, 246, 79, -87, 79, -38, -18, 33, 35, 51, -90, -3, -103, -52, 15, -37, -215, 48, 242, 102, 112, 90, -31, 72, 52, 84, 62, -62, 49, -67, -6, 308, -310, -111, -48, 340, -75, -24, 163, -18, 14, -100, 35, 86, -6, -172, -84, -59, 126, -28, 152, 30, -70, -132, 264, 35, 394, 211, -92, 53, 390, 55, 314, 152, -264, 82, -155, 36, 41, 247, -2, -75, -125, -7, 1, 312, -147, 32, 151, 81, 66, -18, 105, 89, -98, 216, -171, 162, -75, -200, -161, 62, 46, -185, -48, -135, -94, 36, 236, 308, 170, -193, -7, 53, -156, -14, -127, -32, 35, -121, 142, -56, 14, -27, 64, -33, -158, 99, 313, 30, -216, 326, 14, -76, 85, 143, -115, -95, -149, -183, -154, 166, 83, -289, 43, 297, -10, 234, -104, -154, 18, -352, -20, -44, -144, 24, 18, 63, 78, 76, 178]
6452A78Mj99Q1o6O0O1O3j61k67L7O6J45J83l8j69R7j8j72L77l19O5j31J96j52
6476g9J49j59J3M9J04k46L44m51K71k48M17r6j67J82j59o9K0K27j39j4Q2m3K08
6499A96l08j7K94m57K57J41n6K10k39k64N10Lj80k47J2P3N47l91k9j56P2m1J44
6522G4Q3m51L80j06R8j80J69jr4j49K45P7R4l50Q7J23l58m3M74n02L82O4j20j3
6546a7r5M7j56L44nJ66k37K5o3j55R4j81K69R4k73K2M7O9J23m5k52R4J73K08o68
6571c72K88J85Rm1j40J98m4QQ8l12J62J47l93K84Mj35n8Q7N9R3n2J38k33p8Lj2
6597a17M8jK60k76R6J64m41N19m00L18n7j25j00L02l10L25k13J3Q6r5o7l0Q1J91
6621A71m7j93K61j13K14l20j2M9l2J36j14%J91l02r3L20k35K31k03J27j43p9J15
$$ y = [178, 182, -17, 64, -2, 58, 119, 182, 21, -246, -209, -143, 2, 185, 147, -22, 75, 57, -115, 262, -57, 8, -123, 73, -79, 70, -89, -76, -27, 77, -169, 175, -276, -5, -253, 164, 68, -99, 83, -76, -145, -125, 102, -37, -51, 31, -12, 196, -112, -129, 165, -292, -35, 106, 50, 260, 21, -243, 267, 270, 90, -157, -145, -72, 475, 84, 55, -101, -29, -70, 74, 157, -294, 86, -20, 78, -102, 67, 66, -28, -177, 68, 145, 239, -111, -24, 99, -259, -302, 172, -330, 52, 116, -4, -17, -112, -65, -221, 123, 118, 284, 47, 72, 9, -146, -52, -233, 36, 130, -143, -121, -74, -5, 118, 73, -179, -85, 88, 296, -372, -84, 101, 110, 69, -71, 127, 83, 91, 179, -133, 29, 176, -217, 67, 71, -64, -122, -35, 24, 117, 65, 203, -30, -108, -105, -117, -69, -70, 190, -86, 10, 174, -267, 252, -148, 170, 113, -12, -112, 190, -120, 205, -8, 5, 91, -4, -71, -101, -20, 171, 124, -69, 192, 79, 293, -27, -39, 10, -22, 114, 0, 0, 191, -111, -204, 116, -119, 112, -91, 36, -107, -186, -71]
6644g1j19M70k29m3PJ74j87n7J41l7N9l03L03j01J55Nj66J70j80J13n7j2r8j71
6668b34L67Mk73J89o2J9p6L8Q4k78J93J11K8l60K53j47K08l38L4M33k10J95l29
6691a51J77j30p7J12J15J14l79J56J01m8r2m1J27o6K15j92j5r3J79o4M9kJ05j94
6715i4k72N86l66N1J26k38K31l7j05Q9k6R1j74M31m51K05K23m42K71l51K39J20
6737A07K9k81K48k91l1L31o5m2J06p1L0l34K64k7J85J51o19J74J30j78K35P3J69
6760B93j03K4j02k70j48K00Mk0j86J88K93N9l37J89J48J08k08k23k1L05k35k1
6782f3O5n7J27K9K10l86J26j72M7L00j92R8l27J06J98j98R6O0k0J05k85j8L11
6805A60k27mM6r2O5k25J29J40j12rK91l09K34l24L35J59j33j79m7K04l4r5j56
$$ y = [-71, -190, 280, 51, 8, 15, 189, 2, -55, 86, 49, 108, -195, 108, 7, 162, 167, 1, 171, -9, 104, 47, 35, -63, -234, 133, 137, -136, 53, -9, 10, -66, -28, 56, -222, -29, 82, 110, -250, 3, -144, 64, -274, -240, 193, -17, 178, -151, 26, -104, -181, -69, 46, 160, -219, -63, 38, -10, -102, -143, -16, -82, 133, -59, -74, -167, 12, -52, -3, -5, 100, -94, -366, 220, -146, -95, 31, -207, 24, -13, -118, -29, -55, 36, -138, 293, -158, 47, 270, -172, 99, -252, -13, 107, 136, -145, 103, -188, -219, 112, 47, 5, 111, 40, 70, -264, 0, -27, 158, 309, -310, -136, -6, -184, 51, 124, 293, 190, 214, 112, -158, -306, -106, -102, -122, -308, -120, 173, 232, -105, 84, 232, 340, 132, -91, -112, 193, -42, -63, 2, -55, 72, 101, 311, -75, 51, -121, -74, 226, 34, 132, -195, -89, 109, -89, 7, 67, 47, 152, -133, -151, 160, -67, -71, -25, -117, -52, -277, -148, -8, -120, -129, 162, -147, 87, -237, 98, 257, 124, -55, -102, 102, 68, -27, -183]
6828a83q7L60K3j66j74J70J63m54M50k85L41k47M6q0K06n1j52K1K50k75LJ74J75
6851B28j64k01q2K56Q5j71J66J23j76l58K65K9P5j72J54l68P15l72N2Jk55n5J64
6874f1J65k9l26K96K75j69j23p1J33m30K73L08k7n4k99N8K7L1K01P3l41L7N2J25
6898A24J17j78j51N6j59L61l6m7o3k4j5l3J75M4j54K1K19j26o4Q3j81Lk0o2JO5
6924d4L5M5j87J63K57j65n2R1k8j53J22j4M8J05k49M6J23J23m56K68j75m4J56
6947A5p4O3j53M92k20k02j62J96K14k75K60j29j63j62K18J81P4j83m4j11M54l17
6969b8j21K13k16q9K06J11j68K80N4j91q1J13j13L57k53J43o6l55M64k88j07O4
6991g1K9o3Jo8J3L17k67Q4K39l14R2J28P6m42L90j65jj2P1J53l31K14J3j61L9
$$ y = [-183, -270, 90, 113, -53, -227, -57, 106, -348, 102, -183, 158, -89, -43, -123, 83, 32, -120, -99, 151, -124, -121, 53, 228, 64, -137, -219, 37, 122, -49, 117, 240, 64, -294, -29, 0, 75, -97, 57, -311, 404, 32, 84, 85, -170, -225, -61, 104, 75, -251, 45, 320, 151, 28, -43, 90, -340, -67, 241, 214, 160, -139, -81, -54, -23, 178, 251, -90, -53, -1, 124, 241, 63, -88, -32, -191, 170, 134, 87, 24, 0, -15, -48, 127, 171, 17, 38, 257, 131, 67, 150, -31, -28, -48, -110, -109, -44, -9, 36, -151, 12, 269, 104, 52, 143, 115, -38, 84, 70, 118, 223, -26, 20, 143, 266, -190, 78, -97, -141, 15, -59, 4, -149, 343, 123, -79, -241, -45, 169, -106, 154, 25, -138, -300, -82, 99, 173, -10, -54, -165, 289, -28, -149, 64, -152, -241, -35, 76, -92, 188, 242, 51, -30, 83, -30, 327, 74, 217, 151, -204, 260, -28, -135, -71, -42, -105, -104, -172, -159, 158, -109, -25, 214, -100, -8, 120, 196, -246, 144, -21, -22, -34, 37, 190, -141, 73, 86, -75, -36]
7016c6Q0P5m4J00R1R8l62M1k24J56j3k14J94J98j20p7J03J64j31k73M82m56K80
7039A12j35J12p0O3O8k57J76K1j16k07K21M2o8k50K97j38K74l14J32J41j30J10
7061H4J10j64m08M03R9l55L98o7o0j0q7K9Mo3%K1j33K26j60NK36k78j0L38k00
7086d2K8q1k10L37k23L61j80J85m4j80K51m27K36K26k14R0K17l19k60J46RJ69
7108G5M6Q7j47j1R4l40L57k42j5J20j91n9M4J39P9P5J54k77PK25l02l8M08k29
7132E9l3q9N3j34J17k53K22J00k4p2J35r2J10p3j59J55j95O8oJ80J2r3j75Q6Q
7157i3J17k6J27j4Kj66j17L79j65J72m03J14J59P7l77L09k13K79j74L94m88j77
7179b84J98ML5l5O5J7K9r8j61k3L60k71K70k18K54ok40k9L19j78nR6k80K32P2
$$ y = [-36, 44, 119, 75, 175, 266, 364, 2, 43, -181, -25, -38, -252, -58, 140, 20, -57, 46, 210, 79, -194, 288, -168, 112, -23, 89, 19, 82, 150, -107, 69, 90, -26, -233, -12, 30, -38, -288, 9, -129, 145, -169, -37, 104, -26, 84, 194, 30, -378, 25, 124, -231, 167, 100, 40, 30, -57, -28, -24, -87, -87, -66, -199, 27, -133, -128, 108, -170, -180, 158, -42, -14, -95, -305, 32, -191, 170, -10, 175, 131, -49, 202, -225, 11, 237, 23, 113, 330, 11, -249, -103, -94, 75, 121, 208, 61, 50, 144, -196, 161, -81, -96, 24, -167, -226, -182, -43, 36, 111, 265, -12, -5, 220, -82, -120, 288, 59, 26, -63, -10, -144, -27, -280, -58, 42, 18, -54, 81, -11, 99, 26, -133, 22, -173, -105, -111, 69, 81, -12, -187, -101, -93, 24, -2, 125, 111, 113, -53, -170, 209, 44, 216, -187, -73, 86, 163, -214, 95, -118, 161, -13, 381, -107, -284, -86, -82, -47, -82, -17, 0, 29, -69, -230, -253, 107, -164, 106, -112, 142, 136, -104, -133, 186, 8, 3, 99, -181, 51, 123]
7204A23qm4q8l57M06j25j23L09N3r0j18J87j18P1m8J60k8j59N7j61J15P2k25J48
7228Ik8Kq4R8J35j16On8j73K76L2LJ56k00Q6N2k46J73j96k9L14k75k9M2L5m2L45
7255B88j41j21j70P9K76K12j71j94r6L8Q0j48p8J51k38L26j88o2J98j01J66k30
7277a24K02Ql06K26J23j75j79K22j08K56k99J28oK38j40k0km8K04l54k0K74j56
7300e6N2L34n68K76J51k57L54l31r4N7K20k14P7j20k2Q3r7j82J75J44j16j10J36
7323a08P3j62L4N4o5M22j7l13Q6L4R8k12K03j64J4K7j34J8m3J62m5k3k7j35K36
7348A3l53M68j95Q9r2l3J92k17K38k38J09j0J70l60K70k14K33N2k79k4N52K3n11
7371a17K41O3k03J3n1J69j95R4J74j98j92J43J23M8p1j26M9K49m62K84K0p4J43
$$ y = [123, 115, 71, -17, -374, 32, -93, -216, 93, 146, 56, -62, 125, 7, 78, 30, 190, 162, 3, 60, -101, 14, 86, -139, 9, -19, -17, -101, -3, 132, 16, 22, -36, -209, 67, 99, 102, 258, 58, 144, 196, -50, 123, -73, -102, 212, -63, -92, -50, -15, -57, 288, 147, 26, -144, -65, 211, 423, 252, 58, -38, 0, 80, -68, -146, 5, -233, 93, -95, -157, 41, -60, 106, -124, 78, 86, -220, 6, 129, -46, -225, -3, -111, 145, -154, -26, -32, 206, 66, 46, 44, -4, 200, -154, -174, 100, -56, -4, 330, -238, 38, 189, -68, 286, -45, -139, -82, 138, -76, 1, -119, -141, -58, -155, -337, -162, -18, -134, -244, -108, -35, -197, -163, -109, -174, 248, 231, -82, 4, 38, 136, -76, 127, -37, -23, 4, -130, -112, -155, 7, -38, -61, -88, -223, 13, -340, 128, -67, 22, -70, -103, 89, -128, 110, -128, -19, -29, 141, -219, 51, -163, 70, 122, -157, -181, 371, 394, -117, 124, 187, -16, -3, -54, 115, -80, 14, 188, -10, -202, -59, 64, 112, 41, -85, -36, 213, -249, 35, 55, -19, 124]
7394A24r5j02K70j73K13p5k51L1L34m02J57o8n3N6j07k6L84j94j56L32j51k72
7416b24L52j19N5R9r5J14j14Q4j6o6L5l06J58j14K45Om25K00R0K77r8j35J60l64
7440b01J28m5M9p4J6J93J44k71N7p2q2j6K04j1k2m6j37L23k51K24J20j60R4k27
7464f3K03M9k35k57R1K51q3j15L57l54L30k5O6j38j90P0K5O0j62k40L09n0K11
7487A10l27K79j61K4L1J14j65m1J07k17J95Q7K1k16j20J30L59l75K54r6k6M43
7509D10o20p4L84q7J49j31l7J81n7k71J43l0Mj97K8J39k8J25N3J22m2l1k80O8
7533g9J11k18J6J60l12M9Q6l9J10K00k36J12J74j28Q0R7k37j53k1K00j87J95j04
7556a24P1L1K39k07J28jj46j59K66N9K3j25k69L73J16m07J48k09K16R0k3l19K5
$$ y = [124, 29, -73, 197, 24, 237, 162, -89, -58, 276, -126, 31, -37, -90, -34, -141, -167, 217, 23, -133, 199, 48, -224, 128, 9, 64, 163, 68, 182, 68, 152, 136, 70, 105, -201, -43, -157, 88, 94, -331, -131, -41, 236, 138, 3, 163, -201, -73, -118, -69, -143, -127, 66, 210, -61, -4, -76, -158, -174, 30, 19, -3, -49, -186, 137, -114, 110, 230, 70, 164, -63, 140, 189, -46, -303, -212, 39, -44, -159, 198, -156, 174, 149, 215, 77, -113, -43, -18, 42, -120, -360, -51, -101, 110, -217, 62, -99, -75, -44, 70, -95, -136, -29, -246, -51, 36, 57, -159, -279, -149, 210, -165, 89, -7, -33, 410, -210, -284, 100, 13, 162, 31, -6, 175, 118, -153, -10, -40, -36, -233, -205, -66, -94, 31, 84, 206, 164, 133, -147, -79, 32, -186, -170, -10, -322, -273, -187, -226, -116, 84, -152, -40, 134, 6, 86, 183, -54, -207, -228, -28, -215, -20, -124, -53, -22, 217, 10, 138, 137, -9, -168, 98, 157, 180, 55, -214, 159, 275, -132, 16, -193, 23, 113, 90, -229, -204]
7579b04l3o1L76j69n2L01j82n7K63j31J69j66M8l94K66K67o7l05j00n8j3N3K01
7602d8k94N74k35j36J10j03l0K44j45J91L0j22J58j84j16Q7k04J77%j71K35R0
7624A08r5j96m0L11l00J83L3J60j41l19K84k04P1K75l8J09k32J86J06l43J46O0
7646A24k73J45L1K63l86j35K92j1O2r7J92j21R9k13J86l25j36L48J6j8O6k56J16
7669c1RL40l38k19M31j01K2k95L21l33J99K2J78j35k04J26LJ6J51l55j5k6N10
7692B76q2j66M4l1k24J73j39M72m84K31j6j65J76l0j48R4k09L78k20pK06j06p1
7715d8j21K88l07K23K1m65M57k31l5K8L07j71K72k45j69K82k95r0M06j52O2j6
7737Aq0K0K99K30m07j4p7k60K43J73k07M03k18m8J77j74k10J61M8k0N6o2j75O6
$$ y = [-204, -237, -298, 78, -91, -143, 158, -24, -81, 182, 51, 220, 54, 102, -292, -26, 241, 174, -131, -231, -289, -302, -249, -48, -342, 232, -3, -139, -29, -132, -162, 82, -63, 128, 158, 36, 194, 10, -106, -19, -223, -46, -46, -217, 18, 108, 13, -183, -223, 88, -212, -29, 4, 164, 23, -296, -12, -216, -145, 130, 92, 201, -31, 155, 261, -82, 64, 124, -149, -4, 27, 290, -96, -231, 61, 50, 112, 15, 207, 86, 185, -28, 158, -167, -303, 45, 61, 43, 109, -147, -31, -22, 318, -20, -239, 192, 91, 113, -182, 139, -194, 5, 27, 205, 70, -134, -8, -5, 11, 162, -193, -208, -234, 276, 194, 28, 72, 41, -183, -10, -149, 323, -161, 70, 54, -111, 65, 35, -113, -19, -228, 150, -70, -77, 129, 23, -48, -169, 119, -188, 35, 56, -409, 48, -183, -218, -190, 117, -54, 218, -27, -196, 86, -209, -299, 107, -45, 17, 1, -79, -59, 240, 470, 63, 49, -28, -288, -45, 128, -79, 324, 106, 58, 235, 61, -149, 12, 60, 40, 96, 34, -141, -75]
7761g5K9k25L79n1M6M5Rp7q8L15l63p2O1o5Q9j63K82J71j43k28n6J78J8k1p0J59
7787H4j46K40l36j09L40pj80j13K1L23j35jl0r1J09R5l19N05p6k81R4J33r3k60
7811b33J05J92n9N3r4J7k12n6J29K08j2j35l3k15N17k18n3J44L7j85K36k18K08
7834A23j85K95k72J9j08j51L01J07j83Q2j97k8J32Q8o2J44r4J91j27k44K16k3
7856B4k08K42l0o1J22K8m6K03k69O6J8j20P1j73J23J78l60r8J96jK16l9j97J71
7880E6o4k22J07K78j37J04k80M5J7K13k03J44K6k35K57P5p6k11M9L21l71J67p9
7903a9M8O2q2K12m5q4l87K94O1o3K30j52l71K15j73M82k63Q5o4N5j18J3J49j26
7927d1J15J3Op1J03K8J3k1j22j35K73q4L9k90K17K9j11j45q5M62k31J10L8k23
$$ y = [-75, -46, -271, 108, 57, 103, 148, 157, 80, -8, 307, -56, -128, -67, -132, -43, -206, 76, 247, 104, -124, -180, -2, 16, -5, -75, 84, -62, 178, -158, -267, 73, 66, -114, -227, -206, 117, -18, -19, -49, -140, -31, 64, -255, 250, 174, -107, -13, 120, 27, -233, -128, 64, 5, 58, -36, -19, -231, -287, -158, 50, 38, -97, -130, -345, 172, -46, -99, 45, 82, -103, 133, -85, 123, -62, 233, -39, -20, -128, -279, 22, 129, -54, 28, -169, -197, -65, 23, -39, 105, 11, 202, 75, -169, 47, 24, -184, 58, 28, -33, 89, 117, 71, 274, 5, 71, 89, -31, 40, -133, -10, 168, -192, -290, -94, -95, 121, 82, -115, 56, -8, -230, -123, 155, 18, 122, -158, -113, -96, 117, -86, 58, 84, -151, 106, 181, 105, -106, -57, 264, -107, 60, -19, 29, 91, 9, 221, 176, 92, -295, -1, 60, -3, 227, 75, -296, -81, -254, 228, -35, 50, -14, 41, -77, -64, 85, -41, 74, 87, 93, 22, 125, 153, 166, 145, 23, -112, 161, 77, 116, -174, 43, 72, -39, -184, -269, 193, -38, 72, 110, -113]
7951a13j28N2K20n10M34R1p6r6Q0j91L41k66K6pj30Q2N10l38K63n28L21o6k49
7974b78L68k56Q4j0j25N44k77j51Q3L00j99j6P7k20K3R0J01N5J25m55L7o8K83
7997A15k88L2j49L01n1k34K91nJ34r0j89M2J58O6r2r3J0J12o1L3qk27P1K23j65
8022f4o7J41J82j64j51J63j19M1N6n8N4o0n3o7lJ61l6L7M8p5j5J64L5j06k16J17
8048e5o5J60R4M2k85k46M85j68k28K73J02j83J44j7n3j45l9O0L58q2J9j20O2p1
8072D2j00K04j7j97m7P2j73K42k81J27N7J43j73J34L6M6j02J08M8j99j22P9o1
8095a34jL57l55K04o5Q9m3J73K03l56J2j84n1O3J29q3N7J10k87M23r9m6k0J10
8119B06k03j05K75j40OJ8j31p0L63k23L3j25L4o9K66k83K34l28L29k6j8J41n6
$$ y = [-113, -241, -189, 31, -479, -45, 46, -30, -126, -46, -237, 104, -162, -136, -143, -273, -191, 319, -19, 244, -284, 37, -29, -278, 90, -166, -82, -92, -217, 327, 50, -101, -18, 282, 83, 67, 144, -76, -53, 37, 138, 193, 318, -137, -100, -168, 115, -173, -141, -290, 11, -40, -274, 17, 12, 146, 56, -133, -91, 67, 133, 41, -52, -42, 70, 9, 42, 34, -193, -122, 101, -64, -131, 10, 192, 28, -123, 40, -79, -38, 18, -40, 14, -46, -99, -166, -169, -8, -44, -7, 41, -34, -49, 115, 150, 44, -172, -55, -120, 40, 134, 176, -109, -355, 130, -38, -266, 7, 109, -74, 70, 53, 0, -145, -184, -124, 234, 152, 171, 51, 113, 42, -58, 146, 129, -68, -115, -43, -216, 26, -255, -128, -71, 72, -101, 33, 69, 115, 13, 121, 169, -30, -152, -73, -134, -135, 222, -133, 71, 6, 95, 52, 225, 428, 72, 84, -100, -151, -88, 41, -42, 15, 125, -162, 261, 162, 116, 96, 206, 3, -102, 173, 33, 39, 57, -74, -144, 219, -4, 29, -96, -62, -131, 135, -148, 86, -242, 87, 61, 43, 184, 128]
8142A28n0m3k50J67K18k74O9M3o4J50J85l13k42J68p5L6m1K82j94J09P3r9j72
8165a89L46l25L08k52j48L70j09N0o7k48K91L43k78k8K7k20k02L74j45O4K81j57
8187H6J1L2l87K74
$$ y = [128, 78, 35, -215, -48, 170, -104, -35, 8, -56, 94, 279, -34, -276, -108, -183, -147, -188, 94, -100, 9, 82, -17, -189, 157, -168, 140, -112, -260, 110, 1, 51, -16, -264, 27, 370, 92, 64, 91, -129, -331, 43, -102, -38, 243, 86, 97, 129, -258, 16]
8191A6
$$ Imaginary data points
##PAGE= N=2
##DATA TABLE= (X++(I..I)), XYDATA
0@%%%%%%%%%%%%Qj6J6j6K4l2L2m0M8n6P2q8J04j20J36j58J82k08K40k72L11l56
34a89M03m54N10n72O39p11P93q84R81j087J204j330J467j619J785j966K164k387
52a253K634k902L202l542L926m364M872n464O166p019Q075r427J1229j3756J7584
67I961k4143L8357j25508J07777J42277k51072O7780J41927j06620q2288J20182
78C8630K293p3543L0756M2600p5510K0793O6041o2671k6021O8165m2614j9801
90c0882N3166j9165j7102K8367k0813j450J2832j5075N675J3501n231j963j912
103e2J7551j3094l0655L5751R974m5933K2024K4026k2636Q527j958j5700J4947
116B772q793j2213J7537P859k058j4076N093K8133k7329j4142M1876k2034k1171
$$ y = [0, 0, 0, 0, 0, 0, 0, 0, 0, 0, 0, 0, 0, 8, -8, 8, -8, 16, -16, 16, -24, 24, -32, 40, -48, 56, -64, 72, -86, 96, -112, 128, -144, 167, -189, 214, -240, 270, -302, 337, -374, 419, -465, 516, -571, 633, -697, 770, -849, 936, -1030, 1134, -1253, 1381, -1521, 1681, -1861, 2065, -2299, 2573, -2891, 3275, -3744, 4331, -5096, 6133, -7623, 9961, -14182, 24175, -101333, 6444, 148721, -102351, -34571, 107356, 736, -81552, 38630, 40923, -32620, -1864, 40736, -34774, -13981, 52060, -10611, -36632, 31533, -11081, -30882, 22284, 3119, -13983, 14384, -6429, -7879, 4953, -10122, -4447, 9054, 3823, 1860, -52, 17499, 4405, -26250, 9501, 19475, -26458, -4434, 19592, -3044, 5483, 3525, -12175, 2772, -6021, -18234, -697, 7162, 5104, -8972, -3879, 24254, -3075, -17217, 24659, 2625, -18546]
129a8546M1027j6351k3527K7607j1082j4628J4843m192L76N701l924N473J414
142D191m37o611n988K2035o815k2514L3140o847l3889L9727j288m3008L3656O540
156A1892l7907K8719J9635l0043j102J4481p760r915J6959J0599k5734L541K1841
169A5206k3812M583K3346k8327K606K0673k6213J1738K0272l0430L026J5830j8690
182a0192L429J1810p096j388K669N109n476k596J6383j2512j2313K6869j0899
195C797j7654K6618p380j7061J7890o252j0470J0885j217O75j346j571R361j1510
209e235j356K0606j6034n570K1978j6102o640K0482j0930q918J0497r48n490j259
223d919R225Q12j6212J3297P965k4971J4074J3926k6462J1858J4555k1615P604
$$ y = [-18546, 22481, 6130, -17397, 10210, -872, -15500, -657, -4849, -4473, 1228, -2696, 2777, 4191, 3754, -2857, -8845, 13190, 6375, -16139, 17001, 10154, -23735, 15992, 14704, -28304, 5352, 11892, -26015, 2704, 22339, -7704, -8806, 5675, -2085, -12000, 4959, 15558, -10176, -6635, 15206, -8606, -4023, 19323, -9004, -6398, 14275, -11938, -200, 20072, -10358, -7332, 8498, -10192, -6763, 5047, -2049, -3437, -768, 4341, -1135, -3731, 12652, 140, -12173, 14696, 3797, -13857, 12761, 5381, -11680, 6210, -42, -10512, 373, -844, -169, -1515, -3086, 6275, -5235, -6591, 14015, -2019, -7589, 14389, -1713, -8353, 12129, 1199, -7719, 2778, 1830, -3660, -4919, 4306, 5118, -11094, 2203, 10168, -14803, -729, 13197, -13265, -1407, 13148, -8467, -863]
236h63R118j3118O835K441o909M465j456Q78k69m384O550o382n130J3035q210
251c399j808J4207j4447q7J5607j4630K915J1662j5002N593O653j2076Q384J504
265E076j0897P201k005l941O346m298K90K036l116O047m637j360J1944j1763j166
280d243J5698j4876m4J5189j7749J709J4341j5461J281J1342j0086ML840k445
294a500N94k746N007J056r494J0799J183j2428J2281Q80j1694J0637k740o339
308d504J0089o115j323O465r913M858M138j2433R577L409j1916Q129J581n427
322c385O074l245L49N466p094L451K470o432N715l169m009Q689q430p88J0557
337F219j3053L178J1654j5488L637J2651j3091J984Q307o872O80K366m75Rm365
$$ y = [-863, 8255, -4863, 1972, 4413, -2496, 1969, 513, 1391, 1122, -3262, 3288, -3094, -8224, 4811, -3399, -5207, 9000, -5447, -5534, 10073, -4557, -1642, 10020, -4982, 611, 7264, -4812, 3572, 5076, -5821, 1380, -625, -4566, 1780, -2518, -2228, -192, -3308, 2739, -1898, -3258, 8686, -3077, -4243, 11455, -3421, -3465, 11724, -6025, -4316, 10025, -5436, -4155, 7187, -2899, -2895, 945, -1500, -906, -3652, 1355, 2411, -7083, 3716, 4899, -7529, 4752, 5632, -6062, 4575, 1835, -4504, 5585, -530, -1853, 4612, -5301, -443, 3695, -8738, 839, 4248, -7668, 461, 2042, -3385, 2689, -556, -207, 5259, -1835, 1616, 4086, -2346, 3369, 200, -3809, 4880, -3550, -4338, 6219, -6834, -3656, 7998, -7490, -3853, 8798, -4293, -2309, 5998, -874, -194, 2172, 1697, 1706, -2659]
352b659N953n44r565J0867k88j2820J1945J46j1155J0871j982o518Q689m208k55
367a523M865o935O359J540j0075J0590r6j0606R599l94p819O159j158k745J535
382g04j806M174m691k333J1586p822m867J4920r148m518J4049j0457j296J1247
396H334j0885m49R155q474j10M692l724k95k22K489q02m959Q981k031r866J4244
412F078j757j3521J5539r24j3378J2888Q9j0106P828j009l838K649k450K850j740
427h02l503O690l918l206Q551n759o29P295o931K711M394p902O293O17q629Q595
443C867j506p561P909k750l857N781m331P80L114n749N623j03n820Q796k645n256
459c708Q806l987l968O983l825j428L486l654K712k078k673O766p084o62J0289
$$ y = [-2659, 3294, 2750, -6815, 4052, 3764, -9056, 2889, 3035, -8120, 2751, 769, -5749, 2940, -1268, -1523, 3342, -3593, 2766, 4306, -5769, 4821, 4725, -5881, 3718, 3324, -4495, 1664, 506, -2239, -704, -2510, 1664, -3027, -5360, 6226, -1596, -6463, 8457, -691, -5209, 8840, -1617, -2913, 8334, -2551, -3000, 6155, -2319, -2429, 2263, -1461, -1756, -1978, 511, -291, -5250, 3731, 1700, -8166, 6078, 4321, -9200, 6339, 5415, -7963, 4925, 5014, -5092, 2736, 1727, -2111, 538, -1912, 938, -802, -4305, 2385, -1533, -4739, 3812, -1947, -2576, 4719, -2212, 499, 4893, -3009, 3284, 3901, -4728, 3867, 2361, -5200, 2709, -41, -3898, 1883, -2448, -1668, 1446, -4303, 1320, 1217, -4603, 4193, 1548, -3708, 5098, 1111, -2857, 4126, 301, -1127, 2359, -1295, 1417, -661, -3334, 3432, -3652, -4314, 5975]
474E975j1120L76J2514j1860M19J1865j0680N13Q482o745r08M322j598k056j076
489a577M373l424n970J1377m583r909J5718m428j3092J7854k387j4143J5759Q0
503E648j2640R821K910q474J596N153k266o710N861M586j3062N587J0821j6631
517g800L920J3834j6491J499J4008j2530p29J0382n386k225L546Q44j860m003
531b991N986Mr041Q834Q44j1311R396J208j0201Q219J044o608O150n78k977M025
547B003j805J641m96k256N364n002k323R139q627k276J1271r803k538J1035q276
562b949k302Q960m516j714M157m07r40k001M289M27p245P894J211j1127Q934K270
578D941j2282R188J770j0311Q350M68p691O523l65l721M684j611m17J473l59J529
$$ y = [5975, -5145, -4769, 7745, -4115, -3696, 8169, -2511, -1998, 6484, -261, -1169, 3153, 1555, -501, -1577, 2796, -628, -6598, 4779, 196, -9713, 6005, 1577, -11515, 6339, 3952, -10191, 5568, 5648, -6992, 2829, 5739, -2735, -1139, 4014, 1748, -4962, 899, 5485, -7577, -1990, 8831, -7800, -3880, 9954, -6537, -5038, 8970, -3560, -4289, 6093, 707, -1518, 2028, 2872, 1012, -2991, 2995, 2999, -6042, 2792, 3636, -7675, 1721, 2929, -7272, 947, 1991, -4617, 1533, 955, -2022, 2003, 198, 1839, 1343, -913, 4451, -551, -2874, 6265, -2362, -4638, 6633, -3170, -5708, 5327, -2949, -5251, 3709, -807, -2521, 1636, 1229, 289, -1712, 2577, 3004, -4241, 3653, 4864, -6263, 2671, 4941, -7341, 1847, 3617, -6694, 1656, 2124, -5567, 956, 591, -3130, 1554, -57, -474, 999, 640, 2169]
594B169k893J876L154q551M029O632j2250N159Q390j4502M181R202j2011K515
608b900P186p113J22M297j84r52j941M967j633n558Q165j952p397Q935k913o756
624e627R061l363m850P581l960k221N549m050J047J909k257K984j771r60N164
639D236n687P46O920q633J009O151q694J963N592o783J643K617k718J318r66J912
655F26M57m877O323M95q195Q843Q68j0468Q967J188q802O810L41n759M227j235
671a91j307J166j548K372j060j996N013m024K77N822o548J962N262r244M458N885
687F299j0576M196M575r377L979L915n463J230J203j324L96m80L406j840l707
702c568P111l116l835R010m343m554Q211n454k550P302o066o55N064n181J319
$$ y = [2169, -724, 1152, 4306, -4245, -216, 6416, -5834, -675, 7715, -6787, -2606, 6596, -5415, -2900, 4286, -2827, -2705, 1592, 1408, 456, -1485, 3482, 1849, -3709, 4456, 2504, -4893, 4042, 1129, -5627, 3434, 71, -4779, 2802, -1158, -3379, 2170, -1880, -833, 1076, -1181, 1803, 32, -928, 4236, -1451, -705, 6215, -2418, -1409, 4742, -3952, -1989, 3603, -3180, -1537, 1080, -1638, -320, -1286, 626, 1083, -3794, 2529, 3024, -5171, 3672, 4540, -5928, 3039, 4227, -4575, 2235, 2576, -3183, 1044, -191, -1498, -332, -1880, 492, -568, -2564, 2449, -1575, -1298, 4524, -2024, -62, 5200, -4044, 414, 6299, -4277, -81, 4494, -4883, -904, 3011, -2452, -1222, -19, -1343, -947, -1427, 1979, 139, -3568, 3543, 427, -3408, 5602, 1259, -3295, 4916, -538, -3088, 4214, -1852, -2507, 2557, -2624, -1305]
717a305L328l731J221n8p80K260l071L396J555n827N828R39q233O850J159p725
733d194O405O89o345L791l29j890K097k177K678j536k869P197k886m510Q564l971
749G14n030R113l014l831N615k987k133K167j053P07j921J20L143n016K290M881
765C765p761L041N536r448M287N846q716M035M594p862K539K547l666J069R45
780G51L84k180k013N428l369l794Q977m984n365J0590m064m372R212m515l852
795c166O547k940j241K955k203O44j266p34L571m124M84L643n873K297L884n200
811b722L342J865n422M609j92l467N182k373j710M282m414J26L163m811K453J547
827A458m365L672o37k970M822k721j636M416l518Q45L335l578K252K90l655M414
$$ y = [-1305, 2023, -1708, -487, -545, -1325, 935, -2136, 1260, 2815, -3012, 2816, 3755, -4478, 2372, 3531, -4194, 2211, 2900, -3445, 346, 17, -1873, 224, -1953, 725, -811, -3680, 3517, 631, -3879, 4685, 714, -4316, 4797, 1783, -2048, 3567, 580, -1553, 614, -439, 268, -1653, -1533, 1610, -3406, -1116, 3765, -3996, -955, 4581, -4867, -580, 5266, -3450, 585, 5179, -2683, -144, 2403, -1263, -194, 751, 1135, -1045, -3058, 2370, -999, -4793, 4184, -800, -6165, 4425, 361, -4011, 5201, 686, -3166, 3381, 441, -800, 2155, -48, 596, -670, -1404, 2167, -1957, -1473, 2170, -3703, -1406, 2478, -2722, 620, 2485, -2937, 1672, 1480, -1987, 3195, 822, -888, 3394, -1020, -894, 2269, -2542, -89, 1458, -2907, 765, 128, -2842, 1980, -741, -2377, 2039, -1479, -634, 2701, -877, 1375, 1665, -1990, 2424]
843B424j925k341N058m294j240N368n596J029M253n741J860K713m134L404R00
858A738l077K762j549k09K714l518K126J324m518L644p68l632N611l304k698O103
874B749m255j951O697m569q09N105m184K95L243k516J610n47q65K095l850J942
890A90K767o043K911K337o351M331J626n317M215l22l185M891k492l54M130m646
906a312J235L066m896K724J715m779L214o46j916K901k940Q86J866m364L520J342
922A616m795M873l00m180N858k619l074O456l609j791N119m239q93L580l275R44
938c29N91j746K169k425J018K902n155K461L640o435L694L527o365L395J845m828
954b041L177L75l030K715k100O37J729m354K801J361m664M215M07m477M864o12
$$ y = [2424, 499, -1842, 3216, -1078, -2318, 3050, -2546, -1517, 2736, -3005, -1145, 1568, -2566, 838, 1738, -1339, 1423, -126, -335, 2379, -1139, 987, 2311, -2207, 1437, 669, -2963, 2648, -656, -3354, 2749, -1506, -3457, 3240, -1329, -2138, 2967, -1217, -922, 2321, -195, 1415, 868, 3, 2098, -1752, 190, 2957, -3086, -175, 2162, -4189, 142, 1768, -3549, 666, 344, -2841, 2050, -442, -796, 3334, -1312, -77, 2989, -1907, 817, 2532, -2247, 967, 321, -1595, 1306, -1634, -748, 1118, -3246, 274, 1616, -3179, 1694, 1394, -2786, 3072, 453, -2621, 3835, 226, -1565, 3554, -685, -1578, 2002, -1273, -329, 262, -1484, 685, -1740, -722, 2180, -2975, -514, 3126, -3309, 385, 3912, -2453, 942, 2787, -2041, 1136, 1511, -1519, 1196, -904, -267, 1462, -2892, -91, 1270, -3394, 821, 1228, -3249, 1615, 1003]
970A003k511L604k240K08K058l453K587J37l684M165j346l841N776l016k626N425
986B246l552j028M782m250N43L216l377J921N56j581K499k113K17K001m048K586
1002F18J384n202L859O94n417N044K47n170N192o25l398M733j940p55K556k455
1018f35J341O51k260K814j662j347L272l396j43L661m824J646K917n459L510J896
1034A982n481M476R18m573M147k6l005L213j112j28N89k153K737j648k320M717
1050B333l335k013N672l994j397N346l942m14L793k981J358J218k417K669j682
1065B14q66L477l935j27M005m742Q35L233m630J827J968l485K468K9j470K615
1081A416j933O66J475k857K318Q74m214M421n63m707N628j815m554N848j779l477
$$ y = [1003, -1508, 2096, -144, 64, 2122, -1331, 1256, 1393, -2291, 1874, 528, -3313, 2463, -553, -3179, 2246, -1306, -2334, 2448, -1802, -1259, 1957, -1420, 501, 1057, -524, 1975, -138, 79, 2080, -1968, 618, 2002, -3200, 659, 1353, -4064, 980, 1227, -3943, 1249, 624, -2774, 1959, 19, -736, 1820, -635, 706, 1357, -903, 1911, 249, -1098, 2174, -1222, -1365, 2296, -2528, -882, 2035, -3424, 86, 1982, -3499, 977, 1895, -2678, 1469, 1443, -1562, 1651, 539, 411, 1000, -1153, 1584, -64, -2384, 2333, -1002, -3015, 2657, -1337, -2734, 2612, -1330, -1744, 2049, -932, 426, 1644, -773, 1896, 214, -652, 2825, -1110, -1237, 2768, -1974, -1139, 2094, -2536, -709, 1259, -2226, 242, 271, -1199, 1416, -517, 149, 1624, -1233, 1085, 1959, -2255, 2166, 1603, -3104, 2524, 709, -3845, 2003, 224, -3253]
1097c253M986j997j588K480j133P33p44J35K832l669P39M360n573Q25M819o215
1113b263J385L754n258J741K439m020K146N85k454K768j342j00J977j834J269
1128G93O21k546K568p74j996L728k732j780M912m156o74M521m168K5L402l407
1144a663J024J448k056K075j076k37K542k946P82K839m148J671J978m243K603
1159E93L67l170L229j288j970L333k255K61K385k897J483J077k763L301j058k218
1175a590M390k786j629M989l932j204M019l197q03K854j630j73J57o9J766l008
1191a846J553L260n783L106L571o512K965L394o169K545K445m252J708J065k007
1206i57P54o89R11k53j677K849r11k416M470k003k140N526l649j897N628m032
$$ y = [-3253, 1733, -264, -1852, 628, -505, 228, -516, -381, 2451, -1218, -479, 3881, -1692, -867, 3952, -2263, -878, 2876, -2382, -641, 1798, -2222, -76, 509, -1945, 823, -519, -619, 1358, -476, 793, 1414, -1132, 1436, 662, -1334, 2394, -338, -2118, 2794, -1362, -2036, 2485, -1683, -1658, 1744, -1663, -639, 809, -1247, 828, -248, -485, 2057, -889, -107, 2732, -1416, 255, 2233, -2010, 593, 960, -2210, 1019, -269, -2239, 1094, -1161, -900, 1485, -1412, 71, 1148, -1615, 1686, 628, -1590, 2800, 14, -1615, 3374, -558, -1762, 2257, -940, -1743, 1111, -519, -692, -535, -604, 1162, -1846, -293, 2967, -2816, 290, 3861, -2651, 314, 3708, -2461, 84, 2529, -1723, -15, 1050, -957, -203, -892, 19, -234, -1911, 938, 27, -2389, 2081, 78, -2062, 3464, -185, -2082, 3546, -486]
1222d86j460M891l266r49K650j995J25m85J25J717k772J652K450m627K208L031
1238B809m910K116K566m330K367J110k614J940j041n08J617k676J106J415l577
1253b610K794N06k979L453o09k693L522j482q52K926k422P8K191k592J363J90
1269G84k094K190j264q38K593k667q0L091m011J448K991m129J854K151l714K155
1285D60P99j738J409o27n60J171j848J294R25l212L000j081k546L594j466k163
1301b589M512k562q35L680k751m94K930k490O76J376j708J102q73j60J162k582
1317a606J185J915l923K136J713l962L027P61l495L305J07k248K477p95q30J771
1333A538k098J258M94k712K258l77k478L239j277j979L354j837o39K536k173O86
$$ y = [-486, -1946, 2945, -321, -1270, 1380, -615, -490, -975, -850, 867, -1905, -253, 2197, -2430, -222, 2809, -2101, 15, 2581, -1749, 618, 1728, -886, 1054, 13, -495, 1122, -1554, -448, 967, -2610, 184, 690, -2289, 1164, 555, -2138, 1384, -98, -950, 1976, -446, -368, 1823, -769, 594, 784, -1310, 880, -384, -1222, 1371, -1296, -1376, 1715, -2296, -848, 2143, -1986, -132, 2019, -1695, 460, 1259, -479, 930, 303, -257, 914, -934, 360, 1285, -1927, 1073, -8, -2554, 1040, -426, -2589, 1923, -639, -1474, 2206, -545, -1039, 1891, -599, 77, 1453, -255, 847, -26, -186, 976, -1606, -421, 1494, -2429, -293, 1420, -2542, 485, 1246, -2249, 1056, 1163, -1085, 1392, 597, -233, 1538, -560, 698, 1192, -1520, 738, 361, -2117, 1122, -155, -2134, 1220, -617, -1256, 1280, -893, -207]
1349b07J494k245K032l19j809K989j783r32L121l373O2L213l700M90K370l148
1365a745J362R12j709J557o38l85K074k306J029J247k552K073N41l049K927j23
1381A215l279L239j071k164K807j403n43K043k063R87Q90k087K297l43j726K953
1397A752j359r16K222k188L72J603k602J498P25k772K304p31j844L027j483j050
1413a442L092k612j38K783k076M69J257j692J430n39j137J924j661j45J907k720
1429a300Q42J660l077J684R22k550K245o7j581K563j248r37K620k106L84J307
1445A361k076R05L52j810K103r78j143K367j865l95K313k641J118J530k551J691
1461B81N27k146K481n55j646K874j738r37K669k262j54J811k052L83O31j610J827
$$ y = [-207, 1287, -958, 1074, 755, -1054, 1935, 152, -780, 2341, -1032, -970, 2243, -1457, -967, 1403, -1745, -383, 529, -1180, 377, -261, -646, 1428, -878, 151, 1398, -1154, 919, 1460, -1589, 1338, 1215, -2064, 1175, 104, -2060, 747, -656, -1199, 844, -1219, -232, 658, -1429, 868, 525, -1201, 1752, 393, -523, 1699, -489, -117, 1486, -1116, 382, 1107, -1665, 639, -92, -1936, 1091, -392, -1442, 1650, -962, -1100, 1683, -393, 76, 1333, -359, 1071, 532, -605, 1319, -342, -487, 1420, -1300, -458, 1202, -1875, -191, 731, -1819, 426, 359, -1222, 1341, 93, -844, 1776, -330, 54, 1361, -715, 190, 542, -1268, 835, -143, -1286, 1081, -784, -1179, 1134, -1507, -389, 1141, -1410, 281, 808, -1338, 1143, 588, -1058, 1816, 78, -859, 1810, -452, -606, 1205, -847, -464, 167, -1443, 384]
1478C84j044n04K214j912K19K378k681Q36K152l096J441J145k274J204q6j205
1494h29J512j505J23J656k283P28J446k605J964N31j844J982n71j131K341j652
1510a37J37J586k306R46O48k298J856L71k493K499o98j992K815j478q78K370j506
1527e58J89J425j406J019Pj081J721j469j84J973k450L55K075l273J075J630k805
1544a757J262J323k274J908k06j077J868j105L81P23j720J340M90k063J868m14
1560E47j777K030j020j252K420j830j05K018k119R06J058k231J700O90j975K071
1576A131m92j042J876j891L34J132j869J138K44k035K032o11j445K424r87j452
1592a513K473j477l4J713j794J311K35j756J623jj843K336j078r43J831j789j17
$$ y = [384, -660, -1164, 1050, -862, -643, 1735, -946, -110, 2042, -1054, 387, 1532, -742, 462, 376, -829, 683, -822, -699, 957, -1326, -598, 848, -1757, 207, 738, -1106, 876, 305, -826, 1515, -137, 0, 1586, -720, 226, 874, -1424, 432, 803, -1690, 809, 111, -1881, 934, -544, -1422, 948, -558, -369, 1056, -350, 669, 676, -405, 1316, -153, -337, 1636, -814, -459, 1616, -1657, -582, 1048, -1757, -495, 828, -1446, 462, 256, -821, 1047, -58, 323, 1046, -674, 666, 1156, -907, 961, 547, -1230, 800, -220, -1472, 948, -882, -987, 1031, -1088, -182, 876, -1355, 345, 1035, -940, 1131, 639, -403, 1473, -418, -84, 1048, -821, 317, 561, -1474, 558, -53, -1498, 926, -61, -1513, 960, -517, -551, 1162, -632, 679, 914, -842, 781, 780, -1063, 1273, 195, -748, 1083, -706, -823]
1609h23J405j485N52O29j399J690m80q17J962j359m12J899j769O76Q97k218J487
1626D35P56k699J929L19k360K077q30n43J217p65L74N68j547J686k16j181K072
1643A292j238r43K470j670q92K538k116j60J559j734N34N09j342J438m89p84J856
1660H28j252j34J779j793M40J530k241J582K84j919J706m38j404J737j092o03
1676i90J847j479K67R66j552J059K45j740K274l91j453K565j310p63J739j475
1692a91J18R34j515R33j35j196J711j212k65J885j800m9J982j949M94J722k126
1709f59J018L85j475J437j17j056J274j108k26J131j090K41O12j488J807o11j293
1726a218K380j455r80K358j351m76K417j839K27J100j870R36J22q06R03r20l33
$$ y = [-823, 582, -903, -351, 278, -1121, 569, 89, -728, 1234, -125, -537, 1362, -407, 269, 1166, -1052, 435, 1191, -1508, 421, 740, -1620, 457, -373, -916, 301, -464, -90, 478, -1069, 617, 401, -780, 1292, 54, -889, 1581, -89, -981, 1557, -559, -719, 840, -894, -360, 149, -1193, 245, -244, -1028, 828, -424, -558, 1221, -572, -132, 1398, -843, 739, 1023, -896, 810, 372, -1032, 705, -387, -990, 857, -622, -355, 611, -941, 118, 363, -1377, 897, 506, -947, 1618, 308, -455, 1284, -191, -73, 861, -654, 279, 144, -1052, 659, -553, -818, 1067, -733, -782, 1200, -749, -255, 1467, -659, 359, 744, -731, 706, 589, -467, 807, -301, -527, 604, -486, -245, 367, -1121, 686, 75, -1218, 1162, -293, -1273, 1085, -266, -742, 1675, -164, 63, 1163, -707, 229, 351, -455, 448, -472, -805]
1743h05J187j497M13J542j762Q61R16j816J598kj360K148r10j340K395j818m41
1760f91J838j620K35P98j358J034l64j343J877q86j91J647j530L5J465j324L40
1777c8N76q70J062l42j107J881j256m99J936k205rJ420j558M71J227j498R17K31
1795C39j056J527p66m05J417j087J25J151j850Q80K26j807J878m35j557K071q28
1812a77r74K230j720L9J192j154P71L37r60Q84o2j074J585j065k92J532j803L05
1830d06R37j587R27L98j316J405l87r58J846j097o29J855j497L86J772k243O41
1847D7R09j235P40l73r51J345p19m59J231j215L16J423k076J359K18j327J433
1864F66n67q20J859j346n2J198j327J07J206j514O55K69j116R67l54q11J538j145
$$ y = [-805, 382, -1115, -702, 840, -922, -61, 855, -961, 637, 635, -725, 1423, 513, -827, 1568, -250, -691, 1147, -473, -238, 560, -798, 236, -128, -1471, 406, -480, -671, 976, -554, -519, 946, -378, -38, 538, -332, 730, 388, -719, 1162, -94, -593, 1343, -862, -871, 549, -1009, -538, 689, -809, 108, 339, -717, 810, 44, -361, 1056, -31, 94, 1245, -605, 275, 501, -1306, 572, 137, -1420, 651, -177, -1151, 1079, -641, -602, 590, -564, 207, 544, -416, 468, 406, -668, 917, -148, -440, 1092, -711, -406, 531, -1056, -129, 269, -1047, 358, -29, -987, 859, -238, -867, 988, -509, -123, 1649, -594, 47, 956, -279, 461, 88, -863, 482, -237, -696, 535, -680, -364, 1059, -1017, 342, 560, -767, 666, 99, -721, 1138, -208, -260, 938, -389, -282, 924, -590, 65, 334, -782, 185, -169, -980, 558, -587]
1882e87k01J651j604M26J315j550J099K13j438J327k85j054J702j328m29J438
1898F95j710O17J191j592P74L58j234J305n04p4J225j372J71J492j945P17P40
1915H54j616J189M36j741J359l47j290K055j243l63J353j339M57O01j033Q14L76
1932E22q53J220o70p51J788j576Q4J205j643P38M45j450P96L97j146J461p25j006
1950a164K127r70m36J233r56K79P38j226Q21j48j055J275p97l65J248j205k20
1967h21J444j359M72J109j672J215J50j199J572p74o15J524j063l47J317j322
1983c69J95O81j176P94N8r87J195o82q19J793j103j98J279j292O51O83j269J132
2001E66k5j312J752p64j185J833j030l13J132j557Q71L82j119R39j64r97J793
$$ y = [-587, -788, 863, -741, -315, 1000, -550, 549, 762, -676, 651, 366, -688, 1014, -314, -743, 695, -1015, -398, 793, -799, -25, 333, -901, 404, -100, -174, 1051, -321, -150, 1342, -603, 114, 854, -762, 427, 863, -878, 481, 134, -1156, 899, -344, -707, 646, -693, -236, 365, -668, 146, 522, -331, 889, 219, -532, 1256, -320, -236, 969, -674, 64, 509, -941, -145, 252, -894, 567, -158, -1164, 963, -7, -443, 790, -166, 113, 851, -375, 446, 298, -757, 518, -279, -644, 604, -601, -821, 623, -736, -264, 845, -827, 388, 538, -661, 911, 137, -478, 1046, -17, -364, 953, -369, -174, 507, -669, 125, 183, -804, 391, -291, -1110, 683, -420, -618, 661, -631, 20, 703, -566, 566, 541, -771, 981, 217, -968, 865, -165, -478, 654, -903, -32, 350, -769, 170, 6, -991, 802]
2018H02j080k28J688j369K9J069j278J98J049j678J229k60q19J366j139l93J455
2035F41j354K01R29r98M67N63r79J072j92r62J558r78j11J229j060k98J106j846
2053a012R29K91j080J162k74r20J327m62l86J359j291K10J195j429O24N08j267
2070e16J300o54p82J226j120j21J497j641N84J023j489N83O46j352J184l3q61
2087e26J206q98k8J005j225N01R17j604P85J35j027R79m62m30J206j099k07J382
2105F10j264N16J269j791Q25O33j264J382q08n38J212j164M2J201j414M99M00
2122C46j214J110j57j019J534r30p12J605j008K10J153j081M20N90j252Q87oj174
2140f98J262o48k74R20p85l20J416j740P85N93j723J622ro20Q20j78q97J372r26
$$ y = [802, -278, -506, 1182, -187, -158, 911, -367, -169, 880, -798, 431, 171, -648, 718, -421, -814, 641, -713, -512, 417, -581, -114, 449, -530, 542, 350, -612, 946, -32, -143, 1086, 26, -272, 834, -1012, -83, 208, -872, 290, 16, -904, 423, -39, -425, 934, -357, -147, 1048, -381, 243, 751, -516, 784, 130, -652, 574, -546, -667, 830, -811, -227, 796, -693, -110, 536, -816, 368, 335, -526, 680, -218, -246, 759, -466, 35, 952, -652, 133, 268, -759, 220, -242, -672, 534, -565, -772, 610, -654, -138, 1131, -660, 165, 798, -466, 916, 108, -430, 782, -382, -340, 861, -553, -54, 346, -868, 242, 85, -934, 600, -330, -1042, 563, -445, -235, 918, -163, 257, 847, -405, 482, 476, -698, 564, -84, -358, 562, -223, -543, 873, -867, -82, 511, -1212, 410, 401, -219, 601, 423, -474, 898, -28]
2159b8PR65j155L97K76j403J253M4j386J283k18q99J247n47K48L53p98L97N24
2178E60j238J212j22j096J415r60l10R41p86n3J009j258K44Q77j213P31J79r83
2196h51J542o71m19J128r74J62P73j093M45O58j804J721k49j147J698q90q14J241
2214D56j044oQ85j044Q49L92j025R11j25p96J318o40n03J161j262K76O91j158
2232f64N30L97r98J028K3r68J096n84l56J028o97J04N54q64Q95%j348J443n41
2251G8q85J451p32o18J166p64L2O80j107P17L54j129J318k61q53J361r84p7J271
2270A018j374O8J077j219O36J83j343J198m05o59J210n26m46P69p05M85N53j026
2288e06Q64J92j215J472m32j097J388o45m50R16o34m15O96n51N21m12n59J328
$$ y = [-28, -21, 944, -211, 186, 462, -941, 312, 356, -1030, 253, 35, -864, 383, -164, 84, 437, -361, 36, 560, -678, 534, 412, -684, 731, -229, -539, 402, -384, -437, 572, -686, -442, 435, -778, -47, 132, -851, 691, 20, -399, 729, -245, -83, 690, -403, 42, 700, -1104, 617, 368, -779, 919, 29, -785, 456, -588, -594, 291, -753, 96, 488, -537, 374, 249, -547, 771, 131, -372, 789, -473, -197, 494, -664, -134, 263, -735, 293, 316, -652, 444, -140, -496, 532, -165, -61, 493, -371, 524, 524, -824, 619, 78, -807, 644, -88, -706, 460, -304, -272, 408, -699, 18, 372, -757, 561, 300, -553, 808, -176, -253, 1018, -356, -288, 789, -430, 206, 389, -954, 244, -161, -820, 390, -136, -582, 187, -518, -33, 520, -506, 358, 550, -665, 807, 375, -722, 666, 21, -429, 487, -147, -562, 134, -417, 104, -308, -867, 461]
2306D61l88p67J348q68j28J332j246L48N63q68N58K48r78R09n57p75J153l39m41
2325d35O90j001N51N18j110J151k16p03J039j46q66R94k38m69O83n99L93K81j058
2344e41N72J6o90Q68m29p33J421q00j02J227j064N72L40r45P58k84o04R64l71
2363A75m96O97l90n78J042q86J17N81j076R74m2q24J235n46n51J273m55l81P82
2382F51j059N25L46j064Q12q4p94J191q10m39J215r39j6J132j041L15N91j032
2400e00P56J84j022J217m14o96J139r88L31N30p27M9J05n14R14j85q75J326q15
2419a85l55J231j089M59N93r23M75K53r18P07L5r22J224p58k36P86q81J88Q62
2438E46r40K61M90m83L61p8p94J098n48j4R53j162L57M43p37N47K38r40N98n6
$$ y = [461, 73, -694, 654, -214, -342, 990, -256, 92, 655, -213, 345, 593, -385, 524, -33, -808, 345, 6, -435, 255, -746, -195, 323, -787, 364, 148, -555, 484, 338, -528, 466, 228, -241, 442, -157, 236, 517, -541, 31, 47, -643, 225, -204, -937, 484, -316, -418, 809, -255, 317, 657, -288, 470, 186, -418, 546, 175, -321, 376, -14, -592, 450, -436, -319, 262, -814, 160, 118, -706, 529, -17, -568, 705, 250, -131, 651, -408, 117, 463, -601, 211, 127, -667, 524, -286, -725, 490, -449, -465, 667, -374, -59, 532, -500, 256, 440, -582, 635, 221, -475, 664, -324, 7, 537, -190, -141, -36, -550, 364, 179, -696, 630, -185, -540, 691, -398, 61, 654, -269, 206, 459, -459, 248, 283, -639, 585, -173, -409, 377, -504, -316, 546, -394, -133, 357, -126, 235, 157, -637, 461, -87, -101, 852, -310, 47, 490, -247, 300, 538, -402, 196, 140]
2458A40r82Q27l32j61J032q16j07Q85q47L39M52q88Q90J17r29J029p34n4P39j128
2478e28L29L58p62N42m7n02P56O9q91J380o05l58P79o73J37O36j024O39K03j104
2498f66J083n28m12Q32q63J94Q98j055M91N93r77L64L87r72J012l67k09Q32n36
2517A01r3N02q72k2N44o16P58j30j063R58r7q06J430q91J48Q61j010J06R29j270
2537e33P14J4n76R89m38q37J205p23j50Q24p82pO54p58M67Q5r64J141k82l46Q04
2558E01n82O7O78j026M83L52q72M98k7n41N30k65k46P81l38m27O96m28J98N73
2578F05r25O62k43n63R81l14m83Q04q28K34P40j178L35K27q31P67N3p77Q39m4
2598F1l28N35j81j06M20n42K13J49n81P81l42o05P81l07l20O37o98L09K55q72
$$ y = [140, -842, -15, -347, -508, 524, -292, -399, 486, -361, -22, 430, -458, 432, 549, -380, 649, -85, -139, 600, -528, -199, 159, -603, -61, -108, -610, 146, 215, -676, 704, 99, -259, 520, -153, -16, 620, -404, 235, 438, -666, 417, -111, -523, 309, -554, -360, 538, -517, -26, 567, -410, -46, 341, -631, 381, 14, -195, 637, 101, 8, 510, -362, -384, 160, -456, 302, 172, -891, 67, -30, -836, 594, -297, -149, 712, -298, -192, 737, -533, 181, 195, -381, 608, 170, -667, 538, -185, -335, 489, -293, -300, 354, -404, 63, 148, -816, 325, 43, -303, 501, -81, -14, 664, -362, 121, 473, -399, 99, 72, -469, 61, -204, -450, 331, -7, -434, 262, -166, 32, 605, -320, 342, 99, -464, 517, 203, -280, 524, -304, -70, 670, -508, -173, 54, -777, -10, 43, -734, 105, 61, -267, 268, 87, -19, 401, -141, 72, 221, -360, 421, 79, -526, 255, -52, -372, 265, -433, -124, 131, -741]
2618g41Q21K01n82Q71m43l37O48n24m8P83p37L21J04n14L71j44n94O31n9o85R68
2639C11m07k90R34p56J4N54o33L47J14k71L75l62l34O48j5m01P57r55K84N68j179
2660f97O06J52o90N96J06n67J014m41m28O18l46L2K86p14N18K17p65O75j20n02
2680d50P67m86k00Q32p58j7P88j061P11K8o19J088l41n81N22l84k59J020q46K0
2700b26N34q85J41M00l50L39j48l23P31m58K61R4l72L91J90m60L53K14p33Q01
2720D94p38j83P69l45m5K61n48P0N30p92M13K00k85M71l78j7O57n59jO71q74K69
2742D0N31j104N72J20n43O54j75n43P37l36K8K53n66L95K28n66N16j86j46N13
2762D22l67n33P45q2m07O79p01L29L9k63L88n1o78N76k02k68P84n39J87J89n83
$$ y = [-741, 80, 281, -301, 570, 127, -210, 438, -86, -134, 649, -88, 233, 337, -177, 194, 50, -544, 87, 28, -657, 311, -96, -386, 548, -208, -194, 360, -273, 74, 188, -83, 292, -70, -404, 244, 229, -172, 585, -370, -86, 482, -697, -91, 61, -629, -33, 73, -494, 520, 79, -349, 269, -77, -45, 241, -473, 45, 262, -503, 172, 52, -450, 317, -169, -369, 463, -295, -312, 476, -585, 126, 154, -465, 623, 282, -299, 223, -161, -420, 600, -246, -226, 308, -577, -436, -36, -386, -47, -195, -518, 213, -245, 16, 110, -262, 129, 319, -141, 212, 426, -307, 494, -244, -427, 342, -3, -48, 213, -335, -265, 265, -527, -114, 86, -199, 272, -106, -123, 534, -25, -26, 645, -229, 40, 571, -533, 39, 159, -384, 270, 95, -448, 289, -47, -19, 234, -332, 63, 291, -275, 241, 55, -91, 422, 55, -478, 267, 185, -222, 457, -244, 85, 124, -139, 249, 198, -480, 96, -106, -374, 410, -129, 58, 247, -336]
2783c36M65M52q26L55P7o67M03P1l2K36n23L7P85p74L68K53m83N05r9r02R81l48
2805bk60Q17q15J18J97l26L02L3k63K33l4l86N37l76J90K09n77K51N63o84J70
2826a03N04o54O53m9m29L85k53j89M63n47RM27p46R23k00p38O64p8k33P38n44
2847Ck2O63o62K51K10m85M00j37n08L10m8k78K99j21j0L52p72M08N45o85o3R62
2869F12j073P80l53j87M42M1k20K84m67L5L63n56M17K76m98J92k3k23O82n56p9
2890a11K96k70j12M63l95M15p2m50P58l88j06O1m65M15L23q29K93K79m29O41l60
$$ y = [-336, 129, 581, -245, 110, 187, -480, -77, -6, -38, 198, -325, -288, 497, -277, 91, 344, -139, 366, 267, -635, 346, -2, -262, 555, -260, -142, 55, -271, 31, 64, -199, 34, 0, -386, 151, -225, -35, 174, -403, -152, 411, -273, -103, 401, -253, 400, 351, -78, 307, 54, -135, 328, -219, -210, 217, -529, 394, 194, -544, 120, 42, -191, 547, 3, -19, 644, -18, 233, 443, -42, 358, 221, -287, 23, -25, -303, -4, -125, -135, 217, -555, -147, 398, -287, -350, 612, -461, 319, -34, -221, 221, 262, 42, 326, -141, -106, 257, -299, 118, 394, -104, 88, 65, -158, 524, -32, -111, 185, -85, -197, 266, -129, 286, 214, -236, 522, 134, 28, 89, -376, 39, 362, -467, -174, 105, -324, 317, -43]
$$ [...]
8191B6
##END NTUPLES=NMR FID
##END=
