##TITLE=1H_Ser EL-19
 CDCl3
 8 sc, 
 10.9.2024
##JCAMPDX= 6.0         $$ Bruker NMR JCAMP-DX V2.0
##DATA TYPE= NMR FID
##DATA CLASS= NTUPLES
##ORIGIN= UXNMR, Bruker Analytische Messtechnik GmbH
##OWNER= root
$$ XWIN-NMR		Version 3.5
$$ Tue Sep 10 14:48:35 2024 Russian Standard Time (UT+4h)  she@DPX200
##.OBSERVE FREQUENCY= 200.1318
##.OBSERVE NUCLEUS= ^1H
##.DELAY= (6, 6)
##.ACQUISITION MODE= SIMULTANEOUS
##.ACQUISITION SCHEME= undefined
##.AVERAGES= 8
##.DIGITISER RES= 18
##SPECTROMETER/DATA SYSTEM= spect
##.PULSE SEQUENCE= zg30
##.SOLVENT NAME= CDCl3
##.SHIFT REFERENCE= (INTERNAL, CDCl3, 0, 15.7039)
##AUDIT TRAIL= $$ (NUMBER, WHEN, WHO, WHERE, WHAT)
$$ ##TITLE= Audit trail, XWIN-NMR		Version 3.5
$$ ##JCAMPDX= 5.01
$$ ##ORIGIN= Bruker BioSpin GmbH
$$ ##OWNER= she
$$ F:/spectra/data/she/nmr/H-F/1/audita.txt
$$ ##AUDIT TRAIL=  $$ (NUMBER, WHEN, WHO, WHERE, WHAT)
(   1,<2024-09-10 14:46:05.54 +0400>,<she>,<DPX200>,
      <created by zg, POWCHK disabled, PULCHK disabled
       configuration hash MD5:
       00 E9 B6 7A A2 85 ED C7 34 08 36 98 17 FE 4E 26
       data hash MD5: 16K
       F8 50 7C 36 9C 06 5C 1B 78 E0 BD F0 FA D9 84 75>)
$$ ##END=
$$ 
$$ hash MD5
$$ 47 76 8F F3 2E A6 DB 4F 24 29 3C 51 65 63 8B FC
##$RELAX= 
##$RELAX= 
##$RELAX= 
##$RELAX= 
##$RELAX= 
##$RELAX= 
$$ Bruker specific parameters
$$ --------------------------
##$DU= <F:/spectra>
##$EXPNO= 1
##$NAME= <H-F>
##$PROCNO= 1
##$TYPE= <nmr>
##$USER= <she>
##$AMP= (0..31)
100 100 100 100 100 100 100 100 100 100 100 100 100 100 100 100 100 100 
100 100 100 100 100 100 100 100 100 100 100 100 100 100 
##$AQSEQ= 0
##$AQ_mod= 1
##$AUNM= <au_zg>
##$AUTOPOS= <>
##$BF1= 200.13
##$BF2= 200.13
##$BF3= 200.13
##$BF4= 200.13
##$BF5= 200.13
##$BF6= 200.13
##$BF7= 200.13
##$BF8= 200.13
##$BYTORDA= 1
##$CFDGTYP= 0
##$CFRGTYP= 5
##$CHEMSTR= <none>
##$CNST= (0..31)
1 1 145 1 1 1 1 1 1 1 1 1 1 1 1 1 1 1 1 1 1 1 1 1 1 1 1 1 1 1 1 1 
##$CPDPRG= <>
##$CPDPRG1= <>
##$CPDPRG2= <>
##$CPDPRG3= <>
##$CPDPRG4= <mlev>
##$CPDPRG5= <mlev>
##$CPDPRG6= <mlev>
##$CPDPRG7= <mlev>
##$CPDPRG8= <mlev>
##$CPDPRGB= <>
##$CPDPRGT= <>
##$D= (0..31)
0 1.2 0 0 0 0 0 0 0 0.06 0 0.03 0 0 0 0 0.0002 0 0 0 0 0 0 0 0 0 0 0 0 
0 0 0 
##$DATE= 1725965164
##$DBL= (0..7)
120 120 120 120 120 120 120 120 
##$DBP= (0..7)
150 150 150 150 150 150 150 150 
##$DBP07= 0
##$DBPNAM0= <>
##$DBPNAM1= <>
##$DBPNAM2= <>
##$DBPNAM3= <>
##$DBPNAM4= <>
##$DBPNAM5= <>
##$DBPNAM6= <>
##$DBPNAM7= <>
##$DBPOAL= (0..7)
0.5 0.5 0.5 0.5 0.5 0.5 0.5 0.5 
##$DBPOFFS= (0..7)
0 0 0 0 0 0 0 0 
##$DE= 6
##$DECBNUC= <off>
##$DECIM= 24
##$DECNUC= <off>
##$DECSTAT= 4
##$DIGMOD= 1
##$DIGTYP= 9
##$DL= (0..7)
0 120 120 120 120 120 120 120 
##$DP= (0..7)
150 150 150 150 150 150 150 150 
##$DP07= 0
##$DPNAME0= <>
##$DPNAME1= <>
##$DPNAME2= <>
##$DPNAME3= <>
##$DPNAME4= <>
##$DPNAME5= <>
##$DPNAME6= <>
##$DPNAME7= <>
##$DPOAL= (0..7)
0.5 0.5 0.5 0.5 0.5 0.5 0.5 0.5 
##$DPOFFS= (0..7)
0 0 0 0 0 0 0 0 
##$DQDMODE= 0
##$DR= 18
##$DS= 0
##$DSLIST= <SSSSSSSSSSSSSSS>
$$ [...]
##$SUBNAM2= <"">
##$SUBNAM3= <"">
##$SUBNAM4= <"">
##$SUBNAM5= <"">
##$SUBNAM6= <"">
##$SUBNAM7= <"">
##$SUBNAM8= <"">
##$SUBNAM9= <"">
##$SW= 24.0689170037331
##$SWIBOX= (0..15)
0 0 2 0 0 0 0 0 0 0 0 0 0 0 0 0 
##$SW_h= 4816.95568400771
##$TD= 16384
##$TD0= 1
##$TE= 0
##$TE2= 300
##$TE3= 300
##$TEG= 300
##$TL= (0..7)
0 120 120 120 120 120 120 120 
##$TP= (0..7)
150 150 150 150 150 150 150 150 
##$TP07= 0
##$TPNAME0= <>
##$TPNAME1= <>
##$TPNAME2= <>
##$TPNAME3= <>
##$TPNAME4= <>
##$TPNAME5= <>
##$TPNAME6= <>
##$TPNAME7= <>
##$TPOAL= (0..7)
0.5 0.5 0.5 0.5 0.5 0.5 0.5 0.5 
##$TPOFFS= (0..7)
0 0 0 0 0 0 0 0 
##$TUNHIN= 0
##$TUNHOUT= 0
##$TUNXOUT= 0
##$USERA1= <user>
##$USERA2= <user>
##$USERA3= <user>
##$USERA4= <user>
##$USERA5= <user>
##$V9= 5
##$VALIST= <valist>
##$VCLIST= <CCCCCCCCCCCCCCC>
##$VD= 0
##$VDLIST= <DDDDDDDDDDDDDDD>
##$VPLIST= <PPPPPPPPPPPPPPP>
##$VTLIST= <TTTTTTTTTTTTTTT>
##$WBST= 1024
##$WBSW= 4
##$XGAIN= (0..3)
0 0 0 0 
##$XL= 0
##$YL= 0
##$YMAX_a= 315865
##$YMIN_a= -340511
##$ZGOPTNS= <>
##$ZL1= 120
##$ZL2= 120
##$ZL3= 120
##$ZL4= 120
##$ABSF1= 10
##$ABSF2= 0
##$ABSG= 5
##$ABSL= 3
##$ALPHA= 0
##$AQORDER= 0
##$ASSFAC= 0
##$ASSFACI= 0
##$ASSFACX= 0
##$ASSWID= 0
##$AUNMP= <proc_1d>
##$AZFE= 0.1
##$AZFW= 0.1
##$BCFW= 1
##$BC_mod= 2
##$BYTORDP= 1
##$COROFFS= 0
##$CY= 11.3945322036743
##$DATMOD= 1
##$DC= 2
##$DFILT= <>
##$DTYPP= 0
##$F1P= 15.6554695791079
##$F2P= 12.8336369535428
##$FCOR= 0.5
##$FTSIZE= 0
##$FT_mod= 4
##$GAMMA= 1
##$GB= 0.15
##$INTBC= 1
##$INTSCL= 1
##$ISEN= 128
##$LB= 0.24
##$LEV0= 0
##$LPBIN= 0
##$MAXI= 10000
##$MC2= 0
##$MEAN= 0
##$ME_mod= 0
##$MI= 1.114404
##$NCOEF= 0
##$NC_proc= 0
##$NLEV= 6
##$NOISF1= 3.799351
##$NOISF2= 2.8
##$NSP= 1
##$NTH_PI= 0
##$NZP= 0
##$OFFSET= 15.70392
##$PC= 1
##$PHC0= -25996.32
##$PHC1= 15.58748
##$PH_mod= 1
##$PKNL= yes
##$PPARMOD= 0
##$PSCAL= 0
##$PSIGN= 0
##$REVERSE= no
##$SF= 200.130013532006
##$SI= 16384
##$SIGF1= 3
##$SIGF2= 2
##$SINO= 400
##$SIOLD= 16384
##$SREGLST= <1H.CDCl3>
##$SSB= 0
##$STSI= 0
##$STSR= 0
##$SW_p= 3612.71676300578
##$SYMM= 0
##$S_DEV= 0
##$TDeff= 0
##$TDoff= 0
##$TI= <>
##$TILT= no
##$TM1= 0
##$TM2= 0
##$TOPLEV= 0
##$USERP1= <user>
##$USERP2= <user>
##$USERP3= <user>
##$USERP4= <user>
##$USERP5= <user>
##$WDW= 1
##$XDIM= 8192
##$YMAX_p= 0
##$YMIN_p= 0
$$ End of Bruker specific parameters
$$ ---------------------------------
##NTUPLES= NMR FID
##VAR_NAME=  TIME,          FID/REAL,        FID/IMAG
##SYMBOL=    X,             R,               I
##VAR_TYPE=  INDEPENDENT,   DEPENDENT,       DEPENDENT
##VAR_FORM=  AFFN,          ASDF,            ASDF
##VAR_DIM=   8192,          8192,            8192
##UNITS=     SECONDS,       ARBITRARY UNITS, ARBITRARY UNITS
##FACTOR=    0.0002076,     1,               1
##FIRST=     0,             0,               0
##LAST=      1.7004516,     0,               0
##MIN=       0,             -340511,         0
##MAX=       1.7004516,     315865,          0
$$ Real data points
##PAGE= N=1
##DATA TABLE= (X++(R..R)), XYDATA
$$ [...]
1956D43k37l66N00K35o69r33J232j69m97O66p33M46J391j518l88J275m03l16N57
$$ 443 206 -160 340 575 -94 -1027 205 36 -461 205 -528 -82 1309 -209 -597 678 275 -41 516
1975E16j320P3J759j163o27R57m70M54Q39j670J66J527j114l95M82n80O52N81
$$ 516 -804 -731 1028 -135 -762 195 -275 179 1018 -652 -486 1041 -73 -468 14 -566 86 667
1993F67j816O15J489q50q4M03q76J200L89j937N57N00k16r3k82k19R62J9l29k03
$$ 667 -1149 -534 955 105 21 424 -452 748 1137 -800 -243 257 41 -52 -334 -553 409 428 99 -104
2013a04J97J49M91r29OK93j71r3m28N2J166n72p10Q16k26K08Q82j568%J094l92
$$ -104 93 242 733 -196 -190 103 -68 -161 -589 -537 629 57 -653 163 -63 145 1027 -541 -541 553 161
2034A61p27O53l12LJ509j725l34J943p26p65O87j380P04J186j608m19K030q55
$$ 161 -566 87 -225 -222 1287 -438 -772 1171 445 -320 367 -1013 -309 877 -731 -1150 880 25
2052B5m28J167j410M65J776k257p8J368r26J71R27k009J138J352j575l27J428
$$ 25 -403 764 -646 -181 1595 -662 -740 628 -298 -127 800 -1209 -71 1281 -294 -621 807
2069H07j033R39M3j880R77J086j485K88J12m54O25N48j036L20Q62n50J31l5p25
$$ 807 -226 713 756 -1124 -147 939 -546 -258 -146 -600 25 573 -463 -143 719 169 300 265 -460
2088d60M28O18j232l63J083K16o72K27J41k66J113n26j047Q31J14o11N19o54j40
$$ -460 -32 586 -646 -1009 74 290 -382 -155 -14 -280 833 307 -740 91 205 -406 113 -541 -681
2107f81J570o97j276J410J31o89O38n96p63J909n58j436Q79J22o8O74j032r8J714
$$ -681 889 192 -1084 326 457 -232 406 -190 -953 956 398 -1038 -159 -37 -105 569 -463 -561 1153
2126A153m77j533J405n28n54J450j135p05J561q11m82J005o62K05J095j404K6
$$ 1153 676 -857 548 20 -534 916 -219 -924 637 -174 -656 349 -313 -108 987 -417 -391
2143c91J149p66j97K35q01L00J104j318J98R25o32P60l25o72R07L31j288k4K08
$$ -391 758 -8 -205 30 -771 -471 633 -685 -487 438 -194 566 241 -431 476 807 -481 -505 -297
2162b97J20O03q46m11J291J41q93M93j98qQ62r46o00Q12n6KM01j395N72R70o88
$$ -297 -177 426 -420 -831 460 601 -292 201 3 -5 857 -89 -689 123 67 69 470 -925 -353 617 -71
2183g1k88O92m20K69J73j099M44R00p54j41K08k16O83M48j449N77O37j005L99
$$ -71 -359 333 -87 182 355 -744 -300 600 -154 -295 -87 -303 380 828 -621 -44 593 -412 -13
2202a3k17l20R13O1q84Q9O72l01K01K5j078J321Q0j027J68N55k62o2R6m88M10
$$ -13 -230 -550 363 424 -460 -371 301 0 201 226 -852 469 549 -478 -310 245 -17 -79 17 -471 -61
2223f1P47n72m85Q25K6k85J07n78j61J104p48p22Q43L9k85P53o14o25J640o17
$$ -61 686 114 -371 454 480 195 302 -276 -437 667 -81 -803 40 79 -206 547 -67 -692 948 331
2243C31j227J245n40j85J008r40o64J653q11m82J095q07J82J298j407o63K101
$$ 331 -896 349 -191 -376 632 -308 -972 681 -130 -612 483 -324 -142 1156 -251 -914 1187
2260A187j399n43J353p85k73J436j120p92K238j483k12J362j659K65J223j232
$$ 1187 -212 -755 598 -187 -460 976 -144 -936 1302 -181 -393 969 -690 -425 798 -434
2276d34o50J442q35N33N45j120M38J133j277k34R30n23M15k11j268O31Q34m40
$$ -434 -1084 358 -477 56 601 -519 -81 1052 -225 -459 471 -52 363 152 -1116 -485 349 -91
2294i1l33N93k88M48M19j007J32L27j89l75MP4K92L92m45m8J79M67m85j55P8j69
$$ -91 -424 169 -119 329 748 -259 -127 200 11 -364 -360 -286 6 398 -47 -95 84 551 66 -89 -11 -180
2316a80L18k2r97N46J029q11j99L24J30k7M01j053K38Q98n90K1j07j63K88M12
$$ -180 138 116 -881 -335 694 -117 -316 8 138 111 512 -541 -303 595 5 26 -81 -244 44 456
2336D56r37L24Q56o15J81Lr67R94J3o64L5N68n50O29m17m32R61K44o45k96jK96
$$ 456 -481 -157 699 84 265 268 -699 295 308 -356 -321 247 -303 326 -91 -523 438 682 37 -259 -260 36
2358C6L01p14j80O95j61oj1l67N52M70o53j36N10R5q6l62n12M97L31o78L01j20
$$ 36 337 -377 -557 138 -23 -29 -40 -407 145 615 -38 -174 336 431 345 -17 -529 -32 299 -379 -78 -198
2380a98N32K39n05n98J039n31k22N15r15K64R77r19m78J207j73l54M19q94P93
$$ -198 334 573 68 -530 509 -22 -244 271 -644 -380 597 -322 -800 407 234 -120 299 -595 198
2399A98M97n98k42L63o72P44j64r64O17O79j98k8L27o12O39l46q43L77L56l34
$$ 198 695 97 -145 218 -454 290 126 -838 -221 458 260 232 559 -53 586 240 -603 -226 130 -204
2419b04j07K38o43R63L00j002M63L44k04K57n27l63N97j07j80k95L40O9M60m42
$$ -204 -311 -73 -716 247 547 -455 8 352 148 405 -122 -485 112 5 -175 -470 -130 -61 399 -43
2439d3j6M75k00j70m8j48L08k83l17N8K36M36K68p63j31R23m56L4j5o40M45L84
$$ -43 -59 416 216 46 -2 -150 158 -125 -442 -384 -148 288 556 -207 -338 585 129 163 148 -492 -47 337
2461C37q18p5P18l04M04L00j031N95M66r01k78N50QL37o29n25J205j77n16K95
$$ 337 -481 -556 162 -142 262 562 -469 126 592 -309 -587 -37 -29 308 -321 -846 359 182 -334 -39
2481c9J54n16Q62l08q77J033J39n48k75K48r0N62j5p77N25L9MK6m04Q4O95n5j219
$$ -39 115 -401 461 153 -724 309 448 -100 -375 -127 -217 345 330 -447 78 117 121 147 -257 -173 522 467 -752
2504g52P87k65L83k07j59l1O90n4n51N7R2K88l29l54K4K37M94J8q59O98M30n71
$$ -752 35 -230 153 -54 -213 -244 446 392 -159 -102 -10 278 -51 -405 -381 -144 350 368 -491 207 637 66
2526F6Q1l91jN28j14p09M66J68l63L98l44O0P58l30o45M18J8k63M88o71J22L90
$$ 66 147 -244 -245 283 169 -540 -74 94 -269 129 -215 -155 603 273 -372 46 64 -199 289 -382 -260 130
2548A30l11k65L38J41m6N89j169M21P71n51o0Q2l53J16M41p78J54L77L15n7k49
$$ 130 -181 -446 -108 33 -13 576 -593 -172 599 48 -12 70 -283 -167 274 -504 -350 27 342 285 36
2569C6n35O67Jk68j15k76M94J19m65J43L49O43m06l94P0q9L32m36l40N80j35k07
$$ 36 -499 168 169 -99 -214 -490 4 123 -342 -199 150 793 387 -7 63 -26 306 -130 -470 110 -25 -232
2591b32K13n76O17M31m76n2M14m27M49m89m28O26L14p50L70j57K7P09k51p31N91
$$ -232 -19 -595 22 453 -23 -75 339 -88 361 -128 -556 70 384 -366 4 -153 -126 583 332 -399 192
2612A92J54r2J14l93k94M71m03j42L58j03N50J71r72K71K74l52r8q7J55L87j58
$$ 192 346 254 368 -25 -319 152 -251 -393 -35 -138 412 583 -389 -118 156 -196 -294 -381 -226 161 3
2633Cl11PO40l21K80j14m82M54O9l11J64k36J52K60o67L04K06p0o9J32r5M4K91
$$ 3 -308 -301 339 18 298 184 -298 156 225 -86 78 -158 -6 254 -413 -109 97 27 -42 90 -5 39 330
2656C30p80L81k5L42k66N8m31O44Q2l25J57j30K61%m69k32M01K12m10J90k55K27
$$ 330 -450 -69 -94 248 -18 40 -391 253 335 10 167 37 298 298 -171 -403 -2 210 -200 -10 -265 -38
2678c8O49p77J60M25k39J53m67j19J76M97p45K2O82k46L22l72n78O49L83m30k15
$$ -38 611 -166 -6 419 180 333 -134 -253 -77 420 -325 -303 379 133 455 83 -495 154 537 107 -108
2699a08n7J3K21j36l77L44K21n1k69J59N4J70Q8k03k04K87j07l14k7J46J82k74
$$ -108 -165 -152 69 -67 -444 -100 121 70 -199 -40 14 184 272 69 -135 152 45 -269 -296 -150 32 -242
2721b42L22j87q9M08K33n56L2M27k85m6l46K02L97k79k17qM04q1q9Kk19O21n68
$$ -242 80 -107 -196 212 445 -111 -79 348 63 17 -329 -127 270 -9 -226 -234 170 89 0 2 -217 404 -164
2744a64K12k25l03P24o9m36nP42m18O6o2j75L85k83l27j65P62m06l7J5r8M30K1
$$ -164 48 -177 -480 244 175 -261 -266 476 58 124 62 -113 272 -11 -338 -503 259 -147 -184 -169 -267 163 184
2767A84n79N90O9m13J39k96Q2N42j03r5J95m24L30R7q5k55j26L62J6k35l99L91
$$ 184 -395 195 264 -149 -10 -306 -224 318 215 120 315 -109 221 318 233 -22 -148 214 230 -5 -404 -13
2789a3K85l63j96M54m3L24l94k60M86jj76j64l19L15J65m34RO64m46Q5k5o3J84
$$ -13 272 -91 -287 167 124 448 54 -206 280 279 103 -61 -380 -65 100 -334 -325 339 -107 -22 -47 -110 74
2812G4M94m73n40M34Q7K52l28n4N1L01m34M66n45M01N0k40l01J29J76q2l56K90
$$ 74 568 95 -445 -11 76 328 0 -54 -3 298 -136 330 -215 186 236 -4 -305 -176 0 -82 -438 -148
2834a48j10N05K2n88M93k14J3R0k51O2L21J3k38k93M94K06k72J1l78K24K62l29
$$ -148 -258 247 269 -319 174 -40 -27 63 -188 -126 195 208 -30 -323 171 377 105 116 -262 -38 224 -105
2856a05j62K14J78K05n62M6q3N01p4k35J90K47K4n73J0k9L23km44J73M69l08J13
$$ -105 -267 -53 125 330 -232 -186 -269 232 158 -77 113 360 384 -189 -179 -208 115 113 -331 -158 311 3 116
2879A16j55k98L63M4l15K29J5K01j19j95k70N81k37n31P49k58J56R5k21k53M11
$$ 116 -39 -337 26 70 -245 -16 -1 200 81 -114 -384 197 -40 -571 178 -80 76 171 -50 -303 108
2900A08q5j06m3M1K5M27p90L84M71k19J73j48n92L99L06n39K04k14m0O26j67m86
$$ 108 23 -83 -126 -85 -60 367 -423 -39 432 213 386 238 -354 45 351 -188 16 -198 -238 388 221 -265
2922b65N48j92Pj67r4j88O37l69m06N40j84R0M03o90M70L60n46p9R3J0r0j9m22
$$ -265 283 91 98 -69 -163 -351 286 -83 -489 51 -133 -43 360 -330 140 500 -46 -125 -32 -22 -112 -131 -553
2945e53K98L64r6j15J67r9J59K37m44q4M44k95K7k19j25M67k9k85n8J88J74P1
$$ -553 -255 109 13 -102 65 -34 125 362 -82 -166 278 -17 10 -209 -334 133 104 -181 -239 -51 123 194
2967A94j83j36J20K78m28n3J92j27J6K44lL8L02j94l76L73K5k49j14k33J4O08
$$ 194 11 -125 -5 273 -155 -208 -16 -143 -127 117 114 152 454 260 -116 257 282 33 -81 -314 -300 308
2989C08j96l81L19K32j02j82j62r5L80k27k01RJ06M7M07l45j18M56r1j97K09O3
$$ 308 112 -269 50 282 180 -2 -164 -259 121 -106 -307 -298 -192 -145 262 -83 -201 255 164 -33 176 239
3011B39J2j16l45k76N19K0n13O21l27K53J04m7l21L18l4Ol64O4M90k05R5n5j50
$$ 239 251 135 -210 -486 33 53 -460 161 -166 87 191 144 -177 141 107 113 -251 -187 303 98 193 138 -12
3034a2K97L8pr90N39P68o46l89P36m09K31j26o12O98j77J23J97l34K74L8j09m82
$$ -12 285 323 316 -674 -135 633 -13 -402 334 -75 156 30 -582 116 -61 62 259 -75 199 237 128 -354
3056c54o0L18j33r3jK93L33j85j12P5J84k61j21R8o46Q15o7j83O8m6L01K26n29
$$ -354 -414 -96 -229 -322 -323 -30 303 118 6 81 265 4 -117 -19 -665 150 83 -100 -32 -78 223 449 -80
3079h0J28K19om40j52K37O0L84k73k51j0K77j95j99K00KL16k82j59j0M69l27o5
$$ -80 48 267 261 -179 -331 -94 -34 350 77 -174 -184 93 -102 -301 -101 -99 217 -65 -224 -234 235 -92 -157
3102a57q3K72M67n72j88L95J3j4j98K05r6K52l02l99M11K30l12JJ69l41N45J32
$$ -157 -240 32 499 -73 -261 134 147 133 -65 140 44 296 -6 -405 6 236 -76 -75 94 -247 298 430
3124D30o20J96L2k1K40m49l80L79Q8k28L53J72l56L78k60J25L81l39l07L9n7L0
$$ 430 -190 6 38 17 257 -192 -572 -193 -105 -333 20 192 -164 214 -46 79 460 121 -186 -147 -204 -174
3146a74J75k46R7M87l76R1m4j62q7M30j86J9J38n32L84L0m34K45M49m25J83Jj47
$$ -174 1 -245 -148 339 -37 54 10 -152 -239 191 5 24 162 -370 14 44 -390 -145 304 -121 62 63 -84
3169h4K18m5n11J55K80K2pk1n44Q80j89n57J31L25j9j04k28q2K33L14m40L83o3
$$ -84 134 89 -422 -267 13 35 28 7 -537 343 154 -403 -272 53 34 -70 -298 -380 -147 167 -273 110 47
3192D7J37K52n84p8J71R7k16P1j13L29m7j69j8J76R9j5k39J44PM9L2l13K44k9
$$ 47 184 436 -148 -226 -55 42 -174 -103 -216 113 66 -103 -121 55 154 139 -100 44 51 100 132 -181 63 34
3216C4r2j90K72L4K0J42k29j88L32O4N9o11L42j21M73k66l30M44j29J11m18K11
$$ 34 -58 -248 24 58 78 220 -9 -197 135 199 258 -353 -11 -132 341 75 -255 189 60 171 -247 -36
3238c6PJ93k40k62N36p4k84r6K80J74O0J87l68n7M5L85l84m35K55K36k38k1L05
$$ -36 -29 164 -76 -338 198 124 -160 -256 24 198 258 445 77 20 65 450 66 -369 -114 122 -116 -137 168
3261A68k00K52j37k01L59j02j08R2k23Pl6P8j70L26m9J01p0m8L0J44k83j49j03
$$ 168 -32 220 83 -118 241 139 31 123 -100 -93 -129 -51 -221 105 56 157 87 39 69 213 -70 -219 -322
3284c22J67J08J96k72J2J00R9r8k68K24K25k7l44K37K42j34k93J58k46oQ9K83
$$ -322 -155 -47 149 -123 -111 -11 88 -10 -278 -54 171 144 -200 37 279 145 -148 10 -236 -242 -153 130
3306A30MM5K17l68j31K20N6k83RN5j08L14K6l63J21O6p5O2k6k71L29Kr5J1m3L8
$$ 130 134 179 396 28 -103 117 173 -110 -101 -46 -154 160 186 -177 -56 10 -65 -3 -29 -300 29 31 -64 -53 -96 -58
3332e8J12J18m24M94Lj03Qq6j89M42j66j90K72J08l37j3j84O84j71k95j18p0L18
$$ -58 54 172 -252 242 245 142 150 64 -125 317 151 -39 233 341 4 -9 -193 491 320 25 -93 -163 155
3355A55L8m0l31j69M13R7p7n4j54J78Q9m91M12J78Q8m75j64J65L45k6n64L16M45
$$ 155 193 153 -178 -347 66 163 86 32 -122 56 145 -346 66 244 332 -143 -307 -142 203 177 -387 -71 374
3378C74j16M1m41J39J7j05k84P8P2J66K34j69q6M12n7o4k95M7J40k41J36j4L7
$$ 374 258 299 -142 -3 14 -91 -375 -297 -225 -59 175 6 -80 332 275 211 -84 -37 103 -138 -2 -16 21
3401B1j8m74L99j64M72rm50L58k82K31r9j10j85J54K49M2m03o4K51J52j91N1J11
$$ 21 3 -471 -72 -236 236 227 -223 135 -147 84 -15 -125 -310 -156 93 135 -268 -332 -81 71 -120 -69 42
3424D2J74p8n07M87J64j23l27J26J11j13K88j8j95J31p6k59n0R3K45k27J30m14
$$ 42 216 138 -369 118 282 159 -168 -42 69 -44 244 226 31 162 86 -173 -223 -130 115 -112 18 -396
3446c96P7L16K97j81k0o4N8j70j07K25k09J74k7l32K32J57L60k63l21K61K70m29
$$ -396 -319 -3 294 113 93 29 87 -83 -190 35 -174 0 -27 -359 -127 30 390 127 -194 67 337 -92
3468i2j19m0J02K69M3m20M49m23K1J39J32m20P83k17n12L24l8J42Q8k61K74k11
$$ -92 -211 -251 -149 120 163 -257 192 -231 -210 -71 61 -359 424 207 -305 19 -19 123 211 -50 224 13
3490A3r4N8P4J86k94J86j83k73L70j10k55J02J49L46l00n2J04J80L06o71N2P9
$$ 13 -81 -23 51 237 -57 129 -54 -327 43 -67 -322 -220 -71 275 -25 -77 27 207 513 -158 -106 -27
3512b7QJ80k18k63M23J48m65Q8J95M8j3l7j39K5R3O5L8n07L44P8kj20K0L20l35
$$ -27 -19 161 -57 -320 103 251 -214 -126 69 117 104 67 -72 -47 46 111 149 -358 -14 64 62 -58 -38 282 -53
3537e3k84K46q1J20J25l72L07oL0o3M7r8K20p7l74M54k68j11K02k39M1N35l63
$$ -53 -337 -91 -172 -52 73 -299 8 2 32 -31 16 -82 138 61 -313 141 -127 -238 -36 -275 -234 301 -62
3560f2K44l02p2K94M51n02l72K00k58L06J47l2k92K98l8o5J59O6j66K6j84L23
$$ -62 182 -120 -192 102 553 51 -321 -121 -379 -73 74 42 -250 48 10 -55 104 170 4 30 -154 169
3582A69l1j53k52N11j82J99l90l05M58K45k72j34MK19q8j5q3l32P39m28J22M7
$$ 169 138 -15 -267 244 62 261 -129 -434 24 269 -3 -137 -133 86 -2 -17 -100 -432 307 -121 1 48
3604D8l1%J58n16J12L69j91K38l15j23M03p6k43J69N16m79M0R4m43N71j69l37
$$ 48 17 17 175 -341 -229 140 -51 187 -128 -251 152 76 -167 2 518 39 79 173 -270 301 132 -205
3626b05J47K63m22K47k51qL35j33j90K45R9Qmk57k04K60M82n10J31J25k10J65
$$ -205 -58 205 -217 30 -221 -229 106 -27 -217 28 127 135 131 -126 -330 -70 412 -98 33 158 -52 113
3648A13m52K79K56j7O1r9k44J30L85m20r6K21j0j11k75J40j5K50J65m11L17k92
$$ 113 -339 -60 196 179 240 141 -103 27 412 -8 -104 117 107 -4 -279 -139 -154 96 261 -150 167 -125
3670a25N5Nlj2L64j68K1j21k86M81j96j1k4k90K96j87J67J11p6L41m52L3M15l25
$$ -125 -70 -65 -68 -80 284 116 137 16 -270 211 15 4 -20 -310 -14 -201 -34 77 1 342 -110 -77 338 13
3694A3Q6l54K60j37J81R3k63O8m2K99l32r6J32L46k49K23m84L24J20M5n40O25
$$ 13 99 -255 5 -132 49 142 -121 -53 -95 204 -128 -224 -92 254 5 228 -256 68 188 233 -307 318
3716C18p6m56M33k72J5N3L17m31o2O13l32J12r1k60K68l3m7k97K40K62k33k80
$$ 318 242 -214 219 -53 -38 15 332 -99 -161 452 120 232 141 -119 149 116 69 -228 12 274 41 -239
3738b39M20j68p4l15J59L98r2J38m38K35L09j93k23o5J30O1k1JO5J71l01K09j79
$$ -239 181 13 -61 -376 -217 181 89 227 -211 24 333 140 -83 -148 -18 43 22 23 88 259 -42 167 -12
3761a2j00O4L81l68K05p6k78j22L68o3l33N48m8m4j67P9k36K98j14l77L76p7k4
$$ -12 -112 -48 333 -35 170 94 -184 -306 62 -1 -334 214 166 122 -45 34 -202 96 -18 -395 -19 -96 -120
3784a20j18M36k53J89j84K00k0j52j77J61l72K92J28j13K23J77m01L05j69J80
$$ -120 -238 198 -55 134 -50 150 130 -22 -199 -38 -410 -118 10 -103 120 297 -104 201 32 212
3804B12k2l21n6l3J09o6J89k10K50P7J8l13o4K39J38j09j22K27m05L35l64K19
$$ 212 190 -131 -187 -220 -111 -177 12 -198 52 129 147 -166 -230 9 147 38 -84 143 -262 73 -291 -72
3826g2j1l6K23l63K99j8j10K51j25k74M31k12J50j99N0j8L52m94R3K16J97j47
$$ -72 -83 -119 104 -259 40 22 -88 163 38 -236 195 -17 133 -66 -16 -34 318 -176 -83 133 330 183
3848A83l37J1J28Rq4R2J8K2l00L1K32m9L89k30l60K87J7K35m54Q1j57M91j33k26
$$ 183 -154 -143 -15 -6 -90 2 20 42 -258 -227 5 -44 345 115 -245 42 59 294 -160 -79 -236 255 122 -104
3872a04m0K01o0OP1p7K4K11j49k62L01k99O8K0J91Q0j67J6j72J28J47k29J44k41
$$ -104 -144 57 -3 3 74 -3 21 232 83 -179 122 -177 -109 -89 102 182 15 31 -141 -13 134 -95 49 -192
3896a92J55j45L30j26o0J92K51J8k61k84K55j32k15J14p9K32pR9j53J26j55J52
$$ -192 -37 -182 148 22 -38 154 405 423 162 -122 133 1 -214 -100 -179 53 46 145 -8 118 -37 115
3918A15p5M8q2J43m25j83N67j07j25J82N8k1kj60J91j48n6J44p6k32K67J06k88
$$ 115 40 88 6 149 -276 -459 108 1 -124 58 116 95 93 -67 124 -24 -80 64 -12 -244 23 129 -159
3941a59j06J86m3L43k1p1k71J03K41k47J97M4n35M77l52L50r1Q7m33K66J0L28
$$ -159 -265 -79 -122 221 200 129 -142 -39 202 -45 152 196 -339 138 -214 136 45 132 -301 -35 -25 303
3963C03Jl20L6J80j88O4l77K45J82Q4J5m5%k29J63j23j72q6N17o48J11L33J27
$$ 303 304 -16 20 200 12 76 -301 -56 126 210 225 180 180 -49 114 -9 -181 -267 250 -398 -287 46 173
3986A73j2J5k87o2K62j03K2J07j80j48j1K28j42K52q5k16j26K36M69j21l32j73
$$ 173 161 176 -111 -173 89 -14 8 115 -65 -213 -224 4 -138 114 29 -187 -313 -77 392 271 -61 -234
4008b34L46J05k35l07K93J75J42K6k52P4K42q7l01J07J02l20J82K3j84j94N21
$$ -234 112 217 -18 -325 -32 143 285 311 59 133 375 288 -13 94 196 -124 58 81 -103 -297 224
4029B24l06J29j66J86k28j88N19j14J43l26J40l9J53k41K40m53M91J6m3J13j88
$$ 224 -82 47 -119 67 -161 -349 170 56 199 -127 13 -26 127 -114 126 -327 164 180 137 250 62
4050F2j88J89J76n22N16l63j52M0J09r5L53k0l31M09k3J0l10o8K34K28l26L3J34
$$ 62 -126 63 239 -283 233 -130 -282 -242 -133 -228 125 105 -226 183 160 170 -140 -208 26 254 -72 -39 95
4073I5j43K31lj50K06l43J15r9K00j62K62k77j62K97k69M24j66J47l03L96k17
$$ 95 -48 183 180 30 236 -107 8 -91 109 -53 209 -68 -230 67 -202 222 56 203 -100 296 79
4094G9j82mJ86j40K47K5j41j36Q5J52k49K34j95J18p2M9k4k19L6K2M84m77l7L59
$$ 79 -103 -107 79 -61 186 211 70 -66 19 171 -78 156 -39 79 7 56 32 -187 -151 -129 355 -122 -159 200
4118B00j6j17q0j11K22q0r5Pk81J34J90L10j98n67N53p3K49j20j26j35O3M9O5
$$ 200 184 67 -13 -124 98 18 -77 -70 -351 -217 -27 283 85 -482 71 -2 247 127 1 -134 -71 -22 43
4141D3k7l19M48J6m65M81j76M1JJ3R4m21O14m58L04k14j33K78LL5k47R7J60k06
$$ 43 16 -303 145 161 -304 177 1 42 43 56 150 -271 343 -115 189 -25 -158 120 123 158 -89 8 168 -38
4165c8j46K97j19o5L05l03K74j69J61N4k55m5r8J21l15K45J68J44k82K71k59p6
$$ -38 -184 113 -6 -71 234 -69 205 36 197 251 -4 -49 -147 -26 -341 -96 72 216 -66 205 -54 -130
4187a30J29L11k69k2o1j04j04K80N9J13k51J03K79k87l7k77N38n2l49J37N7K8
$$ -130 -1 310 41 19 -42 -146 -250 30 89 202 -49 54 333 46 9 -268 270 218 -131 6 63 91
4209I1r8j35j12J13k94K16J66K28l59L79k69j15n6J00J38J14l82K13P7Om9K57
$$ 91 -7 -142 -254 -141 -435 -219 -53 175 -184 195 -74 -189 -245 -145 -7 107 -275 -62 15 21 -28 229
4231B29m34M29N7m39L5M52m40r8J88M5K66n10K47j89N35m82R0n9j60M30j49l23
$$ 229 -205 224 281 -158 -123 329 -111 -209 -21 24 290 -220 27 -162 373 -109 -19 -78 -238 192 43 -280
4253b80M16j23j36L63O8j35J89o46K08J23j69O0r0n7J39L07j79m26L38o6J46j23
$$ -280 136 13 -123 240 308 173 362 -284 -76 47 -122 -62 -152 -209 -70 237 58 -368 -30 -96 50 -73
4275g3l40K00J50L28k92K34j37k79r2J65J61O7k29J34%N0nO9k22J80K63n4n0j96
$$ -73 -413 -213 -63 265 -27 207 70 -209 -301 -136 25 92 -137 -3 -3 47 42 111 -111 69 332 278 228 32
4299C2J2K0j08L23l56q0K09k54J07R5J38k92J89j56K6O0Q0J2l5j67J49J51j05
$$ 32 44 64 -44 279 -77 -157 52 -202 -95 0 138 -154 35 -121 -95 -35 45 57 22 -145 4 155 50
4322E0j31q9K36k25J68L41p5k33O1j94o2L14k79L0N1K6J45j55j31l9M24j01m7
$$ 50 -81 -170 66 -159 9 350 275 42 103 -91 -153 161 -118 -88 -37 -11 134 -21 -152 -191 233 132 85
4345H5l9k36J46j47O1L2N63n25q2L64n44Q51n90j72P7M60k01n1l4k33L22k5p4
$$ 85 46 -190 -44 -191 -130 -98 465 -60 -142 222 -322 529 -61 -233 -156 304 103 52 18 -215 107 82 8
4368Hm5l34L75K9n2j5J5J95J5l51K83k84q8M74l99K63k27q8J0M4J58k04N23l66
$$ 8 -37 -371 4 33 -19 -34 -19 176 191 -160 123 -161 -249 225 -174 89 -138 -226 -216 -172 -14 -218 305 -61
4392f1QQ7M7j71J13r9p3L3K93l97L08J52k48L02m53K01m48L45J28k2%k1oJ28p0
$$ -61 -53 34 81 -90 23 -76 -149 -116 177 -220 88 240 -8 294 -159 42 -406 -61 67 45 45 24 18 146 76
4417G6J7LL54m15j35q2K50J69R3j87om07L87j68J40j97j09n9K11m8J57J87m05
$$ 76 93 96 450 35 -100 -182 68 237 330 143 137 -270 117 -51 89 -108 -217 -276 -65 -113 44 231 -174
4440a74J70J12m86R1P21l24l74L17k12K84k24N9K67j94o7q4J42K71l04J43j53
$$ -174 -4 108 -378 -287 434 110 -264 53 -159 125 -99 -40 227 33 -34 -118 24 295 -9 134 -19
4461a9j09J71m1O8k11J68J79r2j32n3J59J06l12R9J5L78k62J39l17J44k93L28
$$ -19 -128 43 2 70 -141 27 206 114 -18 -71 88 194 -118 -19 -4 374 112 251 -66 78 -215 113
4483A13q2J7P2m5Q8m29L69K5m7k58L97j38P3K45n2l10j84M72k12Q6k8k90J72j
$$ 113 31 48 120 75 163 -266 103 128 81 -177 220 82 155 400 348 38 -146 326 114 200 172 -118 54 53
4507E3l6J54K6k49J20PJ63m32M8jk52M02J3Rj04P4l06P11n83O4M31k87P6J3q9
$$ 53 17 171 197 -52 68 75 238 -194 -146 -147 -399 3 16 25 -79 -5 -311 400 -183 -119 312 25 101 114 25
4532B5j82n3K44j83P1K14k93R4M7L3k1O5l43L06J25L26l81k66L25l76R7q9L38
$$ 25 -157 -210 34 -149 -78 136 -157 -63 -16 17 -4 61 -282 24 149 475 94 -172 153 -223 -126 -215 123
4555A23o6N8J47n89K43L7J43l18J44M8j7r5K2M3N0J22j91K13k67P6K68j85j65
$$ 123 57 115 262 -327 -84 -47 96 -222 -78 -30 -47 -142 -120 -77 -27 95 -96 117 -150 -74 194 9 -156
4578a56K8K20m27L93K22k55J31o5Q4k03o0Q6M4j21k26N93k14J24m19J77M5j66
$$ -156 -128 92 -335 58 280 25 156 91 175 -28 -88 -2 42 -79 -305 288 74 198 -221 -44 1 -165
4600a65L04j12N4Rk44J81K15l10m8o7L6J31j00K14q5k64L43j66j12K27k64K82
$$ -165 139 27 81 90 -154 27 242 -68 -116 -183 -147 -16 -116 98 13 -251 92 -74 -186 41 -223 59
4622E9k0l91K44K74P6k39P4M5l5j64M8J87k49K60k91RL75k58k50K28k42K19J32
$$ 59 39 -352 -108 166 242 3 77 122 87 -77 -29 158 -91 169 -122 -113 262 4 -246 -18 -260 -41 91
4645I1K98n9k89M8j26j24M9Q4j0j1o8m6J57J82l11J47j35L58nk3l05OJ73m2k84
$$ 91 389 330 41 89 -37 -161 -112 -28 -38 -49 -117 -163 -6 176 -135 12 -123 235 230 207 -98 -92 81 39 -245
4670b45j2L12Q6j86j55K90l26M1K56j56j12K95q5l5K86l30N20n64K14n2j85L07
$$ -245 -257 55 141 -45 -200 90 -236 -195 61 -95 -207 88 3 -32 254 -76 444 -120 94 42 -143 164
4692A64k19Pp3L99o52O62j30j81j07R5j61J87P9j1q0j37k45M4M45k64P0J27J9
$$ 164 -55 -48 -121 278 -374 288 158 -23 -130 -35 -196 -9 70 59 -21 -158 -403 -359 86 -178 -108 19 38
4715C8Q2l95K17R8J08j39l8j66K86l61J51L95l21K36j76p7j27K75j04O05p94K90
$$ 38 120 -275 -58 40 148 9 -29 -195 91 -270 -119 276 -45 191 15 -62 -189 86 -18 587 -207 83
4737H3r7J23j9p3j34J59R7j37l3N4K9k66J84n6J88j65K05J31n60K49j41M25r5
$$ 83 -14 109 90 17 -117 42 139 2 -31 23 52 -214 -30 -86 102 -63 142 273 -287 -38 -179 246 151
4760A51j1j49l8k3n4r8K55l8J6n7L04l9k67J49r8P7j95J11j75K55j48j47K43J6
$$ 151 140 -9 -47 -70 -124 -222 33 -5 11 -46 258 219 -48 101 3 80 -115 -4 -179 76 -72 -219 24 40
4784D0k48J17lL65j51J5m40M50Ll23J50Q0o1J46j67j06K86j27O9j93J92J01j30
$$ 40 -208 -91 -94 271 120 135 -305 145 148 -175 -25 55 -6 140 -27 -133 153 26 95 -98 94 195 65
4807F5Pl04M13k22j4q9P9kO6P8M2m4k42K4l1M05j83J3j37J27p5n2M06k13Rk3l04
$$ 65 72 -232 181 -41 -55 -144 -65 -67 -1 77 119 75 -167 -143 -174 231 48 61 -76 51 -24 -76 330 117 126 103 -201
4834b01j15N17j94K40j49R0r7k73J97m6J65k92LO4l0K5Q9k37J36K69k38J4J4q1
$$ -201 -316 201 7 247 98 188 91 -182 15 -31 134 -158 -155 -91 -121 -96 -7 -244 -108 161 -77 -63 -49 -130
4858a30J49J06Q0k2k47m7J39R0j70r1L06k32L04k37Nk4O5l1Qj56M30l46l4K83
$$ -130 19 125 205 183 -64 -111 28 118 -52 -143 163 -69 235 -2 3 -21 44 13 21 -135 295 -51 -85 198
4882A98j47KP8J9j35L1n3k2O0j25N3J4R8k33N83m47l0P6J87k57m3r8N48l06j14
$$ 198 51 53 131 150 15 46 -7 -29 31 -94 -41 -27 71 -162 421 -26 -56 20 207 -50 -93 -191 357 51 -63
4907f3q9O3J37L03k73J94m68J87M6k75M22P6m18J04j27M9K39k19J56j02J71J7
$$ -63 -152 -89 48 351 78 272 -196 -9 37 -238 184 260 -158 -54 -181 -132 107 -112 44 -58 113 130
4929A30j73n3n7k6J5J37K15k21J73l16O7J62J3P7p1j05K47l66L3J79j63Q1l0j
$$ 130 -43 -96 -153 -179 -164 -27 188 -33 140 -176 -109 53 66 143 72 -33 214 -152 -119 60 -103 -22 -52 -53
4953e3Kj37L50j59J89n21K26l4K41Ol46J78m9k1J51K36j99k65L50m07N8J18J78
$$ -53 -51 -188 162 3 192 -329 -103 -137 104 110 -236 -58 -107 -128 23 259 60 -205 145 -262 -204 -86 92
4976I2K1k34J34j09K40j11r1k22M48Ol28j08K74O5j80J15J00j07J42j90N98p54
$$ 92 113 -121 13 -96 144 33 -58 -280 168 174 -154 -262 12 77 -103 12 112 5 147 -43 555 -199
4998a99Q8K0R2J60J58k27r2K3J3J06Q4k25j81J82J15j95P6p3NK78l02J15j00k26
$$ -199 -111 -91 1 161 319 92 0 23 36 142 226 1 -180 2 117 -78 -2 -75 -70 208 -94 21 -79 -305
5022c05K16m2J57m2k10N50l58J55m00P01j98j84o9j21k9L9L14l4l2k9k35M22l80
$$ -305 -89 -131 26 -16 -226 324 -34 121 -279 422 224 40 -29 -150 -179 -140 174 140 108 79 -156 266 -114
5045a14K04j22J4J32j93Oj27L99l45M5K30j09oJ30L5m8J05p6n55N59j92pJ73j51
$$ -114 90 -32 -18 114 -79 -73 -200 199 -146 -101 129 20 14 144 179 131 236 160 -395 164 -28 -35 138 -13
5069a3j66L92K90m89J18j81L4L24l23k9L4K13l14J18j89J89L6p8J6j9J00j12K09
$$ -13 -179 213 503 14 132 -49 -15 309 -14 -43 -9 204 -110 8 -181 8 44 -34 -18 -37 63 -49 160
5092A60j86K3l8J5j32j6J85M8K85m85J72J13k35m3O4K35k52j38M2K03j51M67j49
$$ 160 -26 -3 -41 -26 -158 -174 11 59 344 -141 31 144 -91 -134 -70 165 -87 -225 -183 20 -131 336 187
5115A87k46Q3j92J86K62m07Mq9K90J44r3Q3j48j42Q9l7J63l38M11j40j14L87k25
$$ 187 -59 24 -168 18 280 -127 -123 -212 78 222 129 212 64 -78 11 -26 137 -201 210 70 -44 343 118
5138A18p9k97M66L5j74o6L0j07J56j89K85k14P6J17k07q6l8K72J60l62l1r7L39
$$ 118 39 -258 208 243 69 3 33 -74 82 -107 178 -36 40 157 -50 -136 -174 98 258 -104 -135 -232 107
5161A07j27J11J40l49O6j52J61J37n7l8J07m7J06l20K83k49J39J48k89J87j06
$$ 107 -20 91 231 -118 -52 -204 -43 94 37 -1 106 59 165 -155 128 -121 18 166 -123 64 -42
5182d2l7p1L70k08l7L7k53L12L2l89L23j92J50J00K34k77nk97L82R5o2l27L85
$$ -42 -79 -150 220 12 -25 12 -241 71 103 -286 37 -155 -5 95 329 52 47 -250 132 227 165 -162 223
5205B23m99L45N5k15j43lJ84R1j23J25K0l12o4K28K68j10J00j13J32M9j32j51
$$ 223 -276 69 124 -91 -234 -237 -53 38 -85 40 60 -252 -316 -88 180 70 170 57 189 238 106 -45
5227d5p4N2L57k43NJ45r7K48n73M28k28J56k72k47N29q2K1k1j89J54K0k24K96
$$ -45 -119 -67 290 47 52 197 100 348 -225 203 -25 131 -141 -388 141 59 80 59 -130 24 44 -180 116
5250A16k81K41J96m06k24L71k00j15J28J33M1k30N62l66j49K64K7j70R0j07K72
$$ 116 -165 76 272 -134 -358 13 -187 -302 -174 -41 0 -230 332 -34 -183 81 108 -62 28 -79 193
5271A93pl38K24j54K0M8J8m7j68K78k71K41l26J55J11p6J45O5k20J36K08j65M16
$$ 193 186 -152 72 -82 -62 -14 4 -43 -211 67 -204 37 -289 -134 -23 -99 46 111 -109 27 235 70 486
5294D86k76l62K97k0k58J63L11l62J84k7r3j8j13K2k15Q3J73k7j14L01q7o6L14
$$ 486 210 -152 145 125 -133 30 341 -21 163 136 43 25 -88 -66 -281 -198 -25 -52 -166 135 48 -18 296
5317B96l61J95k07Q4m0RP8j03n9L0J23r2M9j54K74n5j59J29l3K7J46o09K21j34
$$ 296 -65 130 -77 7 -33 -24 54 -49 -108 -78 45 -47 2 -152 122 67 -92 37 4 31 177 -432 -211 -345
5341c45J94K46J55k9j73l29l6M72l65M00j54P0L9R9k46J94k20K40l40J29j98K29
$$ -345 -151 95 250 221 48 -281 -317 155 -210 190 36 106 145 244 -2 192 -28 212 -128 1 -197 32
5363C2R2m8j55r6J27L15j1k98K43m15L21P7k32K00J3k26R4J10j50J46o3j96p1
$$ 32 124 76 -79 -175 -48 267 256 -42 201 -214 107 184 -48 152 165 -61 33 143 -7 139 76 -120 -191
5386a91J93j99NJ95R1k37M63n80o9K37q6j54J80J24R5j75O7K38K06n71L5l5L59
$$ -191 2 -197 -192 3 94 -143 320 -260 -329 -92 -178 -332 -152 -28 67 -108 -41 197 403 -168 -133 -168 191
5409A91j24k9j28K43j7l09N32n30K62j21J59k37J68p6K9k13J23Kj23L22q0k0M7
$$ 191 67 38 -90 153 136 -173 359 -171 91 -30 129 -108 60 -16 13 -200 -77 -75 -198 124 44 24 71
5432G1j41K99j23j07J45j76Q4k59K20k67M90k93P5k30K63J26k89K82k55P0K2M7
$$ 71 -70 229 106 -1 144 -32 52 -207 13 -254 236 -57 18 -212 51 177 -112 170 -85 -15 7 54
5454E4L0j63N8K98o31N04k34L13n30M92j46j20L18M1J84o17L44j48j60J79k03
$$ 54 84 -79 -21 277 -354 150 -84 229 -301 191 45 -75 243 284 468 -149 195 47 -113 66 -137
5475a37K04R3k63J91l38L00k69K98O1J55J08m12r4Q8j9J42K9J92l79J63j63r0
$$ -137 67 160 -103 88 -250 50 -219 79 140 295 403 -9 -103 -15 -34 108 137 329 -50 113 -50 -140
5497a40L43k78Q7k95N82k93J07r9l16K70K75k42k8J97l70K46Q7l81M03j10k21
$$ -140 203 -75 12 -283 299 6 113 14 -302 -32 243 1 -27 170 -200 46 133 -248 155 45 -176
5518a76J93j12K81k66J57J97l02j8j06L08j4j81Q3j47K15k87L48l29o5K45m4p0
$$ -176 17 -95 186 -80 77 274 -28 -46 -152 156 142 -39 44 -103 112 -175 173 -156 -221 24 -20 -90
5540i0k88L64K24j42o9R4j49P7K4L41l85J97k25p2J07N7j06l68O18l13J37J74
$$ -90 -378 -14 210 68 -1 93 -56 21 45 386 1 198 -27 -99 8 65 -41 -409 209 -104 33 207
5562B07j90M5k63QK28o8j45L47j05r2p8J53j28N34k68J30l51J43L8j24L01o3k38
$$ 207 17 62 -201 -193 35 -33 -178 169 64 -28 -106 47 -81 453 185 315 -36 107 145 21 322 259 21
5585B1j91L07k34L87o35K00M12k43RK53k96M11m01R0l21J71k4j75J67m3J32j40
$$ 21 -170 137 -97 290 -345 -145 267 24 33 286 -10 401 0 90 -231 -60 -84 -259 -92 -135 -3 -143
5607a43K13q8J8q1k64L52Q6j05l2J05j24p0M65o64K13j9K73l5k64K12m35O32k8
$$ -143 70 -18 0 -81 -345 7 93 -12 -44 61 -63 -133 332 -332 -119 -138 135 100 -164 48 -387 245 217
5630B17k83K29j33j25L73j99j72r4J77K86k58o4J89l12j96L33j01L14l03j6R8
$$ 217 -66 163 30 -95 278 79 -93 -187 -10 276 18 -46 143 -169 -365 -32 -133 181 -122 -138 -40
5651d0M3J02j04K29J14k46R3m37L46l8K02j73o8R9l85K90j2k0l7J63Q9l58O9K87
$$ -40 3 105 1 230 344 98 191 -246 100 62 264 91 23 122 -263 27 15 -5 -42 121 210 -148 -79 208
5675B08j31l42J96Q5N1k72j25P20m52N9J22L11n52J26j12m3p7M77j03j34k56K49
$$ 208 77 -265 -69 16 67 -205 -330 390 -62 -3 119 430 -122 4 -108 -151 -228 249 146 12 -244 5
5697Ek31J79M1J04k36J81K12l69M1j41M36q2j81M3O2J3J40l03J89j41K4k0K35
$$ 5 -226 -47 -6 98 -138 43 255 -114 -73 -214 222 140 -41 2 64 77 217 -86 103 -38 -14 -34 201
5720B01l86M75k75j93L04l94L66j86J99k32j4K29j40k5J70k29K6L56p3l02L00
$$ 201 -185 290 15 -178 126 -268 98 -88 111 -121 -135 94 -46 -71 99 -130 -104 252 179 -123 177
5741A77j40J48k55J58l85J98J23j01J91l13L65p0k6l10J63L77m71J34L9o8k21
$$ 177 37 185 -70 88 -297 -99 24 -77 114 -199 166 96 70 -240 -77 300 -171 -37 2 -66 -287
5762b87L81P3k02L07k23M2r1K8q3M4J80Qk06K71k59K18n03L03J14J1r8L0j99j1
$$ -287 94 167 -35 272 49 91 0 28 -55 -11 169 177 -29 242 -17 201 -302 1 115 126 28 58 -141 -152
5786a52J5l6L57o1k11q1K15k69K78l33M49k66J71k32M05k59o9o1Q8N9j04J22Q
$$ -152 -137 -173 184 123 -88 -169 46 -223 55 -278 171 -95 76 -156 249 -10 -79 -140 -52 7 -97 25 33
5809C3j13r7J03K17j30j42J38l1p6K72k88j76M40j04o7L6P3jj07k76K29K87j53
$$ 33 -80 -177 -74 143 13 -129 9 -22 -98 174 -114 -290 150 46 -21 15 88 87 -20 -296 -67 220 67
5832F7j55J23j36R8J27k74Q6R2j33q8O6J05j46J83L6j69m9J73J50j15j41J18j49
$$ 67 -88 35 -101 -3 124 -150 -64 28 -105 -193 -127 -22 -168 15 51 -118 -167 6 156 41 -100 18 -131
5855a31K27k04j69O0J24M22m46J30P2k19J73J69j4j75K47p9k75K84o7k43J53j92
$$ -131 96 -108 -277 -217 -93 329 -117 13 85 -134 39 208 194 19 266 187 -88 196 129 -114 39 -153
5877a53K72j81j71L05j60J44m4k6j17N1M53l23k32K11n0J92k85L07j67j41J27
$$ -153 119 -62 -233 72 -88 56 12 -14 -131 -80 373 50 -182 29 -21 171 -114 193 26 -115 12
5898A2j27O4p0J93l0j62J94j92K8M6J01k56L19k01L4L7j24j42J14J73j2k8K11
$$ 12 -115 -51 -121 72 42 -120 74 -118 -90 -44 57 -199 120 -81 -47 -10 -134 -276 -162 11 -1 -29 182
5921A82l24J25l9M7J14k37L84l52M66k74j08j30j8J43j59N57m52P6R5l34Q3L00
$$ 182 -142 -17 -56 -9 105 -132 252 -100 366 92 -16 -146 -164 -21 -180 377 -75 1 96 -238 -155 145
5943A45k48K30k25k04L01j45J97k52J68o6K84j65j92P2K82j04J46P5l38J21J62
$$ 145 -103 127 -98 -302 -1 -146 51 -201 -33 -99 185 20 -172 -100 182 78 224 299 -39 82 244
5964B44l40J56Q6j94K05k20j4L62l76L79l02j12K29n5K1J87k68J26j62J32L7o4
$$ 244 -96 60 146 -48 157 -63 -77 285 -91 288 -14 -126 103 48 69 256 -12 114 -48 84 121 57
5986E7k5k13J6J44J21m2k24J10j57L25j49j7N9J2K38n6l65J11R0j2Q5l22J13k38
$$ 57 32 -181 -165 -21 100 58 -166 -56 -213 112 -37 -54 5 17 255 199 -166 -55 35 23 108 -214 -101 -339
6010c39K32L4J00q7J10j93O4J13J28o5k08J27Q7J67k14l29K73Q3j81L24l47M14
$$ -339 -107 -73 27 -60 50 -143 -79 34 162 97 -111 16 103 270 56 -273 0 83 -98 226 -121 293
6032B93l71K87k93J40p6L4K0j96K73J6j03J58j8o2m04K51K36rj78j76L61o5k37
$$ 293 -78 209 -84 56 -20 14 34 -162 111 127 24 182 164 102 -302 -51 185 176 -2 -178 183 118 -119
6055a19j8J19J30j11L7J64o4k79N3J2L3j40N6K15nn64M69q0P8n5J57J03k61L50
$$ -119 -137 -18 112 1 38 202 138 -141 -88 -76 -43 -183 -127 88 83 -481 -12 -92 -14 -69 88 191 -70 280
6079B80m71M49k86L38k48J92j95r3j7J42n7k76J82o0J19j9K08P0l64K80j15J41
$$ 280 -191 258 -28 310 62 254 59 -34 -51 91 34 -242 -60 -120 -1 -20 188 258 -106 174 59 200
6101B00j24O9j89J35O9m49N35l05j70L0M23m70M16l81J49p2M2J93l60K27k40M46
$$ 200 76 145 -44 91 160 -289 246 -59 -229 -199 224 -246 170 -211 -62 -134 -92 101 -259 -32 -272 174
6123A74L0P3l14J53l64M27l18N14m01m6J21j1J4J00j05j12O0J32j17j69L78m40
$$ 174 204 277 -37 116 -248 179 -139 375 -26 -72 49 38 52 152 47 -65 -5 127 10 -159 219 -221
6145b21M06r7P4l9j42m4L53l13J20l31J4O7J77Lo0M5j5M6N5l44M04p9J22l55K04
$$ -221 185 88 162 123 -19 -63 290 -23 97 -234 -220 -153 24 27 -33 12 -3 43 98 -246 158 79 201 -154 50
6170E0r5j27J58o4J7Q6K10l46R9k0K04l01L27m24j03L87l5n2M9j24J31K7j61J21
$$ 50 -45 -172 -14 -78 -61 25 235 -111 -12 -32 172 -129 198 -226 -329 58 23 -29 20 -104 27 54 -107 14
6194A4J09r2j74K40q8M0k10R9J70k98N57j23n51K13R2M9M89o32OL0k48O07l51
$$ 14 123 31 -143 97 9 49 -161 -62 108 -190 367 244 -307 -94 -2 47 536 -96 -90 -60 -308 299 -52
6217e2M3J66j25QO0j83J60j67J5J83l21J08K63l21N77o09n8L94k62P1J79m98M21
$$ -52 -9 157 32 40 100 -83 77 -90 -75 108 -213 -105 158 -163 414 -195 -253 141 -121 -50 129 -369 52
6240E2L3M5j68j68L51k67K1o1K18p7K49k14j48L62l61K84l04J55KJ72k78J56m6
$$ 52 85 130 -38 -206 145 -122 -101 -162 56 -21 228 14 -134 228 -133 151 -153 2 4 176 -102 54 8
6263HK2k17J96J9k33Q2J59J23k95K18J9J77R8l10k31K85j58L18m97K92m3J73j
$$ 8 30 -187 9 28 -205 -123 36 159 -136 82 101 278 376 66 -165 120 -38 280 -217 75 32 205 204
6286B04k59J91o06N08l3n0Q7M6n1K1J94j52o8k00L07l45L43n5k67J46L52n78j5
$$ 204 -55 136 -470 38 5 -45 42 88 37 58 252 100 32 -168 139 -206 137 82 -185 -39 313 -265 -280
6309b80O19l00r7J34k34q1L41q3M1k14L63l27r9N80n40J60K16K2j33j35l16M79
$$ -280 339 39 -58 76 -158 -239 102 19 60 -154 209 -118 -217 363 -177 -17 199 221 88 -47 -363 116
6331A16m8K21k29M2j3j89J87j95K10K1Jj47J22M60l43k53L21j90l50M32K01k29
$$ 116 68 289 60 102 89 -100 87 -108 102 123 124 -23 99 559 216 -37 284 94 -256 176 377 148
6353A48j75k00P7k59K33K85k16R1L8l12K01k40J16J26K93l96J03K37q2k6j53K23
$$ 148 -27 -227 -150 -409 -176 109 -107 -16 22 -290 -89 -329 -213 -87 206 -190 -87 150 68 42 -111 112
6375A12Lj66j42K18l69K14J06J09J3j56L24m96J76J11k30k72N40O1j68q0l2K78
$$ 112 115 -51 -193 25 -344 -130 -24 85 98 -58 266 -230 -54 57 -173 -445 95 156 -12 -92 -124 154
6397A54q9k12K46k10J63j4J35j10j1k70k8K42n2J49K81k51j47m9l5k1J58n7O0
$$ 154 65 -147 99 -111 52 38 173 63 52 -218 -246 -4 -56 93 374 123 -24 -73 -108 -129 29 -28 32
6420C2j17l19L94J04o5m8L2N44p91K77j81J53N2k23K24j53K09k16P18m68j92j87
$$ 32 -85 -404 -10 94 29 -19 13 557 -234 43 -138 15 67 -156 68 -85 124 -92 626 158 -34 -221
6442b21O8r1K35k22L99l60j22L87m8N4j47k2K44m5l39kL84J60o9k11J20k39l47
$$ -221 -153 -244 -9 -231 168 -192 -314 73 25 79 -68 -90 154 109 -230 -232 152 312 243 32 152 -87 -434
6465d34N29l3j56J59R8k54P7K22p2q8K7k19K70k34j13K51n2J74k82K54j55R9K41
$$ -434 95 62 -94 65 163 -91 -14 208 136 48 75 -144 126 -108 -221 30 -22 152 -130 124 -31 68 309
6488C09k81o9K82m69J59J81k62J55k21L72m4o5m2J81l22K73j59J35j46q9Q6q4
$$ 309 28 -41 241 -228 -69 112 -150 5 -216 156 112 47 5 186 -136 137 -22 113 -33 -122 -36 -120
6510a20j10q3K39j8j27k04O33k9j46R7r5p1J01j23J09K9l01R0M5L02k08N7j83
$$ -120 -230 -313 -74 -92 -219 -423 210 181 35 132 37 -34 67 -56 53 82 -219 -129 -84 218 10 67 -116
6533a16K70l30L36j19K44m41n0P7m3j30J31J35p6M92m26K52k36L53l93K32o8J35
$$ -116 154 -176 160 41 285 -156 -206 -129 -172 -302 -171 -36 -112 380 -46 206 -30 323 -70 162 94 229
6555B29j58l0K54j27k20J5K00j73K14p9o2J98n39K06j6L15k45J91n2l11l04N76
$$ 229 71 41 295 168 -52 -37 163 -10 204 125 63 261 -278 -72 -88 227 -18 173 121 -190 -494 82
6577H2Q5l06J26j17j09nK72P4P7o6o6j13K90l44K75m49O40j76q6j0J6K4l1p5J73
$$ 82 167 -139 -13 -130 -239 -244 28 102 179 113 47 -66 224 -120 155 -294 346 170 84 74 90 114 83 8 181
6602A81k61J3jL4j97K80J67k08k76J82J37k36L52m51L44k2k15Q4K79l79J14R2
$$ 181 -80 -67 -68 -34 -231 49 216 8 -268 -86 51 -185 167 -284 60 38 -177 -93 186 -193 -79 13
6624A3Q1j28k2p5l7J15J23q0J70j87l9P7pK0K39l46L51k37j22mJ21L4J20l31J4
$$ 13 94 -34 -56 -131 -168 -53 70 -10 160 -27 -66 11 4 24 263 -83 268 31 -91 -95 26 60 180 -151 -137
6649a37J40K89m10r8K61j06K42l02L30l07L03j7m19K98n1l55L83k50K86J27k87
$$ -137 3 292 -118 -216 45 -61 181 -121 209 -98 205 188 -231 67 16 -339 44 -206 80 207 -80
6670h0K2K32l04k46L47M1n1j28K69Q0k53J72Q1k51m5L38m75K80k4J59k87Q2O0
$$ -80 -58 174 -130 -376 -29 12 -39 -167 102 182 -71 101 182 -69 -114 224 -251 29 5 164 -123 -41 19
6693A9L7j78K98k10Jj52L64J90l44J82n3k54L31p7j55j42l62P21l42P9K57j51
$$ 19 56 -122 176 -34 -33 -185 179 369 25 207 154 -100 231 154 -1 -143 -505 216 -126 -47 210 59
6715E9n7J5j34o0n8K49j31J10M4k03k0O1L70j99l3R6k75K77k95L30j88m6J01K7
$$ 59 2 17 -117 -177 -235 14 -117 -7 37 -166 -186 -125 245 46 13 109 -166 111 -184 146 -42 -88 13 40
6739D0J01N1j69p4k1j0j68K92p7k43K84l27K68K35j55o3K58l84J52Q6j05J00J84
$$ 40 141 192 23 -51 -72 -82 -250 42 -35 -278 6 -321 -53 182 27 -36 222 -162 -10 76 -29 71 255
6762B55j10k33K39l03P7J21Q0n9JR0j50k6J58p5k4j65J36j56J2J37q0K0R9J20
$$ 255 145 -88 151 -152 -75 46 126 67 68 158 8 -18 140 65 41 -124 12 -144 -132 5 -75 -55 44 164
6786A64k05j49J10m8l9R0J27M7p2rJ67Nj61j1k66O0L61l03j4R3L8J42q3R1j09
$$ 164 -41 -190 -80 -128 -167 -77 50 97 25 16 183 188 27 16 -250 -190 171 -132 -146 -53 -15 127 44 135 26
6811B6K5m9k46J76J33J47j20l14K86k38J42j23J80Qq8K3k9O5j73R1J50l11K08
$$ 26 51 2 -244 -68 65 212 92 -222 64 -174 -32 -155 25 33 -55 -32 -61 4 -169 -78 72 -239 -31
6834c1L0k10K84NKk25L94o6m7j01K31j86j85r6q4L34l91O20k86P9k83J11q6K23
$$ -31 -1 -211 73 78 80 -145 249 183 136 35 266 80 -105 -201 -285 49 -342 278 -8 71 -212 -101 -187 36
6858C6K61j92r6p0K16l24J61K51j26o5J74o8k81P7J91J73n55J47J03K55R3l98
$$ 36 297 105 9 -61 155 -169 -8 243 117 52 226 158 -123 -46 145 318 -237 -90 13 268 361 -37
6880c7J19J97j78k07K63k46k3J05j46k7K02j15L7K01K03n42Q0J1J73l32J64J90
$$ -37 82 279 101 -106 157 -89 -112 -7 -153 -180 22 -93 -56 145 348 -194 -114 -103 70 -262 -98 92
6902I2K23l83j00N9K74j29M6K27Lk06%l34k01N31k78K60l68L54k09J9K04lk3J40
$$ 92 315 -68 -168 -109 165 36 82 309 312 106 106 -228 -429 102 -176 84 -284 70 -139 -120 84 81 58 198
6926A98k39o4J26K9j44J09m4L21k65n0n4J37j76J22J74j27k42J45N7r3l49L49
$$ 198 -41 -105 21 50 -94 15 -29 292 27 -23 -77 60 -116 6 180 53 -189 -44 13 -80 -429 -80
6948h0j7M47j43l49M02l55L15j2k23j17K15J5k76M60k9k41J15r8L5j01j05J50
$$ -80 -97 350 207 -142 260 -95 220 208 -15 -132 83 98 -178 282 253 12 127 29 64 -37 -142 8
6970HJ80j76M9L7j63O0m21M19M3k95J93o2k70N41K6j39L8j2R0R6l04O0mk8R2j36
$$ 8 188 12 61 98 -65 -5 -426 -7 36 -259 -66 -128 -398 143 169 30 68 56 146 242 -62 -2 -6 -34 58 -78
6996g8k5p0L70o3kk16Q9j82M39r6m95L07l79M24r4M0J03j15r4J78l20L70j21M3
$$ -78 -103 -173 197 134 132 -84 5 -177 262 166 -329 -22 -401 23 -71 -31 72 -43 -137 41 -279 91 -30 13
7020A3q9R2k03K44K24j94K1N7m43J57L89m21M8n8K2J47j86K99j38jm1j68r3K12
$$ 13 -76 16 -187 57 281 87 108 165 -278 -121 268 -153 -105 -163 -141 6 -180 119 -19 -20 -61 -229 -322 -110
7044a10l55M21P7R6J3j80J76k75L10k09Q1K20m22M31j13l30J13J58j04k70j22
$$ -110 -465 -44 33 129 142 -38 138 -137 173 -36 45 265 -157 274 161 -169 -56 102 -2 -272 -394
7065c94N12J14k29k03K57l34L63l62K78J03l3k7k71O8R1J39P5j30j52L62j95n4
$$ -394 118 232 3 -200 57 -277 86 -276 2 105 72 45 -226 -158 -67 72 147 17 -135 227 32 -22
7087b2k8K15M7k19j9m2nM8O0n2J33j94j68Q0L30j42oR5j40J1L0R4J4Jl06J36J22
$$ -22 -50 165 212 -7 -26 -68 -73 -25 35 -17 116 -78 -246 -166 164 22 16 111 -29 -18 12 106 120 121 -185 -49 73
7114G3L1j54mj1o2R7K62l43l8mJ30p5K47j72l8p7R9Q7j4k01K41j16J20K38l46
$$ 73 104 -50 -54 -65 -127 -30 232 -111 -149 -153 -23 -98 149 -23 -61 -138 -39 48 34 -167 74 -42 78 316 -30
7139c0j81K90J4K3k66j40N20J2k52O2R0k72M20l04J85j30J40o7j99M5J78p8j19
$$ -30 -211 79 93 116 -150 -290 230 242 -10 52 142 -130 290 -14 171 41 181 114 -85 -40 138 60 -59
7162e9N2k43K22J3J9j29J99N9l81J67q2J76K9n6m50N60K30l94K57l95L93j79O0
$$ -59 -7 -250 -28 -15 4 -125 74 133 -248 -81 -163 13 42 -14 -464 96 326 -68 189 -206 187 8 68
7185F8Q2j83L63m15L05l08J73j47Q1k5K22m16K79n8K18k34k25L78k06J52M1Q1
$$ 68 150 -33 330 -85 220 -88 85 -62 19 -6 216 -200 79 21 239 5 -220 158 -48 104 145 226
7207B26l63J94M6q7k11K33j40Q0K2P3k16jL48m2j20q4J78j20K13l28j05K03j22
$$ 226 -137 57 103 16 -195 38 -102 -22 0 73 -143 -144 204 162 42 -42 136 16 229 -99 -204 -1 -123
7230a23K39p5J03K39l99K78j10R0j32j11K96m06J59J01q6M8m59J16O5M3j65K7
$$ -123 116 41 144 383 -16 262 152 242 110 -1 295 -111 48 149 63 111 -348 -232 -167 -124 -289 -262
7252b62L80j83K37k28J62K87m42j7R2J55j05n6on5J38k05m2j14L27j62J2K04k59
$$ -262 118 -65 172 -56 106 393 -49 -66 26 181 76 20 14 -41 97 -108 -150 -264 63 -99 -87 117 -142
7275a42J32j35lJ37J13K7m54M07l26O34l99j02L0J88J15k58M21n54M54k47n1K04
$$ -142 -10 -145 -148 -11 102 129 -325 82 -244 390 -9 -111 -81 107 222 -36 385 -169 285 38 -13 191
7297A91j77N6p7R0L9j82n4m1p3J04O4K45m17K13j28J99n3k54J83K62j23n2k19
$$ 191 14 70 -7 83 122 -60 -114 -155 -228 -124 -60 185 -232 -19 -147 52 -1 -255 -72 190 67 15 -204
7320b04N48l32l41L33j40M6j84L68j46J35j93j27M22k57j14L59j26k31K11j8K34
$$ -204 344 12 -329 4 -136 -90 -274 94 -52 83 -110 -237 185 -72 -186 173 47 -184 27 9 243
7341B43ll37k74K00J99j8K83k56j6J13l87L79k43K33Qk04n6L17r3l5J15K61l03
$$ 243 240 -97 -371 -171 28 10 293 37 21 134 -253 126 -117 116 124 -80 -136 181 88 53 168 429 126
7364A26K0j64j24Q3n4K33j04q2K7N7O1l32K34Kq7Q2L6K05m91O33l45n5J68l5j8
$$ 126 146 -18 -142 -59 -113 120 16 -66 -39 18 79 -253 -19 -17 -104 -22 14 219 -272 361 16 -39 129 94 76
7389G6J21j28l28K67K3k05M29j80J8j11R0q4J46j90J69K44m77K77k09l8K71j98
$$ 76 197 69 -259 8 31 -174 255 75 93 -18 72 -12 134 -56 113 357 -120 157 -52 -90 181 -17
7411a7j03K17k21L69p4l8m71M5K27J8M9o6k11N01j94j8Q7p0m34L02L25j88j77
$$ -17 -120 97 -124 245 171 133 -338 -293 -66 -48 1 -65 -276 225 31 13 100 30 -404 -102 223 35 -142
7434a42J04L63mk16r8j94K00M92m50R3l20K41K74l84o6K28k51o7K04l4o7J48l
$$ -142 -38 325 321 105 7 -187 13 505 55 148 -172 69 343 -41 -107 121 -130 -197 7 -27 -94 54 51
7457E1l9o0K68j73J5l4KJ91mk00M2j12k66L43j88L42k45k04N17m09L87k76J30
$$ 51 12 -48 220 47 62 28 30 221 217 17 59 -53 -319 24 -164 178 -67 -271 246 -163 224 -52 78
7480G8j05P1q0K06j98K17j33j19j79K05J02%K1j11n5L54k51Q0j54J3k05R7J60
$$ 78 -27 44 -36 170 -28 189 56 -63 -242 -37 65 65 86 -25 -80 274 23 103 -51 -38 -243 -146 14
7503A4Nk28P3m2J05j6k84P18k44oJ58n55M26J28m71K04j13L57m35L04p7J77j00
$$ 14 19 -209 -136 -178 -73 -89 -373 345 101 95 253 -302 124 252 -219 -15 -128 229 -206 98 21 198 98
7526I8J8o5K77k93K01k18J41l17Q0J19q7M8m39P07m07L2N6K03M9j22k76J24J3
$$ 98 116 51 328 35 236 18 159 -158 -78 41 -46 2 -437 270 -137 -105 -49 154 203 81 -195 -71 -58
7549e8J89k19J74j93M0m0J6L67o34N05j87j90J72K80n09M17k28j21N7J44L8L77
$$ -58 131 -88 86 -107 -67 -107 -91 276 -358 147 -40 -230 -58 222 -287 130 -98 -219 -162 -18 20 397
7571C97n78J72J81l20J95J38m95K63K4m5P3j12J13r8o9J89M9q5Q8j19K49k88J99
$$ 397 -181 -9 172 -148 47 185 -310 -47 -23 -68 5 -107 6 -92 -161 28 77 -8 80 -39 210 -78 121
7594A21k96L60j57J80r0j6r2O8jM7q4nN8m5P4j83RL1R8k6pJ52j51Qk64L49k86
$$ 121 -175 185 28 208 118 102 10 78 77 124 40 35 93 48 122 -61 -52 -21 77 51 44 196 45 53 -211 138 -148
7621a48K32L9r3m92M89J27n8m83L72j77l1M25n59L45L6k4l5R8j49J70m3j05j97
$$ -148 84 123 30 -462 27 154 96 -387 -15 -192 -223 202 -357 -12 24 0 -35 63 -86 84 41 -64 -261
7644b61j6K70L64l96K7M9j30J47m05O70j41l30L03Op8j61R0L03m15n6J25l60P
$$ -261 -277 -7 357 -39 -12 37 -93 54 -351 319 178 -152 151 157 79 -82 8 311 -104 -160 -35 -395 -388
7667c88L86K38o1j09j61J41k19L24m44L55J04k48M34k33pk37k0k7K30r1q9K25
$$ -388 -2 236 175 66 -95 46 -173 151 -293 62 166 -82 352 119 112 -125 -145 -172 58 -33 -122 103
7689A03o3K37j07j06j90n7K0J50J4r6J90l05K72q3J86M5r2k10O4Qk87K11J91j97
$$ 103 40 277 170 64 -126 -183 -163 -13 1 -95 95 -210 62 -21 165 210 118 -92 -28 -20 -307 -96 95 -102
7713a02P3J25j9j49nJ98K36n63M49l16l97M37J48J43k03j52K69l3lO8k26l5N2
$$ -102 -29 96 77 -72 -77 121 357 -206 243 -73 -470 -33 115 258 55 -97 172 139 136 204 -22 -57 -5
7736eJ15j21R6j74j64j29K20K73Jo0j19j66M38n54M32k18K40K5m25N0K50Q8K5
$$ -5 110 -11 85 -89 -253 -382 -162 111 112 52 -67 -233 205 -349 83 -135 105 130 -295 -245 5 93 118
7759A18j41N5o0J09k86K70k01J92l7k55K71oL1j03K98k03K66m14J83j98L22J22
$$ 118 -23 32 -28 81 -205 65 -136 56 19 -236 35 29 60 -43 255 52 318 -96 87 -111 211 333
7781C33m72K32j77j18J76J53o3q6O1L1L8k75M13q7k14K59j04k75J56J42K12k37
$$ 333 -139 93 -84 -202 -26 127 64 -22 39 70 108 -167 246 159 -55 204 100 -175 -19 123 335 98
7803I8J17q1j3m8q6k80M04p0j22M2p0K55K57l75Pk52K94n8j51K5K95j16j24L44
$$ 98 215 134 121 73 -13 -293 111 41 -81 -39 -109 146 403 28 35 -217 77 19 -132 -107 188 72 -52 292
7827B92o89J30L76R3j64J25k85J36J70k26j14KN3P8oj63K76l82K48M9J70k29J88
$$ 292 -397 -267 109 202 38 163 -122 14 184 -42 -156 -154 -101 -23 -29 -192 84 -298 -50 -1 169 -60 128
7850A28j53nK48j75k60K20n3q4L3m5j13J94J05k5R3K20k95K3j06K72j05l9j24
$$ 128 -25 -30 218 43 -217 3 -50 -134 -101 -146 -259 -65 40 15 108 328 33 56 -50 222 117 78 -46
7873d6j23K83Qj55l0K34k50M4M17n03K14J30R1k40nj30l2j06J42J00l03R8K04
$$ -46 -169 114 122 -33 -63 171 -79 -35 382 -121 93 223 314 74 69 -61 -93 -199 -57 43 -260 -162 42
7896D2j90r3j8K71J5k00M69m15K48J48l27n3J90r0K9j9K30p3p2j8j67K0k50L66
$$ 42 -148 -241 -259 12 27 -173 296 -119 129 277 -50 -103 87 -3 26 7 237 164 92 74 -93 -73 -323 43
7920D3j62K36L4k34R6j42K23J75k51l0o8J71j03J82J72k67l09O01p01N60k71L28
$$ 43 -119 117 151 -83 13 -129 94 269 18 -12 -80 91 -12 170 342 75 -234 367 -334 226 -45 283
7942B83R6l24J9kj18K36o5Oj27j03K47n9m09M71l26J02J03j31Oj99M39j73p7K84
$$ 283 379 55 74 72 -46 190 125 131 4 -99 148 89 -320 151 -175 -73 30 -101 -95 -294 145 -28 -105 179
7966A79n2k67K89J1k28K99l28k31L80l0k66L43k88P6J07K28k33M2k68M97m8j71
$$ 179 127 -140 149 160 -68 231 -97 -328 52 22 -244 99 -189 -113 -6 222 -11 31 -237 260 212 41
7988D1N0J23m6l1k76K11N0j72j35K40P1j09J3L6m4q3r6K2L67Ll89O4n7K60r9K7
$$ 41 91 214 168 137 -139 72 122 -50 -185 55 126 17 30 66 22 -61 -157 -135 232 235 -154 -90 -147 113 14 41
8014D1j5r6J4J57j50k20J57k10L59k84J92Q1M1l9M8k1j17J01j91J02J40j86Nj1
$$ 41 26 -70 -56 101 -49 -269 -112 -322 37 -247 -55 26 67 28 76 55 -62 39 -152 -50 90 -96 -91 -102
8038a02K25l0k77K79k63L07J99j81J48l86l8K40l4k98J83j66J5O0j40N0K81j58
$$ -102 123 93 -184 95 -168 139 338 157 305 -81 -119 121 87 -211 -28 -194 -179 -119 -259 -209 72 -86
8060h6j20M12j83j12L8L9j27J31K6p8L1L28l47J63j23k0n7Q9N1k54n8M88j80J44
$$ -86 -206 206 23 -89 -51 -12 -139 -8 18 -60 -29 299 -48 115 -8 -28 -85 4 55 -199 -257 231 51 195
8084A95l04nr2L39j78K44o6l81N00J4j81k46L49l24L33l09K91n20K63J10J21j23
$$ 195 -109 -114 -206 133 -45 199 133 -248 252 266 85 -161 188 -136 197 -112 179 -341 -78 32 153 30
8106C0l1N4Q8n1n4K6J54m16J78J86l06K59N3k97n7K56l4m8j4Q4p9k19J16M7M3
$$ 30 -1 53 141 90 36 62 216 -200 -22 164 -142 117 170 -127 -184 72 38 -10 -24 60 -19 -238 -122 -75 -32
8131c2Q3J07J22l96K41l6q8J38K06n00m5N37k58l19K91j69K92j9o0K04k89k51
$$ -32 51 158 280 -116 125 89 1 139 345 -155 -200 337 79 -240 51 -118 174 155 95 299 10 -241
8153b41n6K98j73N0M10k82%J01k76K69k11k3k6qP1J5K41k69P5j74L25k74Q7P0
$$ -241 -297 1 -172 -122 288 6 6 107 -169 100 -111 -134 -160 -168 -97 -82 159 -110 -35 -209 116 -158 -71 -1
8177ak47J59l09L60j72L77J64n28K65k28K04K25n04J5
$$ -1 -248 -89 -398 -38 -210 167 331 -197 68 -160 44 269 -235 -220
8191b20
$$ Imaginary data points
##PAGE= N=2
##DATA TABLE= (X++(I..I)), XYDATA
0@%%%%Qj6J6j6K4l2M0n6O4p2R6j20J44j76K08k40K80l28L79m35N00n74O56p48
$$ 0 0 0 0 0 8 -8 8 -8 16 -16 24 -32 32 -40 56 -64 80 -96 112 -128 152 -176 203 -232 268 -306 350 -398
28c98Q48r58J080j212J357j519J698j892K102k334K592k873L182l524L900m317
$$ -398 450 -508 572 -640 717 -802 896 -996 1106 -1228 1364 -1509 1673 -1851 2049 -2268
44b268M781n302N890o557P320q203R239j0480J1995j3887J6328j9614K4294l1518
$$ -2268 2513 -2789 3101 -3456 3864 -4339 4900 -5580 6415 -7472 8856 -10758 13536 -17982
58a7982M4167p2313K29844q0885m43342N51492j16045l64066M04876L013l74444
$$ -17982 26185 -46128 183716 102831 -340511 210981 94936 -269130 135746 138759 -235685
69b35685L17893K3435k71940K19350L1622k06476J93227k0741j64600J73123j2442
$$ -235685 82208 105643 -166297 53053 84675 -121801 71426 50685 -113915 59208 46766
80D6766j46077J52220k0812j05535J20153m1134q1783J36387l2547p6681R0901
$$ 46766 -99311 52909 32097 -73438 46715 5581 -76202 60185 27638 -49043 41858
91D1858m6806n1108J08845l6879n8607O7904l1676k4669O6111n2197r816R0050
$$ 41858 -4948 -56056 52789 15910 -42697 25207 -6469 -31138 34973 -17224 -27040 63010
103F3010p0188n0593J06372l5057p0642J00254r311j05113P6408M7731r8270J8966
$$ 63010 -7178 -57771 48601 13544 -57098 43156 33845 -71268 5140 52871 -45399 -26433
115b6433P7143m5596l0796L3709n600r134J6016m7j0995j1068M759J7603j6194
$$ -26433 50710 5114 -25682 8027 2427 -6707 9309 9262 -1733 -12801 -8042 9561 -6633
128f633m639L0492j2193j9117J4926j2261J0885L1325m3641j2411M3152l2307
$$ -6633 -11272 19220 7027 -12090 2836 -9425 1460 32785 -10856 -23267 19885 -12422
140a2422m276M5335m0163n533M8749m2286q731M4372l3937Q300L0401n8316J2678
$$ -12422 -16698 28637 -11526 -17059 31690 -10596 -19327 25045 -8892 -592 29809 -28507 -15829
153a5829M6721n2456J1397L7548m5837K1271J5105n4118N0072K0943o6302M7669
$$ -15829 30892 -21564 -10167 27381 -18456 2815 17920 -36198 13874 34817 -31485 16184
165A6184K69p4990Q4374J6219j02344P1145L0312r0781O0146K1992p6565O7660
$$ 16184 16453 -58537 25837 42056 -60288 10857 41169 -49612 10534 32526 -44039 23621
177B3621J0400q1285N9313P730o0808O5956p108o3362O9419n801n9640O0967k503
$$ 23621 34021 -47264 12049 19779 -41029 24927 17819 -45543 23876 18075 -41565 19402 16899
190A6899l8188M8436l0676l1042O2099k7250k0881M9230m5914n866O0656n2542
$$ 16899 -21289 27147 -3529 -34571 27528 278 -20603 28627 -17287 -23153 37503 -15039
202a5039o675O2304n2032l423M8770o2095J1176O2990o5864m431N8177n2828J797
$$ -15039 -21714 40590 -11442 -14865 33905 -28190 -17014 45976 -19888 -24319 33858 -18970 -17173
215a7173N1884n1797M566N0697n1403o615M3127l4698M981L3036m6548J283M3366
$$ -17173 34711 -17086 -12520 38177 -13226 -19841 23286 -11412 -6431 26605 -19943 -18660 24706
228B4706l1201p410L2354k0171m585K1082k3130l790K8598j3479j3967J5150j0101
$$ 24706 -6495 -13905 18449 -1722 -6307 14775 -8355 -12145 16453 2974 -10993 4157 -5944
241e944l733K3580j3162j4395K6840n740k1507K0417l375j3474K6093j3295k6301
$$ -5944 -9677 13903 741 -13654 13186 7446 -14061 6356 2981 -10493 15600 2305 -23996
254b3996L3014k293k3442L1230r857k5089M0196j1509l6007M3693j819l6313L5015
$$ -23996 9018 6725 -16717 14513 4656 -20433 19763 8254 -27753 15940 14121 -22192 12823
267A2823j0254l2483M9736o592m2051M3291k236l4793L9093r635l1005M4304r666
$$ 12823 2569 -29914 19822 13230 -28821 14470 12234 -22559 16534 6899 -24106 20198 10532
280A0532l6685L4125m465j8988L2216j5698k1036L6264r255k3067K5667m470j3005
$$ 10532 -26153 7972 3507 -15481 16735 1037 -19999 16265 7010 -16057 9610 5140 -7865
293g865J6919j1324j0494J6786j261l304J048p328J0642K995j2478P793K041n932
$$ -7865 9054 -2270 -12764 4022 2761 -543 505 -6823 3819 6814 -5664 2129 4170 -1762
307a762O799r159n344J5440o082j947P125j5488J0711J4461k4504P915J6287k3797
$$ -1762 5037 -4122 -9466 5974 -108 -2055 5070 -10418 293 14754 -9750 -1835 14452 -9345
321i345J0393Q304k8966K1536J6671l5439J3672J5559k6263K0854O811l2626K5471
$$ -9345 1048 9352 -19614 1922 18593 -16846 -3174 12385 -13878 6976 13787 -18839 6632
334F632R772l4910K1390N828k8015L0977q18l7030L3049Q838l2161K3406K975
$$ 6632 16404 -18506 2884 8712 -19303 11674 10856 -26174 6875 15713 -16448 6958 9933
347I933k5304K5451k238k5950K3389J483j7255J7085q286j1294K4867o606j5582
$$ 9933 -15371 10080 7842 -18108 5281 6764 -10491 6594 -1692 -12986 11881 5275 -10307
360a0307J7056l540q469J2217r291o503J6041m785r952O831N11K78N237n092l835
$$ -10307 6749 3209 -5260 6957 -2334 -8837 7204 2419 -7533 -702 -191 87 5324 232 -3603
375c603N836L049n341m931N707J449m645L689o114j730J7956q653j4939K0892
$$ -3603 2233 5282 -59 -4990 717 2166 -2479 1210 -4904 -6634 11322 2669 -12270 8622
389H622k927j5966K0050p017j9312K7143j865k6498J9538N658j5313J4593m153
$$ 8622 5695 -10271 9779 2762 -16550 10593 8728 -17770 1768 7426 -7887 6706 2553
402B553j2906J9716m303j3939J4328o014o149J5956j3929o419K1371j0940m022
$$ 2553 -10353 9363 5060 -8879 5449 -565 -6714 9242 -4687 -11106 10265 -675 -4697
415d697J3585j5877M875J7509k2901l83J9968j7189n1J3782j8146N051J7577j7441
$$ -4697 8888 -6989 -2114 15395 -7506 -7889 12079 -5110 -5161 8621 -9525 -4474 13103 -4338
429d338j950J3493q394J914N380j2294L997Q793q333l611L438L103K680o307p7
$$ -4338 -6288 7205 -1189 725 6105 -6189 -2192 6601 -1732 -5343 -1905 1198 3878 -2429 -2506
444b506N722k954J709K374j0165M523Q176r824j379L653j40M821m956m126J0288
$$ -2506 3216 262 1971 4345 -5820 -1297 6879 -2945 -4324 -671 -811 4010 -946 -5072 5216
459E216l225m089P459q936MJ2228j2388l083J1613q819L861Q178j8522Q863J6005
$$ 5216 1991 -2098 5361 -3575 -3571 8657 -3731 -6814 4799 -4020 -159 8019 -10503 -1640 14365
474A4365k1123M015J2635j9476J0867J0188k6343J1892J6695k4572R207J2107
$$ 14365 -6758 -2743 9892 -9584 1283 11471 -14872 -2980 13715 -10857 -1650 10457
486A0457k1988J4601J0910k6751J0920J3897j9482P236L263j3380J5334P11j5928
$$ 10457 -11531 3070 13980 -12771 -1851 12046 -7436 -200 3063 -10317 5017 5728 -10200
499a0200J3265P91q650J2663p434r467J7145n904r078J0014o799Q25J0585j3960
$$ -10200 3065 3856 -4794 7869 435 -9032 8113 2209 -6869 3145 -3654 -2829 7756 -6204
513f204J296J4563j1954Q50Q303j3137O917Q279j6903N105P192r926R124q68j2957
$$ -6204 -4908 9655 -2299 -1449 6854 -6283 634 8913 -7990 -2885 4307 -5619 3505 2637 -10320
528a0320J5575K148j4379J0445j565p286J2973p951r920J6284m991p774J2796
$$ -10320 5255 7403 -6976 3469 1904 -5382 7591 -360 -10280 6004 1013 -6761 6035
541F035r262l244J8764j3012q575J8109p916n811J1468j2043r74J7196j4449m914
$$ 6035 -3227 -6471 12293 -719 -9294 8815 899 -4912 6556 -5487 -6461 10735 -3714 -8628
555h628J6236q613k476J2109j1521k646J4512q181p418Q770k784j275N679o974
$$ -8628 7608 -1005 -3481 8628 -2893 -5539 8973 792 -6626 2144 -640 -1915 3764 -3210
569c210j762J1051l323p365P251l92m977P194l098r623J0210L235j1056N236L338
$$ -3210 -4972 6079 2756 -4609 2642 2250 -2727 4467 1369 -8254 1956 5191 -5865 -629 2709
584B709p660J0042l47j4427J3673N230j8143J0010M342j6373J6157K682k3391
$$ 2709 -4951 5091 4744 -9683 3990 9220 -8923 1087 5429 -10944 5213 7895 -15496
597a5496J8360P877k2444J6626K460k1427K3309J495k9605K4272N083k6179K1375
$$ -15496 2864 10741 -11703 4923 7383 -14044 9265 10760 -18845 5427 10510 -15669 5706
610E706N82k3351K6936r19k5410K5880k585k0735K6808j0147k2125L3400q265
$$ 5706 6288 -17063 9873 8954 -16456 9424 6839 -13896 12912 2765 -19360 14040 5775
623E775k5438L0408p867j8270L0858j3938j8204L2493j2789j7227K7568j5215
$$ 5775 -19663 10745 2878 -15392 15466 1528 -16676 15817 3028 -14199 13369 -1846
635a846j2000K9987j8267j4463K9681j2437j0737K1602j5122l783K2053j8240
$$ -1846 -13846 16141 -2126 -16589 13092 655 -10082 11520 -3602 -7385 14668 -3572
647c572n698K0178j4421j810J4422j7483K808J7273j6229J27J1967j1865N540
$$ -3572 -9270 10908 -3513 -5323 9099 -8384 -5576 11697 -4532 -4405 7562 -4303 1237
660A237O580j7307R563R876j7651N261P660j2189Q061O210j4030N538Q053r066
$$ 1237 7817 -9490 73 9949 -7702 -2441 5219 -6970 1091 7301 -6729 -1191 6862 -2204
674b204K657J941o901O663J986j0753M460N945n813J778K329m972M098L318o266
$$ -2204 453 2394 -4507 2156 4142 -6611 -2151 3794 -2019 -241 2088 -2884 1214 4532 -1734
689a734M93K910k311K256j659n848O423M731q731R02O197m647J688M125r263L608
$$ -1734 -1241 1669 -642 1614 -45 -5893 530 5261 -3470 -2568 3629 -1018 670 4795 -4468 -860
705h60P314j0519R93O457q480N959O081j5763P023J2437j5788L126R503j3053
$$ -860 6454 -4065 -3072 3385 -5095 864 6945 -8818 -1795 10642 -5146 -2020 7483 -5570
719e570N962O768j6678Q346R301j5987Q989N071j6850J4968O447k2346J2859Q241
$$ -5570 392 7160 -9518 -1172 8129 -7858 1131 6202 -10648 4320 10767 -11579 1280 9521
733I521j8952J2647K307j8549J8441J935k0526J7743R75j6632K0342l832j9113
$$ 9521 -9431 3216 5523 -13026 5415 7350 -13176 4567 5542 -11090 9252 5420 -13693
746a3693K1861j960j8474J8338m491j1960K0805j0567j3613K4721q183j2930K0794
$$ -13693 8168 6208 -12266 6072 1581 -10379 10426 -141 -13754 10967 2784 -10146 10648
759A0648j1137r337K2392j3401j0871K1270j0556o493J6441j4559j334K0765j7131
$$ 10648 -489 -9826 12566 -835 -11706 9564 -992 -7485 8956 -5603 -6937 13828 -3303
772c303m158J8781j4640j886J5301j6174p5J6098j3797k263J2632j0257K352J0210
$$ -3303 -7461 11320 -3320 -5206 10095 -6079 -6154 9944 -3853 -6116 6516 -3741 -1389 8821
786H821j3689J292J1723j0192j198P630p327J677N418q125J017O607l833R27P05
$$ 8821 -4868 -3576 8147 -2045 -3243 4387 -2940 -1263 4155 -3970 -2953 3654 -179 748 1453
801A453m576M454K427n890k02L792j210j030k24j256K293K919k644k785L408R21
$$ 1453 -3123 1331 3758 -2132 -2334 1458 248 -782 -1006 -2262 31 2950 306 -2479 929 1850
817A850j763R40k534j079N590k876n263N824J879l681K565j384k713N820p14n866
$$ 1850 87 1027 -1507 -2586 3004 128 -5135 689 2568 -1113 1452 68 -2645 3175 2461 -3405
833c405L750m5k031L580l648j394O366k107k993L078j971J722L159o869J249M418
$$ -3405 345 300 -1731 1849 -1799 -3193 3173 1066 -1927 1151 -820 902 4061 -2808 -1559 2859
849B859n241J981J860o182O304L113r147M157L095m804N799k679p317R593p85
$$ 2859 -2382 -401 1459 -4723 1581 4694 -4453 -296 2799 -2005 3794 1115 -6202 3391 2606
864B606q261P714j897m343J0053n840o557J2682m242o175R326p452k443J2762
$$ 2606 -5655 2059 162 -4181 5872 32 -6525 6157 1915 -4260 5066 -2386 -4829 7933
878G933j0521m582J4169q437k930J1236j1084Q60J3898j3299k404J2571j1260
$$ 7933 -2588 -7170 6999 -1438 -4368 6868 -4216 -3356 10542 -2757 -5161 7410 -3850
891c850J236R643j3527L377J1431j3066J840R751j1180N166O531j3843M770Q494
$$ -3850 -2614 7029 -6498 -3121 8310 -4756 -2916 6835 -4345 821 7352 -6491 -1721 6773
905F773j1864M648M170j0386Q265L635j1878P464M339q229N176M0p741Q642K26
$$ 6773 -5091 -443 3727 -6659 1606 5241 -6637 827 5166 -3063 2113 2153 -5588 3054 3280
920C280q417N634P95m272N623k970l765Q075j155n595L824q61j617M819m206l189
$$ 3280 -5137 497 1292 -2980 2643 -327 -4092 3983 2828 -2767 1057 196 -1421 3398 -808 -3997
936c997N475q86k312K222q96O32K861l491j136K792n26o08n24j222J082J669j668
$$ -3997 1478 592 -1720 502 -394 238 3099 -392 -1528 1264 738 130 -394 -1616 -534 1135 -533
953e33j202J935J505o39r53q24m08L255m07m392J488K169j741J002l00k294M571
$$ -533 -1735 200 1705 1066 113 -711 -1119 2136 1729 -2663 -1175 994 -747 255 -45 -2339 2232
970B232R00n462K308K010k963K672j242n097O497N59o484M726J326m306N815k123
$$ 2232 3132 -2330 -22 1988 -975 1697 455 -4642 1855 2414 -4070 656 1982 -2324 3491 1368
986A368o305Q453m93p067N843k196l789Q902n276n162J0116l552l874P632o273
$$ 1368 -4937 3516 3023 -4044 1799 -397 -4186 4716 -560 -5722 4394 842 -3032 4600 -1673
1001a673j063R438q041l609R331o647n80Q454r606N37J0760r812q25R214q784
$$ -1673 -2736 6702 -1339 -4948 4383 -2264 -2844 5610 -3996 -3459 7301 -2511 -3336 5878 -2906
1016b906K236P190j1912K586R519j0419J451O448q941N244N614j1485M647O687
$$ -2906 -670 6520 -5392 -2806 6713 -3706 -2255 4193 -4748 496 6110 -5375 -728 5959
1030E959q729K878K118p408O754K474r388M956K874n458M777m05n067O803l99
$$ 5959 -2770 108 2226 -5182 1572 4046 -5342 -386 2488 -2970 1807 1402 -3665 3138 2739
1045B739o618M797k08l656N426k567m433P028r20m116M125j014j556M024k776
$$ 2739 -3879 918 710 -2946 2480 -87 -4520 2508 1588 -2528 1597 583 -973 3051 275
1060B75l216L659J98j767M84o47M58K111r19j315P08J550k15k118l07J072N91
$$ 275 -2941 718 916 -851 -367 -1014 -556 1555 636 -679 29 1579 1364 -754 -1061 11 602
1077F02K2k113p93L164J57j649P18l6K99K237l198j794M445j478k037K045k803
$$ 602 624 -1489 -2282 882 1039 -610 108 72 371 2608 -590 -2384 2061 583 -1454 591 -2212
1094b212J129L976l832j288M763k243m16K086m829K400M203o352N58L814l679
$$ -2212 -1083 2893 -939 -2227 2536 293 -123 1963 -2866 -466 3737 -2615 -2057 1757 -1922
1109a922K228K207n288K966L650n192R58J785l610L675R5n463L733J757l220K806
$$ -1922 306 2513 -2775 191 3841 -1351 -393 1392 -2218 1457 1552 -3911 -178 1579 -1641 1165
1125A165r46k335N282j684m423M221l28k116L050m025o63N623k975j909L812k465
$$ 1165 219 -2116 3166 1482 -2941 1280 952 -1164 1886 -2139 -2802 2821 -154 -2063 1749 -716
1141g16J212K843n559J216L982m092J78J562l113K874K091n269K341K577k616
$$ -716 496 3339 -2220 -1004 2978 -1114 -936 626 -2487 387 2478 -2791 -450 2127 -489
1156d89J996q10k848M152o00m221K691N35j859L223k225k095M758q58j644J251
$$ -489 1507 697 -2151 2001 1401 -2820 -129 406 -1453 1770 -455 -2550 2208 1350 -294 957
1172I57j471O37J632l077P3J541j198J883r97k523L990J098m005J893N49j924
$$ 957 -514 123 1755 -1322 -1249 292 -906 977 -20 -2543 1447 2545 -1460 433 982 -942
1188i42K434j558k879L734K55k409J736j570N28L955l987j002L874k155n67J789
$$ -942 1492 -66 -2945 789 1044 -1365 371 -1199 -671 3284 -703 -1705 2169 14 -553 1236
1204A236l583J359L801m683N26K966k837K477O39m831L973J916n186K779J7l783
$$ 1236 -2347 -988 2813 -1870 -1344 1622 -1215 1262 1901 -2930 1043 2959 -2227 552 569 -3214
1220c214M929l5n913M800K237m670L052N4l614M826p17m493L060L06k172K980
$$ -3214 1715 1680 -4233 567 2804 -1866 1186 1240 -2374 2452 1735 -2758 302 608 -1564 1416
1236A416k612q99M591j522k724K876n19q38J981k636j388L864j021j868P50Q9
$$ 1416 -1196 -2095 2496 974 -1750 1126 607 -231 1750 -886 -2274 1590 569 -1299 -549 -460
1252d60P49J214j027j686K059M63r74q54j14P12l0k19r85J65K484j218j345J559
$$ -460 289 1503 476 -1210 849 1312 338 -516 -630 82 52 -167 -1152 -987 1497 279 -1066 493
1270D93K2m55J572k492p43L646j935k178K496j007O5L032l374n36M033k244j062
$$ 493 515 60 1632 -860 -1603 2043 108 -2070 426 -581 -516 2516 -858 -1394 2639 395 -667
1287f67K162l330J102L351m959J99M278l062P34J773l687K780L133n928J512K689
$$ -667 1495 -1835 -733 2618 -2341 -2142 2136 -926 -192 1581 -2106 674 3807 -2121 -609 2080
1303B080l948K338P95m805L823K419n041K811R31k726L813r85m530M698k32l715
$$ 2080 -1868 470 1265 -3540 283 2702 -2339 472 1403 -1323 2490 1505 -3025 1673 1441 -2274
1319b274L044j327j406M104j855k897M179q26j194K511l383J04L863l459q81K784
$$ -2274 770 -557 -1963 2141 286 -2611 1568 742 -452 2059 -1324 -1220 2643 -816 -1697 1087
1335A087k351J174K034m176J771L300l794R16J037l044L291P04n272L129K074
$$ 1087 -1264 -90 1944 -2232 -461 2839 -955 -39 998 -2046 1245 1949 -3323 -194 1880
1350A880l174K131q85k028M412n94l796K896j24k083L404k713k544N210j280k942
$$ 1880 -1294 837 -48 -2076 2336 1742 -2054 842 718 -1365 2039 -674 -3218 1992 712 -2230
1366b230L465j043j161L569k952j167L335j395k078K469j672M0K394k153j207
$$ -2230 1235 192 -969 2600 -352 -1519 1816 421 -1657 812 -860 -820 1574 -579 -1786
1381a786L126o66j070J164j094L1J803j551j556J171J127r36M13p11m07K255p2
$$ -1786 1340 674 -396 768 -326 -295 1508 -43 -1599 -428 699 -237 176 -535 -942 1313 1241
1398A241k187K76J704r44k59J0j320K067J003l194O02K724j920N41N79k739K630
$$ 1241 -946 -670 1034 90 -169 -159 -1479 588 1591 -1603 -1001 1723 -197 344 923 -1816 814
1415H14J485m318J092J923k455K208p8l421L554J616m055K067P14k588K977l18
$$ 814 2299 -2019 -927 996 -1459 749 671 -2750 804 2420 -1635 432 1146 -1442 1535 1217
1431A217m287L866O36l670L097p98k416N072j357m128M398j20k960K898k366j314
$$ 1217 -3070 796 1432 -2238 859 61 -2355 2717 1360 -2768 1630 1510 -1450 1448 -918 -2232
1447b232M653k525k435L787j562m0K644l571N91L485l176o21J788k579J637J885
$$ -2232 2421 -104 -2539 1248 -314 -354 2290 -1281 -690 2795 -381 -1002 786 -1793 -156 1729
1463A729m264J797L158l145J142O91k862L089R74m432K157Q32k242K318j010k787
$$ 1729 -2535 -738 2420 -725 417 1108 -1754 1335 2309 -2123 34 866 -1376 942 -68 -2855
1479b855M534o15l032L442r73j603L294k421k253M338j616k312L298k089p54M203
$$ -2855 1679 1064 -1968 1474 501 -1102 2192 -229 -2482 1856 240 -2072 1226 -863 -1617 2586
1495B586l329j132M366j985j237K363l010Q0L805l477j331L817j729j94J807k634
$$ 2586 -743 -1875 2491 506 -731 1632 -1378 -1298 2507 -970 -2301 1516 -213 -407 1400 -1234
1511a234N13L643k886j617K703j778j05J793k846M32L311k065j094K349j116l32
$$ -1234 -721 2922 36 -1581 1122 -656 -761 1032 -1814 -1382 1929 -136 -1230 1119 3 -329
1527c29K252k339j453L470j275k744L009n11j343K919j241k894M277n70l036L186
$$ -329 1923 -416 -1869 1601 326 -2418 591 80 -1263 1656 415 -2479 1798 1228 -1808 1378
1543A378j358j807L909k028l272M751n40l263L752j553j920N026k407l747N144
$$ 1378 20 -1787 2122 94 -3178 1573 1033 -2230 1522 -31 -1951 3075 668 -3079 2065
1558B065j512k711M464l396j777O246l162l377N557k100j872M867m030j879O336
$$ 2065 553 -2158 2306 -1090 -2867 3379 217 -3160 2397 297 -1575 3292 -738 -2617 3719
1573C719m036k645N339l587o27M825m583q04O164m127j438M174l845N11L892n008
$$ 3719 -317 -2962 2377 -1210 -1837 2988 -1595 -2399 3765 -362 -1800 2374 -1471 -960 2932 -2076
1589b076J22M383l510K11K818l756J869K648m121J045K204l054J754P35l952K813
$$ -2076 -1954 2429 -1081 -870 1948 -1808 61 2709 -1412 -367 1837 -1217 537 1272 -2680 133
1605A33J710l691J373J604k387K250M98l394K671P30k394Q07m11q76K515q81k114
$$ 133 1843 -1848 -475 1129 -1258 992 1490 -1904 767 1497 -897 -90 -501 -1377 1138 257 -1857
1622a857K330L99j071J021j372K81J891j567j598J561J51l33N33j252M31J749
$$ -1857 473 872 -199 822 -550 -269 1622 55 -1543 18 169 -164 369 -883 -452 1297
1638A297q99m66L89k54L15L35j794J46J744j005p04J023m62L05J208r17r54J504
$$ 1297 398 -68 321 67 382 717 -1077 -931 813 -192 -896 127 -335 -30 1178 261 -693 811
1656H11K73j924N45J6m31J124m17j634K067O99j642R23n20j146L105j319k809
$$ 811 1084 -840 -295 -279 -710 414 -3 -1637 430 1129 -513 410 -110 -1256 1849 530 -2279
1673b279K886L53k792K801j088j709L817j273k713L679q00k248K877k013j754
$$ -2279 607 960 -1832 969 -119 -1828 1989 716 -1997 1682 882 -1366 1511 -502 -2256
1688b256M446k119k762M211j681j375M342l233k049N511k714k456L963k420j048
$$ -2256 2190 71 -2691 1520 -161 -1536 2806 -427 -2476 3035 321 -2135 1828 -592 -1640
1703a640M266l585j758N092k615j032L396l327N42L609m040m82L282k579k09K251
$$ -1640 2626 -959 -2717 2375 -240 -1272 2124 -1203 -661 2948 -1092 -1574 1708 -871 -1080 1171
1719A171k896R03L485l873j82L455k605P72J372l339J166K331k916n8K097j447
$$ 1171 -1725 -822 2663 -1210 -1392 2063 -542 230 1602 -1737 -571 1760 -1156 -1214 883 -564
1735e64Q94Q98k266P34J966j436o55O25n96K83M03r97j34J533l27n99K05J05N7
$$ -564 330 1228 -1038 -304 1662 226 -429 196 -400 -117 286 -711 -845 688 361 -238 -33 72 129
1754A29Q20q62q99J495l3j748M94M78l58J195j68j736J329J704k132o4J011j577
$$ 129 949 87 -812 683 650 -1098 -604 -126 -484 711 543 -1193 136 1840 -292 -356 655 -922
1772i22J323K37k407J577J042j492P08K55j262K330n48k264J797M58j379O14l99
$$ -922 401 638 -1769 -192 850 -642 66 321 -941 1389 841 -1423 374 832 -547 67 -332
1789c32r06J966P0j923R88O48o32J153j091o87J463k93j081K12J77m4J022j349
$$ -332 -1238 728 798 -1125 -137 511 -121 1032 -59 -746 717 424 -657 -445 -268 -312 710 -639
1807f39M7J337p08O92p62n29J151j61j333N79J27q5R24j137l00J916p51m61N42
$$ -639 -592 745 37 729 -33 -562 589 428 -905 -326 -199 -284 640 -497 -797 1119 368 -93 449
1826D49r09L92J336j934o2R97o12m7J026k187J759J675k517K90J308j532J222
$$ 449 -460 -68 1268 -666 -728 269 -343 -390 636 -1551 208 1883 -634 -344 964 -568 654
1843F54j24j936J376J030k268J082O29j180J450Q9k052J761O03j620O30j63p12
$$ 654 530 -1406 -30 1000 -1268 -186 443 -737 713 802 -1250 511 1114 -506 124 -39 -751
1860g51J446o61j360J369P60j079M22n86j52J260J15j710N84L67j02L19p18J90
$$ -751 695 34 -1326 43 803 -276 146 -440 -592 668 783 -927 -343 24 -78 241 -477 -287
1878b87M01K38m3m75K76P27p68k80N2k20Q18k27j268P99J379j175K43M6q64J455
$$ -287 114 352 309 -166 110 837 69 -211 -159 -379 439 212 -1056 -257 1122 -53 190 236 -628 827
1898H27k7k148J206R27j430O37k74j028K014K79j955J333L1q17J161o79j364K290
$$ 827 800 -1348 -142 785 -645 -8 -282 -1310 704 983 -972 361 392 -425 736 57 -1307 983
1916I83l07j875J379k11m58J796j127j250K349q92j250R24m2n73J283j407o63
$$ 983 676 -1199 180 -31 -489 1307 180 -1070 1279 387 -863 61 19 -554 729 -678 -1341
1933a341J592K77q33Q31p54O4J500j045j072Q53J71m57k46l82O07J089q01m56
$$ -1341 251 528 -305 526 -228 -164 1336 291 -781 72 243 -214 -460 -842 -235 854 53 -403
1951d03J46J011l41n11j51K28J12K18o97n73J188m6l51K40j11k40J322r34j031
$$ -403 -257 754 413 -98 -249 -21 91 309 -388 -961 227 181 -170 70 -41 -281 1041 107 -924
1970i24J536j00j150Q22n85m79J788j255n23J228J34o74J160j466j83J723p20
$$ -924 612 512 -638 184 -401 -880 908 -347 -870 358 492 -182 978 -488 -671 1052 332
1987C32j343J111l01j21J196j514K17J457q39o51P34p26M77M93j300J54J276p32
$$ 332 -1011 100 -201 -322 874 -640 -423 1034 195 -456 278 -448 29 522 -778 -624 652 -80
2005h0N7M7J1O91M1j238J81O73k77L31j056J1J155l29n75K27j85R34K98j647P15
$$ -80 -23 24 35 726 767 -471 -290 383 106 437 -619 -608 547 218 -357 -130 -315 619 917 -730 -15
2026a5N75q94L01L5j115J748k79j243J152K30q87J311r26r66J897l96j294P81
$$ -15 560 -334 -33 2 -1113 635 356 -887 265 495 -392 919 -7 -973 924 528 -766 15
2044A5m04l48J555j064j240K277m57o02R09j029j92J902j590p39J721o76n58Q57
$$ 15 -389 -737 818 -246 -1486 791 334 -268 641 -388 -580 1322 -268 -1007 714 38 -520 337
2062C37j127K40J848j420n86J318n62l23J182j412j55J673j167m42O64m01N14
$$ 337 -790 -550 1298 -122 -708 610 48 -275 907 -505 -660 1013 -154 -596 68 -333 181
2079A81N86q97k24J049m96n28K93N7j44O97q39o52J528k56m17lK54k14N89l85
$$ 181 767 -130 -354 695 199 -329 -36 21 -123 574 -265 -917 611 355 -62 -65 189 -25 564 179
2099A79j219J100L47q26J89K95k84O85O1j157Q34O68j027J06j42l67J130q3j700
$$ 179 -1040 60 407 -419 -230 65 -219 466 527 -630 204 872 -155 -49 -191 -558 572 489 -1211
2118a211J016P88j081R13j05j344J883k59j583R95L95q96P46m21r21J446K11j288
$$ -1211 -195 593 -488 425 320 -1024 859 600 -983 12 407 -489 257 -164 -1085 361 572 -716
2136g16J216j71m88Q24o82r15J286l6q33M06m84J49J638j446n29J511o59l75N05
$$ -716 500 329 -159 665 -17 -932 354 318 -515 -109 -593 -444 1194 -252 -781 730 71 -304 201
2155B01r72P54O33j060l84P63k05O90m00l64O85K74j011K51L34o78J237j034r85
$$ 201 -771 -17 616 -444 -828 -65 -270 420 20 -344 341 615 -396 -145 189 -489 748 -286 -1271
2174a271J370P7l53O04n98j94J516q52j023R71j61m93O23r61K28J047o51k98L28
$$ -1271 99 176 -177 427 -171 -365 1151 299 -724 247 86 -407 216 -745 -517 530 -121 -419 -91
2193i1K36Q2R4n23m21J348o83k15j44m63J166K16r44j8J207l21k75l95j49K53
$$ -91 145 227 321 -202 -623 725 42 -173 -317 -780 386 602 -342 -360 847 526 251 -144 -293 -40
2213d0O67j218o5O46M17m05k33Q0M97P8m16n18P02Q9l22n61R3R7Q42J7j324P14
$$ -40 627 -591 -656 -10 407 2 -231 -151 346 424 8 -510 192 281 -41 -602 -509 -412 430 447 -877 -163
2235a63O97o82N39o7q63J042Q1j454R23K14r50J245q94p37J812m9j581J490k40
$$ -163 534 -148 391 324 -539 503 584 -870 53 267 -683 562 -332 -1069 743 694 -887 603 363
2254C63p46J349j072j113J723k46j316J479n41l94J571r91j318J754J07j131Q43
$$ 363 -383 966 -106 -1219 504 258 -1058 421 -120 -514 1057 66 -1252 502 609 -522 321
2271C21n72m51J816r82r62J385k67n72P24p16j51J391p98r99Q32o4j83P41q72
$$ 321 -251 -702 1114 132 -830 555 288 -284 440 -276 -427 964 166 -833 -1 -65 -248 493 -379
2290c79N3O70K93q55M31l60M66%k71m61L72L48m57j25J71L36L13o02m11P20J07
$$ -379 -326 344 637 -218 213 -147 319 319 48 -413 -41 307 -150 -275 -104 232 545 -57 -468 252 359
2311C59p6l84R5o3k16J78k85l2J171o25j09K61N1k36L42p54k57J197l82q99O15
$$ 359 283 -101 -6 -69 -285 -107 -392 -424 747 122 13 274 325 89 431 -323 -580 617 235 -664 -49
2332d9j89L96j18l87O2J019o09l1j72j92L32M06j062Q0R14m60L38m45n79J213
$$ -49 -238 158 40 -347 -285 734 125 94 -78 -270 62 468 -594 -514 400 -60 278 -167 -746 467
2352D67J81p00k02K72k02K35j73k58O46K7l39K53r4J37M0k24m29L84l6j19K0n06
$$ 467 648 -52 -254 18 -184 51 -122 -380 266 293 -46 207 113 250 290 66 -363 21 -15 -134 -114 -620
2374f20P09M02n49L44l27K23J90l12q50R13j49m44N13m45J48P84o77n13R69K93
$$ -620 89 491 -58 286 -41 182 372 60 -790 123 -26 -470 43 -402 -254 530 -147 -660 309 602
2394F02n14K35m99p6R04p42k23M69j55J74M31r64J10Q78l74m05M57l69L47K02
$$ 602 88 323 -176 -252 652 -90 -313 156 1 175 606 -358 -248 630 256 -149 308 -61 286 488
2414D88j235J11J221k65m77Rr9P44K41j074L0M11K62n01l08P4M47k29k7J8L72
$$ 488 -747 -636 585 320 -157 -148 -247 497 738 -336 -306 105 367 -134 -442 -368 79 -150 -177 -159 213
2435B13J42j88m07j4M13k31R4p64M25M72k49j60M74j88O5L72m01l25R04o07k38
$$ 213 355 167 -240 -254 159 -72 22 -742 -317 155 -94 -254 220 32 97 469 68 -257 647 40 -198
2456a98N67p24K24L14o28J04P74j0l22L21r02P15K03j074J99N14j12l17M44n13
$$ -198 369 -355 -131 183 -445 -341 433 423 101 422 -480 235 438 -636 -437 77 -35 -352 92 -421
2476d21N64L90o87N6K15j73K87r8o68L18M34m44o4L00j05N98j49p42O43J96m99
$$ -421 143 533 -154 -98 117 -56 231 133 -535 -217 217 -227 -291 9 -96 502 353 -389 254 450 -49
2497d9k78K48j35K33j31m19L19K34M34k00j16j99K41J27k93m19J80P91p41l18
$$ -49 -327 -79 -214 19 -112 -531 -212 22 456 256 140 -59 182 309 16 -403 -223 568 -173 -491
2517d91L70L18J15q5j40j67P94q82J53K79m28L91j35p47L79N94l27M09k76m80
$$ -491 -121 197 312 227 87 -80 714 -168 -15 264 -164 227 92 -655 -276 318 -9 400 124 -356
2537c56R18j21q78K37M77m65L38l74m8L92N14p90K07L89k40K57p38k43J196n89
$$ -356 562 441 -437 -200 277 -188 150 -224 -272 120 634 -156 51 440 200 457 -281 -524 672 83
2557H3n48N25j24k60Q93p60kO18j54j82j48j50L70L54p49l20M67K92k15n6j57
$$ 83 -465 60 -64 -324 569 -191 -193 425 271 89 -59 -209 161 515 -234 -554 -87 205 -10 -66 -223
2578b23M13K29m0o31J88m1L51j09o19L29K78k04Jnk9N19l13k80J52j19O22n23
$$ -223 190 419 379 -252 -64 -105 246 137 -482 -153 125 -79 -78 -83 -112 407 94 -186 -34 -153 469 -54
2600e4m58O73N57p81Q5J04j43M34k65m74M96J3k75j7M2r9M54n8p03Q95j95J37
$$ -54 -512 161 718 -63 22 126 -17 417 152 -322 174 187 -88 -105 -63 -162 292 234 -469 426 231 368
2622C68k5m79J04M58j47n25R0L2K97n8m22K33J61N6J1j32k63L65k27o57O29L00
$$ 368 343 -136 -32 426 279 -246 -156 -124 173 115 -307 -74 87 143 154 22 -241 124 -103 -760 -131 169
2644A69j21q4o8J34K99O9k43j89n3J14L1k13k73N62P7m76N41m05N62k41l79P4
$$ 169 48 -36 -104 30 329 398 155 -34 -87 27 58 -155 -428 134 211 -265 276 -129 433 192 -187 -113
2666a13K84l14M76k05m36O12mo86J49j41M17J20k96k04O08j27l37k00J42J18L68
$$ -113 171 -143 333 128 -308 304 300 -386 -237 -378 39 159 -137 -341 267 140 -197 -397 -255 -137 231
2687B31J32o45O58k2j00k11k70M73J65o54k19K66N08O8m64J6J45R7o6j80j61j5
$$ 231 363 -282 376 354 254 43 -227 246 411 -243 -462 -196 312 380 -84 -68 77 174 108 -72 -233 -248
2709b48M24l78m15R2P12k72j62j20J81O42m31j40R4J42L23p18l9L42K37j1l47
$$ -248 176 -202 -617 -525 187 -85 -247 -367 -186 456 25 -115 -21 121 444 -274 -313 29 266 255 -92
2730i2K00k93M83K8l08J90K48l11O2n36J79K52k22k07M40m20K91K79n84J25P87
$$ -92 108 -185 298 326 18 208 456 145 207 -329 -150 102 -120 -327 113 -307 -16 263 -321 -196 591
2751E91l66k48r5j38K67L72p35j14Q27j16k71R1p2J03L27p24K08K36j75Q1n5m57
$$ 591 225 -23 -118 -256 11 383 -352 -466 361 245 -26 65 -7 96 423 -301 -93 143 -32 49 -6 -463
2773d63N11K92n28K58N0J83J39q85N5O77l76J62l53j78O02L16m84O6K04R5j62
$$ -463 48 340 -188 70 120 303 442 -443 -388 289 -87 75 -278 -456 146 462 -22 44 248 343 181
2794A81m66K4L26l4j93Q2o9J81J27j45j91L70L42r38K54k52M56J64k39k72M40
$$ 181 -285 -261 65 31 -162 -80 -149 32 159 14 -177 193 535 -403 -149 -401 55 219 -20 -292 148
2815A48l89M91j50o11M59M64l99lJ07o27N68j83m03J04O82k48J71L3m11L55m0
$$ 148 -241 250 100 -511 -52 412 13 10 117 -510 58 -125 -528 -424 258 10 181 214 -197 158 118
2836A18l36j26L18J84k19k10l9N24o0m28J11M82k53K45n53k0M46j27q3m30N26
$$ 118 -218 -344 -26 158 -61 -271 -310 214 154 -274 -163 319 66 311 -242 -262 184 57 -26 -456 70
2857G0k6n8q3O2k4M94J1n74Q1j54L12p8n38K04M76l33k42L23L20k61J25j12m63
$$ 70 44 -14 -97 -35 -59 435 446 -128 -47 -201 111 33 -505 -301 175 -158 -400 -77 243 -18 107 -5 -468
2880d68R45k11p67O50j70j90M55m56K01L60j14k84Q5L9K0Q0k33J92k86q6qL38
$$ -468 477 266 -501 149 -21 -211 244 -212 -11 349 235 -49 36 75 95 175 -58 134 -152 -238 -246 92
2902I2k87J40M89l62J79k83K48k45j59j06Q7N19n24R7L34j8k68K19k82N50j93
$$ 92 -195 -55 434 72 251 -32 216 -29 -188 -294 -207 312 -212 -115 219 201 -67 152 -130 420 227
2923B27k13j23K57m04R8J31l07J51K66J0j29K5J21J70j44m62J64O37n99K30p6
$$ 227 14 -109 148 -256 -158 -27 -334 -183 83 93 -36 -11 110 280 136 -326 -162 475 -124 106 30
2944C0k66J47M5O1K91k91l2K56j51m52O86o28PJ18O1K74J68P7o66K61L12l12j98
$$ 30 -236 -89 -44 17 308 17 -15 241 90 -362 324 -304 -297 -179 -118 156 324 401 -265 -4 308 -4 -202
2967b02Q6L38l30j99L55j6K24m14Q6j88K41J74l45k73L53Q9J68k37L3j81N13k67
$$ -202 -116 222 -108 -307 48 32 256 -158 -72 -260 -19 155 -190 -463 -110 -21 147 -90 -57 -238 275 8
2989Hk46L18P4Q9J27n25m62P69k29j22M7J21o9P8J69l09M55o3k98j09J37j45M84
$$ 8 -238 80 154 243 370 -155 -617 152 -77 -199 -152 -31 -100 -22 147 -162 293 230 -68 -177 -40 -185 299
3012B99n60m3O32pk65O1M1l16M89o76J11N35k98j39L33m53o8N27l03j71O58l80
$$ 299 -261 -304 328 321 56 117 158 -158 331 -345 -234 301 3 -136 197 -256 -324 203 -100 -271 387 7
3034GK55j78k28L09K39m54k50L83P8j98J52k45L54K9k14J4p1l8J90P4l23J04J8
$$ 7 262 84 -144 165 404 -50 -300 83 161 -37 115 -130 224 253 39 53 -18 -56 134 208 -115 -11 7
3057GP8J38j16p0Q3j74l04N6K19L28r6j80l19N19L2m68J4M79L7j40o7j57P06n97
$$ 7 85 223 107 37 120 -54 -358 -302 -83 245 149 -31 -350 169 201 -267 -253 226 263 123 56 -101 605 8
3081Ho3j95k74O18K5m55K94j11L26j66rJ49j56r6K78l16J15L43l21m61K27K68
$$ 8 -55 -250 -524 94 119 -336 -42 -153 173 7 -2 147 -9 -105 173 -143 -28 315 -6 -467 -240 28
3103B8K19j20k34M11M3n42J51j25J05J13J43m47j93K53L43j60J25l23K98l7K6
$$ 28 247 127 -107 304 347 -195 -44 -169 -64 49 192 -255 -448 -195 148 -12 113 -210 88 51 77
3124G7j11q1k4K41J47k49K23o2k36J25k06j3K29k01j91L48L53n27J41j12J47J36
$$ 77 -34 -115 -139 102 249 0 223 161 -75 50 -156 -169 60 -141 -332 16 369 -158 -17 -129 18 154
3146A54Kj70kK40pn59L78l45M26J76m02K99k6k6J39n19K79K71k99k08J09p0m3
$$ 154 156 -14 -16 224 217 -342 36 -309 117 293 -109 190 164 138 277 -242 37 308 9 -199 -90 -160 -203
3169b03K47l37o1N32O4j46K69l27L64r2l67k26K12K35m02K40m6J44JJ2J77M4k32
$$ -203 44 -293 -354 178 242 96 365 38 402 310 -57 -283 -71 164 -238 2 -44 100 101 113 290 334 102
3192A02L3Pm63N59l98J35p1L0L07M1m57K58O1L1j86J28j83q9p0J17j61N4M48l40
$$ 102 135 142 -321 238 -160 -25 -96 -66 241 282 -175 83 144 175 -11 117 -66 -155 -225 -108 -269 -215 233 -107
3216a07J75l45N60j04jl12J59l74K08K77m61L16K66K0n1n02L12P8J78l04j57K86
$$ -107 68 -277 283 179 178 -134 25 -349 -141 136 -325 -9 257 277 226 -276 36 114 292 -12 -169 117
3238A17j98K40l90K41K37k30q8O2K10k32j80J77j63L10k02rk60M09k03K2J05J9
$$ 117 -81 159 -231 10 247 17 -71 -9 201 -31 -211 -34 -197 113 -89 -98 -358 51 -152 -130 -25 -6
3260fL1q0J45o66M63j10P0N7o3K38R6r7k75L16o6j12J80k80j97M57o3m19K34l
$$ -6 25 -55 90 -576 -113 -223 -153 -96 -159 79 175 78 -197 119 53 -59 121 -159 -356 101 38 -381 -147 -150
3284a50k1L04k40Q0M61m25o7J9k37K62m0R4j63j1j9N22m40j33K72j25K5J18K58
$$ -150 -171 133 -107 -27 434 9 -58 -39 -276 -14 -54 40 -123 -134 -153 369 -71 -204 68 -57 -32 86 344
3307C44m31p2l5L1L81k97Q4L09n29K12J96l26M0K01J44q0k46jK78j12j80j4K96
$$ 344 -87 -159 -194 -163 218 -79 5 314 -215 -3 193 -133 -93 108 252 172 -74 -75 203 91 -89 -103 193
3330A93J35k85p1J39j18K6j05J74k6m84N93k10j77L63j34R7m0J29k07K14l68K41
$$ 193 328 43 -28 111 -7 19 -86 88 62 -422 171 -39 -216 147 13 110 70 199 -8 206 -162 79
3352G9k52J49J87o43L32K57O6k09K05p70M56K57J01m19J21J95k23L04j89j01K13
$$ 79 -173 -24 163 -480 -148 109 175 -34 171 -599 -143 114 215 -204 -83 112 -111 193 4 -97 116
3373A16P9l96p4M54l3R9m28J19J81k38k69J19N79l47K1J96Q9jp6k98J26L8K62
$$ 116 195 -201 -275 179 146 245 -183 -64 117 -121 -390 -271 308 -39 -18 178 267 266 190 -108 18 56 318
3396C18j32j46j17n6N13l30p8J46j14J36l72N38k4j70r4k33k9L87k03K11n47J26
$$ 318 186 40 -77 -133 380 50 -28 118 4 140 -232 306 282 112 18 -215 -244 143 -60 151 -396 -270
3418b70M60j52J25M1l37K62k66nlJ53M09k27l03Q3M78m2l49k03J18P8m72N23k46
$$ -270 190 38 163 204 -133 129 -137 -142 -145 8 417 190 -113 -30 448 406 57 -146 -28 50 -422 101 -145
3441a45L54r0ko1J09j04j86L10n9o6r6p2L37m50O01o32K21o8K68J83n09M79k80
$$ -145 209 119 117 56 165 61 -125 185 126 60 -36 -108 229 -221 380 -252 -31 -99 169 352 -157 322 42
3464D2Nj01J07k19J62j11L24Km32K1K40J5j27l5O9j01J37m06N3k0M58k5r0j7L70
$$ 42 47 -54 53 -166 -4 -115 209 211 -221 -200 40 55 -72 -107 -38 -139 -2 -408 -355 -375 83 58 -32 -49 321
3489C21j54k23L11k0n4j3j56k54L78K1L0k51L20l23J20l3l69O58l31Q3k71L78
$$ 321 167 -56 255 235 181 168 12 -242 136 157 187 -64 256 -67 53 20 -349 309 -22 61 -210 168
3511A68o1J8j38m80N87J53k00Om14L14Q3k19q9L55L90m81L0k68L58R9j87k52J92
$$ 168 107 125 -13 -493 94 247 47 53 -361 -47 36 -183 -272 83 473 -8 22 -246 112 211 24 -228 -36
3534c6K85j29k39k52L58J36k89P6K26j84M38m31J69k15M15j85j82q9J36o7J8j86
$$ -36 249 120 -119 -371 -13 123 -166 -90 136 -48 390 -41 128 -87 328 143 -39 -128 8 -59 -41 -227
3556b27R2K38j28l2j50L05j41n8J06j66L11P8l56q8o0K15L2P6K39J81k47l11J35
$$ -227 -135 103 -25 -57 -207 98 -43 -101 5 -161 150 228 -128 -216 -276 -61 -29 47 286 467 220 -91 44
3579D4j7Rj80J37k03J19K05m52N46m09J59P9N8k45M48J3m16J47n0L50j30m80j30
$$ 44 27 36 -144 -7 -210 -91 114 -338 208 -201 -42 37 95 -150 298 311 -105 42 -8 342 212 -268 -398
3602c98K85J3m4J41k96K77J91Lm53M00O6j46p3j52L08M5p1r7J32k88J00Rl04K84
$$ -398 -113 -100 -144 -3 -299 -22 169 172 -281 119 185 39 -34 -186 122 167 96 -1 131 -157 -57 -48 -352 -68
3626f8J28L7J5q6L4J24J65l34j54K15k31K07J33k04M8n6k20M92n36K42L30n61
$$ -68 60 97 112 26 60 184 349 15 -139 76 -155 52 185 -19 29 -27 -247 245 -291 -49 281 -280
3648b80K58n2R8j87K43k57P4L17P4k82o5L36k81k92L11r7K31k92o2o3L17k00Q5
$$ -280 -22 -74 24 -163 80 -177 -103 214 288 6 -59 277 -4 -296 15 -82 149 -143 -205 -268 49 -151 -66
3671f6j9N4O8J38k32n7J90k64K05m1j90M39k11P3Q7k86n2j66M62j62J89j31l2
$$ -66 -85 -31 37 175 -57 -114 76 -188 17 -24 -214 225 14 87 174 -112 -164 -330 132 -30 159 28 -4
3694dj5j08L76p4J1k42L40j07k07k51N2J08J68j91q5K79j80K87j77j19J15J57
$$ -4 -19 -127 249 175 186 -56 284 177 -30 -281 -229 -121 47 -144 -229 50 -130 157 -20 -139 -24 133
3716A33q5K6l77M40J62m66J50M3j7K6k80N24k41J2j46j12J0K96J17k51L7r9o7
$$ 133 48 74 -303 137 299 -167 -17 26 9 35 -245 279 38 50 -96 -208 -198 98 215 -36 1 -98 -165
3739a65j9k31K70K14J2K1k2k16J96o8k48K56k25J70P2n2J51j51l3P6K22q7l43
$$ -165 -184 -415 -145 69 81 102 80 -136 60 -8 -256 0 -225 -55 17 -35 116 -35 -68 8 230 143 -200
3762b00J07p8k15N64n3P5j9q8L2j61p2Q1K63j84J8q2p3J31J22k96Q8J21K14l79
$$ -200 -93 -171 -386 178 125 200 181 93 125 -36 -108 -27 236 52 70 -12 -85 46 168 -128 -40 81 295 -84
3786h4K38p7J8o3J23k52K18P8o6l26n5J27K86k92K11l76L71m96M87r6k13K61P2
$$ -84 154 77 95 32 155 -97 121 199 133 -193 -248 -121 165 -127 84 -292 79 -417 70 -26 -239 22 94
3809I4k22N6K66l69J69J7k22K22k18L90k41Q7j37L22r1l94K77m2J68r9k05J50
$$ 94 -128 -72 194 -175 -6 11 -211 11 -207 183 -58 29 -108 214 123 -271 6 -36 132 33 -172 -22
3831b2K93m13J32K3M3k17J69q1L05l56J5K97K9j73k67M70l71L02j68K4p8K4j26
$$ -22 271 -142 -10 13 56 -161 8 -73 232 -124 -109 188 217 44 -223 247 -124 178 10 34 -44 -20 -146
3854a46M78k49O9j36M06k82k22n7JJ16J60k80j33J78K97j50L38l32k0L06n44Q1
$$ -146 332 83 152 16 422 140 -82 -139 -138 -22 138 -142 -275 -97 200 50 388 56 36 342 -202 -121
3876a21J38K3J35J0k57K58j41N7m15K14q1L84l10j04J81J42o9O4k37J19n7J27
$$ -121 17 40 175 185 -72 186 45 102 -313 -99 -180 204 -106 -210 -29 113 44 108 -129 -10 -67 60
3898F0j31K45k15K75l45k3K42K18m21k1k85M54l4P1Pkl8k22L97j62k69K53J33
$$ 60 -71 174 -41 234 -111 -134 108 326 -95 -116 -401 53 19 90 97 95 57 -165 232 70 -199 54 187
3921A87j1k89L13j63j05J0K82j4k66K25k47j35J72k84L09L08k97k2J96J1k40L4
$$ 187 176 -113 200 37 -68 -58 224 210 -56 169 -78 -213 -41 -325 -16 292 -5 -27 169 180 -60 -26
3943b6J35j06M9k13L35j04p8J66Om54K78k23J19N57n02L39l44N0j01Q1l02L02
$$ -26 109 3 52 -161 174 70 -8 158 164 -290 -12 -235 -116 441 -61 278 -66 -16 -117 -36 -338 -36
3965c6P5j66K20k77M94l97m2j77L35j54kJ96k68k89N36k8k52J54L06l9j41O9p8
$$ -36 39 -127 93 -184 310 -87 -129 -306 29 -125 -127 69 -199 -488 48 20 -232 -78 228 189 48 117 39
3988C9R6o6J7n2J15m04K68K99m18J25J23K2l4q4J65K23l11j53L77k15j49L4k76
$$ 39 135 69 86 34 149 -255 13 312 -106 19 142 164 130 46 211 434 123 -30 347 132 -17 17 -259
4011b59L14j34Pj90M45k86L19j56j16K5m5L0j8L13k67J26J63l44j53M40o2L6j87
$$ -259 55 -79 -72 -262 183 -103 216 60 -56 -31 -76 -46 -64 249 -18 108 271 -73 -226 214 152 188 1
4034Aj37J25K06j58j7J08L7l81M3J53L01k09l34K61m1R9k05JJ76m4M8K48r5j58
$$ 1 -136 -11 195 37 20 128 165 -216 -173 -20 281 72 -262 -1 -42 57 -148 -147 29 -15 33 281 186 28
4058B8K6j03k59L73K3K43k19j73j3J37k96K06J91m46K80j04J88P4J7j92QQ3n1
$$ 28 54 -49 -308 65 88 331 112 -61 -74 63 -233 -27 164 -282 -2 -106 82 156 173 -19 -11 72 21
4081B1J29k71J44m2L16k83J93m46M52m2l16j8j89J26L61l8q2m8o4J19n3k65J58
$$ 21 150 -121 23 -19 297 14 207 -239 213 171 -145 -163 -352 -226 135 97 15 -33 -97 22 -31 -296 -138
4104a38R7k42N5J93J36j88Q3M5K45n13L55m58J55K02j81J24J48k84K14J60j05
$$ -138 -41 -283 -228 -35 101 -87 -4 41 286 -227 128 -330 -175 27 -154 -30 118 -166 48 208 103
4125A03r5r8L13k71Nj9K15j08P9j23r8L05j64j78K34K5j50J91n7j90J20j14J34
$$ 103 8 -90 223 -48 -43 -62 153 45 124 1 -97 208 44 -134 100 125 -25 166 109 -81 39 -75 59
4148E9k95K95m5k5j6l83N25j00J00l90N50k06Q6K2m59K3M70j27m4j84R8J86m62
$$ 59 -236 59 14 -11 -27 -410 115 15 115 -275 275 69 155 177 -282 -259 211 84 40 -144 -46 140 -322
4171c22L55k20O3j1o5jK33L1R6j43J01j87J86P5r3k10R7J54l80M30k24p7J72j28
$$ -322 33 -187 -124 -135 -200 -201 32 63 159 16 117 -70 116 191 98 -112 -15 139 -241 189 -35 -112 60 -68
4195f8P0j50K92j63p3m7N9K8J43l22K72J87k48M06n05L20j28j0J15Q4k21J50l
$$ -68 2 -148 144 -19 -92 -139 -80 -52 91 -231 41 228 -20 386 -119 201 73 63 178 262 41 191 188
4218A88r1J98k56R0j57P2%j58J59j63J07J75j98j4j02J59j53J08n4j28J96L7R8
$$ 188 97 295 39 129 -28 44 44 -114 45 -118 -11 164 -34 -48 -150 9 -144 -36 -90 -218 -22 15 113
4241A13j49kk7K01l07M6J80Q3J49k34k05J53L8j8Q8K8k87qK90j86k34O0o7J11
$$ 113 -36 -38 -65 136 -171 -125 55 138 287 53 -152 1 39 21 109 137 -150 -158 132 -54 -288 -228 -295 -184
4265a84J66J97j98l0J45o7P4j74k0P7M5J42P3k11k4r1M42k43k41rJ53J93k18k79
$$ -184 -18 179 -19 -49 96 29 103 -71 -91 -14 31 173 246 35 11 -80 362 119 -122 -131 22 215 -3 -282
4289b82K71P2J64r0l53J92J3K73l63R4J86K1j04m62M84j22K04k67L03l50L8L89
$$ -282 -11 61 225 135 -218 -26 -13 260 -103 -9 177 198 94 -368 116 -6 198 -69 234 -116 -78 311
4311C11l38J20j97j08k0J20K07J75j88j66j82J50L23l00L56j73k16l2P8J62l39
$$ 311 -27 93 -104 -212 -232 -112 95 270 82 -84 -266 -116 207 -93 263 90 -126 -158 -80 82 -257
4332b57M12k70j88N13k16L8L65l92q1j51M50j56l1j61L07j30k3qp1K6j57M9O1
$$ -257 155 -115 -303 210 -6 32 397 5 -76 -227 223 67 36 -125 182 52 29 21 -50 -24 -181 -132 -71
4355g1k53K80R0P2k40K69j08ok48K47j9O5k7l23N17k43j53K8J37m4J13J8j26J76
$$ -71 -324 -44 46 118 -122 147 39 33 -215 32 13 78 51 -272 245 2 -151 -123 14 -30 83 101 -25 151
4379A51K16m91k8K35P3r2l9k61J74q0j50N40k33j95O4K16J9j25J53P6m55K04K05
$$ 151 367 -124 -152 83 156 64 25 -236 -62 -142 -292 248 15 -180 -116 100 119 -6 147 223 -232 -28 177
4402A77k11p1O0J52j02J86j14j82J54j01j38J41M0K02j11j37J7k70J66L29j31
$$ 177 -34 -105 -45 107 5 191 77 -105 49 -52 -190 -49 -9 193 82 -55 -38 -308 -142 187 56
4423E6n8l9J7r7K34k9k69J78m0j95K61L21n35J76o0o5K87L0k91J45J05K22l24
$$ 56 -2 -41 -24 -121 113 84 -185 -7 -47 -242 19 340 -195 -19 -79 -144 143 173 -118 27 132 354 30
4446C0k53J17O8K10j37o4rJ24k2o2n4j37P9N23k49J07j99Kj1n5J00j49J83k58
$$ 30 -223 -106 -38 172 35 -29 -38 86 64 2 -52 -189 -110 413 164 271 72 74 63 8 108 -41 142 -116
4470a16J81J71k13O6n7j65J82Q9L3j83K02l96L51n19N08j67Rj73K00n6q7J50J09
$$ -116 65 236 23 89 32 -133 49 138 171 -12 190 -206 145 -374 134 -33 -24 -197 3 -53 -140 10 119
4493A19j62m9J60j49K25k93M1K39j00J90j50j37K88l96J55L29n31J92P3L81k88
$$ 119 -43 -92 68 -81 144 -149 -108 131 31 221 71 -66 222 -174 -19 310 -221 -29 44 425 137
4514A37J69l97K23k42K19j68l2J61j08J10m0K81l48J41K00l69J16q3j39N7K28
$$ 137 306 -91 132 -110 109 -59 -91 70 -38 72 32 313 -35 106 306 -63 53 -30 -169 -112 116
4535A16o0j73R1J27l02L34j36m5j14Q8P3j1n5k89R3K65j04N7L62l63n6J97J63
$$ 116 56 -117 -26 101 -201 133 -3 -48 -162 -74 -1 -12 -67 -356 -263 2 -102 -45 317 -46 -102 95 258
4558B58j60K84j51j63k85J29J53M1r2k87O71l60O8q4j14L22m37L38j76j91L95
$$ 258 98 382 231 68 -217 -88 65 106 14 -273 398 38 106 22 -92 230 -207 131 -45 -236 159
4579A59k6J25m33J80L55k68l34j20L79K25j53J43k46m4j03J49j48K9N9m2k0R2
$$ 159 133 258 -175 5 360 92 -242 -362 17 242 89 232 -14 -58 -161 -12 -160 -131 -72 -114 -134 -42
4601d2l84K62K20O6P7k36j21L2L5m5L16k11o5K24jk11J74m18N05l29L45m18O2
$$ -42 -426 -164 56 122 199 -37 -158 -126 -91 -136 180 -31 -96 128 127 -84 90 -328 177 -152 193 -225 -163
4624a63L83l79rR8K26l5j57J44j6l4k71J16l0j37L71j83j14J26L2M2l44L42k64
$$ -163 220 -159 -168 -70 156 121 -36 108 92 58 -213 -97 -127 -264 107 -76 -190 -64 -32 10 -334 8 -256
4647b56K58j28J82j67L4K04M75n39j06K93m04K70J47k43J11k58m3J11p3L99k60
$$ -256 2 -126 56 -111 -77 127 602 63 -43 250 -154 116 263 20 131 -127 -170 -59 -132 267 7
4668GJ12P8j25l03L9K52l44K88q7j4k29L45R5K8k97M41j68j01o4K04k60J61q0
$$ 7 119 197 72 -231 -192 60 -284 4 -83 -97 -326 19 114 142 -155 286 118 17 -47 157 -103 58 -22
4691b2j22R0K4R2j65k32M55j21p1K66j31k4j05q9K9J79K6m1k87L67ROj63J19N3
$$ -22 -144 -54 -30 62 -103 -335 120 -1 -72 194 63 39 -66 -155 -126 53 79 38 -249 118 127 133 -30 89 142
4716A42m86K37L6j51L52k33J5J03j19N8j28l8O7nP1K28o6p1K9m1K85l71q9J58
$$ 142 -344 -107 -71 -222 130 -103 -88 15 -104 -46 -174 -212 -145 -150 -79 149 83 12 41 0 285 -86 -175 -17
4740a7J15N8j85K12k33J8l07n3L99P2n7Q0L5l22J50Q6j60L73k39l33M00j36m46
$$ -17 98 156 -29 183 -50 -32 -339 -392 7 79 22 102 137 -185 -35 51 -109 264 25 -308 92 -44 -490
4763d90O66N0k83k61J77P8K23l37L15j30m3K28k63O5Q1j05P3j61K62q5J52j81
$$ -490 176 226 -57 -318 -141 -63 160 -177 138 8 -35 193 -70 -5 76 -29 44 -117 145 60 212 31
4785C1K50l1M3m56p2K56j6P6m3p3K61j08No7l50L92k22k98J48J41n5J33J01Q0
$$ 31 281 250 293 -163 -235 21 5 81 38 -35 226 118 123 56 -294 98 -124 -422 -274 -133 -188 -55 46 126
4809A26k25L18p1l33j07K80P9l23j64K76J62j22L2J29j87K06Mlp2l1P1K60o2m65
$$ 126 -99 219 148 -185 -292 -12 67 -256 -420 -144 18 -104 -72 57 -130 76 80 77 5 -26 45 305 243 -222
4833b22K66J52l44K7K46j46J53j64J57l07M2L59m12J84O1k83K44j44K42O8k85
$$ -222 44 196 -148 -121 125 -21 132 -32 125 -182 -140 219 -193 -9 52 -231 13 -131 111 179 -106
4854a06J3K97J99n14L39k30J16j36L43l50J57n1j1q5j86J95R1j71J81j03N9L0
$$ -106 -93 204 403 -111 228 -2 114 -22 321 -29 128 77 66 -19 -205 -10 81 -90 91 -12 47 77
4876G7r8J08M1l51L19j98P2K73k44O6k32K65j77M7n2P0K56K3m30J77J58K3m12
$$ 77 -21 87 128 -223 96 -102 -30 243 -1 65 -167 98 -79 -32 -84 -14 242 265 -165 12 170 193 -219
4899b19J48K23j01k42L24l64J22K94j02j66j60J76MJ49L8j26K74l60r7K56l03
$$ -219 -71 152 51 -191 133 -231 -109 185 83 -83 -243 -67 -63 86 124 -2 272 -88 -185 71 -232
4920b32J19K44N4j46K1n3m4R6K2Q6j1l92o4M32J69m60J53k59mL60k39L48k10l6
$$ -232 -113 131 185 39 60 7 -37 59 81 167 156 -236 -300 132 301 -159 -6 -265 -269 91 -148 200 -10 -46
4944d6J98ro4k82K25j56O3J04k15J09J87p5k41M14l79K62L7j78L9P4N0j94O0J37
$$ -46 152 143 79 -203 22 -134 -71 33 -182 -73 114 39 -202 212 -167 95 132 -46 -7 67 117 -77 -17 120
4968A20q5n0J41J01l64j0J09Pl2R7J61k62p8J30l16J48j37J71J67k10M4L40n91
$$ 120 35 -15 126 227 -137 -147 -38 -31 -63 34 195 -67 -145 -15 -331 -183 -320 -149 18 -192 -148 192 -399
4991c99N84l15N4k65M70m09K61J44r2j98L5pK2K10l65l0M2L94l07K76q3K14k23
$$ -399 185 -130 -76 -341 129 -280 -19 125 33 -165 -130 -137 -115 95 -270 -300 -258 136 -171 105 22 236 13
5014A3J7o6o5J40m7q9P9L7R6K3j38j10l0r0K33j5L18l87o7L89k06j56J40k29K23
$$ 13 30 -36 -101 39 -8 -97 -18 19 115 138 0 -110 -140 -230 3 -12 306 -81 -148 241 35 -121 19 -210 13
5039A3J66o9m6K17k95j50K09k1K83n53N6R9K06Lk32J64J58k16J33l13L95k66j10
$$ 13 179 110 64 281 -14 -164 45 24 307 -246 -190 -91 115 118 -114 50 208 -8 125 -188 207 -59 -169
5062a69K68o3K90k96K2j05J14n62Q76n72L12j51L44l05l7P3j08J49l73l5M17k15
$$ -169 99 36 326 30 52 -53 61 -501 375 -197 115 -36 308 3 -34 39 -69 80 -293 -328 89 -126
5084a26K39M10o40J78k34L3K01p8k1J73j5l72M34l76K23J6N4k62M37l45k18O29
$$ -126 113 523 -117 61 -173 -140 61 -17 -38 135 120 -252 182 -194 29 45 99 -163 274 -71 -289 340
5106C40k48j5j17o2K22Q8j17j95j0K2p2L3Q1k34L20p5k47K33J16j12J58r9j84
$$ 340 92 77 -40 -102 120 208 91 -104 -114 -92 -164 -131 -50 -284 36 -39 -286 -53 63 -49 109 10 -174
5129a74J81J92j54j97J41J33m88L33q6k79K55J82p9%n07M98L6m3n5PJ56j48k69
$$ -174 7 199 45 -152 -11 122 -366 -33 -119 -398 -143 39 -40 -40 -547 -49 -13 -56 -111 -104 52 -96 -365
5152c65J87J09K26l69M05j64k75J89p1K57l53K81o6k9k7Nn4k6m9M21l65p0R7P4
$$ -365 -178 -69 157 -212 193 29 -246 -57 -128 129 -224 57 -9 -38 -65 -60 -114 -140 -189 232 -133 -203 -106 -32
5176c2K11j41K57n29L27j92K67N4k95J98j22j89M08k68k76N41j68j60N3lJ70q1
$$ -32 179 38 295 -234 93 -99 168 222 -73 125 3 -186 222 -46 -322 219 51 -109 -56 -59 111 30
5198C0j68L94j11j37l59L01J08K9j37r2K23K02k61q2N3J15Mq2m39M59J26j9j33
$$ 30 -138 256 145 8 -351 -50 58 87 -50 -142 81 283 22 -60 -7 108 112 30 -409 50 176 157 24
5221B4l01K80j45J15J99m53O1L37L9k92kJ2J63K25k19p7o7p2K39K5K11k63M1J13
$$ 24 -277 3 -142 -27 172 -281 -220 117 156 -136 -138 -126 37 262 43 -34 -101 -173 66 91 302 39 80 193
5245A93l61J83L4J83k16K05k03K54Mo33L64M8Q3o4j5k27KJ35j09J63k7R0k02Q9
$$ 193 -168 15 49 232 16 221 18 272 276 -357 7 55 138 74 59 -168 -166 -31 -140 23 -4 86 -116 -27
5269b7O7K49k68o3J67l2m02J77MK1J39n8M68m87K64k12m9L0J78n5k12k6nK76l7
$$ -27 40 289 21 -42 125 93 -309 -132 -128 -107 32 -26 442 -45 219 7 -42 -12 166 111 -101 -127 -132 144 107
5294A07l15R2K54k73J25n6J22j3M83m04k80M32m47K64j62K02L1k24J89k00j47
$$ 107 -208 -116 138 -135 -10 -66 56 43 526 122 -158 274 -173 91 -71 131 162 -62 127 -73 -220
5315b20L22J22k44Q4p9j35m7L28p2L2k54K61m8j23l2no8J23j64L37k11M8O6j61
$$ -220 102 224 -20 64 -15 -150 -197 131 59 91 -163 98 50 -73 -105 -110 -178 -55 -219 118 -93 -45 21 -140
5339a40J48K18l24l81M21K93j69pj91L79l04K15J39l62r1q7J61J06k4l4M6J95
$$ -140 8 226 -98 -479 -58 235 66 59 -132 247 -57 158 297 -65 -156 -243 -82 24 0 -34 12 207
5361B07l61K03Q0k71j46L71L8j97K43j86NK02q8L3l69L94k55j1K00j80J07K18
$$ 207 -154 49 129 -142 -288 83 121 -76 167 -19 -14 188 100 133 -236 158 -97 -108 92 -88 19 237
5383B37j56p8J17j48J85m48L4N92k24l20K92p4j6n0Q3p4M8k29L54J22l31J51j53
$$ 237 81 3 120 -28 157 -291 -257 335 111 -209 83 9 -7 -57 26 -48 0 -229 125 247 -84 67 -86
5406h6O5K81k25r3K14o8j4M5P0l5j31j77K02k85L23o0K20k5j91j66P5M14k35j41
$$ -86 -21 260 35 -58 156 88 74 119 189 154 23 -154 48 -237 86 26 246 221 30 -136 -61 353 118 -23
5430b3K10j37r7N5rJ22J4m08Q08o23J75N8l54J43L57r8j65k23K91Rk84K37M1J21
$$ -23 187 50 -47 8 -1 121 135 -273 535 -88 87 145 -209 -66 291 193 28 -195 96 105 -179 58 99 220
5454B20m40J97M12l96J21N3j0m69o5K22J3K47j5j96J11K83k63L3K22l61P2L16
$$ 220 -220 -23 389 -7 114 167 157 -312 -377 -155 -142 105 90 -106 5 288 25 58 280 -81 -9 307
5476C07o65L74O3j47j1J47k18L56k17j44M31m44J72J4l47J59K44j48L56l07j6
$$ 307 -358 16 79 -68 -79 68 -150 206 -11 -155 276 -168 4 18 -329 -170 74 -74 282 -25 -41
$$ [...]
8191c11
##END NTUPLES=NMR FID
##END=
