##TITLE=1H_Ser EL-18
 CDCl3
 8 sc, 
 13.8.2024
##JCAMPDX= 6.0         $$ Bruker NMR JCAMP-DX V2.0
##DATA TYPE= NMR FID
##DATA CLASS= NTUPLES
##ORIGIN= UXNMR, Bruker Analytische Messtechnik GmbH
##OWNER= root
$$ XWIN-NMR		Version 3.5
$$ Tue Aug 13 16:38:10 2024 Russian Standard Time (UT+4h)  she@DPX200
##.OBSERVE FREQUENCY= 200.1313
##.OBSERVE NUCLEUS= ^1H
##.DELAY= (6, 6)
##.ACQUISITION MODE= SIMULTANEOUS
##.ACQUISITION SCHEME= undefined
##.AVERAGES= 8
##.DIGITISER RES= 18
##SPECTROMETER/DATA SYSTEM= spect
##.PULSE SEQUENCE= zg30
##.SOLVENT NAME= DMSO
##.SHIFT REFERENCE= (INTERNAL, DMSO, 0, 15.7039)
##AUDIT TRAIL= $$ (NUMBER, WHEN, WHO, WHERE, WHAT)
$$ ##TITLE= Audit trail, XWIN-NMR		Version 3.5
$$ ##JCAMPDX= 5.01
$$ ##ORIGIN= Bruker BioSpin GmbH
$$ ##OWNER= she
$$ F:/spectra/data/she/nmr/H-F/1/audita.txt
$$ ##AUDIT TRAIL=  $$ (NUMBER, WHEN, WHO, WHERE, WHAT)
(   1,<2024-08-13 16:36:59.60 +0400>,<she>,<DPX200>,
      <created by zg, POWCHK disabled, PULCHK disabled
       configuration hash MD5:
       00 E9 B6 7A A2 85 ED C7 34 08 36 98 17 FE 4E 26
       data hash MD5: 16K
       9C C6 BB 96 56 98 86 A3 E5 88 67 71 BA 7D 6F 32>)
$$ ##END=
$$ 
$$ hash MD5
$$ A1 BB C6 CC 13 34 0B 7D 4B 44 BB 35 5A 55 DE AE
##$RELAX= 
##$RELAX= 
##$RELAX= 
##$RELAX= 
##$RELAX= 
##$RELAX= 
$$ Bruker specific parameters
$$ --------------------------
##$DU= <F:/spectra>
##$EXPNO= 1
##$NAME= <H-F>
##$PROCNO= 1
##$TYPE= <nmr>
##$USER= <she>
##$AMP= (0..31)
100 100 100 100 100 100 100 100 100 100 100 100 100 100 100 100 100 100 
100 100 100 100 100 100 100 100 100 100 100 100 100 100 
##$AQSEQ= 0
##$AQ_mod= 1
##$AUNM= <au_zg>
##$AUTOPOS= <>
##$BF1= 200.13
##$BF2= 200.13
##$BF3= 200.13
##$BF4= 200.13
##$BF5= 200.13
##$BF6= 200.13
##$BF7= 200.13
##$BF8= 200.13
##$BYTORDA= 1
##$CFDGTYP= 0
##$CFRGTYP= 5
##$CHEMSTR= <none>
##$CNST= (0..31)
1 1 145 1 1 1 1 1 1 1 1 1 1 1 1 1 1 1 1 1 1 1 1 1 1 1 1 1 1 1 1 1 
##$CPDPRG= <>
##$CPDPRG1= <>
##$CPDPRG2= <>
##$CPDPRG3= <>
##$CPDPRG4= <mlev>
##$CPDPRG5= <mlev>
##$CPDPRG6= <mlev>
##$CPDPRG7= <mlev>
##$CPDPRG8= <mlev>
##$CPDPRGB= <>
##$CPDPRGT= <>
##$D= (0..31)
0 1.2 0 0 0 0 0 0 0 0.06 0 0.03 0 0 0 0 0.0002 0 0 0 0 0 0 0 0 0 0 0 0 
0 0 0 
##$DATE= 1723552619
##$DBL= (0..7)
120 120 120 120 120 120 120 120 
##$DBP= (0..7)
150 150 150 150 150 150 150 150 
##$DBP07= 0
##$DBPNAM0= <>
##$DBPNAM1= <>
##$DBPNAM2= <>
##$DBPNAM3= <>
##$DBPNAM4= <>
##$DBPNAM5= <>
##$DBPNAM6= <>
##$DBPNAM7= <>
##$DBPOAL= (0..7)
0.5 0.5 0.5 0.5 0.5 0.5 0.5 0.5 
##$DBPOFFS= (0..7)
0 0 0 0 0 0 0 0 
##$DE= 6
##$DECBNUC= <off>
##$DECIM= 24
##$DECNUC= <off>
##$DECSTAT= 4
##$DIGMOD= 1
##$DIGTYP= 9
##$DL= (0..7)
0 120 120 120 120 120 120 120 
##$DP= (0..7)
150 150 150 150 150 150 150 150 
##$DP07= 0
##$DPNAME0= <>
##$DPNAME1= <>
##$DPNAME2= <>
##$DPNAME3= <>
##$DPNAME4= <>
##$DPNAME5= <>
##$DPNAME6= <>
##$DPNAME7= <>
##$DPOAL= (0..7)
0.5 0.5 0.5 0.5 0.5 0.5 0.5 0.5 
##$DPOFFS= (0..7)
0 0 0 0 0 0 0 0 
##$DQDMODE= 0
##$DR= 18
##$DS= 0
##$DSLIST= <SSSSSSSSSSSSSSS>
$$ [...]
##$SUBNAM2= <"">
##$SUBNAM3= <"">
##$SUBNAM4= <"">
##$SUBNAM5= <"">
##$SUBNAM6= <"">
##$SUBNAM7= <"">
##$SUBNAM8= <"">
##$SUBNAM9= <"">
##$SW= 24.0689771365484
##$SWIBOX= (0..15)
0 0 2 0 0 0 0 0 0 0 0 0 0 0 0 0 
##$SW_h= 4816.95568400771
##$TD= 16384
##$TD0= 1
##$TE= 0
##$TE2= 300
##$TE3= 300
##$TEG= 300
##$TL= (0..7)
0 120 120 120 120 120 120 120 
##$TP= (0..7)
150 150 150 150 150 150 150 150 
##$TP07= 0
##$TPNAME0= <>
##$TPNAME1= <>
##$TPNAME2= <>
##$TPNAME3= <>
##$TPNAME4= <>
##$TPNAME5= <>
##$TPNAME6= <>
##$TPNAME7= <>
##$TPOAL= (0..7)
0.5 0.5 0.5 0.5 0.5 0.5 0.5 0.5 
##$TPOFFS= (0..7)
0 0 0 0 0 0 0 0 
##$TUNHIN= 0
##$TUNHOUT= 0
##$TUNXOUT= 0
##$USERA1= <user>
##$USERA2= <user>
##$USERA3= <user>
##$USERA4= <user>
##$USERA5= <user>
##$V9= 5
##$VALIST= <valist>
##$VCLIST= <CCCCCCCCCCCCCCC>
##$VD= 0
##$VDLIST= <DDDDDDDDDDDDDDD>
##$VPLIST= <PPPPPPPPPPPPPPP>
##$VTLIST= <TTTTTTTTTTTTTTT>
##$WBST= 1024
##$WBSW= 4
##$XGAIN= (0..3)
0 0 0 0 
##$XL= 0
##$YL= 0
##$YMAX_a= 271634
##$YMIN_a= -259443
##$ZGOPTNS= <>
##$ZL1= 120
##$ZL2= 120
##$ZL3= 120
##$ZL4= 120
##$ABSF1= 10
##$ABSF2= 0
##$ABSG= 5
##$ABSL= 3
##$ALPHA= 0
##$AQORDER= 0
##$ASSFAC= 0
##$ASSFACI= 0
##$ASSFACX= 0
##$ASSWID= 0
##$AUNMP= <proc_1d>
##$AZFE= 0.1
##$AZFW= 0.1
##$BCFW= 1
##$BC_mod= 2
##$BYTORDP= 1
##$COROFFS= 0
##$CY= 11.3945322036743
##$DATMOD= 1
##$DC= 2
##$DFILT= <>
##$DTYPP= 0
##$F1P= 15.6554695791079
##$F2P= 12.8336369535428
##$FCOR= 0.5
##$FTSIZE= 0
##$FT_mod= 4
##$GAMMA= 1
##$GB= 0.15
##$INTBC= 1
##$INTSCL= 1
##$ISEN= 128
##$LB= 0.24
##$LEV0= 0
##$LPBIN= 0
##$MAXI= 10000
##$MC2= 0
##$MEAN= 0
##$ME_mod= 0
##$MI= 1.114404
##$NCOEF= 0
##$NC_proc= 0
##$NLEV= 6
##$NOISF1= 3.799351
##$NOISF2= 2.8
##$NSP= 1
##$NTH_PI= 0
##$NZP= 0
##$OFFSET= 15.70392
##$PC= 1
##$PHC0= -25991.75
##$PHC1= 7.98748
##$PH_mod= 1
##$PKNL= yes
##$PPARMOD= 0
##$PSCAL= 0
##$PSIGN= 0
##$REVERSE= no
##$SF= 200.130013532006
##$SI= 16384
##$SIGF1= 3
##$SIGF2= 2
##$SINO= 400
##$SIOLD= 16384
##$SREGLST= <1H.CDCl3>
##$SSB= 0
##$STSI= 0
##$STSR= 0
##$SW_p= 3612.71676300578
##$SYMM= 0
##$S_DEV= 0
##$TDeff= 0
##$TDoff= 0
##$TI= <>
##$TILT= no
##$TM1= 0
##$TM2= 0
##$TOPLEV= 0
##$USERP1= <user>
##$USERP2= <user>
##$USERP3= <user>
##$USERP4= <user>
##$USERP5= <user>
##$WDW= 1
##$XDIM= 8192
##$YMAX_p= 0
##$YMIN_p= 0
$$ End of Bruker specific parameters
$$ ---------------------------------
##NTUPLES= NMR FID
##VAR_NAME=  TIME,          FID/REAL,        FID/IMAG
##SYMBOL=    X,             R,               I
##VAR_TYPE=  INDEPENDENT,   DEPENDENT,       DEPENDENT
##VAR_FORM=  AFFN,          ASDF,            ASDF
##VAR_DIM=   8192,          8192,            8192
##UNITS=     SECONDS,       ARBITRARY UNITS, ARBITRARY UNITS
##FACTOR=    0.0002076,     1,               1
##FIRST=     0,             0,               0
##LAST=      1.7004516,     0,               0
##MIN=       0,             -259443,         0
##MAX=       1.7004516,     271634,          0
$$ Real data points
##PAGE= N=1
##DATA TABLE= (X++(R..R)), XYDATA
0@%%%%%%%%mJ2j6J6k4L2m0M8n6P2q7J03j20J38j61J88k18K50k88L30l74M25m82
31b56N44o13O88p70Q61r61J071j191J322j465J624j798J990k203K437k699K995
48A576l329L707m141M645n237N946o812P896r290J1136j3652J6988k6726K88927
62B71634k96858j36012L93950k66605r6654K60755j75307n0622K02963j59803
72e2559J0734J41404j24995J2056N8056j12634Q0170K3883j03723J02385J7350
83E2127j09822P3624k619n5626P9981l2554n3282P9480k5828k5510N8195m1636
95c470j6521M0129m6478J2997M3034n6431J5282N1290m6563O223K6715m8076J3332
108h537K5138m4067J8695K3530l4442L9296K0861p3398K2086N0795o2633q863
$$ y = [0, 0, 0, 0, 0, 0, 0, 0, 0, -4, 8, -8, 8, -16, 16, -24, 24, -32, 40, -47, 56, -64, 74, -87, 101, -117, 133, -155, 175, -199, 226, -256, 288, -325, 363, -407, 454, -507, 564, -627, 695, -770, 854, -944, 1046, -1157, 1280, -1419, 1576, -1753, 1954, -2187, 2458, -2779, 3167, -3645, 4251, -5039, 6097, -7555, 9433, -17293, 271634, -25224, -161236, 232714, -33891, -130545, 130210, -45097, -95719, 107244, -52559, -41825, 99579, -25416, -13360, 44696, -67938, 12232, 36115, -67608, 34777, 52127, -57695, 15929, 13310, -42316, 37665, 5111, -48171, 31309, 5481, -20029, 38166, -3470, -19991, 20138, -26340, -13343, 29691, -26740, -11458, 39832, -6731, -508, 26207, -21869, -8537, 16601, -27466, -8771, 14759, -19683, 19613, 40474, -32924, -10838, 39957, -22676, -31539]
120c1539O0883k2295l3351K4080J7271o406j5539L579J6421j5386p149J0289p327
133f469J9437j979m4333L4057K9232m7835K0453J6688n0238L0128K3477m1486
145a8868L5510Q977n8655K3388K0505k0841J3477j1402O436L2971l8415r90L6224
158B8317m5263n165K5795k7796L4116J9502m7718L6501M590o0403M1471J2293
170A6240m6108L8126j82k8519M4111j5703k5926L4964k6264q811M0391k6902l513
183h096K6033k5747P046M439k4493L2877l380l3891M2529j622l5959L1580k157
196I159k0935J5763j5832L451J9035k1666K0031R043l7520L1777M743n0547M0186
209F688J4035n0668K9694J5160k7471K6050p676j9925K9611k0381j4992M1451
$$ y = [-31539, 29344, 7049, -26302, -2222, 15049, 8643, -6896, -3317, 13104, -2282, -9431, 858, -6469, 12968, 10989, -33344, 713, 29945, -17890, 2563, 19251, -30987, -859, 22618, -18868, 16642, 25619, -33036, -9648, 10857, -9984, 3493, -7909, -1473, 31498, -6917, -7907, 28317, -16946, -22111, 3684, -24112, 10004, 29506, -18212, 18289, 22879, -37524, 3947, 16240, -29868, 8258, 8076, -20443, 23668, 7965, -17961, 17003, -9261, -18072, 22319, -4583, -8096, 17937, -7810, -764, 3675, -20818, 12059, 8679, -25212, 17317, 15695, -20264, 11316, 9159, -11776, 3987, -11845, -8394, 10641, -11025, 9006, 18049, -19471, 12306, 17049, -33498, 6688, 20723, -29945, -251, 14909, -12562, 13488, 5812, -14113, 15498, -4883, -19875, 21576]
221B1576j8013j8529K5222j9049j181K7595k3979j010K6062k3390m608K2685j3394
234a3o662N814p614Q029O553r067J0105p60j7520J2957O393j7698J2209P132k4083
249a4225R035J5485j7392O821Q953j5312J0863L563j6984J6660l621k3528K5133
262E451q93k1505L1534m478k6967L0408p990k4366L2143j1949j8184L1977j8237
275c056j3358L4627k0249j0997K9949j9688m124J9819k0869O496J2458k6531J2435
288c088J2914k1252J5710O138j8718J5293l341j3732J8639q063j1949J6100q214
301c563k445J6144j0391l52P799j2336L107O432q879N145j70o719Q593n10k931
316a076M377m168J72K075l656O975k204q267O385l264l250J0172n200J302O729
$$ y = [21576, 3563, -14966, 10256, -8793, -9974, 17621, -6358, -7368, 18694, -4696, -9304, 13381, -13, -6675, -861, -8475, -446, 6107, -2960, 7145, 6385, -11135, 1822, 8215, -9483, 2726, 9858, -14225, -5190, 10295, -7097, -276, 8677, -6635, 4228, 7791, -9193, 7467, 3846, -19682, 5451, 4558, -16947, 14587, 10109, -16858, 13550, 5560, -18806, 13337, 1388, -16796, 15181, -3056, -16414, 18213, -2036, -13033, 16916, -2772, -6896, 12923, -7946, -1450, 11008, -15523, -3088, 9826, -11426, 4284, 10422, -8296, 6997, 3656, -10076, 8563, 500, -11449, 4651, -3563, -6008, 10136, -255, -607, 7192, -5144, -2037, 4395, -4484, 661, 491, -6228, 2365, 1855, -1076, 3301, -867, -695, 1380, -2276, 4699, 2495, -5772, 613, -2651, -5901, 4271, -929, 373, 7102]
331G102j1094N646O615j6765P199N478j6438J2182P620j2926J1187l48j1236J1471
345E693o237n746J2609j1296j012J3852j3589L962J2623j6981N103R877j7036
358h178Q795O978j5643R226K593j2860J2351k53r412J2144l884o747J1189n653
372F46m337Q451q431j816P799n195K269O369n412N22K729m821K39J727l306j492
388d059K757K365j709K336K680m673p84L694m062J86K346l384J629j92q84M757
404C003l088j026O345p190l16Q170r396N23P223j0757M396Q135j1147P111M423
419F409j2610R519J541j3052J1755j333j2236J4102k588q704J4584n868o900J3116
433G735r139l068J1746j1838Q7R546j1032L680R378j0766M781N226j0421N182
$$ y = [7102, -3992, 1654, 8269, -8496, -1297, 4181, -12257, -75, 7545, -5381, 5806, 5458, -5778, 5693, -544, -6290, 6319, -4977, -5989, 7863, -5726, -1764, 10859, -6122, -1019, 8858, -8178, 617, 7595, -8048, 1178, 3771, -9089, 3262, 3009, -6403, 5741, 1857, -4890, 6299, 646, -3691, 4760, -3671, -5487, 2312, -2883, -614, 5755, 343, 865, 3594, -1227, -988, 739, -2567, -4059, -1302, 1063, -646, 1690, 4370, -303, -1087, 2607, -1455, -1269, 1077, -2307, -678, -870, -1754, 3003, -85, -1111, 5234, -1956, -2272, 5898, -3498, -2975, 4248, -6509, -2113, 6022, -5125, 1986, 6409, -6201, 3318, 4859, -8193, 3562, 2229, -10007, 4095, 1507, -7197, 7387, 1519, -5381, 7735, -1404, -4472, 7274, -4564, -4477, 5069, -5963, -2283, 7095, -3671, 1110, 6336, -4085, 1097]
447A097K373q511N328k02m940O834r15k979N663k449l212M273k355k283K571p35
463d42j576J455J304j593J014K613l180O15L024n586K317L695r766M053O339j0092
479e806O318P173j2333O215N057j3048P515K308j1467J0393m17r334J3900m796
493A678q400J5534r374o468J6180j1751l796J5205j4390k49J3870j4053M290J1141
507I417j4569O651O320j5204R078J618j3359J2637k98r999J4831l536q757J2884
521G714p537o912J1998q422k246J1324q930M05R370r588J211O519q728L120M198
536C496o109L537P55n374M063q25l098N584m27k674M744j469l824K247j249k901
552c524J899J044m99K715P04r84N94p03k734R01n96j935K748J99q96L618j870
$$ y = [1097, 3470, -5041, 287, 85, -4855, 1979, 1064, -1915, 3748, 1299, -1913, 2360, 5, -2278, 293, -442, -2018, -563, 741, -852, 162, 2775, -405, 210, 3234, -2352, -35, 3660, -6106, -2053, 4286, -5806, 512, 7685, -4648, 1567, 6624, -6424, 1091, 3399, -8068, 2325, 1908, -7426, 6474, 1678, -6722, 8812, -562, -7030, 9150, -2601, -6397, 8808, -5582, -5831, 8039, -6014, -1724, 9417, -5152, 1499, 7819, -7385, 1693, 3311, -10048, 2589, 2291, -7708, 7123, 3587, -5170, 7714, 177, -6735, 5263, -3159, -5405, 5919, -3011, -2606, 6764, -2824, -1613, 4906, -3822, -702, 3496, -2613, 924, 1679, -3695, 368, -457, -3555, 2029, 1602, -1072, 3672, 2203, -1621, 626, -623, -3524, -1625, -581, -1080, 1635, 2339, 1355, 1949, 1246, -1488, -587, -1183, -3118, -370, -171, -1067, 2551, 681]
569F81j704M473m033j659N390m674j897O346m199j289N329m135J186L318m862
584a729K929Q87n283M330q5m566N178j811k087N595m200k68N381n663J703L305
600C616p567M014J376p357P377K96o152R823k715n609R430p256m946R542p658
615c786o32Q920p637M438N334j1390P983K226j4944J0893J884j2357J2856L55
629D143j0755J2422m412p921J3273q523l949J3515j1076J41J1894j4259J893R907
643F293j3965O306Q703j3267R378L788j3965R364K87j2429J1845j673q047J4462
657G080m436o718J2927q680p071J2586r242l459J2843q533p46J0729q779m4O456
672D913q671L453M970j0959O038N651j1386N921N429r665M319L770p000N384J113
$$ y = [681, -1023, 3450, -583, -2242, 3148, -1526, -3423, 2923, -1276, -2565, 2764, -1371, -185, 3133, -1729, 1200, 2087, -3196, 1134, 1049, -3517, 1661, -150, -2237, 3358, -842, -1110, 4271, -1392, 311, 3616, -3951, 63, 1439, -5918, 1459, 1755, -4397, 5426, 2711, -2898, 6532, -724, -5670, 3872, -3786, -4418, 4502, -3135, 1303, 6637, -4753, 3230, 5456, -9488, 1405, 3289, -9068, 3788, 4143, -6612, 5810, 1398, -6523, 6750, -1773, -5722, 7793, -3283, -3142, 8752, -5507, -3614, 6293, -7672, -1366, 7337, -5930, 3448, 7236, -6729, 2635, 2922, -9507, 2338, 665, -7382, 7080, 2644, -4074, 8853, 173, -6898, 5688, -3554, -7013, 5830, -2703, -3449, 7280, -1499, -1543, 4913, -3758, -305, 4665, -6294, -256, 5395, -5991, -70, 5359, -4306, 13, 3783, -3217, 2167, 3280]
687C280p896O278J022q123O891M96o648P168j172n148R329l719o158R386o512
702a526m192J0376p290k917J2141q496j354J2342j0048j646Q371j0954K091Q020
716D918j1803O303P488j2481P715N093j2656P464J536j1339R924q32p317J1144
730E157m740n488J1832q109l602J1434r469m94J0001j0337K131P647j1890M137
744a790O804j0363N731M870p180N137j611n469O838n565l330R739n330j037Q380
759E824o365j76N859q037Q39L442n454M002J242l622O228k697m510P473k767m933
775c652N919l418j027M509m716J910L742o156K695L152m333K898L00m614M359
790A568j270l566M768j977k027M276k158K11L979m568N81K247n416K647K696o211
$$ y = [3280, -4616, 1662, 2684, -5439, 1452, 1948, -4700, 2468, 1296, -3852, 5477, 1758, -4400, 4986, -1526, -5718, 4658, -2632, -5549, 6592, -1904, -3258, 9084, -964, -2610, 5761, -5193, -3102, 4918, -6885, -582, 6906, -5575, 2140, 7233, -5423, 2041, 3577, -7762, 2162, 1330, -5987, 5157, 417, -5071, 6761, -1348, -4950, 6484, -2985, -3479, 6522, -3815, -1684, 5963, -5927, -1790, 5014, -5349, 382, 5252, -1928, 3209, 1598, -3871, 2967, -2598, -5928, 3811, -1519, -2556, 5824, -541, -717, 5142, -2895, -2056, 1386, -4068, -66, 1176, -2446, 3782, 1085, -3425, 4048, 1281, -3652, 2267, -1151, -2178, 2331, -2385, -475, 3267, -2889, -194, 2958, -1375, 1523, 1823, -2791, 1568, 298, -3268, 1500, -477, -2504, 1772, -386, -175, 3804, -764, -183, 2064, -3352, -705, 1991, -4220]
806d220L772M023o361L276L936n413J069J765m115J715J022l037K745J020k723
821a526L413J91l243L234j374l963M141n41l494M441j193j595M579l432j570O300
837D368n346k183P108n294j085N361n681J571N298q293L766O367r264L631M647
852D971r994M875K720q666P712J244p972Q897j105o402R002n097n853R912o138
867a894l568J0721o966j381Q962q550J919P385j0561L188M924r839N663L443q809
882e363P533K86p627R632j687p608R501m419n816R886n353l390Q463n466p39O353
898D186o072K034M186p833L068L712p471L905K069n169M815L09l774M801j688
913A078l258M150k190k302M070l265J0L879l109P31K710k553P11O89k349R24L7
$$ y = [-4220, -448, 3575, -2786, 490, 4426, -987, 82, 1847, -2268, -553, 469, -2568, 177, 1197, -1526, 1887, 2078, -1165, 2069, 695, -3268, 873, 332, -3162, 1279, 86, -1509, 3070, -362, -1932, 4368, -978, -3161, 3947, -1347, -2432, 2929, -2752, -1181, 4117, -4176, -410, 5957, -3307, 324, 4971, -5023, -148, 2572, -6094, 1618, 2862, -5110, 3787, 2682, -3720, 5282, 185, -5668, 4244, -1894, -5462, 5259, -1707, -3088, 5874, -2676, -757, 6628, -3933, -745, 4179, -5660, 3, 3446, -5363, 2170, 2456, -5171, 4461, 2774, -4834, 4667, 248, -5568, 4318, -1035, -4425, 4038, -1428, -2167, 4186, -1886, 148, 4334, -3499, -431, 3281, -4190, -285, 1784, -3385, 1430, 1739, -2035, 2766, 1078, -2180, 1970, -220, -2522, 1548, -1717, -1707, 2172, -937, -206, 2504, -49, 662, 1351, -998, -74, -37]
930c7j887J749M06j015J595m06J28J393k014o85J588j637r37J967m20o48J575
947G15q11L29J211j198l83J200k116m28J829j681L55K536k136O94J846k164Q09
964F07O10k896J732L94k651K829J95k751L740n51k797L993k288k030M115l282
980a031j748M802l981K69M457m525K194L355o038K813K129o637M666N76o061O502
996A742o4n567P407j706n026O987l758l538P302n674j755P356n754M69O118p141
1012b602K520M518p638L585K650p522M872J728o636O461L07o198P049j247n159
1027c312O646l213l345N839l804j689N718m223l70N495m510L66M079n249P76K509
1043A713m442J741K487l516K286J812l129K373R12l734K173j20k922K232N04j966
$$ y = [-37, -1924, -175, 231, -784, 811, 405, 533, 1926, -88, -773, 815, -822, -1759, 208, -212, -860, 715, -96, 233, 1444, 246, -137, 1063, -1053, -1481, 348, -1333, -978, 1558, -578, 116, 1962, -202, 607, 1217, -1679, 53, 447, -2204, 625, 820, -1931, 1809, 1258, -1539, 2454, 166, -1864, 2251, -1031, -2779, 2023, -1958, -1689, 2768, -1757, 437, 3792, -2246, 567, 2696, -3941, 725, 1301, -4760, 1742, 1678, -3889, 3518, 1812, -3214, 3773, 15, -3523, 3779, -1895, -3650, 3706, -2048, -1579, 4539, -2602, -82, 4436, -3202, 383, 3033, -4489, 383, 2111, -4525, 1936, 2243, -3955, 3094, 1847, -3312, 3334, 121, -3224, 2615, -1189, -2878, 2840, -1383, -1753, 3742, -768, -402, 3677, -1572, -796, 1713, -2729, -988, 1499, -2017, 269, 2081, -1048, 1325, 2237, -1497, 676, 556, -2366, -134, 370, -1596]
1059a596K250K23j658J955j3j875J597j48j978J535l54j803K501k82k150L466
1075A670j074j664K893j723j687K752k096q60L053j976l44L327k916N93K429l334
1091i57J025J514l763J552J680l639K752J479l034K835P13l033K507j496k387
1106b252L121j769j059L245j578K23K503k499MJ440k571Q18N59j591J063P77j131
1123f97J253L38j199J010n48k81O10r90J9M91q49Q27J04o78J506q06r6Q94r43
1142c5O6L18j897R60N06j087J538L40j068K240j136j382J529j170j634K180j240
1159i72L4K156j592N58K130k925Q13J227l003J488J58k074K294L93j981K542q30
1176D16j027J882j492p08J808j673j66J393j538R32J372j564R54N11j345Q97J95
$$ y = [-1596, 654, 877, -781, 1174, 1161, -714, 883, 735, -1243, 292, -62, -1865, 636, 354, -1796, 1670, 596, -1068, 1825, 102, -1585, 1167, -929, -1789, 1264, -712, -1056, 2271, -645, -52, 2377, -957, 68, 1582, -2181, -629, 1051, -2588, 164, 1643, -1391, 1444, 2157, -876, 1631, 135, -2252, 869, -900, -1959, 1286, -292, -69, 2434, -65, -61, 1379, -1192, -374, 185, -1406, -343, 434, -697, 556, 894, -305, 705, 157, -124, 486, -504, -485, 6, -843, -16, 88, -590, 916, 110, 14, 908, -35, 31, 349, -1548, -588, -82, -1169, 369, 709, -359, 1881, 745, -637, 892, -278, -1912, 268, -972, -938, 1218, -374, 184, 2314, -611, 202, 1429, -1574, -86, 72, -2002, 292, 685, -1296, 1246, 416, -611, 1271, -221, -929, 879, -794, -960, 433, -1105, -173, 1199, -365, 589, 1100, -245, 652, 847]
1193H47j263M76o26o90J482o38L20J083o35O29K08j274M78q42r18J028p40K84
1211g91J550m71J55Q69j642O13J66j874J485n9j270J710o8j292K152j126m16J431
1229A122j266l17J292j709K90J276j634P32J160j550J373K81j547J294l09j636
1245a148J333l77j222J583k48n69J592k71o30J153j436o70J210j604N97Q19j53
1262d1P2R35j73p21P93p76n65O33q23m91J331m02j12J640r82o83J566j213m62
1281d74J495j564k66J797k254N29J583j732R03J713k539Q94J663l095J570k1k462
1298b260K643L78k730L666q93j596K853j763k046L257k518o97L204k533J37L252
1314B354k694P68J685l696J753J088l478J928J259l144L189K58k714L030j011
$$ y = [847, -416, 60, -566, -1256, 226, -412, -92, 991, 356, 985, 1193, -81, 397, -445, -1363, -335, -1075, -791, 759, 288, 443, 1312, -330, 283, 449, -1425, 60, 1, -1269, 441, 373, -919, 1233, 107, -309, 1122, -144, -461, 831, -878, -588, 688, -946, -214, 946, -604, 769, 1050, -497, 797, 488, -1148, 185, -192, -1414, 169, -79, -648, 944, 673, 43, 1196, -240, -910, 300, -1304, -707, 112, -41, 31, 966, 793, 72, 865, 89, -476, 157, -666, -1157, 174, -228, -340, 1300, 318, -365, 1201, -12, -474, 1021, -543, -809, 988, -1266, -737, 846, -886, 17, 1730, -809, 85, 1748, -1347, 223, 202, -2260, 383, 761, -1969, 1697, 804, -792, 2061, 298, -1748, 1509, -1009, -1706, 1498, -1035, -898, 2354, -340, 428, 2113, -1583, 170, 1258, -2220, -292, 967, -2177, 1012, 1270, -1444, 1586, 575]
1329E75j894K793j781j068K678j797p85K818k639M64K329k350O68J714k393O54
1345a4O89k383J591k79q97J784O8r98J613n12o98Q55j240p54J359j070m1J474
1363E47q42O86N94l99M02k66j507N52l4q06Q56K9J51N97l34M12k45J2m09k35j40
1384c79N1L21k44j69P14j67O6M97m51j64K06j06n71M43r13L73R47j122Q43Q10
1404I85r45P55j15j416J057n93j275J787m35q63K184n61j117K076j498p74J813
1421A065k260J5K061k238J026J786k558J544J581l704K491L70l189K726k40k905
1437b429L509r06j766L692j936j280L520l054m81L181l672L91K974l788J535K763
1453B253l658J743K035m292K710P49m110L263l43l126M270q71k494M056j446k200
$$ y = [575, -1319, 1474, -307, -1375, 1303, -494, -1279, 1539, -1100, -636, 1693, -657, 11, 1725, -668, -14, 675, -1708, -117, -396, -1293, 491, 559, -439, 1174, 662, -36, 819, -421, -1175, 184, -886, -927, 547, -295, 391, 985, 586, 988, 722, -785, -233, -267, -1073, -217, -188, -37, 560, 226, 638, 393, 405, -4, -239, -379, -328, -7, -251, -420, 294, 127, 193, 690, 239, 75, 281, 175, -396, 47, -866, -493, 454, -668, 175, 985, 40, 795, 680, -736, 321, -272, -1547, 240, -195, -1058, 1126, 565, -552, 1524, 26, -748, 1065, -1195, -1180, 881, -1357, -331, 1455, -1103, 441, 2022, -1682, 809, 1179, -2010, 716, 476, -2429, 1080, 174, -1592, 2100, 164, -1116, 2404, -650, -1131, 2050, -1622, -1231, 1743, -2045, -510, 2253, -1405, 338, 2373, -1919, 791, 1540, -2570, 693, 350, -2776, 1494, 623, -1871, 2185, 739, -1461]
1469a461L574k419j398L313k545k66K815k580R96K458l376J052J918l341J232
1484b8J484l555K028Q66k936K773K23k070K558L6k503J907o43j497K001q36j258
1501a450K534j286q50K809j420q39J959k068l27J995k027J58J694j700P91J738
1517A711k169Q95P58k041P97R58k666J673K84j832K517k0j531K158q58j945K590
1534A279j321j524K308j477l63K605k273P6K565k125j68J941k539N10J483k732
1550a755J708M70j570J736N99k177K410p64j971K435j189j713K625j686n65L103
1566A696k403O06J784k334L91J155k203J105Q90k480K006N37k094K596o53j351
1582g52K127j257j119J829j582n47J998j743M93K077j797O03J036k578J509P00
$$ y = [-1461, 2113, -306, -1704, 1609, -936, -1202, 1613, -967, 29, 2487, -889, 163, 2081, -1260, -28, 1456, -2099, -71, 795, -2141, 632, 855, -1215, 1343, 1379, -1124, 783, 140, -1357, 644, -192, -1450, 1084, -202, -1052, 1757, 337, -502, 1457, -611, -938, 1057, -970, -812, 882, -818, -27, 1711, -458, 437, 1195, -846, -49, 909, -1757, -84, 200, -1632, 885, 865, -666, 1492, 634, -1311, 1279, -42, -1566, 742, -735, -1098, 1507, -766, -690, 1875, -250, -418, 1523, -1016, -506, 977, -1755, -47, 423, -1147, 589, 1188, -989, 1421, 657, -1314, 1121, -68, -1781, 844, -842, -1407, 1696, -707, -101, 1683, -651, -260, 895, -1308, -203, 687, -1793, 213, 750, -1344, 1252, 599, -752, 1375, 118, -1001, 828, -754, -1301, 697, -1046, -553, 1524, -273, 330, 1366, -1212, 297, 997]
1598I97k724J877J94k092K180K00j566K124n73j313J772j318q50J683j217n25
1614a151K181j776M95J455j319M15Q07j822N83P29j812R31O86j312Q79Q78j211
1631c64J206L5j357J193k01j543J062j10j183J752n62l02J553p25j150J750j123
1648f9j119J658j066o14K132j079j72J796j412J19J011j875L88J105j994O90J205
1665G04j612J050Q89j659J306L13k281J698k4j827K082q42j038K153r17o11K080
1682A464j655j86K027k336K76J393k149M95J600j771R03J096j598R42M41j974
1698a032J650n81j208J591p69n84J850p32j19J054p55o36Q81j371K91N67n53M37
1716a9L78o88O16P06j262O22j93l92J15k47m60Q50k81J70M64j54K54j93Q2O5p86
$$ y = [997, -1727, 150, 344, -1748, 432, 632, -934, 1190, 617, -696, 1076, -242, -1092, 591, -626, -1151, 1030, -746, -251, 1204, -115, 300, 1107, -715, -132, 597, -1215, -284, 402, -910, -31, 847, -364, 842, 877, -480, 713, 512, -1031, 31, -79, -1262, 490, -72, -374, 1179, 454, -696, 1054, -69, -1188, 470, -596, -1210, 922, -157, -329, 1467, 55, 174, 1185, -690, -302, 803, -1191, -501, 704, -908, 142, 1031, -628, 678, 991, -1290, 408, 384, -1443, 639, -203, -1241, 912, -5, -616, 1464, -191, -377, 1650, -686, -410, 983, -1166, -671, 929, -842, 61, 1157, -441, 501, 942, -1032, 618, 37, -1171, 420, -349, -933, 917, 185, 66, 1120, 365, -271, 610, -761, -470, 97, -456, -19, 359, -329, 287, 993, -269, 353, 160, -232, -117, -364, -824, 26, -255, -85, 379, 225, 479, 286, 368, 433, -353]
1737c53LK94l46n1J56L19M04J29r9J62m24n31L33k85k21K62k00K13N41n1R7L18
1759F70n70J02k67k59j82K08m5M91j29k3O70n15K22l05j20Q0j5l75L30k13K01
1780d4J65Q3J05k17k25L45r6n83K26j36l5N34l48J43Q42o77n9O21o98n4K0o17
1802g05K21N72n47M03N17q08J114k55o73O17p84m57J068n96m4Q63p47K78O60r97
1822c00L85O14j153L56L44j067P26L67q51J011J0n98M39j40p18Q08m69o53J023
1841A34o83L82N05k19Q8P09o75J06j54q37N36l86j51J47N60k91N63oJ58k88K12
1862D10o07j52j66PK50J33J29L86m51J93J35R6k43m54L09l1n33Q44k18r1O20o18
1884e2P02m71k56J65Q4q06O23j49k08M28K72k79M80l77j68O98o95n17O66q77J66
$$ y = [-353, -350, -56, -402, -453, -297, 22, 426, 555, 456, 618, 194, -337, -4, -289, -510, -248, -448, -235, 306, 255, 352, 670, 100, 202, -65, -324, -506, -298, -343, 148, 19, -4, 666, 151, 373, 68, -52, 28, 13, -362, -32, -245, -44, 121, 204, 309, 92, -133, 212, 116, -467, -241, -377, -412, 122, -226, -83, 759, 82, 23, 644, -54, -108, -88, -705, -484, 88, -459, -56, 461, -347, 767, 512, -161, 456, -328, -785, 283, -313, -357, 506, -241, 37, 697, -300, 85, 699, -454, -98, 246, -821, -95, 272, -579, 432, 442, -156, 283, 143, -575, 233, -236, -889, 134, -549, -167, 338, 119, 207, 916, 241, 347, 193, -644, -108, -494, -645, -498, 62, -229, 334, 328, 486, 198, 410, -197, -349, -515, -508, -258, -125, 4, 390, -61, 132, 267, 363, 120, -334, -25, -56, -589, 255, 37, -54, 566, -52, 650, 179, -77, 88, 172, -634, -11, -160, -368, 60, 332, 53, 533, 156, -12, 686, -9, -526, 140, -737, -571]
1905e71O90m08J06P68m43J58K66o91J58k41l23J15L93o4J51P54j034O98j14k32
1925A36k80Q1k87O01n90j00O47j07m4L00k3k96J42n74K11m37K65O6J58j12M70
1946B27O1L39l57k46K66o57J57N4o11O66k65L63O13l13k39L15J06o62J86n04K
1967d99M87m46K86N44k15k84L39m67J93l6l64L76J17n03M04L5JM61k33r8O43j010
1989b69K78K19q26J39M02K4R5K17l84M39R7o44K73J67q24L96r8K14L83k4j33J38
2011B79k11K47j94m27M78m19m41O47l2L9M70l60Q3L35m89j65K53m56L59j62j44
2032c10L84K48n32P05j48m33K44r7l73K95k58j02O43n99M10N23o48K58J21o08
2052b77L55k74m70K61J84%M54P4k82O51j82n60K66l23k09r9J66j49M87L2K5N57
$$ y = [-571, 119, -289, -183, 585, 142, 300, 566, -125, 33, -208, -531, -416, -23, -87, 64, 818, -216, 482, 368, 136, -144, -63, -350, 251, -339, -439, 208, 101, 57, 357, 334, 38, 180, -394, -183, -620, -355, -289, -131, -243, 227, 288, 627, 270, 24, 290, -367, -210, -156, -767, -101, -366, -3, 610, 297, 58, 373, 479, -183, 3, -501, -499, -12, -458, -172, 372, 157, -127, 212, -255, -62, -98, -462, -86, 31, -472, -68, -33, -32, 429, 196, 98, 741, -269, 9, 228, -598, -459, -57, -33, 62, 279, -105, 334, 431, -213, 60, 227, -597, -201, -299, -85, 298, 274, 141, 279, 68, 315, 121, -306, 172, -247, -688, -41, -73, -34, 436, 76, 159, 494, 5, -160, 93, -363, -4, -166, -310, 74, 322, -210, 495, 347, -86, 158, 61, -312, -17, -275, -377, 266, -333, 77, 600, -48, 210, 331, -277, 78, -196, -666, -405, -221, -221, 233, 307, 25, 676, 494, -66, 200, -123, -332, -431, -265, -414, 73, 105, 130, 687]
2074F87l53j72j05k48k08L43m57lQ54j99l63O66j97n46N10l7k43J04k94k31L81
2095a11k17J26Q53o61J80O10j013O6N09j048L33L49o20P35L56l81K99K26q02L73
2115A62l50n87Q88m83j85O55k48M2Q58o35R1K39p21K81P7o17M53K86q72R25N5
2136C14p17P37q4p43O66m88j74M52l48Q4M95j5k26P05n83N9K36m63l83L05m57
2157f28M87K63n73P63Q5m44K13R6o78j03L85l14M03J0j54M10j7mJ33L1m18J28
2179G4j47k41Q9J55K04o7K20k25K31n0Qk50m3K9j53P8p0J47J12K77m42L58j05
2202A89K11k85l93J72l0j79K19N3M12j12k9j04j17J89q7k61j39L76o0k89J57O0
2224d7K95L4l69M05l02J7J81p20J4N34j54K23L52m42J86L9l17j12M70q39K13M92
$$ y = [687, 334, 162, 57, -191, -399, -56, -513, -516, 338, 139, -224, 442, 245, -301, 209, 172, -71, 33, -261, -492, -111, -328, -202, 651, -10, 170, 780, -233, -167, 342, -706, -373, -24, -644, 91, 447, 66, 365, 591, -211, 162, -188, -775, 113, -370, -555, 100, -148, -106, 752, 117, 208, 447, -274, 7, 84, -533, -80, 206, -666, 259, 314, -403, 334, 250, -493, 173, -315, -489, -37, -385, -301, 194, 179, -47, 658, 75, 134, 370, -93, -476, -171, -628, -141, 122, -451, 312, 397, -47, 166, 262, -416, -519, -134, -448, -45, -35, -189, 221, 204, 200, 333, 364, -54, 74, -73, -314, -225, -70, 134, 67, 287, 62, 293, 243, 251, 1, -42, -13, -166, -88, -158, -11, 101, 378, -64, 294, 189, 400, 115, -278, -106, -136, -315, -96, -43, 369, 257, 228, 124, 7, 196, 109, -152, -291, 85, 25, -264, -107, -47, 248, 282, -87, 318, 16, 33, 214, -506, -492, 42, -112, 111, 463, 21, 207, 246, -71, -183, 287, -552, -339, 153]
2246A53n54M45K12m90Q67k79o50N38k31k36M84m97k19O70l04J38N10m18J09j05
2266A43k74J95l02m9J28R7r5M50J05m33N05l91l61M23k71k91N52o69J49M37l72
2287c24M44L01n23J33k9K1m93J25K8J77r0j29L17K09J13J5j65j46j61j93K41m2
2309a71k5J65M12k37j67K49k54m2j46j18k08K89J18L93j37r7o5K42r0l90N89l10
2331@m64Q55m43k75K05Q3M3L32q1k78M6j12Qn6k63j3N78k72K16J70k41K86K09
2354E33o78Q2Qn14N41j93J78J56J07K89k8l34q6Lk39qm1J29K08k82l8L21k43M60
2378C31j48r3oj95k52L37j65J05J9J01O0K32k19j32K25l97J50j13k75N5N32m76
2400c24O44M6n89J74J80l11L14l91k74M49l32J21P22l24R5K5l84K47Pk99J54K84
$$ y = [153, -401, 44, 256, -234, 633, 354, -296, 242, 11, -225, 259, -238, -457, 213, -91, 47, 557, 139, 248, 143, -131, 64, -238, -287, -159, -62, -157, 293, 398, -35, 470, 79, -282, 141, -130, -421, 131, -538, -389, 48, -324, 120, 421, -102, 31, 2, 23, -470, -345, -317, -140, -230, -359, -42, 167, 280, 295, 130, -16, -177, -370, -129, -171, -196, -31, 381, 144, -23, 226, -28, -70, -216, -334, -542, -253, -135, 258, 121, 24, -41, 201, 111, -279, 310, 0, -464, 391, -52, -327, -122, -39, 4, 336, 255, -23, 23, -89, -81, -137, -400, -413, 165, -107, 109, 279, 38, 324, 533, -145, -63, -55, -569, -28, -221, -43, 113, 220, 509, 481, 147, 61, 64, -175, -183, -224, -95, 113, -169, -207, 114, -129, 331, 183, 90, 84, -111, -363, -26, -191, -86, -67, 34, 94, 326, 107, -25, 200, -197, -47, -160, -435, -380, 152, -324, 320, 366, -223, -49, 131, -180, 134, -257, -531, -82, -414, -293, 429, 105, 200, 225, -159, 88, 95, -204, -50, 234]
2422B34q66O09L60l80K67K80l48J02j57l20K58l90K76J87k97K7J17J79M6K34k79
2443A39k07L18o24P6J80j71J98J65J52pj13j50J57o8j29m47JK64J68K96q7jM79
2466E89l10l40J6k56l5L26m34j11M21j30K58K35R5j07R5k70PNm35J24K45j78L48
2489A58Pq8L14m31j11K58k70j38K5r2M12K88k76J43K73k24j28j65N2j51j59L13
2511A0J20k17J2R5J04p3j65K82m35j0J73q4j80Q0K79j22J39J78J67m33K21j34
2533GL9j14l55J87J65J69k74K89o7K32k53k6K0o7L32k45j05LJ42k73N44L0m04
2556b4K13M1p7p8o18M02L30p3j05K52p1J02j02r1j72J73o41J45L31q3J70J90m92
2579b78M10j15J1J97l71Q0j63j34l1L43j01J13J32R0p6J91j81R5m32J70k27J28
$$ y = [234, -632, -23, 337, -43, 224, 504, 156, 258, 101, -219, 39, -351, -75, 112, -185, -158, -41, 138, 184, 418, 139, -68, 250, -374, -298, -118, -289, -91, 74, 226, 219, 106, -44, 113, 45, -84, -531, -530, -266, -98, 198, 111, 110, 589, 279, -61, -45, -301, -336, -10, -444, -555, -134, -264, -6, 229, 324, 217, 312, 42, 49, 54, -381, -257, -12, -190, 158, 165, 77, 391, -40, -151, 107, -163, -301, -276, -368, 44, 332, 56, 199, 472, 248, 120, -45, 7, -144, -303, 10, 130, -87, -75, 20, 124, 51, -114, 168, -267, -277, -104, -188, -368, -288, -9, -131, 8, 186, 353, -80, 141, 7, 46, -68, -423, -236, -71, 98, -176, 113, 46, 278, 25, -1, 19, -48, 284, 39, -66, -63, 79, -194, 350, 380, -24, 189, 230, 153, 75, -543, -141, 189, 116, 11, 263, 192, 294, 192, 101, -71, 102, -539, -394, -63, -146, 24, 214, -278, 132, 17, 28, 225, -146, -66, -229, -363, -394, -51, -152, -39, 93, 183, 107, 298, 117, 212, -220, -50, -277, -149]
2601a49j70N95m82O77p0n83K82l10K14m55M13o7K41k00L88R1oN1j59k87k82O3
2623b05k94M19j45L81o9q4l9L33l18L51l57j25J04M1O9j96J79j15M29m69LN61
2645D54l69l01K08m11K29pJ46q4K70J32k47M54p47J93J00k91k33K97O8M7LJ12
2667B3K88j41j20K77l45k0J62l27P5M07k5q3L39l82k52L10j17lj31j89M2K18K50
2690B56l53K26K68j18k02L91p05k33M39l84J54L4K58%J08l28M79J60l19K7l02
2711a44j70K45q1n3M23n4m3J57K7j85n3k12J22r6n37N02J62k9N39n48J01%K30
2734C03m64K75j04r4m3L4L8j45M87j5Nj75N5k63j39K4P0j52L03j46K84l01L55
2757A92N2Q6n27j44J04J13k65L98K6p2r4J47L19j35k25J77l24J64k72j25N29j68
$$ y = [-149, -319, 276, -206, 471, 401, -182, 100, -210, 4, -451, -38, -105, 136, -64, 324, 415, 409, 460, 301, 14, -268, -205, -499, -80, -225, 156, 87, 3, -36, 297, -21, 330, -27, -152, -48, -7, 62, -134, 45, -70, 359, -110, -107, 454, 85, -216, -8, -419, -190, -197, -51, -135, 135, 267, 20, 474, -273, -80, 20, -271, -504, -207, -139, -92, -89, 23, 311, 170, 50, 327, -18, -38, 124, -203, -128, 279, 254, 171, 510, 128, -124, 186, 69, 66, -65, -254, -212, 6, 256, -97, 129, 397, 279, 77, 468, -237, -470, -31, -415, -261, -227, 31, 31, 139, -189, 290, 450, 131, 158, -144, -314, -69, -150, -203, 220, 166, 123, 280, 307, 122, 69, -143, -21, -117, -654, -152, 10, -19, 520, -28, 73, 73, 303, -161, 114, 10, -84, -127, -93, -55, -200, 287, 272, 277, 102, 157, -106, -245, -221, -151, -303, 0, -146, 138, -163, 192, 244, 330, -197, -341, -237, -124, -389, 9, 35, -37, -131, 16, 335, 200, -25, 152, -172, -8, -280, -405, 124, -44]
2779d4K43O1k59J2K62l06k90M75k87l6k26M32kJ76j02j46L5K1K73j69k44l7J24
2802c4j07J02j46J68J14J71r0m5m9m02L49k32k50M84j95K22J64l29J06J04J30
2823B35l17J93k37rm9M57j91P1O9L8K3k61k74K37n29M18N9Jj35R6K77N5j09j24
2847fj63J83N1l69%L0M67N6j98J82L5k51J98Jn06N39p01K24p3J69O2L4J0J61J53
2872B88j83m0J48k97q8K71m16M24qM0J0J8K54k31j22k26J8k95K26Q4O0J76P2J83
2896C66j55l8k28k4j13j50L54k87L32o0L4J26O5k38l11K10Q6J58l17j28N52l31
2918i7J15J6N84p60L75m47J33j33k0J43J78j01J75K76k20l47P5J11k3P1m39L67
2940C2k84K53j0L0J76R2l30k42J46J88j31l12L67l27K89M91j10l14J91k62L48
$$ y = [-44, 199, 260, 1, 13, 275, -31, -321, 154, -133, -169, -395, 37, 35, 211, 109, -37, -2, 19, 292, 123, -121, -158, -34, -141, -39, -185, -17, 97, 268, 178, 133, 84, -318, 31, -201, -451, 33, -162, 60, 224, -105, 1, 105, 235, -82, 111, -126, -135, -184, 273, 82, 153, 222, 260, 283, 22, -252, -15, -544, -126, -67, -66, -201, -105, 172, 227, 118, -6, -169, 14, 65, -304, -304, -274, 193, 249, 51, 233, 268, 17, 215, 216, -290, 249, -452, -228, -301, -132, -70, -36, -26, 135, 288, 105, 65, 213, -84, -172, 99, -317, 107, 99, 139, 149, 167, 421, 190, 68, -158, -140, -435, -209, -125, -65, 111, 183, 366, 211, 173, -55, -79, -192, -342, 12, -275, 57, -3, 31, 157, 222, -16, -327, -117, -31, 127, -190, -318, 234, -97, 18, 34, 618, -142, 233, -214, -81, -214, -234, -91, 87, -14, 161, 437, 217, -130, -55, 56, 33, 104, -335, 32, -252, 1, -9, 21, 197, 289, -41, -283, -137, 51, -80, -392, -25, -352, -63, 428, 318, 4, 195, -67, 281]
2961B81k78K7q9j16mJ92j7q2N27n04P7L32p1k60K96k44k28J98Kk23J71J37R0J91
2985D05k32J26k34l29J4J00N3K38M7k92K70K63l97M28m09j58J4n6j49L19j00J20
3007D1J94k24J87N1k68K0r3k99P7M91m71K34J60j11M37n2m06N3j60q0P0r1K92
3030E2k6J26J56o3m01L13k15r0L59l05j97j08N27k46P2K03k5J91l6j19k10j9J23
3053F2j48m6L11j38M8M1J7J02m5r3o00L89N3l3P6n5K52j1k8k67L12k73Q3j35J0
3078a16Nl4R9J95q0k16M44k97K62j40p7j55J6K19M7l30j60K66P7j6K10j71J79
3101B27k04k84J71J71R9k32K85l5l70N64o22K81j18J53l22K96N5k80M3Q2l9n1
3123a30L88n07M61o8n11M30j65j79M24p0j23K23J33m82M05k88J64L4m03K95k00
$$ y = [281, 3, 30, -59, -175, -179, 13, -4, -86, 441, -63, 14, 346, 275, 15, 311, 67, -161, 37, 39, -184, -13, 124, 214, 405, 173, 299, 65, -264, -250, -150, -97, 141, 188, -104, 166, 429, 32, 460, 51, -107, -93, -149, -298, 21, -79, 41, 235, 11, 198, 249, -19, 1, -92, -391, -314, 177, -294, -60, 100, -11, 426, 374, -32, 21, -139, -219, -149, -240, 52, 26, 152, 308, 245, -156, 157, -58, -148, 211, -94, -291, -399, 128, -118, -46, 157, 132, 323, 287, 168, -42, -61, 62, -86, -132, 179, 41, 89, 130, 147, 249, 204, 111, -489, -100, -47, -80, -4, -59, 193, 182, 154, -113, 199, -74, 9, -126, -116, -111, -145, -46, 149, 69, -147, 297, 0, 262, 122, 45, -110, -94, 125, 172, -158, -318, -52, 25, 9, 219, 48, 227, 23, -261, -90, 81, 180, -52, 233, 198, -172, 392, -230, 51, -67, 86, -236, 60, 115, -165, -122, -40, -79, -130, 258, -249, 212, 144, -367, 63, -102, -281, 143, 73, -50, 173, 306, -176, 229, -59, 105, 139, -264, 31, -169]
3144a69J90K00m6r9J4k15k6P2K53o76M15j01J2J46J16O6L6J94l78M3l75P6J61
3167i1k58m1L70L5M03m45L30k19Kk73p0K78k00p7M85j82k02J56J19J7l79M24l97
3190b15J47J49n9p2K5j73N3K86J07r5n3Ll00j04M77k27J25r3j29O5J18J08L9J59
3214C41m54J08P3r4l15K95J83p2r2nK35k35j2N5J48l0j31j61J90k09J33oR9l7
3238Gl14P05m43k4L00m04K23k9k93O25o8k61j54K29J05l45M88l62j2m2K57j64
3260B4K29n5J8k72K03N0n61M97l38J49L87j86j43K49k09K6J24k32k47K26j99M36
3282A76j64q0K47j65k1J7K21m40J13J79j00k94m7L11K00r5O2j2o4L97m67J55k05
3305g6k45K43J90j75n8m4K41K59j47k48k81M21p5k08q4K45k66K59N0o5K25o1j32
$$ y = [-169, 21, 221, 175, 76, 90, -125, -151, -79, 174, -502, -87, -188, -176, -30, 86, 152, 188, 382, 4, 47, -328, -252, -91, -349, -390, -20, 15, 418, -27, 303, 84, 86, -187, -257, 21, -179, -256, 229, 47, -155, 1, 120, 137, -242, 182, -215, -68, 81, 22, -50, -25, -198, -145, 141, 248, 153, 100, 103, -197, -301, 176, -51, 74, -19, -148, -83, 35, 143, 182, 341, -113, -5, 68, -26, -341, -46, 137, 65, -27, -32, 203, -32, -44, 11, 159, 129, -2, -163, 27, -182, -49, -55, 44, 7, -307, 398, -45, -69, 231, -173, 50, 21, -272, 353, 285, 24, -130, 99, 204, -141, 347, -15, -27, -69, 188, 24, 253, 198, 216, -56, 147, 197, -364, 133, -205, -56, 331, 145, 2, 251, 42, 68, 192, -40, -287, -61, -260, 176, 12, -68, 179, 14, -7, 10, 231, -209, -96, 83, -17, -311, -358, -47, 153, 58, 120, 108, 44, 441, -26, 129, -76, -321, -78, 112, -63, -121, -165, 76, 335, 188, -60, -341, 80, 5, -203, -287, -42, -308, -49, 1, -64, 161, 100, -32]
3328c2j91k1L69r9j04j1l8K87k31J98K53l79J99m75J89j61j72L67J38k28m7M21
3350B32l10K03j2L6l93K92j19M7j27J04L0J63l68J25L0m5J38j42K52m49J34J64
3372a5L77m77J98lk46K70n2K8k7j1j0j56p0L76k42J43q5P0J24m28K27k89K9J47
3396a22l7N6RN2L75m82L44j03r2k19J66J68j31M7k34K37J31Q4k39R1j52N65o34
3419a20L15j61k77N51l77L05j91J79j80O3J94n81K55K61m54L2O4M12l06mj48J43
3441b5J41j00j4K06l49P9L4k44J95O0L89l61K78j37l30j48M68j91l4Pj44n7M33
3464A56k67J76J97qk24r3q6j36K57J65k59L37m38O4L25Q1m49L73n66K36J52p8
3486h5J87P4q7j1J66l55J97o5J59k5Q4j54L61l31K7k41Q0K67j08Jk75J10k9J70
$$ y = [-32, -223, -244, 125, 26, -78, -89, -127, 160, -71, 127, 380, 1, 200, -275, -86, -247, -419, -52, 86, -142, -189, 232, -78, 125, 113, 149, -244, 48, -71, -24, -151, -47, -17, 146, -222, -97, -67, -112, 26, -116, 136, -313, -179, -15, 362, -115, 83, 80, -166, 104, 52, 80, 53, 42, 32, -124, -194, 182, -60, 83, -2, 68, 192, -236, -9, -298, -269, -122, -159, -103, -94, -42, 333, -149, 195, 92, 0, -219, -53, 115, -16, 31, -203, 34, 165, 249, 10, 101, -51, 514, -120, 195, 34, -243, 308, -69, 236, 45, 224, 44, 107, 301, -280, -25, 236, -218, -186, -122, 290, -16, -20, -168, -25, 116, 16, 2, 208, -141, -62, -28, -272, -77, -17, 372, 11, 289, 152, -178, -326, 142, -49, -83, -76, -220, -277, 156, -111, 65, 262, 254, 30, -63, -149, -285, -28, 137, -122, 215, -223, -159, 166, 247, -202, 171, -395, -159, -7, -85, 102, 176, 89, 78, 244, -111, 86, 21, 180, 155, 239, 85, 446, 115, 142, -99, -19, 248, 140, 141, -134, -24, -53, 117]
3510A17K51l67l8K55k18K08rk42P4j0j97K37k28K23L21j07j59J42p4j28J9l8k0
3533A2M0l66N9N17k41L43j90k29j21R5J20l02K54n7J40l14J92K15k29J40R1l1
3555A38k14J0R5l11J75j6J03L34k20J10l62K91j02Pn9n0L81k35L37m34J40l4j43
3578e9o2M49k21K6j09k38M99j36j81j32J84j13O36m40L8j78j07K74l20R7J47L4
3600H8j81q9K46L38k29n9j67j42R6J82k43K03l12M01J48l19L2Q9j87P2j29J65
3622Cj77J7J36k33K67n4j12L03l56M1m3K50p6k36J00K66j75j0j3q0L00j25J5L1
3646C9O0k34L4K9Q8PK99n72M49r0r5J00m2N3j19j68M2J28K55k86l7K28l35K3K60
3671A16k61K2J1j14K24l5L9J3q4j8K59r5j99J65k70M26j98K3k72L65P1k38j2L29
$$ y = [117, 368, 1, -37, 218, 0, 208, 199, -43, 31, 21, -176, 61, -167, 56, 377, 270, 111, 253, 179, 51, 70, 32, 12, 52, -314, -255, 262, 21, 364, 174, -55, -176, -81, 39, -263, -9, -66, 74, -240, -48, 167, -62, 78, 169, 138, -76, -66, 29, -282, -107, -123, -20, 314, 94, 204, -158, 133, 31, 38, -21, -71, 310, 75, 412, -22, 118, 84, -59, -121, 328, 107, 133, 24, -214, 285, 149, -32, -164, 20, -93, 543, 103, 141, -37, -144, 130, -190, -93, 54, 88, -93, -182, 64, 402, 173, 114, -53, -195, -99, 83, -160, 43, -269, 132, 280, -39, -7, 82, -105, -33, -162, 3, -174, -157, -21, -254, 13, -41, -153, 150, -206, -165, -208, 42, -34, -270, -170, 96, -79, -89, -102, -182, 118, -7, 8, 39, 99, -135, -101, -72, 16, 23, 322, -250, 199, 109, 14, 114, 72, 125, 6, -162, -120, 8, 263, -23, -60, 168, -167, -144, 116, -145, -123, -112, -226, -2, -37, 2, 15, -69, -87, 172, 77, -122, 43, -227, 199, 1, 24, -248, 117, 188, -50, -62, 267]
3695B67k43k88q1O9N5L72k63P0J94r1K23l22o8k44M25O2L2m47L89l40M91j66J15
3718B11p4k93K05O7k84q9J33k88O94J01m23k6K25k06o8L35m18J81K30l56K54m7
3740F4j3k21N57m27K10l27J55o1j09R8k93L96j81M0n6L01R0m94nK05r7j04K52
3763b0pj01K15l02K11J74J44j96J79l70K51j89j18M13k63l23L58p8O6J32q2j75
3785h1K23k65J39p3j38J73K44j13J31P9m07n2K28n54N17k01k43N80p5o0K25l97
3807a20K17M2m70J36K42N3l34L71k18K35K39j84k65J85m75K33L43n94L14J25m76
3828d01O02j28K28n60N19j87j2j33j37l1L45oj61j16K98m8n9k39L03k03J03L45
3850C22l93P3J52l26J64m0r0J18k0k0n7l19K01R2K2j5r8M74o5k09J66l4k13L28
$$ y = [267, 24, -264, -345, -276, -221, 151, -112, -42, 152, 61, 284, -38, -106, -350, 75, 137, 169, -278, 111, -229, 262, 96, 211, 137, -156, 49, 116, -168, -257, -124, -412, 282, 383, -40, -66, 159, -47, -115, 220, -198, -17, 213, -143, 111, 64, 51, -170, 387, -40, 170, -157, -2, -63, -172, -74, -367, 29, -152, -112, -168, 133, 223, -271, -276, -71, -168, -272, -20, -27, -128, 87, -215, -4, 170, 314, 118, 297, -73, 178, -11, -129, 284, 21, -302, 56, -22, 44, 176, 94, -81, 142, -123, 16, -57, -195, -22, 222, 109, 240, 319, -88, -140, 88, -466, 51, -150, -393, 187, 112, 52, 277, -120, 97, 139, -331, -195, 47, 100, -234, 137, -81, 154, 393, 209, -56, 129, -346, -113, 230, -364, -50, 75, -401, 201, 73, 301, -259, 260, 73, 61, -72, -209, -240, 105, 99, -62, -178, 120, 72, 13, -226, 77, -126, -23, 322, -71, 2, 154, -172, -8, -48, -138, -20, -40, -60, -117, -436, -235, -143, -121, -136, -234, 240, 175, -34, 132, 98, -115, 213]
3874B13l97K04k82K67j52J50J1k72N3M05m22K66l37J14L09K15n01J66o6L26m2
3895B28q0J67o02M2L40k75o6o0Q3J9R5L51j89j23K49l48L87j47l64N8L8K32N7
3918I2L6j84O7K5N0k91L93l09J79J18l53M0Kj21K34J2J00k47K14J2l87K05oO4
3942e5K83j97j05M02k08j94k05O10k24k82k44M63J27j24O5l93K01M95m40K0J52
3963A47n2O4m07o1M60p6j61M14r3j18%j23J01j86J57l2Q2k41L26K1k64k1J14q8
3987c7N4j9Lj99K7J55j80J9M32n72N13j89j17L2L63l12L1l0n3J73j58L04j84j6
4011D0m76L91J44j78M6J14q1j84L61k29K08l14K49r2J62k51K43m89N88j55j21
4032b4K20O5l39L33k93J62k44K48k26k01J48K71m52L84L26j19J08m93K88k07J04
$$ y = [213, -184, 20, -262, 5, -147, 3, 14, -258, -205, 200, -222, 44, -293, -179, 130, 345, -156, 10, -56, 270, 228, 148, 315, -287, -245, 95, -180, -246, -306, -223, -204, -109, 242, 53, -70, 179, -169, 218, 71, -293, -235, -197, 35, 92, 128, -56, 11, 36, 86, -205, 188, -121, 58, 176, -177, -137, -135, -256, -22, -10, 90, -157, 57, 69, -318, -113, -119, -55, 228, 31, -74, 328, 120, -74, -279, 331, 107, -175, -419, 44, 171, 47, 112, -281, -80, 415, -25, -5, 147, 95, 159, -248, -309, 151, 75, -86, 328, 235, 117, 117, -6, 95, -91, 66, 34, 116, -125, 201, 222, -42, -63, 51, -37, 17, -2, 1, -198, -171, -16, -196, -177, 255, -317, 196, 7, -110, -78, 285, -27, 4, -26, -79, 94, -64, 240, 56, 40, -436, -45, 99, -79, -33, 81, 0, -184, 177, -52, 156, -158, 91, -1, 161, -90, 153, -336, 252, 97, -24, 196, 261, -78, 255, -38, 124, -120, 128, -98, -299, -151, 120, -332, 52, 378, 259, 367, -126, 162, -45, 59]
4053E9j23J07k36K53m8j76M25J41l57M7J27pl99q7L47j52nJ16k2p3r3n6j09N1
4077b70L03j06K25j42J46k62K90P7r2k2m18M73k51K6Q1N3q1J02k7k25J96l66M64
4100A74k51Lk40K01k47P25m64K04k38K60j35K4Q0M9J79n92P9K44J18p4l08J71
4122c8Mj54K16qj05j06O7r5J68J0n7o5J20j1K57m19L44m27L24K8k37M69l88m5
4146a48N8Q0J40K61k61k04K63n04L28j45r7Q1K4P0M0K45k33J24J92k02j00qm2
4169c8M5n9L23k90m8L49l09O8q3m7M7K48k79L61l42q3L82k30r4K27J31l35k64
4192c20K62J69j79PJ33j67J33J11l00J74k00K48j20j45L04M9J45k87ln4L12k35
4214C7J84k38j90K76k9k22Q7P5Q0K00l09L70k90r7K49p24M23K09j60M0J52o0q1
$$ y = [59, -64, 43, -193, 60, 12, -164, 261, 402, 45, 92, 219, 212, -187, -274, 73, -79, -84, 32, 10, -63, -156, -212, -321, -270, 33, -73, 152, 10, 156, -106, 184, 261, 169, 147, -271, 202, -49, -23, 58, 111, 30, 132, 105, -120, 76, -290, 174, -77, -74, -314, -113, -360, 365, -99, 105, -133, 127, -8, 16, 96, 145, 324, -268, -189, 55, 173, 99, -209, -38, -34, -188, 28, 20, -85, -191, -124, -219, -51, -41, -98, -163, -43, -54, 203, -216, 128, -299, 25, 53, -184, 285, -103, -148, -90, -10, 130, 391, 130, -74, 189, -315, 13, -132, -229, -148, -124, -54, -14, 231, -2, 122, 314, 112, 12, 4, -38, 7, -52, 271, -19, -67, 282, -27, 41, -42, -89, -42, 206, -73, 288, -54, -137, 245, 15, -79, 148, 279, -56, -320, -58, 111, -68, -61, 72, -95, 38, 149, -151, 23, -177, 71, -49, -194, 110, 159, 304, 17, 14, -40, 272, 37, 221, -17, -207, 69, 40, -182, -95, -20, 60, 260, -49, 321, 31, -66, 183, -541, -118, 91, -69, -29, 123, 63, -18]
4237a8J02j54k75J76k25Q1L89m86O73j57j1l27P5j33K57k70N01l33j56N69m87
4258b09k68O05R9j07q3K09k29Q8Q8o29N56k32N1J38j92j3J78L31l47k88J54J59
4280E9j47J09J5m4Q2K22k32j13M6P9j71r7L23j3K83m81P7j90j37M04j5n9j59J83
4304B4Nj48M0j05J73J37j54L61k25j73K46k58K26j28J39k61L99j43l11J46j53
4325a63J84K73m83K07k8kj72K77m7J68k54J83q3P3Lm27L0K63r5k42M73k34K01
4348A05K78p57M88OJ76l39N2o3k80L77l9J69p2P7J27m47J94j62J1J30j4l8PM7
4372C3K04l06R5k50J21J28P3l04K69j50J85k22O5K16o9L4q7J88p8j89l8M6J11
4395G5r0K05J05k70J17k6l29J81J56j37k65L22k82j3J34L76r3k95M32m20K39k07
$$ y = [-18, 84, -70, -345, -169, -394, -313, 76, -410, 263, 106, 95, -232, -157, -290, -33, -303, 198, -135, -291, 278, -209, -477, 128, 227, 120, 37, 246, 17, 105, 193, -436, 120, -112, -61, 77, -115, -128, 50, 381, 34, -254, -100, 59, -88, 21, 36, -8, 74, 296, 64, -49, -3, 76, -95, -192, 131, 118, 401, -80, -3, -193, -330, 74, 59, 0, -159, 24, 29, -119, -79, -184, -11, 126, -28, 333, 108, -65, 181, -77, 149, 21, 160, -101, 298, 155, -156, -10, -163, 21, 294, -189, 18, -10, -12, -184, 93, 46, 214, -40, 143, 60, 133, 136, -291, -261, 2, -93, -335, 138, -96, 105, 383, -374, 114, 120, 296, -43, 9, -54, -334, 43, 4, 173, 101, 178, 305, -142, 52, -110, -99, 31, 17, -21, -14, 33, 237, -69, 26, -224, -103, 25, 98, -206, 63, -87, 98, -124, -59, 157, 88, 122, 35, 223, 145, -44, -82, -36, 75, -15, 190, 295, 25, 142, 116, -213, -32, 124, -13, -278, 44, -238, -251, -117, 259, 166, -129, 303, -117, 122, -85]
4417h5j91K37o1Q0Q3r5j5K93n13O62n09L47n56L24n6j34M47k41J46j49L55j84
4439A85l48J35L65m00k54N4L21r2K79q6rJ80k25m20L90j42j1K88m80K59J19J8
4461A26K16j21k39N3J77j47j43k02K48Lp1j65K38N1J66j37n1j42K45Pj40j78K
4484b04J24J6l0J40j1j60K36K83n64qL05j47R2o9L32r7o21N19l3J4m11O99n25
4507a20j60L77k08j3K53k01R2J46l68J46J18m8k06J36l7r0K64p8J60k35J16q4
4529d0J41J57j11O7j63k14J29J09m4O1O0k49L82l45K7m7j22L95o41R20l46q5K93
4552C34m54L73n7r4M9K9j71j42J56r6L65l83K82j77P8k80L32k55Q0J63j36m17
4574d21J34K82L9J36J98n73K94j04k78O3J35k20L21k0K2n6j50J28L86k56J43p3
$$ y = [-85, -276, -39, -100, -20, 63, -32, -47, 246, -267, 395, -114, 233, -323, 1, -55, -189, 258, 17, 163, 14, 369, 185, -163, -28, 337, -63, -317, -263, 58, -34, 245, 159, 150, 330, 105, -315, 75, -67, -78, 210, -270, -11, 108, 126, 342, 221, -18, 35, 212, 65, -78, -280, -32, -29, -100, -265, -27, 24, 190, 53, 2, -140, 105, 112, -28, -206, -204, -80, -64, -94, 46, 35, -125, 111, 394, -170, -178, 127, -20, 72, 3, 335, 238, -383, 136, 103, 117, -294, 405, -120, -280, 97, -111, -124, 129, -72, 20, 166, -202, -56, 62, 14, -192, -56, -93, -183, 81, 3, 163, -72, 44, -40, 101, 258, 147, 214, 51, -163, -34, 75, 31, 92, 152, -97, 285, -60, -33, -80, -202, 193, -448, 472, 126, 41, 334, -120, 253, 196, 102, 151, 180, 9, -133, 23, -73, 292, -91, 191, 14, 92, -188, 144, -111, -31, 132, -4, -421, -287, -5, 34, 170, 368, -205, 89, -15, -293, -230, -95, -315, 6, -14, 8, -48, -198, -70, 316, 60, 203, 130]
4596A30k01j7R3Q3K82l54k68M23k9j61K3l03J15M4J72M3j11J57j58R3M0K4J34
4619B54j08j80j58P2J65o2m83L88L86j04k67j0N6k59N0L1N6K96j95J04M10o52
4641b10K11K9J32k52K10m38M63j25j13M22k88j4O1j64K49J3k11J20l96M92k28
4662c7K11j14J9k16m8L13j33j01l3L23n13J63q1K67k47K22L17j62r0L1q9J55l50
4685a93J09J58J20l48L94J51k81k00L95m11j3K75k66L8K83j81L6k7K79j74j04
4706D0j45jM88o70K30L61m7j37j18M9k7J09K9j19J72k96K08l29J97J62r8k10J44
4729hNJ45j78J06j5k35J39k32JL73n7o2p4j75J16K56j07o7j40K42K13k39k64K27
4753c0l13L06J27k77j4K53k08J33k44O7K21K03q7L4o9j91k16J35N12m39M6J25
$$ y = [130, -71, -88, 5, 88, 370, 16, -252, 171, 142, -19, 4, -299, -184, -140, 32, 75, -36, 121, -37, 56, 96, 120, 254, 146, -34, -192, -120, 45, -17, -500, -112, 274, 170, -97, -107, -51, -310, -260, -229, -173, 123, -72, 32, 442, -210, 1, 30, 162, -90, 120, -318, 145, 20, -93, 329, 41, 27, 88, -76, 173, 186, -25, 95, -301, 191, -37, 174, 60, 79, -137, -185, 128, -5, -106, -139, 184, -329, -166, -247, 20, -227, -5, 312, 150, 60, 91, 2, 157, -193, -84, 74, 194, -154, 240, 391, 110, -90, 305, -106, -119, 156, -110, -72, 211, 30, 66, 39, 318, 144, 40, -105, -106, 382, -288, -58, 303, 256, 119, 1, 50, 23, 132, 161, 42, 214, -82, 126, -203, -6, 156, 58, -152, -8, -3, 142, -36, 70, 55, -180, -41, -273, -272, 101, 44, -18, -92, -267, -151, 105, -2, -69, -209, 33, 246, 7, -257, -30, -343, -37, 90, -187, -201, 52, -156, -23, -267, -200, 21, 224, 137, 171, 102, -89, -305, -170, 342, -97, -51, 74]
4775G4o4m6lK67k86K3L00k91n2K13j27m6l0p3R5j08P4K61l49j5N59l96j18J58
4799B0k58K74j69M66l19n5K16l01P1j26K85k93L09j65r3K6M51p7j13M3J67m34
4821g5j89L64m04J66j06L98p4l0m0K33r2k29K02j07l73L23p9k0O6m2K29p6K2j89
4845a22M60j23k36j90J61J81o3k54k2K91O8K3L1J8k16qk47K87m07L10m2j37L37
4868A00J30j81J35k6k95N97n83N4P0n8K89k03R1J27J5m95L26K03j06k57J9k92
4890c40N30P2j31q5Q1J33J95l07Q5o7j93K00j02k6n6Q6j61K0J73L4l26J17Q2k43
4914b29K34N3k2j69J2J35J6J52l74J41p8O0j7L20m64J82l44L65j82J54o2J07o1
4937g1n2J73j18L0p3J45K0l05L42J94n06J98j46l4M44m29K03M7q3R5qP2l00L62
$$ y = [74, 10, -36, -39, 228, -58, -35, 265, -26, -78, 135, 8, -38, -68, -141, -46, -154, -80, 181, -168, -183, 376, -20, -138, 20, -238, 36, -133, 333, 14, -41, 175, -126, -55, -181, 104, -189, 120, -45, -138, -112, 339, 262, 149, 192, 359, -75, -264, 100, -304, -138, -244, 154, 80, 50, 10, 243, 151, -78, 124, 17, -356, -33, -112, -132, -66, -108, 121, 45, 67, -122, 338, 215, -21, -211, -50, 131, 68, -186, -208, 83, 151, 174, 205, 223, 7, -1, -248, 39, -368, -58, -100, -237, 100, 230, 49, 184, 158, -137, 460, -123, -69, 1, -57, 232, 29, 120, 247, 262, -233, 93, 296, 190, -67, -48, -340, 190, 262, 131, 46, 127, 260, 455, 148, 233, 166, -27, 173, 71, 45, -11, 75, -86, -66, 107, 141, -185, -68, 14, -229, 5, 58, 36, -133, -121, 14, 30, 182, -192, -51, -129, -69, -86, 234, -230, -48, -392, -27, -209, -55, -117, -10, -71, -123, 50, -68, -38, -111, 34, 54, -251, 91, 285, -221, -23, -169, -203, 241, -188, 15, 62, -21, 74, 66, 138, -162, 200]
4961B00l52K74j07k22K76k53N9L27j41K5m09K11k11J44J01j02L01J21m32J02J16
4982B8n8Q7k3J97k71J61j40J93l96J75K20k32K7Q1j81L24k22m8N9Pj7j60O90l22
5006A79j64J64j6J31o62L48K3Q3K13j84L01m94K68k40j36K92j11m9n3j2J93J9
5028I3j14o3k17L77l14K27N4N9Q1q3l12K27L2J29k03L56l90N4o0N7J32j24j66
5051a68K24k66J43r4K9K19l7K6r5K51Ok64J0J54k81m0J34m5m4M55n27J45Q0L32
5075C47k48k32Jq3L73p8L9m21J63j0J87j80J79j23p7q0K96J14r2J50l73N1k82
5098c79N44j75J27pMm23J23J80Q2j1j26J09J1m10N85n89K22K36l86J49J71p0o5
5121i8K01j10M3p8P4m4J04k30PO3L0O3J34qk87J38J13k68K64m3r9m7J05l3k65
$$ y = [200, -152, 122, 15, -207, 69, -184, -125, 202, 61, 86, -323, -112, -323, -179, -78, -180, 121, 242, -190, -88, 28, -30, 57, 34, 231, -40, 121, -19, 174, -222, -47, 173, -59, -32, 49, -132, 192, -30, -78, -19, -12, -29, -189, 501, 179, 15, 179, 163, 294, -368, -20, 3, 86, 299, 115, 416, -78, 190, -50, -186, 106, -5, -54, -107, -119, 74, 93, -21, -84, -301, 76, -238, -11, 43, 102, 183, 100, -212, 15, 47, 176, -27, 329, -61, -7, -67, -10, 122, -2, -168, 56, -210, -67, -161, -132, 87, 50, 76, -19, 232, 238, -26, -16, 138, -143, -183, -49, -94, -138, 317, -210, -65, 15, 347, 99, -133, -132, -215, 158, 80, 119, -302, -139, -149, 38, -142, 37, -86, -163, -243, 53, 167, 75, 225, -148, -97, -379, 165, -10, 117, 110, 114, -309, -186, -6, 76, 65, -61, 48, 59, -351, 234, -355, -133, 103, -283, -134, 37, -33, -98, 103, -7, 36, -42, 32, -12, 92, -138, -131, -68, -38, 25, 159, 151, -136, 2, 115, -153, 111, 68, -31, -78, 27, -6, -271]
5146b71r7J75L36j9L42p12K60p8R1m1j07P7%J60rR5l33J7O2M1J68k38k0K0L06
5171B25j45o2Qk50r6L46k21J9K54k15l8n2L03j68K37k14o7j77L01o1j27k5J48
5194g7K53j48n9J55N9l06K43k03J00K4p0P9o5J30K6l14L36j48j57O6Q0M7j67J9
5218i7J52k9J02l5o0l85L94J38k22m1N3L4j6J9J62l93K23J9j69M84j26k28j08
5241a29J43m7l9k10L38l7P0k11L1L0l8J53o5J4J57m5M4J1j57m5K88k6n2k66J09
5266B1j62L56k28L40k73J5R8P2n23N29j47m16N66n40M38j60K26k50J38j81L27
5287B46k60j11J14K2p0Rq6j07L57k82K51L6J60l36O7p2R4k09J70m4J86k29J06
5310A2j35qL50m8j39N6o7J8j6L0o7N05m80M9o2n1O5n3J67j95M33l84K87Jj37l92
$$ y = [-271, -368, -193, 143, 124, 466, -246, 14, -64, 27, -14, -121, -44, -44, 116, 107, 202, -131, -114, -52, -11, 157, -81, -101, -81, 225, 80, 18, 26, -224, -320, 26, -195, -176, 78, -137, -175, -227, 76, -92, 145, -69, -136, -313, -12, -73, -200, -225, -77, 176, 28, -31, 124, 183, -123, 120, -83, 17, 41, -29, 50, -15, 115, 141, -173, 163, 15, -142, -76, 4, 51, -116, -97, 55, 26, 128, 93, 33, -352, 42, 180, -42, -83, -30, 4, -12, 7, 169, -224, -1, 18, -151, 333, 207, -21, -129, 14, -33, -72, -282, 56, 19, 89, -122, -91, -61, -99, 54, -11, 3, 160, 115, 159, 170, 13, -32, 256, 230, 178, -88, 21, -141, 215, -13, 327, 54, 69, 167, 239, -284, 245, 98, -318, 248, -292, 146, -14, 212, -38, 100, -81, 246, -14, -125, -11, 11, -59, -50, -136, -243, 114, -168, 83, 119, 279, -57, 10, -62, 32, -177, -7, -51, 135, -94, 12, -123, -131, 219, 171, 32, 88, 21, 39, 23, 53, -14, 491, 11, 60, -2, -53, 12, -41, 126, -69, 364, -20, 267, 268, 131, -261]
5336b61L24l08L42k60K64r1L2j91K41O9k0J1l21K12k13J61p9L23l39J7K15q5M0
5359H3k7L0o8K4Q5L1k13J62J43k41M0j0j37j9K45j99M58n17J22l19K53J08m08
5382c74N40J8j84o7J24Q0Mo7j52r8L24k24K93l32P5P5m6Q8o0k78L71j96K46k99
5406a39L00J61m81R3J4J0J79j2n5o2k38L72l29O8J53J49q0j14k7K59k55J39k74
5429a69J21O7J50l33j9K73k06L67n63N11l08L68n46K03Q8k46J35J72J3k87K28
5450A9P2k07K37k0m07K28n8J98N6k0q5j5J4J26m39J23L09k47O1R8m2j22O4R6P3
5475A12m2r0j19K58l1L0O1N7k26l4P5MM07m56j89J14r5J22p9j7K04j14R2j34J27
5500C7M0J49m79M27j05k20J81k83L61j96K13j41m3L71k65K31j35j83k56O1K10
$$ y = [-261, 63, -245, 97, -163, 101, 10, 42, -149, 92, 161, 141, 152, -169, 43, -170, -9, -88, 235, -104, -87, 128, 43, 83, 56, 86, 18, 42, 127, 158, -55, 107, 250, 9, 49, 39, -98, -117, 128, -71, 387, -130, -8, -327, -74, 34, -374, 166, 184, 0, -67, 57, 137, 141, 74, -78, -176, 148, -76, 217, -115, -40, 35, -11, 77, 17, -261, 110, -86, 160, -139, 161, 322, -159, -66, -52, -42, 137, 125, 70, 8, -230, 142, -187, -119, 34, 183, 103, -11, -38, 221, -34, 105, -169, -48, 19, 169, -164, -183, 90, -116, 251, -312, 199, -109, 259, -287, -84, 4, -242, -107, 65, 78, -209, 19, 91, -116, 121, 101, -306, -78, -136, 62, 118, 98, 13, -2, 12, 138, -301, -178, 131, -116, -55, 43, 1, -121, -57, 39, 112, 70, -20, -139, 119, 88, 118, 179, 236, 10, -24, 51, 55, 462, 6, -183, -69, -164, -42, -121, -138, 66, -48, 44, -90, 37, 77, 226, -253, 174, 69, -151, 30, -253, 108, -88, 125, -16, -59, 312, 47, 278, 143, -40, -296, -235, -25]
5521b5j88K93k49N03j18j33mj22Q9k67J56K26l10J44R2k41J84K94j37k07l0J00
5543E0l6j8J38K1j50J41p9l31L27K29l45p7M08j77n5j70pm7L9L58l83J82K93l87
5567g6K94m46K29N6l00M05n25M00j11K18j60J37j82k21K9J10J96j30j8m6L75l12
5589g8L42k43P4k37L74l05n5J48k57J67k94L50K28J92j95J12k55j82K12m46M42
5610I4n9j4J90k70K12R7l59M4J55J27Q8o32L12N9j16K99l08J96R1j70p2N5k9l95
5634d05K31J55k44M41j00p0l20M22J46l45k72M68j55n7K80p1k15L28k43J13j77
5655i0J66k07K07k1r3K1j81J90r6K54k80L64l14K39j62K90j99K0j82k20N6K58
5677B0J08K8j73J06j94K22j31m3N7j00K31K26p6j25j3j57M0k45k80K89K27j91
$$ y = [-25, -213, 80, -169, 334, 216, 83, 79, -43, 46, -221, -65, 161, -149, -5, 87, -154, 30, 324, 187, -20, -50, 50, 14, -4, 134, 155, 5, 146, 67, -264, 63, 292, -53, -130, 278, 101, 46, -124, -131, -178, -139, 219, -164, 18, 311, -76, 218, -228, 1, 57, -243, 162, -363, 37, -74, 144, -16, 121, -61, -282, -253, -143, 53, -77, -95, -141, 234, -78, 264, 21, 95, -142, 232, -73, -128, 20, -237, -70, -364, -14, 214, 406, 211, 323, 68, -114, 98, -348, 94, 35, 21, 211, -59, 153, 250, -109, -65, 90, 217, 305, -327, -15, 44, -72, 227, -81, 115, 206, 36, -36, 19, -10, -405, -174, -19, -263, 178, 78, 8, -312, 110, 256, -89, -361, 107, -48, -105, 175, 104, -111, 217, -26, 87, -90, 76, -131, 76, 55, -38, -17, -198, -8, -104, 150, -130, 234, -80, 159, -3, 287, 88, 108, -74, -294, -238, 20, 128, 156, -17, 89, -105, 117, -14, -57, 0, -100, 131, 357, 281, 156, 143, -14, 26, -219, -499, -210, 17, -174]
5699a74J61N4j25M1j86K20K08l80M11n09L31O8j70R5k68L10L4k06J37j4j65o2
5721a89m6L93l59J23M71k93m21L42J61k42K07k07j24K79l54J96j19L92l91L49
5741A68j88J69J35p0j90j77j55J42M22l26l38N31K7J6n44J92K58K18l53M0m1J6
5763d8P4j16K67m07M7J24R2k36M07k71l9J66k40K9J91o3K82j61n3j62K1q4J43
5786c7k3Q3k85K75N8r9K13p2r4K5q9J58J9l15L28P4m24L35j82J91k25J38r3j65
5810b06J65L1l86J89M01j42K22l56L78k28l0O9k58R2Q7K36l49j00L05j42J23j87
5832h6j19R7K70M3n60N04p9k74L6K89k09J95m8M9m14L47j59l5J8L22m14K58J36
5855A67j26j7J87j76p2l51L25p4J26j64Q5O5J54j06k99M70l62J1L08m11K33J86
$$ y = [-174, -13, 41, -84, -43, -229, -9, 199, -181, 230, -279, 52, 120, -50, 45, -223, 87, 121, -85, 52, 38, -127, -189, -235, 158, -201, -78, 393, 100, -321, 21, 182, -60, 147, -60, -184, 95, -259, -63, -182, 210, -181, 168, -20, 149, 284, 214, 24, -153, -308, -166, 256, -70, -408, 123, 150, 166, -378, -186, 72, 290, -63, -23, -64, -48, 26, -90, 177, -230, -183, -59, 33, -203, 204, -67, -106, 60, -180, -151, 40, -23, 259, 98, 45, -117, -96, -180, -37, -60, 23, -262, 13, 71, -28, 185, 113, 19, 44, -45, 113, 132, -183, 145, 219, -205, 130, -52, 139, -86, 52, -41, -206, -41, -10, -396, -207, 194, 52, 274, -82, 296, 68, 38, 107, -151, -59, 28, 264, -85, -185, 120, -22, 101, -86, -205, -108, 162, 205, -355, 149, 70, -204, -168, 121, -88, 107, 59, 108, -306, 41, -118, -153, -135, 187, -227, 31, 167, 41, 24, 211, 35, -37, -388, -63, -137, -11, -175, -90, -25, 129, 23, -276, 194, -168, -157, 151, -260, -27, 159]
5877A59j25l27L67J40l70J35o5m1J58k32J83P4k85R4J73K30k57J96k51J51k55
5898a48j40K24L60k21K0j7k4J06j40K59k92O6j35J24O5j64k41K62P2J41j67p5
5920f5J20l77M63j84J17q5M6p5j24K76q0Om5K56k80r4N9J18k79K07J44j19l47
5943c42L86J77O2n59K91M8k06J41K6K02k41j44L04j70J72Jj62l1J42l16J10nO4
5966e0J20j55J60J79K2l48K15r6l86MK80k12K46j7J7L23k01m67L99M4j35J41k64
5989a81K04K66j71n5j09l4Q8K54k47J2k27J84k8k97K76J97n7J18j27j50l52O59
6011B23J92m81j38L66j72r0L68j08o4l05N32l41J50k77j0J26M1j9r1o6L58J2l29
6034a23O2K2J08j16N4P8k32R5R1K1j87K67j09P9j90J54q3O6k81M02k43O5J9k06
$$ y = [159, 34, -293, 74, 214, -156, -21, -86, -127, 31, -201, -18, 56, -229, -135, 38, 268, 11, 207, -44, 107, -148, -288, -64, 296, 75, 95, 78, 54, 160, 20, 279, -13, 53, -82, 42, 107, -57, -298, -36, 36, 177, 10, -65, 55, -322, 141, -43, 74, -11, 35, -40, -164, 112, 32, 38, -7, 249, -31, -125, -66, 52, -227, -20, 124, 5, -342, 44, 221, 283, -276, 15, 63, -143, -2, 24, 226, -15, -159, 145, -25, 147, 148, -14, -45, 97, -219, -109, -114, -50, 70, -85, 75, 254, 276, -72, 143, 47, -339, -335, -55, -267, -21, -38, -21, 302, 101, -366, 33, 77, -58, 83, -181, 23, 289, 118, 63, -46, -80, 8, 262, 15, 27, -200, -16, -44, -341, -65, 132, 75, 193, 66, -84, -436, 223, 415, -66, -204, 162, -10, -100, 268, 160, 96, -209, 323, -18, 132, -145, -155, -29, 12, -7, -98, -164, 194, 206, -123, -61, -39, 69, -47, 7, 85, -147, -52, 39, 60, -127, 140, 31, 110, -80, 74, -9, 57, -224, 178, -65, 0, 19, -187]
6058a87j33K02j8J74j39o8L40m53L93l5p3J59R3J4r8j83J94j07k4k84M06n0j94
6081g1L5r9OJ22J05k18k00L00n8o2K03q1M12o43M31j21r4J79m19J33n7L42l07
6104a62K72j05RJ49q6K10k03Pn6j65L52l87j08J43M3L32jk13o1J24rj99K97k2
6128A61k06qJp0O8J41p7L66l81o9J42j03m17M32%j65R1L58k25J27p0m8n5p6K12
6153A29l77L18j00K32K10k69M2n1J04j66j11N39m21Pj9k86K43J41Q1m43K7k1j9
6176b10P1K65K5k54K15k03O4R6mj69J98j47O7j29K7K6J07l13J53K50n4o9J45j54
6200CJ8j64K33Nk53K26PN5p9j32K27k16J96j23j91J7J61Q5Q6k24K05mk4j09J65
6225A70j0k67O2O0k6j49K3J11k01K15J60l11L58j86m2n8j9J27j08j61m9N14m51
$$ y = [-187, -320, -118, -136, 38, -101, -169, 171, -282, 111, 76, 3, 162, 255, 269, 171, -12, 182, 75, 51, -233, 173, 123, -71, -36, -135, -129, -7, 98, -120, -320, -20, -78, -140, 63, -18, 394, -249, 182, 61, -33, 146, -273, -140, -197, 145, -162, 110, 5, 14, 163, 77, 287, 84, 91, 35, -130, 222, -165, -273, -130, -87, 245, 244, 31, -30, 94, 85, -114, 183, 161, -45, -53, -52, -122, -54, 87, 10, 376, -5, -74, 68, -35, -452, -20, -20, -185, -94, 264, 39, 166, 96, 48, -7, -83, 129, -248, 70, -30, 202, 412, 143, 185, 134, 238, 72, -39, 500, 79, 86, 67, -219, 24, 165, 246, -197, -170, -191, -210, -139, 126, 151, -103, 112, -91, -27, 69, 65, -104, 94, -53, 14, -115, -88, -62, 45, -268, -115, 135, 81, 12, 157, 3, 21, -143, 90, 95, -158, 68, 75, 130, 51, -81, 146, -70, 126, 3, -188, -171, -10, 75, 161, -63, 142, 138, 114, 5, 170, 160, -107, -45, 15, -11, -160, -137, -26, -227, -12, 148, -163, 195, 9, -33, -91, -110, 17, -91, -252, -301, 213, -238]
6248b38L63K3m5m48N28k16J46J1L4j19K94n16J59L09j46j33j04j4k0J47l29K70
6270d4L33n12K80K90l26j11J6L7j62N2P7j27J98K05k60L60l50L7J40l38K67M8
6292A10q7J33K86n57L8L43J06m40l3K14k05J32k38L40l6k09K90o6l05M35p0j82
6314aj34M8R2q8L8k15J83K45j24K4j28K19j99N9J33n12K90j04K18J0o8R7m3J01
6338A41j19n9P1r8m9rK78k85nj03J76P8J06j90l7j15J08J97J26j65N1K33k55j29
6362e3J03k0l1k11P5K79k62n1K21j18L49j07q2R3l90o8K05J08R7k26K55j0k1o5
6386G0J8k10j41M94k59q1k5K5j06J09K39l68L51J17m09K39k45K08k09L18j56J8
6408ck6J12Q3k91O8J91O6l69M8K38J32j00l46K68J55k3R9k12m82P26r19O41j18
$$ y = [-238, 125, 148, 103, -345, 183, -33, 113, 124, 158, 39, 333, -183, -24, 285, 139, 6, -98, -112, -132, 15, -314, -44, 289, -223, 57, 347, 21, -90, -74, -37, -199, -147, -70, -197, 1, 206, -54, 306, -44, -7, 133, -205, 62, 110, 23, 156, 442, -115, -77, 266, 372, -68, -101, 113, -92, 40, -198, 142, 106, -103, 187, 121, -184, 251, 181, -1, -135, -87, 5, -83, -45, -260, -77, 168, 44, 68, -60, 159, -40, 19, 152, -360, -70, -174, 44, 54, -14, 83, 40, 141, 22, -37, 34, -64, -113, -122, 156, -129, -134, -237, -61, 17, 123, -67, -104, -219, -111, 86, 212, 47, 98, 331, 76, -53, 50, 30, -1, -212, -137, 142, -120, -171, 50, -68, 281, 174, 92, 185, -205, -273, -68, 40, 137, -89, 166, 156, 135, 70, 88, -122, -263, 231, -28, -109, -134, -109, -215, -106, 133, -235, 116, 233, -176, 63, -182, 26, -183, 135, -21, -3, -29, 83, 166, -125, -57, 134, 200, -169, -121, 117, 249, 149, -197, 71, 226, 203, 302, 90, -392, 334, -585, 56, -62]
6431f2nJ79k49L01j22k70K13l33M28O2j88K12q8k30j52J75K49Q8j39j9L56k24
6453A82r9J7j07m8p9L9L9K88l04O1l1j65J26J09j08O8K75m72J74k7lR0J33j05
6477E3L7j4j10j88J58K31k73j79J00K90l35J79L74k44m8k16P3K2p0J78j58L04
6499A64j76j02j14K87K34l32l23P27k51K52l35m56N07O0J43n5n4j38l73L62n2
6520b5j91L65m29J04L47q3n0j76J94j79J2j21L87k4k57L08o3k33N4K40k61K09
6542A28P3l29r4N96l80l3j11K2J66P2Pk27J56qJ14j56n9J02O1p7J51M9l16R8R2
6567I7p3k28j07J52J32k17M0N5P7Q8j13K03q7K60n53K99m6O7j38j48K96J77l73
6590a40K62K2j23K23l13K27n08R5Q5J06o9J72P6J79l26N2r7J0Q7j71K77J9Kk68
$$ y = [-62, -67, 112, -137, 164, 42, -228, -15, -348, 80, 142, -46, 166, 78, -152, -304, -129, 120, 208, 69, 50, 406, 182, 83, 100, -7, -55, -134, -95, -56, 232, -72, -11, -42, -207, -81, 28, -80, -12, 263, -209, -35, -62, -65, 25, 158, 53, 90, 76, -34, -222, -64, 167, -106, -285, -185, 105, -230, -51, 323, 79, 31, -185, -112, -90, -160, 18, -140, 164, -12, -114, -228, 59, 293, -39, -362, 365, 114, 366, 31, -425, 82, 142, 285, 230, 176, 38, -335, 27, -25, -216, 149, -280, -176, 171, 88, 38, -138, 56, -123, -111, -232, 155, 131, -126, 182, 119, -114, -60, 180, -81, 128, 201, -128, -222, 374, -6, -39, -150, -128, 38, 110, 117, -110, 46, 38, 152, -4, -63, 39, 100, 23, 174, 223, -93, 5, 97, 24, -204, -311, -159, -27, -244, -204, -149, -72, 16, -97, 106, 19, 279, -274, 25, -21, 46, -92, -240, 56, 233, -140, 122, 144, 21, 244, -69, 158, -350, -255, -170, -64, -133, 39, 115, 294, -32, 20, -77, -67, 20, -151, 126, 145, 147, -121]
6614a21J59k86L08K0k59K78k15l5L29m62J07K99J5j11k39M27K20p76N43k38n0
6635h7J75j10K3l0R6qN5q1k93%L25l74K35N5p3J93n6j19K97k98K1q2M9K17k50
6660a20M39l72oJ67K0J78m60K06j8j11o2J19j12J1M9K34l48L29K57l03l18L51
6682A30q5n2L57m16J61j18K61k6j91k46K61j7j5l33L18j3m3J56Lj97L37k73L20
6705B79k15K00m47P8L86m31K39r4N4K11j07J76l08l3r4J7Q9k2j80J07o6M14q0
6728A73k99L02n46M10o6L2J0j06j33j52L39L15m5k70J80k18J46j19j25J16L19
6749B63k96l6n2R0M36l73MO5n9m14M58j8J94k28J20j93QK07m9j80N1L8l83K40
6773a07j7K52k93L15K4k28jj8q6L17j62k61M00j34k28J36QN73k97l45J13R9l32
$$ y = [-121, 38, -248, 60, 80, -179, 99, -116, -151, 178, -284, -177, 122, 137, 26, -213, 214, 434, -342, 201, -37, -87, 88, -22, 1, -29, 67, 59, 114, 33, -260, -260, 65, -309, -74, -19, -92, 101, 45, -74, 223, -75, -54, -136, -87, 130, -120, 319, -53, -59, 108, 128, 306, -154, 52, 34, -77, -139, -20, -132, -121, -72, 162, -186, 143, 400, 97, -221, 130, 45, -7, 350, -66, 95, -23, 238, 212, 21, -225, 36, 19, 4, -329, -11, -24, -67, 89, 92, -105, 232, -41, 279, 64, 264, -183, -105, 281, -150, 89, -5, 49, 260, 153, 329, 21, -12, -106, -89, 0, -22, -202, -95, -161, 253, 173, -126, 176, -370, 40, -26, 6, 16, -90, -223, -375, -36, 279, 234, -36, 144, -74, 72, -47, -172, -56, 263, -33, -69, -121, -31, 405, 32, 36, 101, 42, -372, 86, 68, 262, 34, 154, -39, -31, 176, 127, -53, -2, 36, -347, -107, -124, 128, -165, 150, 174, -54, -55, -73, -159, 158, -4, -265, 135, 1, -227, -91, -83, 490, 193, -152, -39, 60, -272]
6796b72L66l68J58Q7K31k04j3K75k70q6J02j65K79k16J69j20j87L90l16K08j76
6817a28Q7m7j33O1r8J47j3j00O41k24j47p8K94j72k47L3K74o1P3l95K44K29mn12
6841b76J43J25j27M6k66M7M15j05O8q8N2q9o5J01K67o6j85J39J84l58j56P7J27
6864A0l39L35j82K73j12j97M09k05K44l7j79L7l11M39j44Jr7R0K90m20L2Q2n7
6887c8N2j44N30o5k56L0O9j09%P8m20K97p1j04L30m72L17Q4L50n21J23k52K6o1
6911b27J01L08l15J57J92l25J33N2q2r8J09k07q3K83k06m7L17j7k93L31j14J61
6933A30l4j98N06n02n6n1OJ46K11J8l39J56JK53k13K8m9J4J35m97O2M40m4k71
6957a48Q4J06K84l25l73M95j18k6k51J18J40k32K37j00J92j02N3j44J31K17m79
$$ y = [-272, 94, -274, -116, -29, 202, -2, -15, 260, -10, -96, 6, -159, 120, -96, 73, -47, -234, 156, -160, 48, -128, -41, -88, -221, -160, -258, -111, -124, -224, 417, 193, 46, -32, 262, 90, -157, -124, 150, 89, 162, -233, 11, 240, 236, -276, -133, -8, -135, -89, -355, -308, 107, 2, 70, -18, 34, -55, -120, -19, 248, 182, -3, 136, 320, -38, -194, -117, 10, -329, 6, -176, 97, -15, -212, 197, -8, 236, 199, 20, 57, -254, 185, 41, 42, -55, 35, 325, -95, -63, 19, -38, 14, -130, 400, 335, 79, 109, 178, 69, 69, 147, -273, 24, -47, -151, 179, -293, 24, 108, 458, -63, 60, -192, -166, -227, -126, 182, -133, 24, 216, -109, 24, 76, -6, -104, 5, -202, -285, -2, -208, -255, 62, 45, -248, 83, -31, 130, 96, -102, 404, -98, -154, -205, -199, -53, 158, 176, -163, -7, -6, 247, 34, 62, 13, 27, 162, -335, -273, 167, 123, -148, -64, 42, 326, 1, -372, 123, 5, -21, -272, -154, -14, -246, -9, -109, 83, -19, 34, -110, 21, 238, -241]
6978b41Q9J71J69j78J9j92K87m4j65J21k51K14r4P3j06K47j43k74L91J52kk91
7000d8m6l76Q8L79p0rK11m8l14L55k0l02N24m75K41r9n5j51K82Qk72l4J59P3j09
7025a08q6K33l5K8l1J21j25J1K56m55L42l79Q2O8L18m9j54L7J24l41K89j20n1
7048b5L3j52j73K70K01o4k05P9J86l84J44L51l78K92m25L13l93L56J55K19j15
7069B85k20J79k98k13J31r8K95j06p3j1J33J57J15P0n02K37k66K02m7l3J25l67
7091c05L64jj76J30K91l51k17K65r3K22J27n32L57M1j10J83m77L71l99K22J3L47
7113B72l92lM9p7L17l28R0j53K02p2M72k86l22M73q4k52QK06j9J75k54j51j9m5
7137a93J32R5o2k4k37L27j37j92M35m93L73n5J67j65j8j81o5K93j0L21m27Q1j50
$$ y = [-241, -152, 19, 188, 10, 29, -163, 124, 80, -85, 36, -215, -1, -95, -22, -128, 119, -24, -298, 93, 245, 243, -48, -94, -470, -382, -3, -73, -82, 129, 81, -233, 122, 102, -200, 324, -151, 90, -9, -64, -215, 67, 75, -197, -231, -72, 1, -108, -194, 39, 4, 32, 1, 122, -3, 8, 264, -191, 151, -228, -146, -78, 240, 191, 37, 74, 198, -143, 146, 26, -25, 8, -144, -317, -47, 154, 90, -115, -36, 150, -234, -90, 261, -117, 175, -250, 63, -330, 26, 181, 400, 285, 65, 244, -54, -267, -136, -234, 61, -45, -118, -129, 4, 161, 276, 346, -156, 81, -185, 17, -30, -63, 62, -305, 59, 58, -118, 12, 303, -48, -265, 0, -93, 129, 256, -276, 81, 122, 12, 195, -282, 89, -310, -88, -75, 272, -120, -123, -74, -151, 166, -162, -72, -225, -23, -95, 377, 91, -231, 242, 158, -94, -86, 120, 101, 276, 22, -129, -148, -193, -61, 34, -28, -52, -289, 38, -99, -291, 144, -349, 24, -31, 136, -29, -47, -228, -293, 0, -10, 311, -116, -35, -185]
7160a85K74j20j6K19l09j85K93r6q4L60k11N27k53k92q2J68N5o8PQ3l09K21k3
7183b6k55K53K3j60K82j56k29L49K7j85j28J73rL8K9J4k66K95p3j1J2r5J08J98
7207B08mq6j47o7M81k07j00k41O9K24j49j5N2Q6r8j08n4J95o7j7j09M33k97l0
7231d8j67o2O31o54M67Q2m06P4K8J02Mn6j75J46k47K47J2j4J49j57Q4k01J68J06
7255A13k08J56L67m36P2j13j13K95k06J49k7R1J46m6k23K10j6o11L46K0L50k50
7277F6k31L89l25j86K64P4j02K04k17J23P8k64J75r4L11j08l11r5N06n0k39J21
7299H9p9L7J16j66L7p1JK6o8k74n6M57j31j72J77q0p1L36n3J6l48M60l09J06M4
7324B4O2j97lJ71l17J70K2K68j89J38l22M0K97k81J94m3l2k99Q4j5o5N66m89K42
$$ y = [-185, 89, -31, -47, 172, -137, -322, -29, -125, -209, 151, -60, 467, 214, -78, -160, 8, 63, -5, 2, 85, -224, -3, -26, -281, -28, -5, -165, 117, -39, -268, 81, 108, -77, -205, -32, -41, -3, 26, 40, -226, 69, -4, -15, -3, -98, 10, 208, 204, 118, -29, -96, 385, 178, 78, -163, -94, 130, -19, -34, 18, 104, 6, -102, -156, 39, -28, -45, -154, 279, -18, -48, -215, -277, 354, -300, 167, 249, -157, -83, -55, 47, 51, -5, -180, -34, -281, -34, -22, -36, 113, -44, 40, -161, 7, 113, -95, 61, 428, -8, 64, -49, -162, 133, -73, 76, 49, 140, 286, 240, 17, 227, 211, -400, -54, -34, 316, 66, -165, 224, -101, -287, -23, 51, -51, 153, -64, 59, 137, -127, 48, -46, 265, 157, -154, -249, 257, 207, -32, 89, 10, 47, 163, -3, 34, -37, -36, -10, -78, -352, -408, 49, -82, -254, -77, -157, -228, 108, 55, 71, -277, 183, -126, -20, 24, 86, -111, -114, 57, -260, -90, -68, 200, 11, 149, -173, -133, 164, -117, 77, 34, 2, -297, -213, -228, -293, 273, -216, 26]
7348B6j02N1k6J63j83J5K54j40M8q9Q3J36k80J19k13J20J55n54L72p5j18L05j25
7371e8LN4R8j17j5P8j89J46j38j21L23l56M36j63j01j82M23J96m94J68k01R9j03
7394b14J87K01k90R6J29o1k3N3N8l85M14j80L00l8k99O9L2J41k4k16J38o4j44
7417a20J44J00q3k03K52l89J19L70l17J1J23j52K53q9j15k9J05J84r9J36L8q4
7439A55j75Q9k07L29j57Q7N7j3k5L0j54j72L96j53J61m12k1j8K60LJ12j46m8N6
7463C4P9k57M1L95l53k02K85O3n2J13J24l38O5J9j13K97k47o9L40k41K94m41M12
7486B48k01K13j61p3R4j58J68j53K73J67n35P2RK65l93KP9P9L98l69K4o7P7k89
7510b31J01J52J1k82K00R1J97k83J2j80J71p7j00J66J55P7p7K61n27j27k28J28
$$ y = [26, -76, -25, -51, 112, -71, -56, 198, 58, 106, 17, 100, 236, -44, 75, -138, -18, 137, -417, -45, -120, -238, 67, -58, -55, -1, 97, -20, -35, 43, -146, 0, -138, -259, 64, -292, 144, -19, -120, -302, 121, 317, -177, -9, -210, -111, -214, -27, 174, -116, -20, 109, 48, 25, 78, 136, -249, 165, -15, 285, 247, -52, 17, 49, 190, 166, -50, 88, 24, -120, 24, 124, 41, -162, 90, -299, -180, 190, -127, -116, 7, -145, 108, 19, -96, -125, -20, 164, 65, 201, 239, 155, -20, 69, -138, 191, 34, 121, 178, 165, 140, 170, 16, -156, 240, 87, 248, -164, -185, -203, 57, 60, 172, 26, -22, 34, 113, -144, -103, 292, -61, -263, 22, 85, 33, 146, 270, -68, -3, 16, -97, 200, -47, -116, 224, -17, 277, -164, 248, 47, 260, 99, 26, 120, -38, 130, -23, 250, 417, -118, -46, -37, 228, -165, -163, -84, -5, 393, 24, 48, -19, 58, -231, -130, 22, 33, -249, -49, 42, 239, -44, -32, -212, -41, -118, -218, -52, 103, 180, 103, 364, -163, -290, -518, -390]
7532c90L00j6L00l76L03k57J88J32Q8l79l7j73J41R7J48J38k69J22q3K02j7l11
7554a49j36K75K8k11q4L70j11J87k22Q8O2p8J31k45K94j28K03l45k79N59k04k4
7576a9m2K27n22L18l4p8r5J93j19K56j46j33L25k31J71J25k19N9j18K67m95K82
7598b8j30l5K94l81M66m0l4p6lj03l61K45J75n3J79l21J08K17j75J20q2p7J54
7621E9j35K37j55j42K83J11j14Q0J7l24J5J34J20j08j27R7R2k06K7J84j44J21
7643A22j71L30m82n7L60o1n7k94J82J06K66m64L76j34O4k41k89O27j33P0j50K7
7665cP0j88Kq1L37r5K75k75K0lj48K39j60J68l04L97k95k67K89L3M4l22M3K09
7689a5J58K1k87M88l94Lk14K54j27K40l0j45J19p8K88o76K36L94p03M72N4j55
$$ y = [-390, -90, -106, 194, -182, 121, -136, 52, 184, 272, -107, -144, -317, -176, -79, 69, 207, -62, 60, -23, 179, 162, -149, -285, -10, 18, -193, -277, 93, -18, 169, -53, 35, 97, 19, 150, -95, 199, 71, 274, -71, -350, 209, 5, -19, -61, 166, -356, -38, -72, -150, -245, -52, -171, 85, -61, -194, 131, -100, 71, 196, -23, 36, -82, 185, -310, -28, -158, -193, 101, -280, 186, 146, 112, 36, 33, -70, -431, -186, -11, -64, 115, -206, -98, 119, -56, 64, -18, -95, 59, -76, 161, 6, -136, 147, 258, 144, 224, 241, -83, -68, 66, 186, 78, -49, 48, 140, -66, -39, 145, 1, 122, -49, 281, -201, -258, 102, 41, -16, -310, -128, -22, 244, -220, 156, 22, 86, -155, -444, 183, 50, 120, -30, -3, 67, -121, -119, -200, 137, 42, 317, 42, 62, 59, -89, 150, -10, 158, -146, 251, -44, -311, -22, 11, 55, -267, -224, -15, 143, 164, -123, 365, -29, -26, -240, 14, -113, 127, 97, -48, 71, -7, 281, -395, -159, 235, -468, 4, 58, -97]
7711i7J59k91L77k42K5J77l47MK04Q6l9J34o6k45p6K84n4J87k48J54m9k37J00
7734a00J77j78Q1Q8k84M54k75l5K64J71m19J78k18K06J9r6j64J62oJ91k07j06
7756i7J60j48K91m76K99p6J54n9L4J09p3j37j54K18j76L39l4j93r5O6L27k28K07
7779B58l83J94j73M4K01k5j17K59q8j22M52n80J33o0k7O7m85M99n3K76m11J64
7801B3j30j26K06P1J00k31J25j68j47L06J8m9j24k7L77k71j29j52K14L69l36M7
7823c4J30j32K18l58l31P08k68Q6J65k76J40j37K9Q7M7k4%K45l73M12j66P5m05
7846a62K43q8m6m6J34M0J39j77P9L19j81l03k33K86mJ0j50Q0j17K72j49J99L0
7869A75j22k10O7p7K36l50L68j94O6j3J55q5L1O0o2j77J7L02j24NJ16k65N8K02
$$ y = [-97, 62, -229, 148, -94, -69, 108, -239, -235, -31, 55, 16, 150, 84, -161, -237, 47, -7, 180, -68, 86, 37, -200, -100, 77, -101, -20, 68, -216, 238, -37, -72, 192, 363, -56, 122, -96, 110, 129, 33, -131, 31, 25, 216, 9, -97, 63, -85, 206, -270, 29, -47, 107, 48, 82, 191, 118, -19, -173, 45, -131, 208, 174, -19, -114, -48, 279, 51, 258, -125, 69, -104, -60, 141, 116, -1, 258, 170, 48, 500, -80, 53, -7, -34, 33, -452, 47, -6, 270, -141, 23, -107, -233, -27, 44, 144, -87, 38, -130, -277, 29, 47, -2, -126, -153, 224, -47, -176, -328, -114, 255, -81, -34, 96, -36, 182, -176, -507, 201, -67, 19, 184, -92, 48, -89, -60, 27, 74, 50, 50, 295, -78, 334, 168, 243, -162, 81, -7, -53, -99, 35, 75, 214, 37, 116, 435, 254, -49, -282, 4, 0, 10, -140, -60, -177, 95, -54, 145, 175, 53, -157, -90, -167, 69, -281, 87, -107, -41, -54, 101, 16, 47, 107, 45, -132, -115, 187, 63, 68, 184, -81, -23, 179]
7893A79k71j72M60m81J82R4J19ON2q2r0k5K17l66J34M62k88k20k56N94j99n5L92
7916C86k94R0o2J25l42J36P6j30ll43L08J65Q9k18J1L99j43l48o5j7M22o14L98
7939B6l12K07oJ69j69K3J70l46M02j91K37k54m3M17m63k08L11J69l06QJ18o5M4
7962f2l4O3J88k00k06L68R8j09l50N83m28M8l59K63K83k09pl0J24N4Q1n8j35J0
7986b4J81k47R0R5j76J3J40r2j23q0k50N90m49M30k26J72l05K15j58J55J45k31
8008a35L43l99J15j05L25j02r3j28L49l15M33m46J08k3K57j79M10k32j91j44L8
8029a14K42JM8j61j35R6J95k2J02l84J70J61l94J13K22j80M79m99J36j45J24J11
8051A66rj70j27M08l07J28k04J4L35j67j47J72N6j07k7J56k94L36m04r0J00L17
$$ y = [179, -92, -264, 196, -285, -103, -9, 110, 116, 168, 86, -4, -29, 188, -178, -44, 418, 130, -90, -346, 248, 49, -6, 386, 92, 182, 120, 245, -97, 39, 115, -15, -18, -361, -53, 112, 201, -17, -6, 393, 250, -98, -163, -180, 242, -372, 26, -286, -79, -85, 84, -85, -62, 108, -238, 164, -27, 210, -44, -87, 330, -133, -341, -30, 139, -167, -159, -41, -106, -62, -96, -33, 155, -45, -251, 117, 215, 106, -244, 339, -89, -41, -400, -137, 146, -63, -70, -100, 24, 78, 159, 101, -34, -24, 157, -90, 0, 95, -81, -68, 72, -20, -143, -223, -473, 117, -332, 98, -128, 44, -261, -46, -204, -49, 96, -135, 208, -191, -76, -181, 144, 42, -51, -179, 170, -145, 288, -158, -50, -73, 184, 5, 415, 183, -8, -152, -114, 128, 129, 177, 16, -119, -23, 172, 150, 252, -132, 38, 199, -195, -82, 140, -40, 439, -60, 76, -69, 55, 166, 157, -13, -140, 268, -39, 89, -115, -101, 234, 67, -80, 92, 148, 41, 14, 170, -124, 212, -192, -282, -182, 135]
8073A35m47L59MJ10K9k96L16j94j48j74N34l47l0N4P2N7pr7L80Pk37R6j18j81
8097a23q7J06j36J11J23J30n5J12M22l19k90J32L2N8k60J96m13N13m33L49r3M6
8119A21j1q0J19m7p0j27rJ47J33k05L75k07j48j78J96K58l20J04J45l22M1J15
8141C0O4L9J68l42or3O1j61j21L92l32j05M45LK70k32r3K7N3j40K71l71L8n5J21
8166f9J94j75N0j11R4O3j13Q5l9K51k58q0K4L32p4K72n51R4J60m37M50j71j09
8189a18M25l62
$$ y = [135, -312, 47, 51, 161, 190, -106, 210, 16, -132, -306, 228, -119, -149, -95, -23, 34, 27, -70, 310, 317, 80, 176, 58, -123, -210, -104, -240, -129, -6, 124, 69, 181, 603, 284, -6, 126, 158, 216, -44, 152, -261, 252, -181, 168, 75, 121, 110, 30, 149, 102, 32, -95, -104, 43, 176, -29, 346, 139, -9, -187, 9, 267, -53, 51, 196, -126, -85, 30, 94, 133, 301, -41, -47, -140, -79, -240, -361, 31, -301, -406, 39, 42, 312, 80, -13, 14, 67, -73, 198, -173, -135, -190, -69, 125, -50, 0, -111, -17, 46, -67, 18, -21, 230, -28, -108, -84, 248, 174, 446, -105, -11, 149, -288, 162, -9, -118, 307, -55]
8191e5
$$ Imaginary data points
##PAGE= N=2
##DATA TABLE= (X++(I..I)), XYDATA
0@%%%%Qj6J6j6K4l2M0m8N6p2Q8j09J33j60J92k24K57k97L48m04M64n32O08o91
28c67P83q86R99j123J260j410J574j755J953k169K408k670K956l271L620m009
44b107M442m925N468o086O794p613Q575r724J1124j2872J5125j8152K2459k9096
58a6588M0702o6545K13516n5903l74625M34074j28559k48709K90197m4975j82438
69a39853K41305q3497r6179J71706q5782p7172J16482q8326K0814Q3012j06668
80d4158M3842P2101j28967L9502N7077p7154N1916J5059p9470O9199J2207o0714
92b9560N0387j2853m5787N1567j9953j4863N4440l8166j5628O2060l8400k6017
104b2773M0781l3785p914M3954l2899j196M2035l0810P048L0981o4320j805O7617
$$ y = [0, 0, 0, 0, 0, 8, -8, 8, -8, 16, -16, 24, -24, 32, -40, 48, -61, 72, -88, 104, -120, 137, -160, 188, -216, 248, -284, 324, -367, 416, -470, 529, -594, 666, -744, 830, -925, 1028, -1141, 1267, -1403, 1553, -1718, 1902, -2107, 2335, -2590, 2878, -3208, 3586, -4027, 4548, -5176, 5948, -6924, 8201, -9951, 12508, -16588, 24114, -42431, 171085, 115182, -259443, 174631, 46072, -202637, 87560, 42585, -139853, 101452, 17955, -78224, 93482, 7700, -69472, 47010, -41316, -20502, 62510, -44158, -316, 71785, -57182, -17680, 39397, -37757, 14159, 29218, -50252, 18947, 31154, -29560, 20827, 7974, -37813, 13754, -6199, -21062, 33378, -4788, -20416, 41644, 3244, -22773, 18008, -15777, -23691, 20263, -12636, -13832, 28203, -2607, 4441, 35422, -28898, -30703, 36914]
117C6914m6467k9766O7564r321m7495K7344K3105j5739j5550K223J6397r573j3266
130a3630J5777p75L102O749l5108J7426M2706m6099o450L7957m1335Q024M4207
143C2551m2733O581K7952n5050J0113M4746k6591J823O669q811K6503k4838k3760
156b4845M2304k6736k2910M5999j4069N533L0978m9387N926L0034n7726K1269
168a3630M2913n0777J8065K7605m0999K7648P080m3506L0935o26k6562M1425j1503
181H068k5901L2379j5926j1148K0411k0268J6277J5603l9474K5704J8466m6369
193b2178K0140J7505l2383J4226K237q677K4525j5013j105K0458l5214R763K5580
206A9864m7219J9448L7717n1513J1653L7638l5327Q810J1381l0202K2551N76k6995
$$ y = [36914, -9553, -39319, 28245, 18924, -28571, -1227, 21878, 6139, -9411, -7188, 9209, -364, -13630, 2147, 1372, 4474, 11223, -23885, -6459, 36247, -9852, -16302, 21655, -19680, -11656, 32551, -10182, -3601, 24351, -30699, -20586, 24160, -2431, -608, 6061, -2750, 23753, -1085, -24845, 17459, -9277, -32187, 13812, -257, 5276, 36254, -13133, -7207, 22827, -34899, -13630, 29283, -21494, -3429, 24176, -16823, 10825, 17905, -25601, 5334, 4708, -21854, 19571, 8068, -17833, 14546, -1380, -12528, 7883, -12385, 3892, 19495, -19979, 5725, 24191, -22178, -2038, 15467, -16916, -2690, -453, -9130, 15395, 382, -723, 19735, -15479, -5716, 19864, -27355, -7907, 29810, -21703, -10050, 27588, -7739, 1071, 12452, -17750, 4801, 5377, -21618]
219b1618L6917k433l4878K6562j039j5822K9169j3459j6911K8505j4108j6723
231a5838K5828o826j5748J2634k020K440R827j0885J655M835j6363P486J3713
244A0738j7468K430J4649k0167J014K2813j4672m502J5598j3244K31J1242j7060
257h398O383Q511k3043J6991J4754k7402J8383J0848l4972J9894J1098l2343K3436
270D140O963k9821K6531N42k6894L1813m048k6649K9320o762j9450K4518j1602
283a399q687K1047j9529J68K3716k0157L055J5869k1659N603Q811j8181J3289
296A946L366j7715J5215K157j0404J4803n685r608J0950q476l106J1630p242k37
310b406N329p187N654L757o759L451j696k740M610l422K368J828r851N326L699
$$ y = [-21618, 15299, 12866, -22012, 4550, 3511, -12311, 16858, 3399, -13512, 14993, 885, -15838, 9990, 3164, -12584, 50, -1970, 470, 10297, -588, 1067, 5902, -10461, -2975, 10738, -6730, -4300, 10349, -9818, -8804, 14009, -663, -5165, 10433, -2811, -2580, 8662, -8398, -2015, 6496, -16547, 444, 15198, -12204, 6179, 17027, -17945, 1949, 13047, -19296, 4140, 11103, -18718, 7813, 8355, -18539, 13274, 9226, -17423, 11897, 5135, -14315, 10203, -1399, -10086, 10961, -8568, -8400, 15316, -4841, -1786, 14083, -7576, -1973, 6838, -11343, 1946, 5312, -12403, 2812, 4969, -5435, 9368, 3683, -5925, 5025, -3451, -6557, 5073, -2169, -2406, 2923, -4264, 1390, 5147, -1612, 1839, 143, -2597, 2013, -1409, 959, 2787, -7064, -1738, 1961]
325A961n692Q567p74n860P539p473k920J1025j2767n06J3792j3499M829J4453
339A2675j5019K661P075j4526O887K530j0333J1818l252q219J5428o765o295J5939
353A0604j2698m827J5571j3748k01J4386j4726K025J0720j3627O493P782j3206
366e452P547L297j1660R205r3r677Q642k547n702J0412j920l062O902m834l481
381b423M143l685j631M214k211j319L840K474k228j86K124m129k509M784j973
396g15k068L662j662o15K976k110L203p81m146N419l562m400Q654n007m672J0267
412D443o420j997J1846r175n11R135j2424K817Q941j4147O027P417j4473R688
426A167N785j3306J0304J493j2896J1443j874r965J2273n016o984J3470o589l371
$$ y = [1961, -3731, 4836, 4062, -1798, 5741, -1732, -4652, 6373, -6394, -6900, 6892, -6607, -1778, 12675, -2344, 317, 7392, -7134, -247, 2283, -8050, 3768, 516, -7703, 7725, 960, -5335, 10604, -2094, -6921, 8650, -5098, -5299, 9087, -5639, -3614, 7106, -6521, -28, 7754, -5452, 2095, 5392, -6268, 2937, 2844, -6833, 1809, -738, -6440, 3972, 2052, -1010, 5892, 1058, -2423, 1720, -1965, -3596, 618, -1593, -2912, 928, 3402, 1174, 988, 3112, -1017, -3526, 1258, -715, -2783, 879, -783, -1398, 1578, -532, 2671, 1890, -2256, 3163, -399, -4799, 3855, -1152, -5824, 4443, -1977, -3974, 7872, -1303, -1814, 7321, -5103, -2286, 6655, -7492, -1465, 5952, -8521, 1167, 6952, -6354, 3950, 5443, -7453, 3990, 2116, -7849, 4424, -592, -7576, 5894, -695, -4066]
440d066J2661q978k528R131r419m66P415p985J922N188o300M882K696o087M405
455B471m65n396L771p4l452L455N51k223J288K071j514j48J972k329j520L846
471B304l838j499N975n926n91J0086q294j77J0383j0676j192R980j1561R34R879
486E787j1972N395P339j2271Q785L379j4134J1898o92j2990J4801l117j1763J6042
500F487n963r335J7468q578n626J5330j2021k403J2219j3382J408J0496j3881
513g781P221Q667j4023R350M116j5025R895N42j2547J2147r60q277J2387l868
527A844o399J0781o656m340R228o138j808P850n773m47M508n598K188K703m122
542b179M050J727n023L097l5n277K566Q42l080K651K522j166J298P92k399o58
$$ y = [-4066, 8595, -383, -2911, 6220, -3199, -3665, 3750, -4235, -2313, 2875, -3425, 1457, 4153, -1934, 2471, 2006, -3390, 381, 307, -3145, 310, 861, -1362, -74, 1997, 483, 335, 2307, -22, -1542, 2304, -1534, -3033, 2942, -2984, -3575, 6511, -1783, -1960, 8423, -2253, -3445, 6535, -5026, -4092, 5787, -6185, -790, 6549, -5722, 3063, 6442, -7692, 4206, 3514, -9476, 5325, 2208, -9555, 6487, 524, -8811, 8657, 79, -5547, 9783, -2238, -4641, 7578, -5804, -4396, 6100, -7781, -560, 8107, -5916, 3434, 7550, -7475, 2420, 2962, -9585, 2562, 1602, -6675, 5712, 1844, -4555, 6226, -430, -4770, 4458, -1680, -3488, 4362, -1411, -1858, 2650, -2948, -760, 1943, -2179, 1871, 3598, -1425, 1672, 1637, -3640, -1074, -232, -3312, -661, 1861, 695, 1993, 2785, 386, -272]
558b72j08k336Q46J457j239K268J621k374K420o92l220L124j567l882N440j147
574C39m113O686k213l594O186k566k200M212l890k99L757n223J779L141n052L753
590G03J506m763M959j421l557O208l550l043N602n751J30O052o668L378N402q106
606b919N397K444r424O031n15r478J0409q81n989J0700m384k650P937r817K07
621b932Q384j3475M894J0338j3623O943P793j4785Q352K909j2571J1025n88j0309
635g645J3431m052q787J4035q459o128J4402q957k160J4038j2044J23J0301j4742
649f644L234Q413j3053P247P247j1879J0473J831j3490J0686j929j1949J2531
662B718j426r142J3447k794p446J1308n454o059R085o146k425R156q160P29R163
$$ y = [-272, -380, -2716, -1870, -413, -1652, 616, 2237, -137, 2283, 1591, -1629, 1495, -72, -3954, 1486, 339, -3774, 2912, 699, -2895, 3291, 725, -1475, 2737, -1153, -1452, 2305, -2918, -1139, 2002, -3050, 703, 2209, -2554, 2405, 984, -2573, 3635, 85, -2958, 2644, -3107, -2977, 3075, -3593, -215, 5187, -2919, 2478, 4922, -4502, 1529, 1014, -8464, 1945, 1064, -4925, 5775, 1391, -1259, 6678, -3139, -2932, 5452, -8023, -3129, 7209, -6414, 529, 8322, -6463, 1889, 4798, -7773, 3252, 2664, -7645, 5786, 1734, -7053, 6982, -1477, -7605, 6797, -2160, -4320, 9718, -2326, -2203, 8098, -6644, -3410, 5003, -8050, -803, 6444, -5435, 5038, 6869, -6621, 4065, 2136, -9813, 2718, 1292, -7850, 5597, 2803, -4643, 6665, 1211, -4848, 4237, -1909, -4334, 4822, -3338, -2609, 6554]
677F554r693p0R911q919q91Q184o856L50N421q147K990N017q161L898M694p867
693c585M456L103p206N998O61r364P491K26q506R617j030p560J1686k857q646
708e516J2552n564r038J1214n592m113J2185q345n74J1546j1284J39J0361j2838
722d867J197Q325j1078N420O197j0186P491J604j0039J0354k330q962J1612l439
736A299p661J1955n869n222J1200q859j115J1227r067K71Q866q646Q68K778p253
751e228N541K54n730R250j098o031Q069l414n442O965n300k528O952m061R98M426
767C623n046L576N98o844N732R24p091N263J2l614M726j951j223M966n086J8N390
784C973n013L28K518m595K440J996m710L929O49l467L691k78k442L542l136j959
$$ y = [6554, -3139, -3209, 6702, -2217, -3108, 5076, -1780, -1430, 3991, -4156, -1166, 3851, -4310, -412, 4282, -3585, 871, 3974, -3232, 2766, 3427, -5937, 1554, 1780, -6726, 2891, 1861, -5699, 5987, 3130, -5516, 7036, 1472, -7566, 3648, -1944, -6057, 6128, -2217, -2791, 8755, -2529, -2390, 7971, -4867, -3670, 4655, -6423, -1003, 5194, -4992, 2499, 4103, -5936, 4418, 2088, -6874, 4738, 1299, -6362, 5593, -276, -5498, 5702, -3157, -4272, 6955, -2112, -1841, 7025, -1621, -753, 2025, -5228, 313, 567, -5163, 4087, 2989, -3042, 5027, 1613, -3829, 3136, -2164, -4692, 2260, -1801, -803, 3623, -1423, 2153, 2751, -4093, 1639, 2563, -4528, 735, 747, -2867, 1859, -92, -1315, 3651, -1435, -1417, 3973, -1040, -712, 1806, -2789, -349, 1647, -3063, 866, 1515, -1952, 1739, 1461, -981, 2561, -575, -2534]
800b534L942m112O32N179m920Q32N901n841K33N197n566j613L809l063K51K889
816A216k694J584K685k994J357J029l943J672R21m235L065K154m208K904K181
831B694m227L330q25l578N432k442n164P059j880m335O768l164k138O962n471
846i79j665Q990p955j874Q030q188Q8P719p713L113O181r343M385M419r881N942
862A269J087r343R202m39p743J0518k140p254R766m540l940R023p395k777R513
877D807p979L25Q245q598K571N712r337N534L603j0315O341J759q925Q379J55
892B277p523Q424j289n372P851m105l041O220n840q13O585o422J083N958n390
907a397J525L070n009L108Q33n333L468L68l569M013p21k215M286j935j592L337
$$ y = [-2534, 1408, -2704, -2072, 3107, -1813, -981, 4920, -921, -688, 4509, -1057, -2670, 1139, -1924, -1673, 1216, -1478, 106, 2791, -203, 1154, 2183, -1760, -88, 833, -3402, -337, 1817, -2391, 513, 2694, -1533, 1797, 972, -2606, 2826, 384, -4780, 2279, 399, -3936, 2832, -332, -2470, 4492, -979, -2644, 6346, -1609, -3483, 4547, -3641, -3553, 4166, -3547, -434, 5747, -3596, 789, 5208, -4673, 1269, 2356, -6987, 2215, 1776, -5967, 4551, 2411, -4843, 4923, 383, -3557, 5466, -1929, -4706, 4807, -3172, -2847, 5398, -3200, -629, 5083, -4254, 1280, 4883, -5432, 909, 2668, -6257, 2122, 2277, -5246, 3178, 1889, -3483, 4368, 263, -2778, 3442, -2398, -3211, 3374, -3048, -1965, 3993, -1397, 128, 3198, -1811, 1297, 2130, -3203, 265, 633, -2936, 1077, 356, -1859, 2427, 492, -1100, 2237]
923B237k005j337J852k122j13J849j429J067J813j955J143j22j103J010j061j312
939a588J757p96j133K343L93j461J686k99j002J164j270p25J300j223q60K365
955F51o14o11K408j239j040K354j745j209J527j996M79K016k261J460J755l545
971a610K586J181l304K227j97l868L733o53l093M749j464k415N344l010j705N133
987C634n131n84M802n759J381M675o091L284L832p031M434K233p683N468k29o172
1003d937O629j149m739Q000k418m386P453m674k365O637n732j140O101o287J374
1018a633N854p067K743L926p315M188K692p362M628J190n762M999J1m511O137
1033B718j426l915N915k865k466M630l603j826M742l727P6M354l139K35L234l266
$$ y = [2237, 232, -1105, 747, -1375, -1488, 361, -1068, -1, 1812, -143, 1000, 878, -225, 785, -276, -1588, 169, -627, -1760, 583, 976, -485, 1201, 902, -100, 1064, -206, -931, 369, -854, -1714, 651, 37, -574, 1834, 595, -445, 1909, 164, -1045, 482, -1514, -1035, 981, -1280, 180, 1935, -1610, 976, 2157, -1147, 1080, 883, -2985, 748, 95, -2998, 1751, 287, -2128, 3216, 206, -1499, 3634, -1497, -2081, 2721, -3038, -1657, 3018, -3073, 211, 4043, -2988, 1446, 3679, -4004, 1464, 1235, -4937, 1692, 543, -4196, 3804, 1386, -3000, 4453, -221, -2586, 4051, -1681, -2821, 3280, -3007, -1633, 4221, -2846, -103, 3823, -3492, 696, 3388, -3974, 654, 1844, -3918, 1081, 1092, -3419, 2718, 1292, -2623, 3292, 427, -2039, 2591, -1012, -2838, 1904, -1823, -1747, 2607, -532, -297, 2937, -329]
1049c29L31J637l415L45K033k544J703J475j591R06Q84j851Q97N85k258O82Q98
1066C88k145J122J241j714J883Q63k704K366L2k863K262k82k753L008k37k124
1082a657K828l04j918L207j828j544L118k671j316L626l095l36L798l197J133
1097a56L082l764J123J674l640J224J363l480K238J239k420L066k23j899K580
1112B007j696j705J893j730l98K469j421K35J888j642K99J055j588N40O2j195
1128i27R48j22r14J050j72K12K54l70Q46R8q85P33j101o44J392j456M06J320r18
1147b50J032Q34j970R53J98k232J320k78j670K174L76j309K668j237j221K190
1163A578j729q01J880k342L45K235k429J221J569j966J039O83k260J745m87j748
$$ y = [-329, 2, 1639, -1776, -1431, 602, -1942, -239, 1236, -355, 551, 1435, -416, 481, 1066, -1192, -510, 388, -1757, -635, 606, -1108, 775, 1638, -1066, 1300, 1332, -1531, 731, 449, -2304, 704, 467, -1657, 1171, 867, -1051, 2156, 328, -1216, 1902, -769, -2085, 1541, -1554, -1890, 1908, -1289, -156, 2926, -838, 285, 1959, -1681, -457, 906, -2574, -336, 903, -1517, 1549, 1326, -573, 2007, 311, -1394, 499, -1231, -1629, 840, -581, -346, 1542, -100, 199, 1254, -334, 206, 268, -927, 21, -101, -1015, 35, -137, 75, 329, -41, 805, 903, 18, 751, -350, -994, 398, -1058, -652, 668, -250, 782, 1616, -354, 599, 797, -1435, -115, -393, -2063, 111, 487, -822, 1846, 609, -612, 1578, -151, -952, 928, -1414, -1069, 1166, -1263, -42, 1527, -439, 600, 1283, -977, 768, 281, -1467]
1179a467J845n68j059K231j172m28J885j155l82J281j472K42M00j170L40K93m52
1196h08J057L40J9P66j200J26J84j137l8K68r42J258N31n94J184n27l91R30j639
1215f13j55J134j774Q80J223j605J654M07j788J555n9j960J366j84j078J618p85
1232a64q09J834j049m18K113j846N22J087j979K42P46j853Q72R54j297J391P46
1249A092j104J210j95j310N95k89j361J141L9j81J113j39n50R62m35j167N02o
1267h3j000Q00K22l97J176P9q21J029n16j438J525o60r87J282j09j482K522j099
1285D3j061K502j631m31K222k034k26J931k736M11K353k784J460K201l155J787
1301H52J177l492K061K11l556L379p43k376M032o63k062L673k371j329K919k914
$$ y = [-1467, 378, -190, -1249, 982, -190, -618, 1267, 112, -270, 1011, -461, -219, 181, -989, -649, -356, -808, 249, 589, 608, 1374, 174, 300, 484, -653, -691, -423, -1365, -107, 424, -170, 1014, 487, 96, 1026, -613, -768, 366, -1408, -528, 695, -910, 744, 1151, -637, 918, 859, -1101, 265, 81, -997, 621, -164, -973, 861, -188, -606, 1507, -339, 183, 1270, -709, -467, 279, -1574, -702, 252, -1045, 346, 1092, -12, 1198, 1003, -307, 288, -1, -1362, -221, -182, -363, 750, 611, 61, 1023, 588, -579, -77, -83, -1083, -283, -61, -458, 718, 797, -24, 1005, 489, -949, 576, -84, -1071, 211, 102, -1380, 1142, 43, -1018, 1484, -147, -578, 1644, -390, -616, 1315, -1421, -1010, 1343, -1441, 19, 2220, -935, 852, 2029, -1463, 598, 809, -2747, 632, -111, -2487, 1545, 882, -1180, 2493, 122, -1207, 1712, -1202]
1317a202n83L240l072N19K958k978J414J852l372J368J315l307K482J36k667K785
1333H88l50k120L201j297j358K736j594q65K217k203j17J734k170N41K023k144
1349h78J201J218k058J148J86j712Q54k66j312J634K5q18J877j19j214P05p07
1366b36k51N28r01M1P08l19M11N82j89K52k55k57J00k12o35J64L07mL31P9j55
1387H9L08j23n4K13r4m98J7k42m34N95k3K28R44q58P2R40q99l06L55j390P06L87
1409f7j074J840Qj685J851K50k021J797p53j658K255j174q86K537j506l75K626
1426A965k620K09K137k805K91J995l135J442J695k919K498R61l202K451K12k841
1442a666L008r78k671M025j945k133M380k344n59L741l348k93L399m088K63K968
$$ y = [-1202, -1785, 1455, -1617, -1098, 1860, -1118, 296, 2148, -1224, 144, 1459, -1848, 634, 770, -1897, 888, 538, -1582, 1619, 322, -1036, 1700, 106, -759, 1458, -745, -862, 872, -1298, -757, 1266, -878, 323, 1541, -517, 631, 817, -895, -41, -307, -1619, 15, 40, -778, 1099, 980, -234, 471, -236, -487, 41, -860, -819, -111, -430, -19, 563, 374, 626, 371, 114, 214, 2, -633, -469, -162, -166, 165, 244, 89, 397, 274, 220, 433, 339, -159, -142, -384, -818, -223, -246, -18, 926, 68, 140, 1080, 181, -125, 230, -1160, -454, -67, -1141, 699, 707, -978, 873, 1123, -898, 899, 146, -1512, 743, -431, -1317, 1220, -286, -661, 1965, -655, -446, 1691, -1114, -823, 1172, -1963, -521, 1174, -1745, 753, 1714, -1488, 963, 1175, -1666, 1342, 364, -2307, 1718, -227, -2360, 2020, -324, -883, 2858, -490, -783, 2616, -1472, -1209, 1759]
1458A759l913J584K482l929K752J136l652L081J49l824L394m00l307L893p59j960
1474a514L577j692j510L546k624j176K852k435m59K757k677O49K549k954J189
1489G8J816k805J503N93k705J552L25k035J516R27k026K047J13j712J981m56k232
1506a520K016m46j878K270o65q33K197q95o67K114j559o68J471j884j59J972j932
1523a066M86J892j875Q71J529k654J123Q13k728J675N17k226J877N58k002K479
1539A269j55k182K460j269j500K698k000q78K329j751K92K368k315Q33J497k636
1555i40J102R97k623J678N92k526K197K89j827K753r43j878K629j829o55J944
1571I60k011J93K058k099P43J761k346J062R61k354J209N06k168J964m42j298
$$ y = [1759, -2154, -570, 1912, -2017, 735, 1871, -1781, 1300, 1449, -2375, 1019, 619, -2688, 1205, 446, -1514, 2063, 371, -1139, 2407, -217, -1393, 1459, -976, -1435, 1322, -1355, -706, 1843, -1111, 78, 1894, -911, 592, 1185, -1520, 32, 357, -1678, -162, 765, -1261, 786, 899, -813, 1168, 712, -1520, 496, 50, -1828, 442, -223, -1056, 1141, 246, -421, 1693, 134, -534, 937, -947, -1106, 866, -1066, -580, 1312, -563, 308, 1837, -817, 306, 1119, -1609, 66, 583, -1643, 234, 792, -1210, 1269, 1114, -1068, 1392, 123, -1377, 1321, -679, -1557, 772, -979, -687, 1681, -634, 199, 1696, -940, 162, 1159, -1464, 214, 806, -1720, 477, 766, -1061, 1692, 749, -1129, 1500, -329, -984, 960, -1051, -858, 1200, -899, -156, 1605, -741, 321, 1282, -1072, 137, 643, -1525, 439, -3, -1301]
1587a301K171r44l15J991j943Q0J727k248j26J452j555K84J772j791J064J025
1603A343k238J291M61k108J528k32j516J745j06j342K145l76j168J693q53r27
1619f60J310j144p37J601j036J97J299j230J08J627j817L90P03j281L90P65j935
1636a450R52J133j238J212K81j174R50r4j715J310k5j455J496l08p44J805m15
1653E21j131J987r47j165J641j524p93K137j254l74K106j715M29J564j978L55
1669a41J539l028J293R12k454K096N05k151K386J20j986K050p01j626K145j462
1685e03q61K257j614m00K421j456J83J749k167L04Q45k183R37Q49j728J492N80
1702G05j414J352J92j144J305r76q66J240p16o06J361o17J14P01n86j63O95q06
$$ y = [-1301, 870, -74, -389, 1602, -341, -261, 1466, -782, -908, 544, -1011, -727, 1045, -746, 318, 1343, -895, 396, 857, -1251, 277, 45, -1471, 274, 168, -1174, 971, 595, -573, 1120, 267, -660, 650, -494, -1231, 370, -666, -469, 830, -400, -292, 1335, -482, -92, 611, -670, -280, 485, -1450, -498, 635, -603, 609, 890, -284, 666, 572, -1143, 167, 142, -1313, 183, -125, -869, 936, 521, -610, 1377, 430, -735, 906, -618, -1411, 726, -528, -902, 1204, -511, -82, 1482, -496, -141, 1398, -1630, -337, 575, -1879, 217, 722, -1429, 957, 1077, -909, 1141, 440, -1186, 959, -503, -1364, 893, -721, -1121, 1300, -156, 27, 1776, -391, -87, 758, -1425, -488, 361, -1367, 125, 705, -709, 643, 835, -309, 996, 20, -846, 394, -322, -928, 433, -184, -70, 631, 45, -118, 577, -229]
1720b29K6L56q29L30J66L8L96K06m81L69L8k11k07O4l90J82l9j18J98j72L37J07
1742A37K78K64l95r8k38n44J78k50R3J034k88k7L84j18m15M39r70K13l57K19M66
1763EL43n37O11j04k42K94k37l79O7j06rL34j6K58j78O8l0p2J80O4n09J46J68
1786A19p78L53j18K02L92L65n62P33o08l11M37n46j79L90m72N4R09l35J30N36
1806G11r24N35lj065M41K53r21J154O9n73J206n14o67Q64o59n61J024r48o6P01
1826E7m64K61O88j069Q08K45r37O97j13j047Q71J38q85R67n07j09J108n15l72
1845a78O92o41k84Lk75R9K34K17Q1K99j05N16o77l7r9l72n2L01K56p1k3N09k1
1868C72n4j46M0l01K75l67j65J45J13j76L66J15n87O53L9l41K93p2o68O70p45
$$ y = [-229, -203, 153, -676, -346, -180, -142, 254, 460, -21, 348, 386, 175, -32, 32, -358, -176, -215, -333, -135, -307, 30, 137, 415, 679, 284, 186, -52, -596, -418, -668, -575, 459, 171, 144, 528, 410, -5, 434, -536, -323, -680, -461, 5, 348, -189, 422, 318, 76, 370, 133, -246, -179, -285, -294, 40, 24, 282, 104, 172, 142, 70, 250, 314, -195, -49, 119, -659, -306, -424, -222, 170, 535, -27, 706, 98, -213, 224, -322, -501, -111, -583, -529, 380, 45, 175, 711, -213, 322, 319, -746, -305, -52, -973, 181, 250, -323, 883, 369, -298, 566, -93, -654, 370, -578, -644, 57, -407, -146, 542, -527, 281, 526, -411, 286, 173, -874, -3, 135, -750, 217, -290, -399, 709, 194, -178, 514, -127, -411, -408, -683, -584, -350, -133, -52, 247, 142, 658, -19, -56, -155, -527, -579, -278, -22, -93, -116, 393, 372, 318, 172, 212, -89, 186, -181, -346, -201, -88, -264, 102, 217, -370, 283, 322, -19, 274, 202, -466, 204, -541]
1889e41L31K96j80M94P0m35K30L43j256N74jp03P15J54o46J129k46l41O31n97
1909B1m78O17n58o2N34n01K4O18n13K83O37m65o5J30p83L15P8l50N01K93n79L70
1931F7L75k66L0k81k30L28J9n05J50K4L47K27J9n1J06j16j23o32J80N4k27K90
1953b15J32L33J4m5K13M6n84J06K0l15l6R5j57Q59%l50M64m78l18O09o85J23L97
1976B28p27K77J16j19M05L50o36L68M0o24J53n4J9K23l31K00M41k75J12J64k95
1997C5O6K07p35L16l0l63O74j08j19O82k05j41L84r55J61R2m89L72O6O3K14lj09
2020G5K03K4l90L79m83n47P24j44j85M82k32M3N69p37L34L21q39K58R1o44R64
2041B66l2m59N97L8m35O50n02l44L97m57j62Q20n57j86M34j90L31L98n90K16k79
$$ y = [-541, -210, 86, -94, 400, 470, 35, 265, 608, -648, -74, -75, -778, -63, 91, -555, 574, 328, -13, 618, 21, -457, 160, -398, -460, 74, -427, -403, 215, -298, -15, 622, 157, 92, 222, -561, -246, -168, -518, -17, 276, -303, 67, 442, 176, 206, -75, -305, 23, 42, -463, -313, -289, 58, 285, 304, 253, 359, 243, 120, -512, -332, -278, -505, -215, -83, 250, 264, 219, 432, 478, -106, 0, 20, -295, -331, -236, -393, 466, 466, 116, 580, 102, -216, 393, -292, -169, 228, -499, -222, -106, -225, 180, 530, -106, 262, 302, -322, -169, -223, -204, 19, -312, -112, 329, 54, 166, 330, 35, 101, 308, -427, -111, -141, -504, 170, 62, -57, 625, 420, 279, 663, -292, -131, -39, -528, -156, -90, -27, 187, 184, 75, 278, 302, -88, 291, -192, -739, -15, -159, -344, 138, -94, -51, 518, -219, 115, 436, -403, -145, -54, -698, 266, 234, -225, 372, 410, -25, 625, 123, -221, 176, -281, -443, 377, -180, -366, 68, -122, 209, 607, 17, 233, -46]
2062d6n62N20J10q13Q96k93o8M46J45j51J1N3p19M64j85m25O80l2m45M37M79k29
2084B73J46l66l06L78m72j83N27J35l32N23j50r4P71p32m9M24p38j67N89m74R0
2105b07M67m42L81N46p76L57J12r36M99l6p48R38k20m79J314j64q35R20o35m60
2125d04Q02p02j06Q70p25N0O49p33L76O80r34L26K68j118O35j22o05O76M46l51
2145b2O65l75o35P35m58k12P74o93j82M59k39L02M62k34j45J28p36L37J70o18
2165e17M93j26K8M55j83p2J99k98k69M92n0n73L27m33L98k2K39j56K5J70O7l82
2187a88M9j07K3p0Q3O9J33j44K00K66j02O1j27j82J2l35l9J15r1J66M16L7j15
2210A30j22K2L12k63n67J83q2j9M34mJ31M41l94j11O0k7p1q0m04J05K93l42K58
$$ y = [-46, -608, -88, 22, -791, 105, -188, -256, 190, 335, 184, 195, 248, -471, -7, -192, -617, 63, 31, -414, 23, 502, 273, 419, 53, -253, 125, -347, -530, -3, 132, -200, 323, 173, 79, 850, 118, 69, 493, -245, -412, 177, -297, -207, 260, -182, 199, 745, -31, 326, 438, -498, 1, -35, -783, 155, -65, -544, 770, 606, -229, 691, 56, -404, 398, -304, -410, 460, -265, -215, 434, -299, 77, 757, -177, 149, 417, -701, -66, -188, -793, -117, 329, -22, 643, 268, -367, 368, -90, -302, 472, -221, -403, 56, -183, 119, 581, 347, 202, 330, -406, -69, 101, -517, -24, -150, -122, 333, 150, 78, 277, -21, -290, 202, 152, -421, -94, -527, -129, -151, 88, -68, -43, 127, 194, -188, -139, -246, -223, -293, -210, -141, -8, -152, 48, 314, 212, 273, 146, -36, -24, -359, -398, -283, -374, -208, 208, 245, 130, 8, 30, 342, 79, -488, -305, -387, -406, 28, 24, 155, 596, 202, 91, 151, 124, 53, -27, -431, -326, -33, -375, -117]
2233a17L91m33M43l7m07P67q57K32l9p10Q57K18q3R3Om54J55L54n08J58k7m22
2255d20K84L37m99L71O2k35N72p03m28Q78o68l9N17j07k55P61o57Q18k85k65L46
2276C85n74p1K06l52j20P06k29l72P53qm43L30n26oL9J41k4J71J00m7L16m11J09
2299G3J19j84L3R9l91q0K73j40J85J72k20L82j0m81N20m05l42mM05k66K31J73
2321A42j46M77p1l49J20q4k05L05k47m49J33K38Q7L38j53Q6r7J28k18J77l63k16
2343c67R0n4J02K53N0K59K08k07k43k41j86J8J27m1M28k74Q4J92r8j01j11R0J2
2366a0R4k10j37M92l09P5L35k19L28l15p3Nk88M2M19n78K12J62m9J60Q4o3L74
2389E31p42R1J75j24k57L14k89K36M07m12L67J79m15r8K23n22K76J12l22L26M4
$$ y = [-117, 274, -159, 284, 247, -160, 607, -250, -18, -57, -767, 90, 308, 225, 318, 324, -130, 25, 379, -129, 29, 2, -420, -136, 201, -298, 73, 135, -100, 472, -231, -659, 219, -449, -488, 29, -78, -333, 428, -229, 589, 304, 39, 385, -189, -260, -54, -406, -526, 180, -49, -421, 332, 324, -119, 211, -315, -321, -282, -141, -165, 6, 106, 59, 375, -36, 73, 192, 8, 41, 140, -251, -331, -58, -198, -13, 159, -61, 321, 311, -170, 350, -55, -397, -401, 4, -262, -31, 142, -4, 473, 402, 53, 173, 89, -116, 189, -58, -507, -374, -136, -49, 289, 136, 222, 125, 253, 35, 212, -151, -367, -277, -331, -229, 24, 74, 333, 541, 334, 91, -150, -336, -318, -191, -232, 196, -78, 6, 198, 100, -1, -112, -22, -10, 84, -126, -263, 229, -80, -5, 330, 111, 439, 124, 51, 56, -232, -190, 229, -349, -137, 25, -24, 136, 220, 157, 531, -211, -120, 55, -69, -326, -12, -301, -65, 342, -70, 297, 476, 61, -37, 186, -336, -60, 52, -270, 56, 100]
2410A00j81M06k9l91O2j8m42J44P3j2M23J9k47M94p79N92L8n34J37K73k91o5J49
2433g9j44K46n5K69j07J47k85M9j7l06K30j5j13o1J30J64l7L07l91K87j21k72
2455a74m8n6J96J19J0M3J18n5J74k64K07jn01K94k31Q9J70l3J48j74J23K73l58
2478F9k4l28j15K22K5o4K17k71K84P8O0k74K30K37o21K23j25l9K16N8R1K42k61
2501A30K02M7m55N5J20l22P6J44k8p7K31p7K03J65k79p0m23l8L25j97R5M71j23
2524A75j15L54k62J78j53j90J18m43j26L54j46J96M29l38Q7J11j61r4k8j55J52
2545e7Oj13J03N32k41q0J68j46K82m97j2k15q3K90P4K55l75L89j15NMk94L30l65
2569a55n6n9P2K07j08M5M08k45j98L54j83l31J07O4k75N25l8r2K75k97K1K11l05
$$ y = [100, -81, 325, 296, -95, -33, -51, -493, -349, -276, -288, 135, 154, -93, 401, -378, 214, 252, -282, -145, 128, -163, -228, -79, -223, 23, -32, 237, 130, 277, -8, 41, 24, -282, -52, -67, -180, -241, -111, 53, 16, 323, -68, 219, 98, -174, -222, -278, -82, 37, 47, 90, 208, 153, 327, 63, 270, 269, -232, 62, -169, -80, 90, 57, 205, 31, 154, 427, 69, 45, -283, -398, -176, -151, -215, 2, -269, 15, 93, 153, -121, 109, 346, -275, -52, -177, -216, 0, 58, 149, 391, 130, 332, 379, -76, -21, 99, -223, -147, -3, -31, -108, 123, 46, 249, 414, 135, 65, -358, -396, -71, -268, -173, 298, 175, 60, 414, 152, 330, 177, -13, 105, -338, -464, -110, -256, -60, 369, 31, 118, 229, 68, -26, -54, -209, -57, -51, -164, -61, 471, 230, 150, 318, 172, 454, -43, -55, -270, -353, -63, 11, 266, -109, 280, 165, 170, 174, -120, 210, -155, -211, -270, -198, 9, -99, -54, 354, 109, -89, 265, 82, -249, -142, -78, -353, 172, 134, 42, 317, 20, 41, 252, -53]
2592e3J46n61J01J71o7J30j92O45J3k1j25j59O2l64Q1K14k25L69q1R1J4LJ02j14
2616A80j57m1o8m06K50J50l33L93J60j51K05o8j47J04p9m21K32J43k25L78l11
2637b12K85L35k0n11L63j58j18J55m23o9N13p1MK39k23JK6J61n44K32l22O4J40
2660a53L56k09n8k49M04J51j50j17j96q4j50J77L04L9r5J27%L99n59k86J41K16
2682Hn13O78l30K30j83N0K43j06j42j05J84j43O9m2M3L22n30L32K66k40J62j36
2704A17m23K81K24k29k58J82k88L68L01k45J27J08m79K28K46n02J64m8j34L25
2724F5Lj10J47K92j18J87m91L17n62O5K84m7k40K20O9K83l5m03M14o28J1J81j81
2747b77j81M17l9Q6j35K71J07m4p1m6p0j39Q9r0M6J6K66m44M45l66M54n4m57Q0
$$ y = [-53, 93, -468, -367, -196, -263, -133, -325, 320, 333, 312, 187, 28, 90, -274, -193, 21, -204, 165, 84, 175, 189, 192, 294, 180, 23, -18, -86, -492, -242, -92, -425, -32, 128, -23, 182, 114, -33, 71, -8, -429, -197, -54, -279, 99, -212, 73, 408, 388, -123, 240, 82, -36, 119, -304, -373, 140, 69, 73, 312, 89, 90, 116, 277, -267, -35, -357, -293, -153, 203, -6, -64, -313, 91, 242, 92, -25, -221, -305, -455, -278, 26, 65, -30, 97, 97, 496, -63, -349, -208, 8, -505, 173, -157, 73, -110, -60, 183, 77, -65, -170, 14, -129, -60, -102, -59, 263, -267, 65, 331, 91, 253, 117, -306, -25, 199, -30, -288, -106, -394, -26, 275, 30, 157, 265, -214, 14, 260, -242, -78, -126, -260, 65, 68, -42, 105, 397, 279, 466, -25, 292, -270, -205, 79, 32, -208, 12, 81, 364, 329, -74, 340, -288, -277, -96, -277, -458, -41, -80, 6, -129, 142, 249, 205, 134, 88, 18, -121, -32, -122, -76, -60, 206, -238, 207, -159, 295, 241, -216, -136]
2771a36J15p2L33l73j42M31J1J60o0K14n90m4J54j14L27m42J30L36m04K97j7p4
2793D0O2N1k76K16q4k35P6J36j46J64N42n27J65j47K4L53q67J89k42M51L13k60
2815bQ0J42J2n1j88j09J11p2j78Q0K17P6J04Q1j52M1p8j76k10J55k86J44k09L58
2839a10N20n32N20k04M6k13j28N7l8l94J69K51N5J92J33k66J60J00m92P1L17k76
2861f2j34O0J06M08l43J77j60J11l37L30m48J17L23l55m8K80L9J23K64m52M02
2882D01p8o78K3J45K38m2q2J13K5J24N6R1j57J3p8k62N6n5P5P8N54n88M61j25
2906C08j5N7n19K54k44L2L2K37l83K01N05k10j55K2l69K08L25l72j75K86N3J32
2928B10o8M1K78j40k05p4q3o7J20m90J62M87k44K90k09P7J94m07q9K72m11J72
$$ y = [-136, -21, -93, 240, -133, -275, 156, 167, 327, 267, 481, -109, -153, 1, -113, 214, -228, -98, 238, -166, 131, 114, 40, 102, 153, -123, 93, 9, -226, -150, -14, -160, 4, 546, 19, 184, 37, 61, 414, -453, -264, -506, -55, 258, -2, 78, 220, 232, 181, -7, -116, -5, -77, -255, -175, 42, 118, 222, 303, 151, 192, 114, -62, -272, -117, -403, -259, -468, -110, 410, -122, 398, 194, 240, 27, -101, -44, -82, -476, -307, -56, -1, 191, 324, 58, 218, 318, -174, -103, 214, -62, -196, -136, -30, 378, 35, 212, 52, 163, -174, 156, -292, -175, 148, -207, -255, 25, 64, 187, 451, -1, 401, 323, -355, -332, -187, 51, 9, -73, 40, 65, 189, 245, 336, 179, 192, 114, -148, -92, -147, -72, 6, 560, -28, 433, 308, 293, 350, -169, 85, -159, -127, -95, 142, -241, -40, 465, 255, 100, 122, -247, -39, 286, -86, -261, 25, 78, 210, 142, 183, 461, 321, 116, 42, -41, -108, 12, -478, -316, 171, -73, 217, 8, 85, 279, -128, -217, 55, -356, -184]
2950a84J51R2J02j56J45k50n3K36q6N4j2k33P0J43k04j25K53J1L36j74K7l37j61
2973c55k11R07p31J92L79j94M7J57l45L45K10m74M1K7l11M17k99K26n2L6j04J94
2995A02O3l78PL42l51J25O3l49N93k48l1N10l63K23q8p30P13O2m02J58o4l7K09
3018A29Q8j66k7J55l53M69o47J51L7M74l28L2m3J68O8pJo3j88J80m05K72j08J67
3042E6J47o4J91m12J02nn77M75O4k0Q0j34R2L13l94J78r6j60n1M29m79k12M11
3065f6o8O3J28K88j76p9J17l18k78K42j2O0L8K0K63j86L87n03%J21k34K13j60
3088a40j05K51j35J23J85j78QM2J53j28J06l27m1O5J58L1l00M04k27L17N5k78
$$ y = [-184, -33, 59, 161, 5, 150, -100, -153, 83, -3, 51, 39, -194, -124, 19, -185, -310, -57, -46, 290, 116, 143, -194, -355, -566, 341, -390, -198, 181, -13, 34, 191, -154, 191, 401, -73, -32, -5, -316, 101, -198, 28, -24, 12, -92, 102, 165, -213, -206, 136, -215, -90, -27, -376, 217, -31, -62, 448, 85, 308, 220, -510, 203, 265, -137, 21, -43, -80, 129, 217, 51, 24, 179, -174, 295, -352, -201, -164, 310, -18, 14, -29, 139, 207, 200, 201, 138, -50, 130, -275, -3, -111, 56, 203, 139, 330, -82, 20, 15, -562, -87, -23, -43, 37, -97, -5, 308, -86, 92, -4, -164, -215, 214, -265, -477, -66, -134, -71, 57, 345, 169, 90, 207, -111, -389, -147, -159, -99, -61, -41, 222, 36, 423, -80, -80, 41, -193, 20, -140, -245, 6, -129, -6, 179, 1, 9, 51, 204, 76, 182, -145, -186, -121, 37, 68, -232, 172, -55, 262, 317, 39]
$$ [...]
8191F6
##END NTUPLES=NMR FID
##END=
