##TITLE=1H_Ser EL-17
 CDCl3
 8 sc, 
 13.8.2024
##JCAMPDX= 6.0         $$ Bruker NMR JCAMP-DX V2.0
##DATA TYPE= NMR FID
##DATA CLASS= NTUPLES
##ORIGIN= UXNMR, Bruker Analytische Messtechnik GmbH
##OWNER= root
$$ XWIN-NMR		Version 3.5
$$ Tue Aug 13 16:30:35 2024 Russian Standard Time (UT+4h)  she@DPX200
##.OBSERVE FREQUENCY= 200.1313
##.OBSERVE NUCLEUS= ^1H
##.DELAY= (6, 6)
##.ACQUISITION MODE= SIMULTANEOUS
##.ACQUISITION SCHEME= undefined
##.AVERAGES= 8
##.DIGITISER RES= 18
##SPECTROMETER/DATA SYSTEM= spect
##.PULSE SEQUENCE= zg30
##.SOLVENT NAME= DMSO
##.SHIFT REFERENCE= (INTERNAL, DMSO, 0, 15.7039)
##AUDIT TRAIL= $$ (NUMBER, WHEN, WHO, WHERE, WHAT)
$$ ##TITLE= Audit trail, XWIN-NMR		Version 3.5
$$ ##JCAMPDX= 5.01
$$ ##ORIGIN= Bruker BioSpin GmbH
$$ ##OWNER= she
$$ F:/spectra/data/she/nmr/H-F/1/audita.txt
$$ ##AUDIT TRAIL=  $$ (NUMBER, WHEN, WHO, WHERE, WHAT)
(   1,<2024-08-13 16:29:40.32 +0400>,<she>,<DPX200>,
      <created by zg, POWCHK disabled, PULCHK disabled
       configuration hash MD5:
       00 E9 B6 7A A2 85 ED C7 34 08 36 98 17 FE 4E 26
       data hash MD5: 16K
       73 58 DB 92 D0 FA 60 E8 E5 1C 08 17 40 49 82 F8>)
$$ ##END=
$$ 
$$ hash MD5
$$ 5D 97 5B 74 AB E6 50 52 CE 62 4A D2 89 38 7A 89
##$RELAX= 
##$RELAX= 
##$RELAX= 
##$RELAX= 
##$RELAX= 
##$RELAX= 
$$ Bruker specific parameters
$$ --------------------------
##$DU= <F:/spectra>
##$EXPNO= 1
##$NAME= <H-F>
##$PROCNO= 1
##$TYPE= <nmr>
##$USER= <she>
##$AMP= (0..31)
100 100 100 100 100 100 100 100 100 100 100 100 100 100 100 100 100 100 
100 100 100 100 100 100 100 100 100 100 100 100 100 100 
##$AQSEQ= 0
##$AQ_mod= 1
##$AUNM= <au_zg>
##$AUTOPOS= <>
##$BF1= 200.13
##$BF2= 200.13
##$BF3= 200.13
##$BF4= 200.13
##$BF5= 200.13
##$BF6= 200.13
##$BF7= 200.13
##$BF8= 200.13
##$BYTORDA= 1
##$CFDGTYP= 0
##$CFRGTYP= 5
##$CHEMSTR= <none>
##$CNST= (0..31)
1 1 145 1 1 1 1 1 1 1 1 1 1 1 1 1 1 1 1 1 1 1 1 1 1 1 1 1 1 1 1 1 
##$CPDPRG= <>
##$CPDPRG1= <>
##$CPDPRG2= <>
##$CPDPRG3= <>
##$CPDPRG4= <mlev>
##$CPDPRG5= <mlev>
##$CPDPRG6= <mlev>
##$CPDPRG7= <mlev>
##$CPDPRG8= <mlev>
##$CPDPRGB= <>
##$CPDPRGT= <>
##$D= (0..31)
0 1.2 0 0 0 0 0 0 0 0.06 0 0.03 0 0 0 0 0.0002 0 0 0 0 0 0 0 0 0 0 0 0 
0 0 0 
##$DATE= 1723552180
##$DBL= (0..7)
120 120 120 120 120 120 120 120 
##$DBP= (0..7)
150 150 150 150 150 150 150 150 
##$DBP07= 0
##$DBPNAM0= <>
##$DBPNAM1= <>
##$DBPNAM2= <>
##$DBPNAM3= <>
##$DBPNAM4= <>
##$DBPNAM5= <>
##$DBPNAM6= <>
##$DBPNAM7= <>
##$DBPOAL= (0..7)
0.5 0.5 0.5 0.5 0.5 0.5 0.5 0.5 
##$DBPOFFS= (0..7)
0 0 0 0 0 0 0 0 
##$DE= 6
##$DECBNUC= <off>
##$DECIM= 24
##$DECNUC= <off>
##$DECSTAT= 4
##$DIGMOD= 1
##$DIGTYP= 9
##$DL= (0..7)
0 120 120 120 120 120 120 120 
##$DP= (0..7)
150 150 150 150 150 150 150 150 
##$DP07= 0
##$DPNAME0= <>
##$DPNAME1= <>
##$DPNAME2= <>
##$DPNAME3= <>
##$DPNAME4= <>
##$DPNAME5= <>
##$DPNAME6= <>
##$DPNAME7= <>
##$DPOAL= (0..7)
0.5 0.5 0.5 0.5 0.5 0.5 0.5 0.5 
##$DPOFFS= (0..7)
0 0 0 0 0 0 0 0 
##$DQDMODE= 0
##$DR= 18
##$DS= 0
##$DSLIST= <SSSSSSSSSSSSSSS>
$$ [...]
##$SUBNAM2= <"">
##$SUBNAM3= <"">
##$SUBNAM4= <"">
##$SUBNAM5= <"">
##$SUBNAM6= <"">
##$SUBNAM7= <"">
##$SUBNAM8= <"">
##$SUBNAM9= <"">
##$SW= 24.0689771365484
##$SWIBOX= (0..15)
0 0 2 0 0 0 0 0 0 0 0 0 0 0 0 0 
##$SW_h= 4816.95568400771
##$TD= 16384
##$TD0= 1
##$TE= 0
##$TE2= 300
##$TE3= 300
##$TEG= 300
##$TL= (0..7)
0 120 120 120 120 120 120 120 
##$TP= (0..7)
150 150 150 150 150 150 150 150 
##$TP07= 0
##$TPNAME0= <>
##$TPNAME1= <>
##$TPNAME2= <>
##$TPNAME3= <>
##$TPNAME4= <>
##$TPNAME5= <>
##$TPNAME6= <>
##$TPNAME7= <>
##$TPOAL= (0..7)
0.5 0.5 0.5 0.5 0.5 0.5 0.5 0.5 
##$TPOFFS= (0..7)
0 0 0 0 0 0 0 0 
##$TUNHIN= 0
##$TUNHOUT= 0
##$TUNXOUT= 0
##$USERA1= <user>
##$USERA2= <user>
##$USERA3= <user>
##$USERA4= <user>
##$USERA5= <user>
##$V9= 5
##$VALIST= <valist>
##$VCLIST= <CCCCCCCCCCCCCCC>
##$VD= 0
##$VDLIST= <DDDDDDDDDDDDDDD>
##$VPLIST= <PPPPPPPPPPPPPPP>
##$VTLIST= <TTTTTTTTTTTTTTT>
##$WBST= 1024
##$WBSW= 4
##$XGAIN= (0..3)
0 0 0 0 
##$XL= 0
##$YL= 0
##$YMAX_a= 270614
##$YMIN_a= -273543
##$ZGOPTNS= <>
##$ZL1= 120
##$ZL2= 120
##$ZL3= 120
##$ZL4= 120
##$ABSF1= 10
##$ABSF2= 0
##$ABSG= 5
##$ABSL= 3
##$ALPHA= 0
##$AQORDER= 0
##$ASSFAC= 0
##$ASSFACI= 0
##$ASSFACX= 0
##$ASSWID= 0
##$AUNMP= <proc_1d>
##$AZFE= 0.1
##$AZFW= 0.1
##$BCFW= 1
##$BC_mod= 2
##$BYTORDP= 1
##$COROFFS= 0
##$CY= 11.3945322036743
##$DATMOD= 1
##$DC= 2
##$DFILT= <>
##$DTYPP= 0
##$F1P= 15.6554695791079
##$F2P= 12.8336369535428
##$FCOR= 0.5
##$FTSIZE= 0
##$FT_mod= 4
##$GAMMA= 1
##$GB= 0.15
##$INTBC= 1
##$INTSCL= 1
##$ISEN= 128
##$LB= 0.24
##$LEV0= 0
##$LPBIN= 0
##$MAXI= 10000
##$MC2= 0
##$MEAN= 0
##$ME_mod= 0
##$MI= 1.114404
##$NCOEF= 0
##$NC_proc= 0
##$NLEV= 6
##$NOISF1= 3.799351
##$NOISF2= 2.8
##$NSP= 1
##$NTH_PI= 0
##$NZP= 0
##$OFFSET= 15.70392
##$PC= 1
##$PHC0= -25996.05
##$PHC1= 13.38748
##$PH_mod= 1
##$PKNL= yes
##$PPARMOD= 0
##$PSCAL= 0
##$PSIGN= 0
##$REVERSE= no
##$SF= 200.130013532006
##$SI= 16384
##$SIGF1= 3
##$SIGF2= 2
##$SINO= 400
##$SIOLD= 16384
##$SREGLST= <1H.CDCl3>
##$SSB= 0
##$STSI= 0
##$STSR= 0
##$SW_p= 3612.71676300578
##$SYMM= 0
##$S_DEV= 0
##$TDeff= 0
##$TDoff= 0
##$TI= <>
##$TILT= no
##$TM1= 0
##$TM2= 0
##$TOPLEV= 0
##$USERP1= <user>
##$USERP2= <user>
##$USERP3= <user>
##$USERP4= <user>
##$USERP5= <user>
##$WDW= 1
##$XDIM= 8192
##$YMAX_p= 0
##$YMIN_p= 0
$$ End of Bruker specific parameters
$$ ---------------------------------
##NTUPLES= NMR FID
##VAR_NAME=  TIME,          FID/REAL,        FID/IMAG
##SYMBOL=    X,             R,               I
##VAR_TYPE=  INDEPENDENT,   DEPENDENT,       DEPENDENT
##VAR_FORM=  AFFN,          ASDF,            ASDF
##VAR_DIM=   8192,          8192,            8192
##UNITS=     SECONDS,       ARBITRARY UNITS, ARBITRARY UNITS
##FACTOR=    0.0002076,     1,               1
##FIRST=     0,             0,               0
##LAST=      1.7004516,     0,               0
##MIN=       0,             -273543,         0
##MAX=       1.7004516,     270614,          0
$$ Real data points
##PAGE= N=1
##DATA TABLE= (X++(R..R)), XYDATA
$$ plain form
0 0 0 0 0 0 0 0 0 0 -8 8 -8 8 -16 16 -18 24 -32 35 -42 51 -60 68 -81 94 -108 124 -144 163 -185 210 -238
31 -238 268 -301 339 -380 422 -471 524 -584 647 -716 793 -877 971 -1075 1191 -1319 1465
48 1465 -1630 1818 -2035 2293 -2596 2960 -3417 4000 -4764 5810 -7304 9423 -18544 270614
62 270614 50816 -186801 61085 -10034 14750 89610 -125087 -37946 170522 -64004 -101263
73 -101263 43155 7486 64281 23695 -138811 27527 102540 -46267 -3612 -2510 -43346
84 -43346 64342 -18433 -67506 78984 2452 -46810 55329 -50750 -23494 113366 -38804
95 -38804 -63546 35261 -46586 49745 70896 -146211 14513 146780 -99965 -34912 83544
106 83544 -56443 45970 31571 -168140 67512 152008 -136198 -39465 90806 -37622 29906
$$ packed form
0@%%%%%%%%qJ6j6J6k4L2l4M2n6O7p7R3j11J28j49J75k02K32k68L07l48L95m48
31b38N06n69O40p19Q02q93R95j108J231j363J509j670J848k046K266k510K784
48A465l095L448l853M328m889N556o377P417q764J0574j3114J6727k7967K89158
62B70614k19798k37617K47886p1119K4784P4860k14697Q7141K08468k34526l7259
73a01263J44418l5669N6795m0586j62506J66338P5013j48807M2655J102m0836
84d3346J07688q2775m9073J46490p6532m9262J02139j06079K7256J36860j52170
95c8804k4742R8807q1847R6331K1151k17107J60724J32267k46745O5053J18456
106H3544j39987J02413j4399j99711K35652Q4496k88206R6733J30271j28428O7528
$$ plain form
117 29906 14669 -91812 73423 56050 -117187 885 62104 -7762 8738 -45382 -12470
128 -12470 86315 -32024 -45170 59970 -23837 -19432 29818 -50992 30183 53015 -90306 16000
140 16000 71034 -68457 22308 45430 -71891 39225 16380 -90588 78508 35958 -115051
151 -115051 56118 44431 -79829 64744 16840 -84951 73149 5325 -95010 75469
161 75469 23069 -80860 48815 8729 -48668 57689 536 -40148 37599 -22345 -21891 47082
173 47082 -21584 -22137 21408 -14210 19090 4608 -40642 51467 19755 -72566 21323 25739 -22616
186 -22616 34820 -42823 -47846 102910 -5002 -87787 62607 18411 -39193 39609 -47719 -22938
198 -22938 106550 -52500 -88993 87658 13349 -37786 39020 -42949 -8374 84892 -54324
$$ packed form
117B9906j5237j06481J65235j7373j73237J18072O1219o9866J6500n4120L2912
128a2470R8785j18339j3146J05140q3807M405M9250q0810Q1175K2832j43321J06306
140A6000N5034j39491R0765K3122j17321J11116k2845j06968J69096m2550j51009
151a15051J71169j1687j24260J44573m7904j01791J58100o7824j00335J70479
161G5469n2400j03929J29675m0086n7397J06357n7153m0684P7747n9944M54O8973
173D7082o8666n53M3545l5618L3300j4482m5250R2109l1712r2321R3889M416m8355
186b2616N7436p7643n023J50756j07912q2785J50394m4196n7604P8802q7328K4781
198b2938J29488j59050l6493J76651p4309n1135P6806q1969L4575R3266j39216
$$ plain form
209 -54324 -54538 71220 -6494 -32278 18872 -24910 17089 45032 -42879 -17083 29867 -1669
221 -1669 9614 -15889 -30712 35538 6073 -28338 15778 -9433 6777 41696 -48931 -22651
233 -22651 65625 -19099 -29059 22285 -35825 20163 54930 -73350 -12479 81800 -32142 -25341
245 -25341 30901 -33556 22742 37383 -79930 -154 75108 -34476 -22965 24804 -16391 24996
257 24996 15901 -56631 12387 43031 -29540 -17161 6910 3780 21479 -11759 -22815 22966
269 22966 9450 -5296 -2731 -20681 16384 18682 -37553 4434 25667 -22879 15753 11097 -39344
282 -39344 30963 24983 -51146 14050 20942 -38539 25904 12341 -48624 34136 27366 -47844 19108
295 19108 21918 -33774 20885 4958 -41609 27742 19384 -37439 10514 17667 -13847 11562 734
$$ packed form
209e4324k14J25758p7714k5784N1150m3782M1999K7943q7911K5796M6950l1536
221a669J1283k5503j4823O6250k9465l4411M4116k5211J6210L4919r0627K6280
233b2651Q8276q4724r960N1344n8110N5988L4767j28280O0871R4279j13942O801
245b5341N6242o4457N6298J4641j17313P9776P5262j09584J1511M7769m1195M1387
257B4996r095p2532O9018L0644p2571J2379K4071l130J7699l3238j1056M5781
269B2966j3516j4746K565j7950L7065K298n6235M1987K1233m8546L8632m656n0441
282c9344P0307n980p6129O5196O892n9481O4443j3563o0965Q2760o770p5210O6952
295A9108K810n5692N4659j5927m6567O9351q358n6823M7953P153l1514K5409j0828
$$ plain form
308 734 -15187 14633 2280 -16906 594 4771 3052 -3775 -7403 12969 3649 -9683 10918
321 10918 -4580 -10798 17103 -11910 -15930 27624 -9792 -20859 31351 -3979 -20131 29235
333 29235 -8537 -21036 29754 -12789 -25555 32870 -6027 -26847 28437 328 -17953 24739
345 24739 -5309 -19318 23878 -3304 -23221 15307 3093 -13569 9112 2700 -6622 9421
357 9421 4346 -9006 -591 6482 -2570 -8385 2302 2910 -6741 6464 5996 -12153 8461 13372
371 13372 -17750 18 13935 -16308 530 12809 -20091 3412 22539 -18649 -4148 22981
383 22981 -11961 -5681 15769 -15840 -4990 19791 -15310 -11712 21658 -2894 -10761 14137 -2564
396 -2564 -8092 13504 -4556 -15346 11606 4648 -15256 4529 9297 -8225 4245 8596 -10543
$$ packed form
308G34j5921K9820j2353j9186J7500M177j719o827l628K0372r320j3332K0601
321A0918j5498o218K7901k9013m020M3554l7416j1067N2210l5330j6152M9366
333B9235l7772j2499N0790m2543j2766N8425l8897k0820N5284k8109j8281M2692
345B4739l0048j4009M3196k7182j9917L8528j2214j6662K2681o412r322J6043
357I421n075j3352Q415P073r052n815J0687O08r651J3205m68j8149K0614M911
371A3372l1122J7768J3917l0243J6838J2279l2900K3503J9127m1188J4501K7129
383B2981l4942O280K1450l1609J0850K4781l5101L598L3370k4552p867K4898j6701
396b564n528K1596j8060j0790K6952o958j9904J9785M768j7522J2470M351j9139
$$ plain form
409 -10543 1516 11774 -12379 -6593 12273 -6647 -8011 12369 -3028 -6557 14342 -1525 -10940
422 -10940 12058 1252 -14631 7101 3980 -13414 6149 7409 -11646 5418 11792 -11383 -57
435 -57 12856 -11670 -6332 12922 -9246 -7831 15741 -6120 -9028 19101 -3113 -13958 17191
448 17191 -815 -16736 13306 -1161 -16610 15589 2451 -17465 14732 8065 -15255 9236
460 9236 5376 -14134 7979 3687 -15767 5425 8814 -9182 1023 7498 -2651 1329 3507
473 3507 -4255 -3581 4269 200 -9660 1246 8866 -6121 -864 10505 -7612 203 13651 -14326
487 -14326 -6453 18626 -12272 -9870 18231 -10564 -5271 22267 -13730 -9105 25616 -11634 -13645
500 -13645 19142 -11503 -9916 19896 -12542 -10196 22672 -5321 -9840 14439 -5505 -5127 10757
$$ packed form
409a0543J2059J0258k4153N786J8866j8920j364K0380j5397l529K0899j5867r415
422a0940K2998j0806j5883K1732l121j7394J9563J260j9055J7064O374k3175J1326
435e7J2913k4526N338J9254k2168J415K3572k1861k908K8129k2214j0845L1149
448A7191j8006j5921L0042j4467j5449L2199j3138j9916L2197o667k3320K4491
460I236l860j9510K2113m292j9454K1192L389j7996J0205O475j0149L980K178
473C507p762O74P850m069r860J0906P620j4987N257J1369j8117P815J3448k7977
487a4326P873K5079l0898K402K8101k8795N293K7538l5997M625L4721l7250k011
500a3645L2787l0645J587K9812l2438K346L2868k7993m519K4279j9944L78J5884
$$ plain form
513 10757 -9057 -6753 9272 -2055 -3295 1676 235 5565 -759 -2506 4255 -4855 1541 5446
527 5446 -14857 1932 14298 -14817 1270 14862 -15520 6729 16017 -24710 3360 20653
539 20653 -23994 797 17433 -22550 7705 20263 -26130 5668 23124 -21719 1344 14223
551 14223 -20843 6671 13212 -23362 4998 16219 -13067 3429 6477 -9079 9146 1554 -13392
564 -13392 4162 1686 -2819 2868 -7981 4542 11816 -10587 2191 6859 -11086 10287 2341
577 2341 -23380 14611 10670 -23171 12338 7547 -19301 21798 3550 -29760 22676 9055 -29085
590 -29085 15531 3479 -22046 24360 783 -26942 24875 7478 -22084 14715 -1354 -14183
602 -14183 18819 -7096 -17695 17886 809 -8182 8580 -6700 2754 12192 -13671 -2155 7986
$$ packed form
513A0757j9814K304J6025j1327j240M971j441N330o324j747O761r110O396L905
527E446k0303J6789J2366k9115J6087J3592l0382K2249R288m0727K8070J7293
539B0653m4647K4791J6636l9983L0255J2558m6393L1798J7456m4843K3063J2879
551A4223l5066K7514O541l6574K8360J1221k9286J6496L048j5556J8225p592j4946
564a3392J7554k476m505N687j0849J2523P274k2403J2778M668j7945K1373p946
577B341k5721L7991l941l3841L5509m791k6848M1099j8248l3310N2436j3621l8140
590b9085M4616j2052k5525M6406k3577k7725N1817j7397k9562L6799j6069j2829
602a4183L3002k5915j0599L5581j7077q991J6762j5280R454R438k5863J1516J0141
$$ plain form
615 7986 -8094 5657 -2098 -13971 18296 3256 -17212 14962 -274 -11077 19820 -12557
627 -12557 -18452 28432 -7438 -20996 24159 -7645 -11230 29296 -16393 -16021 32795 -11657 -18558
640 -18558 22741 -13286 -8430 24154 -18245 -8693 26852 -11028 -7086 14375 -12857 2538 12268
653 12268 -19151 387 11859 -9219 4889 133 -9114 16793 -896 -14023 11896 -4384
665 -4384 -5751 14656 -17460 -5172 25783 -15047 -7505 20946 -15439 2166 20962 -28842 234
678 234 27917 -26182 -2635 21246 -23311 9108 21838 -30961 6749 26123 -25490 1152
690 1152 14047 -21395 10230 11436 -24816 10047 14011 -14079 7337 237 -9626 15978 -4889
703 -4889 -15076 12323 -3125 -3247 10362 -14963 2259 20606 -15845 -2728 13127 -13849 8613
$$ packed form
615G986j6080J3751p755j1873L2267j5040k0468L2174j5236j0803L0897l2377
627a2557n895M6884l5870j3558M5155l1804l585M0526m5689L72M8816m4452o901
640a8558M1299l6027M856L2584m2399R552L5545l7880L942K1461k7232J5395R730
653A2268l1419J9538J1472k1078J4108m756r247K5907j7689j3127K5919j6280
665d384j367K0407l2116J2288L0955m0830P542K8451l6385J7605J8796m9804K9076
678B34K7683n4099K3547K3881m4557L2419J2730n2799L7710J9374n1613K6642
690A152J2895l5442L1625J206l6252L4863L964k8090K1416p100r863K5604k0867
703d889j0187K7399j5448j22J3609k5325J7222J8347l6451J3117J5855k6976K2462
$$ plain form
716 8613 6881 -26973 13698 17417 -25550 8689 10670 -17969 20627 2005 -31886 23492 11143
729 11143 -30863 13888 5254 -18240 23827 -2526 -25912 27001 6121 -23776 13416 -389
741 -389 -10511 16711 -9846 -12597 19365 -2788 -5920 8613 -9187 6711 10038 -18908 3805
754 3805 9513 -14165 9822 430 -18406 21147 5990 -22766 15683 3355 -14698 18368 -9384
767 -9384 -18937 27972 -4411 -21358 21597 -4449 -8774 23529 -17663 -12165 32052 -14246 -18762
780 -18762 22560 -9781 -6598 19549 -17807 -3547 25846 -13862 -8276 15599 -9113 71 6305
793 6305 -14056 6374 7331 -11760 7800 1503 -7795 13812 -5471 -10596 16103 -8906 -9378 18770
807 18770 -12981 -8354 23433 -12391 -6967 21383 -15407 -2011 20922 -22231 -3641 23331
$$ packed form
716H613j732l3854M0671L719m2967L4239J981k8639L8596j8622l3891N5378j2349
729A1143m2006M4751q634k3494M2067k6353k3386N2913k0880k9897L7192j3805
741c89j0122K7222k6557k751L1962k2153l132J4533j7800J5898L327k8946K2713
754C805N708k3678K3987r392j8836L9553j5157k8756L8449j2328j8053L3066k7752
767i384r553M6909l2383j6947M2955k6046m325L2303m1192N498M4217m6298m516
780a8762M1322l2341L183K6147l7356J4260K9393l9708N586K3875k4712R184O234
793F305k0361K0430R57j9091J9560o297r298K1607j9283n125K6699k5009m72K8148
807A8770l1751M627L1787l5824N424K8350l6790J3396K2933m3153J8590K6972
$$ plain form
819 23331 -19166 -2478 17633 -17558 6360 16581 -23980 6395 18305 -22241 3362 11413
831 11413 -18187 8250 8271 -18321 10695 8334 -13752 9085 2678 -10596 8986 -2447 -6789
844 -6789 8435 -8220 -92 13588 -12818 -498 15040 -11420 2296 7353 -18203 10719 12063
857 12063 -26341 6442 17833 -16561 5961 6026 -16155 18678 5784 -28769 13248 13638 -19663
870 -19663 6110 2313 -11180 18815 -1785 -20138 17854 6306 -14993 6777 -2994 -5348 13331
883 13331 -8222 -9082 14186 -1742 -2416 6236 -8661 4087 8441 -12070 1052 3544 -7921
896 -7921 11317 -1202 -16009 16262 6496 -15195 8657 -1172 -8318 17923 -10215 -19644 23946
909 23946 2929 -18651 10808 -605 -3351 17289 -15029 -12620 25261 -3958 -17854 9169
$$ packed form
819B3331m2497J6688K0111l5191K3918J0221m0561L0375J1910m0546K5603Q051
831A1413k9600K6437K1k6592K9016k361k2086K2837o407j3274J9582j1433m342
844f789J5224j6655Q128J3680k6406J2320J5538k6460J3716N057k5556K8922J344
857A2063l8404L2783J1391l4394K2522O5k2181L4833j2894l4553M2017L90l3301
870a9663K5773l797j3493K9995k0600j8353L7992j1548k1299K1770r771k354J8679
883A3331k1553q60K3268j5928o74Q652j4897J2748M354k0511J3122K492j1465
896g921J9238j2519j4807L2271r766k1691K3852r829p146K6241k8138r429M3590
909B3946k1017k1580K9459j1413k746K0640l2318K409L7881k9219j3896K7023
$$ plain form
921 9169 -984 171 9430 -14335 -919 19999 -7490 -9410 6394 -1490 3028 -814 -11672
934 -11672 7353 7704 -7775 2119 648 -1516 9880 -6774 -8093 11628 -4265 -6310 9252
947 9252 -8519 -1823 16096 -10387 -5768 14664 -7964 -2137 10388 -15129 -112 16946 -14381
960 -14381 -5652 14917 -6324 493 7107 -12583 5386 12178 -15351 -3410 10896 -5107 -778
973 -778 506 -4869 9730 3068 -10346 3503 5097 -2772 -769 -5341 1912 7564 -8786 -2856
987 -2856 9521 -2590 120 2830 -7493 6236 5176 -14905 3484 9313 -11145 2230 6284
1000 6284 -8476 7766 4593 -13360 7525 6928 -13180 3113 4961 -9041 5421 3265 -8906
1013 -8906 6666 5090 -7804 3897 2138 -5683 3441 -193 -5551 3015 1138 -980 1547 -1911
$$ packed form
921I169j0153J155R259k3765J3416K0918k7489j920J5804p884M518l842j0858
934a1672J9025L51j5479R894j471k164J1396j6654j319J9721j5893k045J5562
947I252j7771O696J7919k6483M619K0432k2628N827J2525k5517J5017J7058l1327
960a4381Q729K0569k1241O817O614j9690J7969O792k7529J1941J4306j6003M329
973g78J284n375J4599o662j3414J3849J594p869K003m572P253N652j6350N930
987b856J2377j2111K710K710j0323J3729j060k0081J8389N829k0458J3375M054
1000F284j4760J6242l173j7953K0885n97k0108J6293J848j4002J4462k156j2171
1013h906J5572j576j2894J1701j759p821R124l634n358Q566j877k118K527l458
$$ plain form
1027 -1911 2494 3891 -4119 -361 1324 -1782 3087 -3809 -5554 9314 1736 -8718 4885 3017
1041 3017 -3134 5105 -5469 -5716 12116 -2267 -12438 7667 4324 -4665 3952 -3133 -2601 11932
1055 11932 -3908 -11464 7471 3606 -6523 621 -761 360 6443 -3204 -5614 6137 3788 -4124
1069 -4124 -3024 143 2344 403 -2935 -998 2001 3262 772 -4142 1086 5599 -2856 -3849 1953
1084 1953 -1997 1196 3511 -6545 329 8797 -2844 -3531 4015 -2017 191 3380 -7605 -1744
1098 -1744 8613 -2798 -5442 4458 1603 296 2151 -4640 -1036 6769 -2318 -7443 2453 4175
1112 4175 -1414 -1035 -191 1323 4008 -277 -5811 924 4954 -3086 -4842 2358 1764 -429 544 -1878
1128 -1878 770 5331 -1693 -5668 2970 2553 -3863 -1271 845 -903 2987 790 -4129 2579 4894
$$ packed form
1027a911M405J397q010L758J685l106M869o896j745J4868p578j0454J3603j868
1041C017o151Q239j0574k47J7832j4383j0171K0105l343q989Q617p085N32J4533
1055A1932j5840p556J8935l865j0129P144j382J121O083r647k410J1751k349p912
1069d124J100L167K201j941l338J937K999J261k490m914N228M513q455r93N802
1084A953l950L193K315j0056O874Q468j1641o87P546o032K208L189j0985N861
1098a744J0357j1411k644R900k855j307J855o791L604P805r087n125R896J722
1112D175n589L79Q44J514K685m285n534O735M030q040j756P200n94k193R73k422
1128a878K648M561p024l975Q638m17o416K592K116j748L890k197m919O708K315
$$ plain form
1143 4894 -3631 -2235 2381 -1345 -786 1361 -3225 -511 5967 -1587 -3795 4647 1586 -3107 1741
1158 1741 -1648 -2866 4907 -813 -6460 4140 4151 -3848 1319 1399 -2231 3552 -492 -6573 2708 4070
1174 4070 -4337 -1230 2226 683 2222 -353 -3004 2228 3000 -3052 -3405 1435 2277 -1413 -2265 1354
1190 1354 1527 1242 1052 -3515 -37 4937 -3577 -4669 4389 -614 -2188 3787 -2949 -793 7766 -3276
1206 -3276 -5049 6580 -1162 -4140 4134 -3541 -2534 7263 -2928 -4348 6481 -69 -2673 3278
1220 3278 -3030 -1847 4594 -3169 -3367 3322 -72 -399 780 -1229 2380 1237 -2561 541 -884
1235 -884 -564 1823 -3474 -745 5261 -2478 -1313 4786 -3190 82 4654 -6614 -748 6504 -6183
1250 -6183 -1503 6401 -5355 941 6862 -6471 626 7130 -6766 -691 5649 -6905 430 4853
$$ packed form
1143D894q525J396M616l726N59K147m586K714O478p554k208Q442l061m693M848
1158A741l389j218P773n720n647J0600J1p999N167Q0l630N783m044o081R281J362
1174D070q407L107L456j543J539k575k651N232P72o052l53M840Q42l690q52L619
1190A354J73k85j90m567L478M974q514j092R058n003j574N975o736K156Q559j1042
1206c276j773J1629p742k978Q274p675J007R797j0191j420J0829o550k604N951
1220C278o308J183O441p763j98O689l394l27J179k009L609j143l798L102j425
1235h84L20K387n297K729O006p739J165O099p976L272M572j1268N866P252j2687
1250f183M680P904j1756O296N921j3333P097O504j3896O075O340j2554P335M423
$$ plain form
1264 4853 -6087 1621 5095 -4539 1953 3194 -4375 1598 1538 -3874 2005 -328 -2369 3272 -801
1279 -801 -673 3488 -2586 426 3317 -5234 1062 3542 -6242 1725 3995 -6303 4092 4282 -8113
1294 -8113 4758 4525 -8508 3414 3137 -8487 5475 2665 -8988 6613 4151 -7839 5121
1307 5121 2004 -6704 5764 -209 -8089 5462 930 -5458 4340 -205 -2042 5356 -2344 -2506 4238
1322 4238 -2185 -1230 1474 -4361 2398 3328 -5669 2719 3536 -4309 4309 92 -6776 6759 14
1337 14 -8527 6291 552 -5988 7917 -1965 -6349 10327 -1643 -8049 8072 -2435 -5849 7794
1351 7794 -4650 -5052 10077 -3181 -4730 7696 -3119 -2179 5921 -6168 -2070 6395 -4676 -982
1365 -982 3849 -3795 3048 2797 -5524 3637 2088 -5037 3191 -1687 -4241 6999 -2578 -5126 7937
$$ packed form
1264D853j0940P708L474r634O492J241p569N973o0n412N879k333k041N641m073
1279h01J28M161o074L012K891q551O296K480r784P967K270j0298J0395J90j2395
1294h113J2871k33j3033J1922k77j1624J3962k810j1653J5601k462j1990J2960
1307E121l117q708J2468n973p880J3551m532o388R798m545j837P398p700j62O744
1322D238o423R55K704n835O759R30q997Q388Q17p845Q618m217o868J3535o745
1337A4q541J4818n739o540J3905r882m384J6676j1970o406J6121j0507l414J3643
1351G794j2444m02J5129j3258j549J2426j0815R40Q100j2089M098Q465j1071L694
1365i82M831p644O843k51q321R161j549p125Q228m878k554J1240r577k548J3063
$$ plain form
1380 7937 -2277 -3185 7781 -5357 -3193 9580 -6879 -4152 9042 -6134 -1809 8638 -7428
1393 -7428 -322 9877 -7787 -1590 7155 -7505 375 5696 -8929 1787 7291 -7026 1815
1406 1815 4955 -5577 3868 1809 -6839 3608 1466 -5093 3248 -1298 -2184 6488 -3370 -2762 6567
1421 6567 -3501 -1050 4632 -7100 846 6900 -8400 599 7142 -7349 2718 5696 -9681
1434 -9681 4711 6666 -11004 2293 5254 -8850 5124 3178 -9710 6928 4654 -8910 5002
1447 5002 1965 -6583 5540 -1047 -7334 7151 -64 -5415 5258 -1184 -1505 5985 -4445 -2546
1461 -2546 5771 -3893 -1296 2785 -5157 3029 4013 -7414 3327 4371 -6134 4630 378 -7898
1475 -7898 7264 841 -10040 7392 1759 -7424 7665 -437 -7247 9826 -986 -9196 7961
$$ packed form
1380G937j0214r08J0966j3138K164J2773j6459K727J3194j5176M325J0447j6066
1393g428P106J0199j7664O197Q745j4660P880N321j4625J0716N504j4317Q841
1406A815L140j0532R445k059q648J0447k142o559Q341m546q86Q672r858O08R329
1421F567j0068K451N682j1732P946O054j5300Q999O543j4491J0067K978j5377
1434i681J4392J955j7670J3297K961j4104J3974j946j2888J6638k274j3564J3912
1447E002l037q548J2123o587o287J4485p215n351J0673o442l21P490j0430J899
1461b546Q317r664K597M081p942Q186R84j1427J0741J044j0505J0764m252q276
1475g898J5162o423j0881J7432n633r183J5089q102o810J7073j0812q210J7157
$$ plain form
1488 7961 -908 -6241 6945 -3496 -4633 9063 -3034 -4054 7011 -2957 -1973 5173 -5911 -1073
1502 -1073 5627 -4926 -183 3586 -4252 3657 2154 -6168 3982 1879 -5517 3525 -1337 -4261
1516 -4261 7335 -2254 -5414 8008 -1695 -4198 7096 -5168 -3014 8909 -6230 -4636 9065
1529 9065 -5361 -2376 8732 -6144 -1104 9101 -6755 -2292 6945 -6054 -347 5046 -6519
1542 -6519 1368 5575 -5537 1603 3309 -4163 3395 1031 -5612 3745 553 -4389 3671 -1445 -2267
1557 -2267 6118 -2927 -2739 5861 -3823 -1452 4717 -6222 257 6018 -6620 165 6836 -6099
1571 -6099 1829 5352 -8206 2996 5748 -9035 1866 4909 -7418 3850 3594 -7149 4836
1584 4836 3788 -7113 3272 2000 -5149 3775 -454 -5055 4701 46 -3093 4023 -1293 -594 4227
$$ packed form
1488G961q869n333J3186j0441j137J3696j2097j020J1065r968R84P146j1084M838
1502a073O700j0553M743L769p838P909j503q322J0150k103p396R042m862k924
1516d261J1596r589l160J3422r703k503J1294j2264K154J1923j5139J594J3701
1529I065j4426K985J1108j4876N040J0205j5856M463R237j2999N707N393j1565
1542f519P887M207j1112P140J706p472P558k364o643R357l192m942Q060n116q22
1557b267Q385r045J88Q600r684K371O169j0939O479N761j2638O785O671j2935
1571f099P928L523j3558J1202K752j4783J0901L043j2327J1268k56j0743J1985
1584D836j048j0901J0385j272p149Q924m229m601R756m655l139P116n316O99M821
$$ plain form
1599 4227 -3696 -1440 4257 -3740 226 2636 -4771 3049 3731 -6142 2975 3606 -5368 3450 1152
1614 1152 -6846 5455 961 -7902 5078 1928 -5671 5671 -148 -5587 6682 -407 -6787 5162
1628 5162 156 -4787 4890 -1382 -3284 6114 -948 -3427 4324 -1355 -1528 2831 -3429 -384 3114
1643 3114 -2673 348 2005 -2262 2464 1009 -3784 3041 377 -3952 2964 -1483 -3190 5697 -1434
1658 -1434 -3901 6140 -1310 -3258 5856 -3168 -3194 6119 -3264 -3407 5866 -2480 -2001 5545 -3495 -1133
1674 -1133 5803 -3639 -1871 4194 -3223 -821 3278 -3088 252 3619 -2429 857 1768 -2077 848
1689 848 -130 -2451 1417 -416 -1670 2457 -1353 -783 3550 -1944 -602 3403 -3253 -502 3134 -4223
1705 -4223 44 4502 -4184 -42 4281 -3723 1225 3877 -5254 311 4006 -4628 -283 3146 -3286
$$ packed form
1599D227p923K256N697p997L966K410p407P820O82r873R117O31q974Q818k298
1614A152p998J2301m494q863J2980l150p599J1342n819n439J2269p089o380J1949
1628E162n006m943R677o272j902R398p062k479P751n679j73M359o260L045L498
1643C114n787L021J657m267M726j455m793O825k664m329O916m447j707Q887p131
1658a434k467J0041p450j948R114r024k6R313r383j43R273q346M79P546r040K362
1674a133O936r442J768O065p417K402M099o366L340L367o048L286R11l845K925
1689H48r78k321L868j833j254M127l810N70M333n494J342M005o656K751L636p357
1705d223M267M458q686M142M323q004M948K652r131N565L695q634M345L429o432
$$ plain form
1720 -3286 1626 2566 -3562 2027 3080 -3552 218 1331 -2217 1087 152 -2186 1635 662 -1226 973
1736 973 232 950 979 -2343 -34 1288 -2105 658 686 -2315 2307 1551 -2945 2437 1568 -3113 1957
1753 1957 421 -4140 2704 1253 -4117 2572 1568 -2489 2625 602 -3319 3025 829 -4054 1304
1768 1304 1291 -2044 1244 -5 -1315 2237 595 -1937 289 823 -698 -721 -642 413 677 -158 42
1785 42 184 644 1581 -1308 -932 2085 -837 -1648 1740 -763 -645 2591 -1052 -994 3060 -927 -2006
1802 -2006 2276 -976 -1979 2148 -1211 -1764 2443 -185 -1781 2488 96 -1250 2120 -625 -2011
1817 -2011 1185 -127 -1763 713 828 -499 803 486 -522 750 1014 -1677 -1201 1257 -253 -1526
1833 -1526 472 451 -484 1120 308 -805 1400 632 -2582 -66 1136 -1385 -448 697 -744 909
$$ packed form
1720c286M912R40o128N589J053o632L770J113l548L304r35k338L821r73j888K199
1736I73p41P18K9l322K309J322l393K763K8l001M622p56m496N382q69m681N070
1753A957j536m561O844j451n370O689j004m057N114k023l921O344k196m883N358
1768A304j3l335L288j249j310L552j642k532K226N34j521k3P9J055K64q35K00
1785D2J42M60R37k889L76L017k922q11L388k503J18L236l643N8M054l987j079
1802b006M282l252j003M127l359n53M207k628j596M269k392j346L370k745j386
1817b011L196j312j636K476J15j327J302l17j008J272K64k691M76K458j510j273
1833a526J998k1r35J604q12j113K205p68l214K516J202k521R37J145j441J653
$$ plain form
1849 909 1418 -1416 110 2261 -1280 -1609 1071 -589 -1102 1004 -432 -618 2349 -34 -1666 1492
1865 1492 626 -1911 369 209 -1682 1129 1025 -1973 826 1700 -1378 420 1146 -1831 290 1213
1881 1213 -2182 -109 1576 -1082 -448 1480 83 479 875 -497 -605 1066 -10 -1437 -216 854
1897 854 -79 -431 1043 72 182 1337 -1498 -1384 1984 -621 -2219 1586 68 -1161 1883 -182
1913 -182 -1377 2885 -401 -2684 1760 -27 -2630 1802 -242 -1671 2674 262 -2165 2354 349
1928 349 -2016 1010 -220 -1775 1191 -97 -1397 1430 707 -163 478 47 -27 118 -692 126 -504 -505
1946 -505 836 -819 -603 2271 -431 -1124 1936 -1079 -1011 2270 -2056 -1560 2883 -1780 -1872 3171 -1117
1963 -1117 -694 2763 -2103 -1120 3474 -2346 -1652 2596 -1699 -877 2545 -1662 48 2972 -1859 -772
$$ packed form
1849I09N09k834J526K151l541l29K680j660n13K106j436j86K967k383j632L158
1865A492q66k537K280j60j891K811j04k998K799Q74l078J798P26k977K121R23
1881A213l395K073J685k658O34J928j397L96L96j372j08J671j076j427J221J070
1897H54r33l52J474r71J10J155k835J14L368k605j598L805j518j229L044k065
1913a82j195M262l286k283M444j787k603M432k044j429M345k412k427M519k005
1928C49k365L026j230j555K966j288j300K827p23q70O41m31p4J45q10Q18o30j
1946e05J341j655K16K874k702o93L060l015O8L281m326M96M443m663r2N043m288
1963a117M23L457m866R83M594n820O94M248m295Q22L422m207J710K924m831J087
$$ plain form
1979 -772 1800 -1074 -543 258 -1102 793 576 -1135 781 555 -163 571 -924 -451 2006 -1817 -642
1996 -642 1978 -1585 542 2060 -2504 1155 3353 -3197 -154 2522 -3176 790 2397 -3695 1242
2011 1242 3569 -3459 676 2763 -2502 1406 1561 -3692 1092 2178 -3571 374 1594 -1781 1519
2026 1519 329 -2094 2222 563 -1662 818 -519 -255 743 -1920 49 2217 -1003 610 759 -2144
2042 -2144 2010 871 -3673 1308 1706 -3337 1529 691 -2895 3709 886 -4396 2938 1327 -3602
2057 -3602 2572 -300 -3566 3670 -22 -4009 3427 1050 -2900 2189 -575 -1881 2829 -1277 -2471
2072 -2471 2153 -758 -481 1572 -1481 453 1791 -2216 194 970 -1829 945 -296 -2644 2769
2087 2769 394 -2673 2841 -76 -1859 3320 -1564 -2550 3810 -1625 -3050 3891 -1354 -2012 4524
$$ packed form
1979g72K572k874N31Q01j360J895k17j711J916k26p18P34j495M73K457l823J175
1996f42K620l563K127J518m564L659K198o550L043K676n698L966J607o092M937
2011A242K327p028M135K087n265L908J55n253M784J086n749L945J220l375L300
2026A519j190k423M316j659k225K480j337K64R98k663J969K168l220J613J49k903
2042b144M154j139m544M981L98n043M866q38l586O604k823n282P334j611m929
2057c602O174k872l266P236l692l987P436k377l950N089k764j306M710m106j194
2072b471M624k911K77K053l053J934J338m007K410P76k799K774j241k348N413
2087B769k375l067N514k917j783N179m884r86O360n435j425O941n245o58O536
$$ plain form
2102 4524 -1839 -2179 4699 -1865 -2305 3530 -2361 -1398 3398 -2513 -1396 3736 -1834 -444 2788 -2118
2118 -2118 615 1589 -2563 433 1000 -2095 1032 294 -1619 2295 -335 -1229 2274 -1129 -1562 2650
2134 2650 -2396 -1228 3372 -2688 -731 3578 -2704 -68 3699 -3738 -250 3432 -4204 34 3294
2149 3294 -4127 984 3938 -3722 879 3367 -3395 951 2117 -3948 920 2023 -3359 1062 1664
2164 1664 -2165 2250 208 -1726 2071 -266 -1780 1081 -1276 -726 2213 -1990 170 2492 -2313
2179 -2313 714 1836 -3069 1265 1755 -4325 1332 2250 -3644 1900 1740 -3917 2880 2092 -4383 2762
2195 2762 1196 -4030 2581 614 -3672 3490 733 -3551 3136 766 -2566 2586 -707 -2190 2719
2210 2719 -1259 -2149 2236 -873 -529 1710 -1416 445 1951 -2045 385 579 -2419 2025 147 -2819
$$ packed form
2102D524o363l40O878o564m40N835n891R63M796n911J117N132n570J390L232m906
2118b118K733R74m152K996N67l095L127p38j913L914k630q94L503l403m33M212
2134B650n046J168M600o060J957M309o282K636L767p437L488L682p636M238L260
2149C294p421N111K954p660M601K488o762M346J166o065M868J103n382M421O02
2164A664l829M415k042j934L797k337j514K861k357N50K939m203K160K322m805
2179b313L027J122m905M334M90o080N657R18n894N544j60n657O797p88o475P145
2195B762j566n226O611j967m286P162k757m284O687k370l332N152l293j483M909
2210B719l978q90M385l109L44K239l126J861J506l996K430J94k998M444j878k966
$$ plain form
2226 -2819 2742 705 -2503 2696 -357 -2507 3598 -806 -3370 3318 -845 -2706 3630 -1464 -2072
2241 -2072 4176 -1186 -2195 3857 -1386 -1992 2977 -2200 -1520 3351 -1859 -1409 3074 -1261 -294 2142
2257 2142 -2069 -144 1566 -1844 88 503 -1593 1336 270 -1212 1985 -173 -1317 2047 -1617
2272 -1617 -1120 2901 -2249 -1338 3133 -1685 -683 3385 -2543 -473 3499 -3171 -961 3258 -2928
2287 -2928 -493 2877 -2903 668 3235 -3133 36 2909 -2369 274 1770 -2744 832 1564 -2580
2302 -2580 1127 1188 -1341 1091 307 -1251 1718 -399 -1414 1011 -995 -310 1358 -1739 105 2346
2318 2346 -2060 580 1618 -2445 1290 1601 -3603 1159 2392 -2832 1379 1587 -2995 2047 1488 -3589
2334 -3589 1739 1333 -3144 1045 1285 -2706 2180 1185 -2485 2092 1102 -1949 1209 57 -1268 1315
$$ packed form
2226b819N561k037l208N199l053k150O105m404k564O688m163j861O336n094o08
2241b072O248n362j009O052n243o06M969n177O80M871n210M50M483m335R67K436
2257B142m211J925J710l410J932M15k096K929j066j482L197k158j144L364l664
2272a617M97M021n150R11M471m818J002M068n928K070L972o670K210M219o186
2287b928K435L370n780L571K567o368L169K873n278K643J496m514L576P32m144
2302b580L707O1k529K432p84j558K969k117j015K425k006O85J668l097J844K241
2318B346m406K640J038m063L735L11n204M762J233n224M211K08m582N042n59n077
2334c589N328m06m477M189K40l991M886r95l670M577r90l051L158j152j325K583
$$ plain form
2350 1315 -695 -1239 1330 -267 -40 909 -821 642 1103 -1425 588 348 -1817 1278 64 -1383
2366 -1383 2124 437 -2057 1980 21 -1911 2279 -672 -2545 2629 -448 -2334 2354 -403 -1827
2381 -1827 2885 -410 -2294 2414 -609 -1847 1856 -882 -1339 1859 -537 -884 1897 -683 -726 1189
2397 1189 -635 -93 499 -735 37 65 -647 989 -61 -388 1004 -565 -701 1282 -1228 -1049 1667
2414 1667 -1298 -669 2145 -1140 -301 2238 -1176 -636 2374 -1605 -1100 2043 -1925 -1148 2135 -1686
2430 -1686 -193 2259 -1636 -593 1646 -861 -610 860 -1161 -308 1213 -729 -135 587 -220 233
2446 233 153 -530 379 -566 50 -74 -975 460 1050 -1505 582 1166 -922 745 432 -1949 471 698
2464 698 -2319 546 1140 -1437 834 1252 -1490 1179 1419 -2094 430 1017 -1753 -16 801 -1141
$$ packed form
2350A315k010n44K569j597K27R49j730J463M61k528K013k40k165L095j214j447
2366a383L507j687k494M037j959j932M190k951j873N174l077j886M688k757j424
2381a827M712l295j884M708l023j238L703k738m57L198k396l47K781k580m3J915
2397A189j824N42N92j234P72K8p12J636j050l27J392j569j36J983k510J79K716
2414A667k965O29K814l285Q39K539l414N40L010l979N05L143l968P77L283l821
2430a686J493K452l895J043K239k507K51J470k021Q53J521j942N94P22q07M53
2446B33q0o83R09r45O16j24r01J435N90k555K087N84k088J667l13k381K420K27
2464F98l017K865N94k577K271M18k742K669K40l513K524N87k770J737Q17j942
$$ plain form
2480 -1141 642 1041 -1414 307 790 -912 -232 269 -536 -96 191 -355 -41 638 424 39 -101 684
2498 684 -142 -453 474 -462 -642 771 -129 -744 1474 -295 -877 984 -142 -922 1201 -610 -1579 1459
2516 1459 40 -1136 1001 565 -646 1168 161 -1150 724 348 -1707 180 445 -692 472 567
2532 567 -648 526 613 -824 -114 489 -366 -311 588 201 -248 397 251 -649 528 238 -931 338 648
2551 648 -1045 244 726 -894 -83 1165 -397 91 1050 -718 -374 953 -471 -623 700 60 -667
2568 -667 701 -84 -776 826 274 -929 689 314 -1123 203 318 -1171 353 859 -760 271 1222
2585 1222 -711 -300 694 -1038 -405 628 -744 -214 1106 -222 -154 974 -115 -250 541 -394 -856
2602 -856 353 -22 -463 287 419 -406 482 846 -249 -25 686 -403 -771 669 -41 -808 726 214
$$ packed form
2480a141J783L99k455J721M83j702O80N01q05M40K87n46L14O79k14l85j40P85
2498F84q26l11R27r36j80J413r00o15K218j769n82J861j126p80K123j811r69L038
2516A459j419j176K137m36j211J814j007j311J874l76k055J887K65j137J164R5
2532E67j215J174Q7j437P10O03q55N5Q99l87m49O45j46r00J177k90j169J269L10
2551F48j693J289M82j620Q11J248j562M88R59j768L44J327j424j52J323o40p27
2568f67J368p85o92J602n52j203J618l75j437J326J15j489J524N06j619J031R51
2585A222j933M11R94j732O33J033j372N30J320j328O8J128j089j35P91r35m62
2602h56J209l75m41P50J32q25Q88L64j095K24P11j089l68J440p10p67J534n12
$$ plain form
2620 214 -388 1219 366 -846 1095 197 -1233 617 131 -1277 805 372 -892 1115 843 -994 693
2637 693 750 -1131 155 339 -915 192 539 -924 174 778 -141 212 335 -359 -172 43 -40 -356 111
2656 111 328 -228 187 792 -189 -493 851 -575 -710 901 -804 -572 1394 -529 -785 1522 -228
2673 -228 -885 1611 -267 -1348 1391 -828 -1200 1388 -664 -996 1318 -65 -928 1231 -294 -1178
2689 -1178 1011 -576 -603 375 -420 -487 592 -121 21 178 158 47 -9 50 618 -410 -430 740 -486 88
2709 88 1078 -937 17 1315 -1325 -531 1142 -1214 -286 1182 -1278 -220 1625 -891 93 1673 -1259
2726 -1259 -420 1545 -1760 8 1462 -1204 79 1003 -996 360 912 -599 231 517 -995 -86
2742 -86 327 -175 390 -200 -194 382 -511 120 336 -1117 448 762 -1382 -40 538 -1416 1238 935 -1446
$$ packed form
2620B14o02J607q53j212J941q98j430J850m86j408K082m33j264K007k72j837J687
2637F93N7j881J286J84j254J107L47j463J098O04r19L53J23o94J87K15q3l16M67
2656A11K17n56M15O05r81l04J344j426j35J611j705K32J966j923k56K307j750
2673b28o57K496j878j081K739k219l72K588k052l32K314j383q63K159j525q84
2689a178K189j587k7R78p95o7J079p13J42J57k0j11n6N9N68j028k0J170j226N74
2709H8R90k015R54J298k640P94J673k356R28J468k460J058J845k516R84J580k932
2726a259Q39J965l305J768J454k666J283R24j999J356N52j511Q30K86j512R09
2742h6M13n02N65n90ON76q93O31K16j453J565L14k144J342N78j954K654l03k381
$$ plain form
2761 -1446 1261 1005 -1815 904 982 -1804 519 891 -1754 947 1032 -1688 1188 993 -1822 948 135
2778 135 -1568 563 241 -1622 657 360 -866 1116 132 -429 541 -270 -130 424 -870 -99 502 -854
2796 -854 424 281 -948 1020 645 -1251 1139 3 -1545 984 -122 -1351 1614 -55 -1313 2253
2812 2253 -318 -1495 1884 -489 -1889 1665 -468 -1611 1897 -372 -1023 1819 -133 -859 1522
2827 1522 -640 -806 989 -820 -495 1034 -867 -132 863 -440 238 457 -372 511 -129 -1176 1003
2844 1003 -361 -522 1214 -1002 -73 1615 -980 -575 1963 -1044 -663 1585 -1473 -438 1839 -1534
2860 -1534 -456 2396 -1145 -596 1865 -1119 -190 1636 -1897 -269 1173 -1160 -72 1049 -1070
2875 -1070 673 936 -1006 222 587 -975 372 -73 -434 841 -304 -516 733 -538 25 772 -1631
$$ packed form
2761a446K707k56k820K719P8k786K323L72k645K701Q5k720K876j95k815K770q13
2778A35j703K131l22j863K279k97j226J982r84n61R70q11J40N54j294P71O01j356
2796h54J278j43j229J968l75j896K390j136j548K529j106j229K965j669j258L566
2812B253k571j177L379k373j400L554k133j143L508k269o51K842j952p26K381
2827A522k162j66J795j809L25J529j901P35R95j303O78K19q29Q83o40j047K179
2844A003j364j61J736k216R29J688k595M05K538l007L81K248l058J035K277l373
2860a534J078K852l541N49K461k984R29J826l533J628J442k333J088J121k119
2875a070J743K63j942J228L65j562J347m45l61J275j145k12J249j271N63P47k403
$$ plain form
2892 -1631 -76 913 -1575 237 909 -1340 660 1280 -1683 801 1526 -1726 193 852 -1727 1034
2908 1034 914 -2242 943 1329 -1729 679 642 -1566 1000 721 -1812 727 371 -1315 991 223 -474
2925 -474 1027 -381 -503 1096 -128 -390 287 -798 362 600 -999 715 483 -979 866 -56 -1361
2942 -1361 1118 211 -1601 1103 247 -1507 1572 109 -1692 1961 51 -1628 1693 -426 -1720
2957 -1720 1458 -465 -1335 1809 -163 -1388 1330 -203 -846 1031 -676 -1107 706 -796 -439 745
2973 745 -326 505 585 -584 324 296 -728 469 -328 -732 954 -400 -862 1433 -532 -633 1770 -583
2991 -583 -513 1785 -1110 -849 1494 -1171 -356 1874 -1286 -674 1718 -802 -550 1784 -1165 -463 1313
3008 1313 -1134 -510 1070 -987 -67 1111 -410 505 425 -769 194 286 -574 42 -23 -443 810 -52
$$ packed form
2892a631J555R89k488J812O72k249K000O20k963K484P25l252J919O59k579K761
2908A034j20l156L185L86l058K408l7k208K566k79k533K539l56j686K306p68o97
2925d74J501j408j22J599j224k62O77j085J160K38j599J714k32j462J845r22j305
2942a361K479r07j812K704q56j754L079j463j801L653j910j679L321k119j294
2957a720L178j923q70L144j972j225K718j533o43J877j707m31J813j502L57J184
2973G45j071Q31Q0j169R08k8j024J197p97m04J686j354m62K295j965j01K403k353
2991e83P0K298k895K61K343k665Q15K230l160O12K392k520K52K334k949P02J776
3008A313k447O24J580k057R20J178j521R15q0j194R63R2q60O16o5m20J253q62
$$ plain form
3026 -52 4 528 -616 -49 655 -1123 -225 986 -1279 38 1103 -1129 601 1200 -1269 527 1283
3043 1283 -1518 216 872 -1548 226 1087 -1873 318 1197 -1339 627 782 -1065 491 520 -1403
3059 -1403 318 588 -411 644 -116 -205 554 509 -370 652 -470 227 184 -880 573 361 -587 595
3077 595 338 -701 744 326 -1206 404 360 -1464 921 244 -1034 1348 341 -1334 1476 209
3093 209 -994 904 -430 -1378 1068 -49 -1265 1154 247 -644 765 31 -392 467 -463 -679 342
3110 342 151 -133 489 -180 371 416 -380 438 25 -633 557 -459 -660 928 -516 -661 716 -313
3128 -313 -582 1275 -609 -790 1045 -258 -840 1100 -670 -1016 1148 -275 -697 1357 -214 -637 819
3145 819 -427 -418 712 -411 -206 587 -16 -125 485 -380 187 258 -105 -71 78 -187 73 -169 175 338
$$ packed form
3026e2N6N24j144N67P04j778Q98J211k265J317J065k232J730N99k469J796P56
3043A283k801J734O56k420J774Q61k960K191Q79k536J966J55j847J556K9j923
3059a403J721K70r99J055p60q9P59m5q79J022j122O97m3j064J453k12r48J182
3077E95k57j039J445m18j532J610m4j824K385o77j278K382j007j675K810j267
3093B09j203J898j334r48K446j117j216K419r07q91J409p34m23Q59r30k16J021
3110C42j91k84O22o69N51M5p96Q18m13o58J190j016k01J588j444j45J377j029
3128c13k69J857j884j81J835j303n82J940j770l46K164j423m22K054j571m23J456
3145H19j246RJ130j123K05P93o03j09O10q65N67P1l63L4J49k65K60k42L44J63
$$ plain form
3165 338 -48 -50 680 -449 166 589 -518 -119 465 -488 62 915 -599 166 426 -466 201 297 -973 16
3185 16 642 -766 -117 598 -796 194 867 -640 239 531 -625 -109 373 -396 -172 196 -361 -30 418
3204 418 303 17 25 188 -211 -663 -132 -81 -351 -26 145 -448 381 -88 -229 362 50 -659 336 181 -851
3225 -851 605 319 -586 265 454 -596 500 340 -526 147 469 -936 -56 317 -231 168 546 -403 34
3244 34 130 -371 -193 292 -368 -172 45 -258 -197 307 208 -243 298 427 -756 -125 152 -313 -3 150 -199
3265 -199 -155 732 -126 -178 434 35 -458 418 -497 -594 481 -274 -443 478 326 -41 282 365 -617 118 -179
3286 -179 -362 277 269 -297 50 349 -320 -235 610 -268 -114 375 -348 -126 237 -226 -252 658 -160 45 481
3307 481 -61 -140 80 -112 -566 13 -134 -192 61 250 -113 239 491 -54 -507 379 -1 -529 94 -306 -21
$$ packed form
3165C38l86kP30j129O15M23j107L99N84r53N50Q53j514P65K60q92O67R6j270R89
3185A6O26j408O49P15j394R90O73j507Q79K92j156N16M82p69K24L68n57L31M48
3204D18j15k86QJ63l99m52N31N1k70L25J71n93Q29m69j41N91l12p09R95j55j032
3225h51J456k86r05Q51J89j050J096j60q66O73L22j405Q80L73n48L99L78r49M37
3244C4R6n01J78M85o60J96K17l03O1N04r9m51N41J29j183O31K77m65L10J53l49
3265a99M4Q87q58n2O12l99m93Q76r15r7J075p55j69R21j52l67L23Q3r82P35k97
3286a79j83O39qn66L47K99o69Q5Q45q78J54M89p23K22L63m63k6R10q18K05M36
3307D81n42p9K20j92m54N79j47n8K53J89l63L52K52n45m53Q86l80n28O23m00K85
$$ plain form
3328 -21 -13 137 -193 774 140 -854 172 186 -612 50 247 -654 593 84 -541 445 503 -498 116 446 -434
3349 -434 9 380 -465 -200 654 -584 40 245 -563 185 287 -276 -25 65 -215 333 193 251 32 88 57
3370 57 -279 -90 286 -232 -691 494 -227 -254 796 110 -403 702 -45 -447 778 -271 -822 498 -359
3389 -359 -499 472 -92 -312 841 170 -933 472 349 -560 231 -222 -565 453 396 -165 439 301 -76
3408 -76 110 -94 206 -69 -321 37 -122 -92 427 -108 -89 765 -116 -578 216 -452 -368 542 -653 -500 858
3429 858 -327 -368 950 1 -60 1006 -285 -741 865 -492 -141 722 -560 -94 826 -125 -254 982
3447 982 -203 -348 256 -306 -180 139 -513 -160 -32 -323 223 358 13 295 -222 -130 226 -280 88 435
3467 435 -282 265 766 -723 159 575 -685 -6 547 -860 -32 763 -1251 434 742 -770 230 622
$$ packed form
3328b1QJ50l30R67o34r94J026J4p98O62J97r01J247n09o25R86N8j001O14L30q80
3349d34M43L71q45K65Q54j238O24K05q08P48J02n63K51R0k80N48j40N8k19N6l1
3370E7l36J89L76n18m59J185p21k7J050o86n13J105p47m02J225j049n51J320q57
3389c59j40R71n64k20J153o71j103J405j23r09P91m53l43J018n7n61O04j38l77
3408g6J86k04L00k75k52L58j59L0N19n35J9Q54q81m62P94o68Q4R10j195J53J358
3429H58j185m1J318r49o1J066j291m56J606j357L51Q63j282M66R20r51j29J236
3447I82j185j45O04n62J26L19o52L53J28k91N46J35l45K82n17R2L56n06L68L47
3467D35p17N47N01j489Q82M16j260O79N53j407Q28P95k014J685L08j512J000L92
$$ plain form
3485 622 -879 184 546 -950 174 409 -473 162 393 -489 295 261 -409 425 36 -672 101 -303 -210
3504 -210 318 -128 -25 573 -354 269 485 -512 78 29 -738 189 88 -841 591 239 -1129 629 406
3523 406 -980 565 -172 -1003 517 314 -868 901 126 -659 900 357 -613 417 -252 -825 391
3540 391 -166 -675 477 133 -275 417 -29 -196 585 -3 -182 224 -274 -88 33 -294 679 78 -362 825
3560 825 -29 -361 697 -233 -739 877 -365 -633 1116 -27 -504 1374 116 -563 1068 -705 -455
3577 -455 1020 -689 -494 807 -526 17 542 -297 -1 590 -462 -91 347 -374 -50 435 -564 38
3595 38 307 -277 289 20 -431 560 -336 -177 572 -364 -172 564 -246 -97 1155 -686 -283 598 -702
3614 -702 -15 639 -973 17 877 -765 209 1090 -616 211 569 -786 279 860 -854 89 389 -807
$$ packed form
3485F22j501J063L62j496J124K35q82O35K31q82P84l4o70Q34l89p08P73m04R3
3504b10N28m46J03N98r27O23K16r97N90m9p67R27j01r29J432l52j368J758k23
3523D06j386J545p37q31J520k03j182J769p75p85J559n43r70J030o69n73J216
3540C91n57n09J152l44m08O92m46j67P81n88j79M06m98J86J21l27R73o01m40J187
3560H25q54l32J058r30n06J616j242k68J749j143m77J878j258o79J631j773K50
3577d55J475j709J95J301j333N43N25q39K96N91j052L71M38p21L24M85r99O02
3595C8K69n84N66k69m51R91q96J59P49r36J92P36q10J49J252j841M03Q81j300
3614g02O87O54j612R90Q60j642R74Q81j706Q27L58j355J065N81j714R43L00j196
$$ plain form
3632 -807 255 583 -516 171 253 -505 315 162 -413 172 -322 -297 184 -391 211 266 -433 283 401 -879
3652 -879 294 381 -930 697 374 -924 285 592 -773 648 598 -974 553 17 -988 530 332
3669 332 -746 547 161 -849 871 24 -669 450 -162 -603 614 65 -683 199 -177 -14 216 -182
3687 -182 -179 -16 -329 33 -24 -457 168 108 -357 798 -23 -250 456 341 -576 730 -100 -511 883 -162
3707 -162 -726 962 -42 -651 850 -277 -652 981 -260 -296 541 -362 -47 619 39 -200 825 -89
3725 -89 -325 476 -239 -391 -188 72 -102 247 -256 400 182 -71 469 -307 -235 400 -391 -433 295 -372 -166
3746 -166 538 -512 -99 917 -331 -187 524 -733 -359 446 -562 -229 509 -339 87 730 -271 -233
3764 -233 736 -668 -138 455 -756 59 261 -474 287 286 -360 -138 -31 -241 47 -183 -264 392 -26 72 71
$$ packed form
3632h07J062L28j099O87Q2p58Q20j53n75N85m94K5M81n75O02N5o99P16J18j280
3652h79J173Q7j311J627l23j298J209L07j365J421n0j572J527n36j005J518j98
3669C32j078J293l86j010J720q47o93J119o12m41J217n49p48Q82l76J63K30l98
3687a82LJ63l13L62n7m33O25o0m65J155q21k27P06j15r17J306q30m11J394j045
3707a62n64J688j004o09J501j127l75J633j241l6Q37r03L15O66n80k39J025r14
3725h9k36Q01p15j52K03K60j74L49n03O56k18k53N40p76P2O35p91m2P28o67K06
3746a66P04j050M13J016j248J44P11j257L74Q05j008L33P38q48M26O43j001L8
3764b33R69j404N30N93j211Q15K02p35P61jo46K22J07k10K88k30q1O56m18R8j
$$ plain form
3785 71 -187 -194 283 -293 243 684 -849 -120 508 -727 210 362 -700 319 359 -440 332 321 -696 -11
3805 -11 508 -789 314 391 -390 442 57 -569 286 126 -463 292 266 -175 113 -263 -315 178 226 -286 -9
3826 -9 -62 -177 199 -249 187 219 -168 189 302 -354 370 -93 -269 417 36 -471 447 -275 -440 674 -68
3847 -68 -370 492 163 -403 546 -30 -587 231 -75 -551 176 192 -124 329 249 -395 195 -279 -20 -91 -109 -264
3869 -264 -95 -74 85 34 -179 1 21 285 542 -331 -191 184 -337 -465 239 -447 132 364 -516 -154 552
3890 552 -53 -240 339 -571 181 485 -520 3 381 -352 -20 590 -197 -177 178 -400 -162 89 -99 -408
3910 -408 -17 207 -305 121 151 -126 98 -125 -139 -145 158 -18 110 23 327 -376 92 82 -166 207 95 -443
3932 -443 -285 54 -238 -172 230 -434 162 611 -489 50 415 -214 99 131 -479 -126 362 -365 139 561
$$ packed form
3785G1k58pM77n76N36M41j533P29O28j235R37J52j062J019M0p99P72j1j017O85
3805a1N19j297J103P7p81Q32l85o26Q55j60n89P55k6m41K88l76n2M93M8n12K77
3826in3j15L76m48M36L2l87L57J13o56P24m63j76O86l81n07R18p22j65J114p42
3847f8l02Q62l29n66R49n76n57Q18l06m76P27J6l16M53q0o44N90m74K59p1j8j55
3869b64J69K1J59n1k13J80K0K64K57q73J40L75n21j28P04o86N79K32q80L62P06
3890E52o05j87N79r10P52L04j005N23L78p33L32O10p87K0L55n78K38K51j88l09
3910d08L91K24n12M26L0k77K24k23j4oL03j76J28q7L04p03M68j0k48L73j12n38
3932d43J58L39k92O6M02o64N96M49j100N39L65o29L13L2o10L53M88p27N04M22
$$ plain form
3952 561 -1 23 440 -74 -148 144 -173 39 137 262 -233 305 453 116 -29 205 -318 -201 292 -75 92
3973 92 193 -353 -376 217 43 116 252 182 -80 172 -157 -231 -141 254 92 402 406 -117 537 359 -609 197 42
3996 42 -257 171 331 -78 204 572 -1 160 -73 153 22 157 -360 -340 424 48 -57 216 135 -430 252
4017 252 291 -119 -16 -84 -596 -67 248 -17 -142 61 -117 123 279 64 -220 316 -190 -377 405 44 -45
4038 -45 230 285 -128 159 133 -299 77 -36 -215 190 120 -115 25 186 -101 163 448 -358 -208 410 -41
4059 -41 27 387 -260 2 334 113 -74 324 13 -264 -45 -19 -101 261 -54 -237 83 -74 85 -49 186
4080 186 -4 -479 322 -231 -369 266 190 14 491 144 -139 177 95 -514 79 316 -576 -21 200 -264 497
4101 497 79 -169 199 296 -260 -305 275 -782 -205 203 -239 -41 139 -167 -145 398 1 -40 164 -240 192
$$ packed form
3952E61n62K4M17n14p4K92l17K12R8J25m95N38J48l37j45K34n23J17M93l67J67
3973I2J01n46k3N93j74P3J36p0k62K52l29p4R0L95j62L10Mn23O54j78r68Q06j55
3996D2k99M28J60m09K82L68n73J61k33K26j31J35n17K0P64l76j05K73q1n65O82
4017B52L9m10J03o8n12N29L15k65j25K03j78K40J56k15k84N36n06j87P82l61q9
4038d5K75N5m13K87k6m32L76j13j79M05p0k35J40J61k87K64K85q06J50O18m51
4059d1O8L60o47K62L32k21j87L98l11k77K19K6q2L62l15j83L20j57J59j34K35
4080A86j90m75Q01n53j38O35p6j76M77l47k83L16q2o09N93K37q92N55K21m64P61
4101D97m18k48L68R7n56m5N80j057N77M08m42J98J80l06K2N43l97m1K04m04M32
$$ plain form
4122 192 -344 -8 -50 -29 132 317 307 120 70 -198 5 -358 -248 352 64 -122 597 63 -336 453 15
4143 15 -465 402 136 -314 266 232 -393 539 -175 -209 430 143 -155 499 9 -260 255 37 -102 375 80
4164 80 -41 156 -416 -29 -1 -209 29 106 -161 31 -246 111 240 85 -30 452 -157 -176 262 -377 -280 399
4186 399 -332 -29 377 -245 78 403 -262 154 401 -192 -367 328 -378 -383 271 -161 -225 461 -24 -187 351
4207 351 -272 -83 1 -143 191 -94 -292 -30 22 -89 -89 -140 -15 134 -477 137 117 -354 33 306 -128 320
4229 320 180 -98 382 113 -518 118 388 -568 -199 261 -558 61 359 -211 362 82 -308 -6 -77 -339
4249 -339 426 316 -596 228 273 -183 363 -21 125 72 -125 18 297 -150 -89 225 -295 282 136 -296 19
4270 19 349 -239 239 16 -579 68 155 -334 160 170 -459 329 -17 -568 568 -42 -346 239 -312 -535 450
$$ packed form
4122A92n36L36m2K1J61J85j0j87n0k68K03l63J10O00k88j86P19n34l99P89m38
4143A5m80Q67k66m50N80l4o25R32p14l4O39k87k98O54m90k69N15k18j39M77k95
4164H0j21J97n72L87K8k08K38P7k67J92k77L57J29j55j15M82o09j9M38o39R7O79
4186C99p31L03M06o22L23L25o65M16K47n93j75O95p06nO54m32o4O86m85j63N38
4207C51o23J89Q4j44L34k85j98K62N2j11%n1J25J49o11O14k0m71L87K73m34M48
4229C20j40k78M80k69o31O36K70r56L69M60q19O19K98n70N73k80l90L02p1k62
4249c39P65j10r12Q24M5m56N46l84J46n3j97J43K79m47O1L14n20N77j46m32L15
4270A9L30n88M78k23n95O47Q7m89M94J0o29P88l46n51J136o10l04N85n51k23R85
$$ plain form
4291 450 42 -366 675 30 27 306 -322 55 290 -46 36 421 99 -53 451 -73 321 71 -270 252 161
4312 161 -101 99 -405 -110 364 8 -225 206 -234 -157 407 -319 -460 371 63 -581 257 19 83 556 -189
4333 -189 -222 700 -119 -155 288 -203 -477 368 114 154 418 -54 344 114 -108 -192 -67 -212 104 -34 -288
4354 -288 120 96 -63 222 -108 -157 318 -441 -300 444 -154 -90 326 -391 -95 331 -433 250 350 -410 -16
4375 -16 378 -626 -176 277 -348 47 334 -300 197 333 -378 62 -366 -524 206 409 -257 392 114 -64
4395 -64 -61 82 -343 -5 -273 -365 425 -338 232 375 60 117 445 -442 128 167 -249 223 223 -446 226 413 -399
4418 -399 167 392 -244 82 -207 -247 163 194 -275 114 98 -133 359 228 -282 385 58 -361 237 150 -181
4439 -181 204 99 -102 290 -152 -225 30 -163 48 162 -351 168 -176 -96 72 153 -12 279 75 87 468
$$ packed form
4291D50m08m08J041o45lK79o28L77K35l36Q2L85l22j52N04n24L94k50l41N22r1
4312A61k62K00n04K95M74l56k33M31m40P7N64p26j41Q31l08o44Q38k38O4M73p45
4333a89l3R22q19l6M43m91k74Q45k54M0K64m72L98k30k22q4J25j45L16j38k54
4354b88M08k4j59K85l30m9M75p59J41P44n98O4M16p17K96M26p64O83J00p60L94
4375a6L94j004M50M53o25L95K87o34M97J36p11M40m28j58P30K03o66O49k78j78
4395f4LJ43m25L38k68r2P90p63N70J43l15N7L28q87N70L9m16M72%o69O72J87q12
4418c99N66K25o36L26k89m0M10L1m69L89j6k31M92j31n10O67l27m19N98q7l31
4439a81L85j05k01L92m42p3K55j93K11J14n13N19l44Q0J68Q1j65K91k04J2L81
$$ plain form
4460 468 -148 -293 721 235 -258 673 -215 -326 191 112 -175 413 -383 -543 536 -527 -107 442 -70
4479 -70 -152 392 -40 176 481 -6 21 118 -197 -70 -11 -184 -160 -190 -319 46 74 52 127 -146 -149 -189 -326 -156
4503 -156 446 -312 -34 251 -513 119 398 -274 -314 251 -284 115 350 -519 83 481 -232 181 249 -3 54
4524 54 227 -114 -304 49 -352 257 266 -40 -101 130 -78 231 25 -198 -5 -88 -200 30 -420 -151 74 -288
4546 -288 156 168 -101 66 92 -479 166 199 -332 497 70 -211 -4 188 -470 227 286 -232 -74 31 -471
4567 -471 201 146 4 115 -118 -56 -36 126 -33 103 98 41 277 -125 161 45 -114 224 224 30 -230 -105 -255
4590 -255 -371 -188 -77 121 -382 -155 252 193 -85 185 -46 -246 308 -137 -367 -38 30 -298 317 338 -70
4611 -70 243 -46 250 171 -50 -195 246 404 -138 102 68 3 62 -319 -20 -256 26 49 5 -55 27 205 -157
$$ packed form
4460D68o16j45J014m86m93R31q88j11N17p9k87N88p96j60J079j063M20N49n12
4479g0q2N44m32K16L05m87K7R7l15J27N9j73K4l0j29L65K8k2P5k73lm0j37J70
4503a56O02p58K78K85p64O32K79o72m0N65n35L99K35q69O02L98p13M13O8k52N7
4524E4J73l41j90L53m01O09Rl06o1K31k08L09k06k23J93q3j12K30m50K69K25l62
4546b88M44J2k69J67K6n71O45L3n31Q29m27k81K07J92o58O97N9n18J58J05n02
4567d71O72n5j42J11k33O2K0J62j59J36nn7K36m02K86j16j59L38%j94k60J25j50
4590b55j16J83J11J98n03K27M07n9k78K70k31k00N54m45k30L29O8l28O15K1m08
4611g0L13k89K96p9k21j45M41J58n42K40l4o5N9l81K99k36K82K3m4o0Q2J78l62
$$ plain form
4634 -157 -17 98 142 355 -16 -141 72 -297 -110 -80 -215 24 250 -80 95 442 -300 83 -331 -542 -186
4655 -186 177 -185 -576 59 131 64 169 259 54 46 -25 -314 379 10 128 125 -147 66 0 -46 -21 -19 54 -222 42
4680 42 62 -120 -43 -196 19 -305 175 -18 -57 -31 261 -186 210 331 -349 3 256 -251 171 140 286 -363
4702 -363 -34 -187 -320 175 54 60 404 41 -46 705 -71 -353 121 -408 -306 -9 -155 -156 79 242 -42 152
4724 152 223 -181 78 89 86 74 -59 195 84 328 -169 -50 -72 12 -33 21 -59 -89 72 11 -59 -296 41 -160
4748 -160 69 128 -217 55 94 -417 -145 116 16 -515 35 203 201 312 -405 -119 342 -165 -269 101 -89
4769 -89 169 173 106 -157 222 3 -348 -34 -116 -170 87 -80 -239 56 342 15 197 79 298 150 120 -259
4791 -259 7 264 303 -21 -75 115 51 -27 282 -133 73 70 -182 -174 79 -211 113 35 -172 -28 264 -291 76
$$ packed form
4634a57J40J15M4K13l71j25K13l69J87L0j35K39K26l30J75L47p42L83m14k11L56
4655a86L63l62l91O35P2o7J05R0k05qp1k89O93l69J18lk72K13o6m6K5KP3k76K64
4680D2K0j82P7j53K15l24M80j93l9K6K92m47L96J21o80L52K53n07M22l1J46o49
4702c63L29j53j33M95j21OL44l63q7P51p76k82M74n29J02K97j46jK35J63k84J94
4724A52P1m04K59J1lj2j33K54j11K44m97J19k2Q4m5N4q0l0J61o1p0k37L37k01
4748a60K29N9l45K72L9n11K72K61j00n31N50J68kJ11p17K86M61n07j04L70j90
4769h9K58Mo7k63L79k19l51L14q2n4K57j67j59K95K86l27J82j18K19j48l0l79
4791b59K66K57L9l24n4J90o4p8L09m15K06lk52QK53k90L24p8k07J44K92n55L67
$$ plain form
4814 76 210 10 211 89 -155 -60 11 -261 -148 80 -192 -61 -60 226 261 31 95 -78 102 -48 -82 -173 71
4837 71 116 85 226 307 -98 9 -227 -62 -29 -159 -394 176 204 -393 246 47 -113 -120 223 -428 75 54 -323
4860 -323 -170 131 -169 15 -103 -3 15 -60 -205 329 122 -410 256 -370 -115 114 555 -92 62 -117 3
4881 3 -116 -55 2 -68 98 193 160 284 157 22 25 -107 -269 -442 542 -204 -102 411 -292 214 687 -281 10
4904 10 245 -96 19 189 18 4 257 -131 -192 388 22 -205 9 72 100 101 34 0 92 37 -277 -162 -26 -13
4928 -13 209 213 138 15 -78 92 -240 -86 160 74 -347 101 -307 -170 157 1 12 261 52 -50 290 -54
4950 -54 126 278 163 -123 123 -43 -44 63 -94 -171 436 205 -56 393 -4 130 321 -301 143 103 1 172
4972 172 146 -262 103 -238 158 48 236 -17 -130 -62 59 245 -220 -272 262 -70 165 457 -469 288 109
$$ packed form
4814G6J34k00K01j22k44R5P1k72J13K28k72J31JK86L5k30O4j73J80j50l4r1K44
4837G1M5l1J41Q1m05J07k36J65L3j30k35N70K8n97O39j99j60pL43o51N03k1l77
4860c23J53L01l00J84j18J00J8p5j45N34k07n32O66o26K55K29M41o47J54j79J20
4881Cj19O1N7p0J66R5l3J24j27j35Lj32j62j73R84p46J02N13p03N06M73r68K91
4904A0K35l41J15J70j71j4K53l88o1N80l66k27K14O3K8Jo7l4R2n5l14J15J36J3
4928a3K22Mp5j23r3J70l32J54K46q6m21M48m08J37L27j56J1K49k09j02L40l44
4950e4J80J52j15k86K46j66jJ07j57p7O07k31k61M49l97J34J91o22M44m0j02J71
4972A72k6m08L65l41L96j10J88k53j13O8J21J86m65n2N34l32K35K92r26P57j79
$$ plain form
4993 109 -129 -3 308 -152 -77 257 -270 -141 195 -144 49 -6 -25 488 96 -53 -32 335 -285 113 364
5014 364 11 44 82 222 -24 -14 -102 -94 82 -198 -108 100 9 292 -87 21 107 -273 -76 -63 -412 190 189 -546
5038 -546 419 -83 -90 227 201 -381 60 -132 -400 308 -229 -53 71 472 -212 178 -56 -252 262 18 242
5059 242 99 158 56 64 -12 -10 -83 -264 94 262 -251 -18 -39 -433 226 -183 -144 485 117 -208 336 -306 -251
5082 -251 266 -256 -182 141 -38 89 156 -101 -61 453 -131 -151 220 -228 -92 -44 -103 68 98 -35 194 200 19
5105 19 -165 233 -240 71 -130 -269 38 212 -309 312 35 237 65 -268 -322 27 -59 -284 -16 -223 262
5126 262 -11 -445 196 726 18 -68 -196 -104 222 93 -730 37 119 -28 281 146 -138 228 55 -284 233
5147 233 42 -182 -10 210 -224 -43 46 -111 263 -96 -55 16 -144 150 -30 -258 -127 186 -103 328 -87
$$ packed form
4993A09k38J26L11m60P5L34n27J29L36l39J93n5j9N13l92j49K1L67o20L98K51
5014C64l53L3L8J40k46J0q8QJ76k80R0K08r1K83l79J08Q6l80J97J3l49O02jp35
5038e46R65n02pL17k6n82M41j92k68P08n37J76J24M01o84L90k34j96N14k44K24
5059B42j43N9j02Qp6Kp3j81L58J68n13K33k1l94O59m09L9O29l68l25N44o42N5
5082b51N17n22P4L23j79J27O7k57M0N14n84k0L71m48J36M8n9J71L0j33K29Oj81
5105A9j84L98m73L11k01j39L07J74n21O21k77K02j72l33n4L49q6k25K68k07M85
5126B62k73m34O41N30p08q6j28R2L26j29q23P67Q2j47L09j35k84L66j73l39N17
5147B33j91k24J72K20m34J81Q9j57L74l59M1P1j60K94j80k28J31L13k89M31m15
$$ plain form
5168 -87 -132 -109 -187 -19 10 35 -266 132 -11 -468 179 67 -298 21 -54 -577 104 42 -254 -186 -50 0 275
5191 275 46 143 -52 16 -34 99 56 -5 44 328 27 26 -49 179 13 358 34 27 18 9 62 -128 251 -75 -19 140
5217 140 198 -81 343 -171 -132 229 -128 -311 83 -30 -96 121 -257 -167 388 33 -238 55 -230 -52 104
5238 104 -84 -47 97 -30 -22 73 218 241 -250 162 -43 -43 44 -16 44 -87 157 -57 239 106 114 -315 140 -110
5262 -110 70 240 -5 -23 477 28 -17 236 48 12 257 -95 -42 234 -143 61 226 -317 7 141 -261
5283 -261 182 317 -26 62 -405 218 -99 113 272 -166 140 -32 14 10 123 116 -200 -362 213 104 243 -43
5305 -43 131 98 -145 -222 163 90 -250 4 71 -480 443 -94 -102 169 484 -172 98 8 -441 222 11 -15 123
5328 123 274 -162 179 37 -176 -136 79 -11 -139 -116 -407 -126 -180 23 -105 -25 148 199 -245 -116 -138 -58 181
$$ packed form
5168h7m5K3p8J68K9K5l01L98j43m57O47j12l65L19p5n23O81o2k96O8J36N0K75
5191B75k29R7j95O8n0J33m3o1M9K84l01jp5K28j66L45l24prrN3j90L79l26N6J59
5217A40N8k79M24n14L9L61l57j83L94j13o6K17l78R0N55l55k71K93k85J78J56
5238A04j88L7J44j27QR5J45K3m91M12k05%Q7o0O0j31K44k14K96j33Qm29M55k50
5262a10J80J70k45j8N00m49m5K53j88l6K45l52N3K76l77K04J65n43L24J34m02
5283b61M43J35l43Q8m67O23l17K12J59m38L06j72M6mJ13pl16j62N75j09J39k86
5305d3J74l3k43p7L85p3l40K54O7n51R23n37qK71L15o56K70r0m49O63k11k6J38
5328A23J51m36L41j42k13M0K15r0j28K3k91K81n4K03j28Q0J73N1m44J29k2Q0K39
$$ plain form
5351 181 -193 186 212 209 29 -84 217 77 -208 212 -269 88 55 -193 144 138 -230 60 108 -33 95 187 -285
5374 -285 113 -5 -207 87 -107 39 72 31 -99 -295 145 213 121 80 136 -417 -178 -149 -217 131 -120 -20 63
5397 63 183 -342 112 170 -347 195 110 -146 221 385 71 -38 -44 -83 -150 -107 -69 -158 47 -100 -521 -105 208
5420 208 14 111 168 -44 -31 -80 -196 41 149 -190 129 95 217 20 254 196 -97 -136 142 -109 -97 323 -151
5443 -151 225 -11 -235 21 -7 -281 -31 221 -215 57 143 -116 110 -202 230 145 -65 -130 -280 197 -280
5464 -280 -270 -13 -168 -284 148 -144 25 180 -66 244 117 -161 -424 -37 -145 12 -137 171 -71 102
5484 102 19 12 147 18 -158 35 78 207 -130 -26 -156 -76 90 -47 50 -203 -164 69 -144 -59 -169 207 374
5507 374 -67 137 309 -277 81 11 -162 -115 -8 -182 -56 501 -179 318 204 64 -176 175 4 -61 500
$$ packed form
5351A81l74L79K6lj80j13L01j40k85M20m81L57l3k48L37ol68K90M8j41J28R2m72
5374b85L98j18k02K94j94J46L3m1j30j96M40O8r2m1N6n53K39K9o8L48k51J00Q3
5397F3J20n25M54N8n17N42q5k56L67J64l14j09ol9o7M3L8q9K05j47m21M16L13
5420B08j94R7N7k12J3m9j16K37J08l39L19l4J22j97K34n8k93l9K78k51J2M20m74
5443a51L76k36k24K56k8k74K50K52m36K72Q6k59K26l12M32q5k10o5j50M77m77
5464b80J0K57j55j16M32k92J69J55k46L10j27k78k63L87j08J57j49L08k42J73
5484A02q3pJ35j29j76J93M3J29l37J04j30Q0J66j37R7k53L9K33k13Q5j10L76J67
5507C74m41K04J72n86L58p0j73M7J07j74J26N57o80M97j14j40k40L51j71o5N61
$$ plain form
5528 500 -57 -125 -59 -177 130 73 -4 -88 53 26 354 -100 157 -113 45 -98 19 -184 -117 -82 50 104 -92
5551 -92 6 256 314 -285 -391 252 46 -99 216 -179 -8 53 -192 -217 90 -194 72 -121 -144 175 220 15
5573 15 -135 -183 -152 14 168 -397 -215 75 -37 82 40 -124 50 253 232 172 359 25 -65 -94 197 -228 -17
5596 -17 96 -76 -82 -232 7 -56 -13 5 -281 70 -216 -147 103 122 -26 76 223 -103 54 14 -363 -44 -162
5619 -162 -238 -96 -75 -215 -29 76 -208 62 183 -367 -136 114 -130 110 -54 -40 27 119 -84 54 -51 -1
5641 -1 -22 -399 -38 123 -141 345 99 277 80 -186 -126 -56 -203 -283 374 -33 -1 263 54 -151 95 63 75
5664 75 -116 203 -189 106 -5 42 -135 50 321 35 -336 -162 122 -89 258 -43 102 59 -50 -89 -4 215
5686 215 154 212 28 -241 362 -78 -42 91 -350 52 169 35 273 79 -136 -111 42 -140 -264 64 -36
$$ packed form
5528E00n57o8O6j18L07n7p7q4J41k7L28m54K57k70J58j43J17k03O7L5J32N4j96
5551i2R8K50N8n99j06O43k06j45L15l95J71O1k45k5L07k84K66j93k3L19M5k05
5573A5j50m8L1J66J54n65J82K90j12J19m2j64J74K03k1o0J87l34r0k9K91m25K11
5596a7J13j72oj50K39o3M3J8k86L51k86O9K50J9j48J02J47l26J57m0l77L19j18
5619a62p6J42K1j40J86J05k84K70J21n50K31K50k44K40j64J4O7R2k03J38j05N0
5641ak1l77L61J61k64M86k46J78j97k66O0P0j47q0O57m07L2K64k09k05K46l2J2
5664G5j91L19l92K95j11M7j77J85K71k86l71J74K84k11L47l01J45m3j09l9Q5K19
5686B15o1N8j84k69O03m40L6J33m41M02J17j34K38j94k15K5J53j82j24L28j00
$$ plain form
5707 -36 -41 69 88 -282 366 53 104 89 -145 15 87 92 92 -44 -40 -84 141 -58 98 16 -17 178 -179 -236 1 33
5733 33 -385 196 -29 423 307 -272 65 170 -262 105 -61 -498 35 218 -151 162 191 -156 259 -133 -71
5754 -71 -28 194 -363 -56 166 -147 -39 102 -305 48 433 -322 -2 76 -88 -126 -102 -78 -148 4 -64 216 240
5777 240 -87 -22 -286 -206 79 -426 295 -75 -8 107 -129 -214 337 -24 -145 -44 92 -255 87 -90 118
5798 118 343 137 143 95 195 55 264 -295 78 242 79 -85 248 -304 -213 235 195 11 66 -242 -112 -47
5820 -47 -34 -73 271 271 -64 107 -7 266 -343 50 69 -276 140 -14 147 77 -13 -304 -183 246 -21 -90 -198
5843 -198 -249 189 247 257 -225 233 -124 134 217 16 -159 19 -197 -82 168 -177 -54 -211 274 179 114 -23
5865 -23 -38 22 -318 -44 -40 -98 -120 -80 147 153 -198 57 138 -169 52 94 -249 -89 -111 -140 24 213 58 -157 131
$$ packed form
5707c6nJ10J9l70O48l13N1j5k34J60P2N%j36Mm4K25j99J56q2l3J95l57n7K37L2
5733C3m18N81k25M52j16n79L37J05m32L67j66m37N33J83l69L13K9l47M15l92O2
5754g1M3K22n57L07K22l13J08J41m07L53L85p55L20P8j64l8K4K4p0J52o8K80K4
5777B40l27O5k64Q0K85n05P21l70O7J15k36q5N51l61j21J01J36l47L42j77K08
5798A18K25k06Om8J00j40K09n59L73J64j63j64L33n52R1M48m0j84N5l08J30O5
5820d7J3l9L44%l35J71j14K73o09L93J9l45M16j54J61p0r0k91J21M29k67o9j08
5843a98n1M38N8J0m82M58l57K58Q3k01j75J78k16J15K50l45J23j57M85r5o5j37
5865b3j5O0l40K74Mn8k2M0K27Ol51K55Q1l07K21M2l43J60k2k9J64J89j55k15K88
$$ plain form
5890 131 -193 -22 -86 -123 -110 -30 -5 44 -111 -206 -100 208 -88 345 241 58 -18 -287 -266 -51 -220 37 -138
5913 -138 48 81 117 -37 204 52 -159 -94 84 19 94 159 41 13 124 -348 70 136 -144 9 28 -65 -80 -74
5937 -74 -48 240 136 -9 21 210 -270 -13 89 -118 20 95 -185 97 134 186 10 -138 -10 -73 88 83 83 189
5961 189 64 45 -51 -69 87 -149 -194 -7 -83 294 183 -197 -148 -326 -354 -64 236 -164 219 283 138 312 -109
5984 -109 -193 140 138 7 62 189 166 -12 -57 -142 505 14 -221 -37 -72 -126 -61 146 57 203 119 85 -85 -178 107
6009 107 -261 259 401 -372 -24 124 -83 -122 246 -94 215 250 -221 -66 203 -66 22 147 -108 -84 146
6030 146 -137 -24 -181 -232 8 98 -167 -148 520 84 -216 342 -132 95 137 68 132 -2 -22 87 153 87 25
6053 25 162 96 -176 -246 133 -168 -119 109 -120 -270 -58 -32 -209 379 63 -470 107 -40 -137 -107 -89 -307 270
$$ packed form
5890A31l24J71o4l7J3Q0K5M9j55r5J06L08k96M33j04j83p6k69K1K15j69K57j75
5913a38J86L3L6j54K41j52k11O5J78o5P5O5j18k8J11m72M18O6k80J53J9r3j5O
5937g4K6K88j04j45L0J89m80K57J02k07J38P5k80K82L7N2j76j48J28o3J61n%J06
5961A89j25j9r6j8J56k36m5J87p6L77j11l80M9j78k8K90L00m00L83O4j45J74m21
5984a09q4L33kj31N5J27k3j78m5q5O47m91k35J84l5n4O5K07q9J46q4l4j70r3K85
6009A07l68N20J42p73L48J48k07l9L68l40L09L5m71J55K69k69Q8J25k55K4K30
6030A46k83J13j57n1K40R0k65J9O68m36l00N58m74K27M2o9O4j34k0J09O6o6o2
6053B5J37o6k72p0L79l01M9K28k29j50K12K6j77N88l16n33N77j47r7L0J8k18N77
$$ plain form
6076 270 180 -13 2 241 51 29 296 -65 -163 43 -222 9 -20 -299 18 -53 22 68 118 -180 56 6 -349
6099 -349 -178 -394 -39 109 267 -302 -85 -79 128 93 -328 61 142 3 -132 -129 -46 339 31 121 193 56 -328
6122 -328 17 -27 138 289 74 95 155 -88 -128 23 78 133 -267 -267 22 13 -63 -178 16 363 225 137 -48 -170
6146 -170 80 21 142 -139 5 11 45 84 135 -110 -21 100 -416 -197 -14 -266 57 -62 53 125 106 31 -15 70
6170 70 -112 -426 28 -119 -603 -101 -109 -192 -52 264 93 235 -183 -123 90 -215 -160 438 324 4 392 490
6192 490 -42 -22 341 175 16 112 -192 -91 158 -363 152 50 87 -70 -81 105 3 184 194 238 -178 247
6214 247 62 -87 504 -83 122 -25 142 480 -113 90 99 28 -44 180 22 83 -41 237 137 112 -206 18
6236 18 -197 -52 62 -222 124 63 -13 102 42 143 199 289 -147 50 177 186 83 116 33 -9 117 328 37 -189
$$ packed form
6076B70r0j93J5K39j90k2K67l61r8K06k65K31k9k79L17p1P5M6N0k98K36n0l55
6099c49J71k16L55J48J58n69K17OK07l5m21L89Q1j39j35LQ3L85l08R0P2j37l84
6122c28L45m4J65J51k15K1O0k43m0J51N5N5m00%K89rp6j15J94L47j38q8j85j22
6146a70K50n9J21k81J44OL4L9N1k45Q9J21n16K19J83k52L23j19J15P2j9p5m6Q5
6170G0j82l14M54j47m84N02qq3J40L16j71J42m18O0K13l05N5N98j14l20L88R8
6192D90n32K0L63j66j59R6l04J01K49n21N15j02L7j57j1J86j02J81J0M4m16M25
6214B47j85j49N91n87K05j47J67L38n93K03Rp1p2K24j58O1j24K78j00k5l18K24
6236A8k15J45J14k84L46o1p6J15o0J01N6R0m36J97J27Rj03L3q3m2J26K11k91k26
$$ plain form
6260 -189 -2 -168 9 -31 -394 -275 -104 -32 -32 24 -246 -160 199 -237 -126 87 -126 -5 342 26 184 94
6282 94 -15 -189 47 35 -205 146 -186 43 -202 111 46 251 -249 -92 163 -186 -55 -51 98 9 -187 329
6304 329 132 -78 14 -88 60 -137 -105 -17 80 -344 -282 -53 128 -61 -29 214 172 276 -212 -409 -56 348
6326 348 -261 -339 105 119 -145 271 -19 80 24 55 -202 -17 -100 -340 -78 -160 -117 -56 103 228 250 33 -46 342
6350 342 -43 -470 -58 91 -69 105 126 93 198 262 -175 -355 194 -29 32 39 200 -295 372 221 -10 55
6372 55 114 -161 115 88 36 255 -41 -176 104 277 -293 520 -254 121 136 -113 -45 113 -199 -94 -92 187 -3
6395 -3 -209 138 1 37 18 156 -30 -1 -135 -241 143 96 -32 134 52 165 -33 414 -36 -100 190 -165 306
6418 306 228 -78 84 210 -153 -157 362 -262 -119 432 -33 178 337 75 -80 131 -116 -91 57 -13 -90 68
$$ packed form
6260a89J87j66J77m0l63J19J71P2%N6k70Q6L59m36J11K13k13J21L47l16J58r0
6282I4j09j74K36j2k40L51l32K29k45L13o5K05n00J57K55l49J31MJ49q9j96N16
6304C29j97k10R2j02J48j97L2Q8R7m24O2K29J81j89L2K43m2J04m88j97L53M04
6326C48o09p8M44J4k64M16k90R9n6L1k57J85q3k40K62q2M3O1J59J25K2k17p9L88
6350C42l85m27M12J49j60J74K1l3J05O4m37j80N49k23O1PJ61m95O67j51k31O5
6372E5N9k75K76k7n2K19k96j35K80J73n70Q13p74L75J5k49O8J58l12J05KK79j90
6395ck06L47j37L6j9J38j86K9j34j06L84m7j28J66q2J13j98M47m50o4K90l55M71
6418C06p8l06J62J26l63mN19o24J43N51m65K11J59k62j55K11k47K5J48p0p7J58
$$ plain form
6440 68 -6 41 -18 81 296 -87 235 192 55 -199 -101 -49 -203 228 -102 423 148 28 169 46 -25 57 -35 -64
6464 -64 32 267 -298 95 200 -110 190 183 -112 81 -142 -120 -29 -20 -229 -98 347 -228 105 51 -171 108 229
6487 229 -271 110 367 -201 107 153 218 -89 53 51 226 -406 -35 137 -268 -8 127 -389 -154 193 -129
6508 -129 132 154 -124 181 140 -96 -27 -25 -129 215 -130 -213 175 167 215 189 -44 -104 187 3 162 39 61 113
6532 113 281 252 60 -206 33 -102 56 242 206 44 -319 -208 -110 -316 86 -109 136 152 -133 -72 327 -43
6554 -43 -336 -83 -119 -139 -50 -86 4 -86 208 87 -82 -15 -215 152 -51 -64 197 -158 -82 -48 -102 52 67 -36
6578 -36 -46 132 77 -35 103 28 127 147 215 3 20 -16 -211 -236 -286 260 134 -220 186 -83 -132 -115 -52 -159 286
6603 286 83 -52 262 -98 12 285 95 1 136 -96 324 74 -164 -141 -91 39 -83 355 124 199 -99
$$ packed form
6440F8p4M7n9R9K15l83L22m3j37k54R8N2j54M31l30N25k75j20J41j23p1Q2r2k9
6464f4R6K35n65L93J05l10L00pk95J93k23K2R1Rk09J31M45n75L33n4k22K79J21
6487B29n00L81K57n68L08M6O5l07J42kJ75o32L71J72m05K60J35n16K35L47l22
6508a29K61K2k78L05m1k36O9Kj04L44l45q3L88qM8k6k33o0K91j84J59j23K2N2
6532A13J68k9j92k66K39j35J58J86l6j62l63J11R8k06M02j95K45J6k85O1L99l70
6554d3k93K53l6k0Q9l6R0r0K94j21j69O7k00L67k03j3K61l55P6L4n4J54J5j03
6578c6j0J78n5j12J38p5R9K0O8k12J7l6j95k5n0N46j26l54M06k69m9J7O3j07M45
6603B86k03j35L14l60J10K73j90r4J35k32M20k50k38K3N0J30j22M38k31P5k98
$$ plain form
6624 -99 202 150 -52 94 -221 -245 20 32 -419 360 38 154 107 267 -106 315 8 -9 172 -64 -3 28 271
6647 271 197 499 250 1 -122 -67 -179 -51 184 -164 -8 155 -209 54 -32 -241 -103 -162 204 85 237
6668 237 143 -141 -59 61 -248 17 17 213 55 -171 -208 32 -50 104 -50 203 156 -1 107 96 327 -67 53
6691 53 -83 49 204 -176 10 -261 116 249 189 -188 -74 8 -203 187 302 -86 99 221 -238 263 484
6712 484 -5 -14 107 -115 146 -97 133 -258 191 -23 59 -48 149 -169 71 90 -433 365 181 -64 -144 239
6734 239 -11 94 119 358 -258 112 -287 153 -1 -132 107 63 -106 -107 164 -162 -47 103 92 -44 128 305
6756 305 -278 -65 170 -7 -139 74 190 -264 -99 -127 -89 -144 -59 54 -147 -80 -61 205 57 -352 -6 -18
6778 -18 -209 74 -45 -14 -88 16 -318 -161 116 -126 121 -132 -340 58 -125 -94 24 -39 79 -305 250 164
$$ packed form
6624i9L01n2k02J46l15k4K65J2m51P79l22J16m7J60l73M21l07j7J81k36O1L1K43
6647B71p4L02k49k49j23N5j12J28K35l48J56J63l64K63q6k09J38n9L66j19J52
6668B37r4k84Q2J20l09K65%J96j58k26l7K40q2J54j54K53m7j57J08j1K31l94J20
6691E3j36J32J55l80J86k71L77J33o0l77J14Q2k11L90J15l88J85J22m59N01K21
6712D84m89rJ21k22K61k43K30l91M49k14Q2j07J97l18K40J9n23P98j84k45q0L83
6734B39k50J05K5K39o16L70l99M40j54j31K39m4j69jK71l26J15J50j1j36J72J77
6756C05n83K13K35j77j32K13J16m54J65k8L8n5Q5J13k01O7J9K66j48m09L46j2
6778a8j91K83j19L1p4J04l34J57K77k42K47k53k08L98j83L1J18o3J18l84N55q6
$$ plain form
6800 164 240 -163 245 -76 -76 34 -5 117 16 94 123 224 49 106 119 -8 -37 -139 -28 -286 287 95 -195
6823 -195 191 -6 -41 401 8 -271 425 4 -76 79 69 92 -30 149 -121 158 120 -22 -1 108 -327 173
6845 173 -185 -143 25 -148 -263 175 416 152 -6 -96 35 1 40 136 -246 -24 -15 76 278 56 194 59 332
6868 332 -133 -2 155 5 -59 -24 112 -61 -75 79 -53 -30 -36 -69 254 54 -135 322 141 -79 204 -22
6890 -22 -165 102 87 -108 104 -266 -193 -88 -33 -54 152 -109 53 109 -85 -224 0 211 -96 217 -72 60
6912 60 -175 262 -71 3 -255 -8 -60 40 -94 -22 6 83 -14 215 220 -146 88 329 -118 -211 -61 -8 208 -135
6936 -135 -11 140 -256 -39 -66 221 -101 -47 92 -296 96 -13 134 203 -29 -108 52 -220 12 -64 218 -413
6958 -413 57 86 44 -136 41 -280 66 168 -194 234 -73 -379 271 -103 -114 -16 204 23 -130 -112 41 39
$$ packed form
6800A64P6m03M08l21%J10l9J22j01P8K9J01j75N7J3j27k9j02J11k58N73j92k90
6823a95L86j97l5M42l93k79O96m21q0J55j0K3j22J79k70K79l8j42K1J09m35N00
6845A73l58M2J68j73j15M38K41k64j58r0J31l4L9R6l82K22RR1K02k22J38j35K73
6868C32m65J31J57j50o4L5J36j73j4J54j32K3ol3L23k00j89M57j81k20K83k26
6890b2j43K67j5j95K12l70P3J05N5k1K06k61J62N6j94j39K24K11l07L13k89J32
6912F0k35M37l33P4k58K47n2J00j34P2K8P7r7K29Nl66K34K41m47r3J50N3K16l43
6936a35J24J51l96K17k7K87l22N4J39l88L92j09J47O9k32p9J60k72K32p6K82o31
6958d13M70K9m2j80J77l21L46J02l62M28l07l06O50l74j1R8K20j81j53J8J53k
$$ plain form
6980 39 -148 -141 94 -152 -332 159 -173 77 -137 -293 -102 248 100 56 -199 40 -108 -18 -169 160 98 -11
7002 -11 -278 42 -82 13 36 33 79 -44 291 169 -59 -65 -291 -63 124 185 7 -69 -160 -135 -82 210 296 -115 96
7027 96 86 131 16 -77 173 324 -302 -200 143 -5 32 -17 -51 169 91 127 57 -28 146 -108 -158 -191 6 0 13
7052 13 -110 164 -139 -148 -48 -147 -32 -43 -219 -59 -16 -51 99 -20 151 184 -383 119 -393 223 -102 186 -111
7075 -111 -96 484 -92 330 345 -307 236 87 29 -115 -119 -177 -220 89 -281 -32 127 67 127 -230 -84 -180 -14
7098 -14 108 -9 -83 250 91 90 230 65 167 -174 12 -12 -4 268 -101 307 113 -202 115 -28 -180 261
7120 261 -172 -345 -53 -46 -281 47 40 -91 109 -88 31 135 -42 -104 -53 -8 -184 72 -42 -95 85 -219 134
7143 134 217 102 -30 -165 173 15 -57 -148 328 38 -191 -340 15 -42 -68 -58 -314 -30 60 97 9 129 213
$$ packed form
6980C9j87PK35k46j80M91l32K50k14j56J91L50j48m4k55K39j48R0j51L29o2j09
7002a1k67L20j24R5K3lM6j23L35j22k28ok26K28J87O1j78p6r1K5N3K92Q6m11K11
7027I6j0M5j15r3K50J51o26J02L43j48L7m9l4K20p8L6p0q5J74k54n0l3J97oJ3
7052A3j23K74l03rJ00r9J15j1j76J60M3l5J50j19J71L3n67N02n12O16l25K88k97
7075a11J5N80n76M22J5o52N43j49n8j44mn8m3L09l70K49J59o0O0l57J46r6J66
7098a4J22j17p4L33j59jJ40j65J02l41J86k4QK72l69M08j94l15L17j43j52M41
7120B61m33j73K92Pk35L28pj31K00j97J19J04j77o2N1M5j76K56j14n3J80l04L53
7143A34Q3j15j32j35L38j58p2r1M76k90k29j49L55n7k6J0k56K84R0L7q8J20Q4
$$ plain form
7166 213 459 -400 156 130 -275 146 319 -463 201 218 -113 -300 309 -258 65 162 -44 43 104 68 -54 -144
7188 -144 -105 187 217 53 -58 125 -108 187 -227 137 99 -10 107 327 111 141 -183 32 -151 299 -66
7209 -66 85 137 -55 -40 -44 -60 353 255 44 -18 84 -99 -17 112 -299 186 221 203 -88 103 -74 -89 367 -273
7233 -273 -49 11 -85 -66 -122 37 62 10 -161 -172 25 -83 248 6 -77 112 143 -314 129 -236 -160 -171 156 13
7257 13 194 153 -83 -26 -204 289 119 -36 101 47 -89 85 233 -446 119 142 -249 -150 238 103 253 -19
7279 -19 146 90 -134 10 97 -174 -112 61 -234 -144 -48 -24 200 -54 -185 84 106 61 30 174 -37 -117 -79 -135
7303 -135 144 -72 90 133 182 80 -83 35 -277 -208 138 -75 218 289 56 55 -65 116 324 -144 -74 -98 -71
7326 -71 -3 135 204 -282 -188 165 213 -41 135 -53 -294 -126 107 180 144 -327 -39 251 -255 166 -18 -16 -164
$$ packed form
7166B13K46q59N56k6m05M21J73p82O64J7l31j87O09n67L23R7k06Q7O1l6j22r0
7188a44L9K92L0j64j11J83k33K95m14L64l8j09J17K20k16L0l24K15j83M50l65
7209f6J51N2j92J5mj6M13r8k11o2J02j83Q2J29m11M85L5j8k91J91j77j5M56o40
7233b73K24O0r6J9n6J59K5n2j71j1J97j08L31k42q3J89L1m57M43l65P6j1L27j43
7257A3J81m1k36N7j78M93j70j55J37n4j36J74J48o79N65K3l91R9L88j35J50k72
7279a9J65n6k24J44Q7k71O2J73k95R0R6K4K24k54j31K69K2m5l1J44k11q0L8n6
7303a35K79k16J62M3M9j02j63J18l12O9L46k13K93P1k33jj20J81K08m68P0k4K7
7326g1O8J38O9m86R4L53M8k54J76j88k41J68K33P3l6m71K88K90n06M21j84Kj48
$$ plain form
7349 -164 -46 169 163 -26 -43 -116 52 344 4 -75 169 -83 96 -39 53 -144 133 -147 194 80 -234 -268
7371 -268 189 -134 37 -91 35 -124 -22 -201 -56 118 -11 8 -26 -43 -111 -226 -104 241 164 -191 -10 -278
7393 -278 194 23 260 290 106 168 122 40 -119 114 -97 -207 18 24 -210 70 -229 -226 107 -194 -350 -5 -280
7416 -280 73 190 -26 140 271 178 -82 60 -496 85 101 125 -23 -57 -258 -23 9 31 49 13 213 46 12
7439 12 87 -136 -197 -121 251 85 71 -61 -146 59 -55 74 -332 -86 71 131 30 -110 219 174 -122 -229 157
7462 157 -124 292 -157 40 -205 -82 6 -116 -103 220 -66 220 -164 -131 270 -109 32 -106 242 -151 56
7483 56 108 -64 71 263 82 30 14 -117 -109 -170 -46 -9 103 75 -67 -234 153 285 24 59 254 50 60 60
7507 60 -17 38 143 8 -160 -86 -127 -45 -118 128 -155 29 -372 120 174 -61 154 58 -80 -69 207 -16 -323
$$ packed form
7349a64J18K15oj89j7p3J68K92l40p9K44k52J79j35R2j97K77k80L41j14l14l4
7371b68M57l23J71j28J26j59J02j79J45J74j29J9l4j7o8j15J22L45p7l55J81k68
7393b78M72j71K37L0j84O2m6q2j59K33k11j10K25Ok34K80k99LL33l01j56L45k75
7416b80L53J17k16J66J31r3k60J42n56N81J6K4j48l4k01K35L2K2J8l6K00j67l4
7439A2P5k23o1P6L72j66j4j32q5K05j14J29m06K46J57O0j01j40L29m5k96j07L86
7462A57k81M16m49J97k45J23Q8j22J3L23k86K86l84L3M01l79J41j38L48l93K07
7483E6N2j72J35J92j81n2j6j31Qo1J24L7J12k8j42j67L87J32k61L5J95k04J0%
7507F0p7N5J05j35j68P4m1Q2p3K46k83J84m01M92N4k35K15r6j38J1K76k23l07
$$ plain form
7530 -323 -282 -225 -8 112 167 -38 139 -434 -32 159 -155 -66 -69 -241 -299 -80 -38 22 118 -35 169 261 146 -10
7554 -10 -130 -44 -187 -163 101 -11 248 -119 148 -165 182 92 -99 199 6 -189 238 -110 191 51 233
7575 233 -93 -567 158 89 -233 58 -194 94 7 60 -148 -108 -98 -107 165 122 -66 -210 -106 -141 205 -35 44
7598 44 96 155 286 161 25 -55 -214 178 79 -32 131 39 134 -104 -339 -31 39 246 48 -91 45 175 85
7621 85 -89 159 31 64 -43 -44 -16 -61 236 -53 -152 -2 41 -165 -167 146 159 98 50 -298 115 -59 -42 54 398
7646 398 39 -41 56 105 -212 55 -89 -209 -353 130 -72 99 39 -79 56 397 -168 5 195 -140 330
7667 330 96 -230 -192 49 141 -40 283 16 -85 120 346 53 87 -63 -173 80 -30 -143 -166 136 -63
7688 -63 61 -261 253 93 -75 93 -333 16 -1 187 45 203 -223 433 207 -292 -62 -78 -148 -60 69 -253
$$ packed form
7530c23M1N7K17J20N5k05J77n73M02J91l14Q9lj72n8K19M2O0R6j53K04R2j15j56
7554a0j20Q6j43K4K64j12K59l67K67l13L47r0j91K98j93j95M27l48L01j40J82
7575B33l26m74P25o9l22K91k52K88q7N3k08M0J0rK72m3j88j44J04l5L46k40P9
7598D4N2N9J31j25j36q0j59L92r9j11J63r2R5k38k35L08P0K07j98j39J36J30r0
7621H5j74K48j28L3j07jK8m5K97k89r9J50M3k06kL13J3o1m8l48M13j74J7R6L44
7646C98l59q0R7M9l17K67j44j20j44M83k02J71o0j18J35L41n65J73J90l35M70
7667C30k34l26L8K41R2j81L23k67j01K05K26k93L4j50j10K53j10j13k3L02j99
7688f3J24l22N14j60j68J68m26L49j7J88j42J58m26O56k26m99K30j6p0Q8J29l22
$$ plain form
7710 -253 130 6 13 -73 115 -245 -1 -217 -143 -260 -103 30 188 43 -57 133 -126 61 -181 296 33
7731 33 -143 265 -35 -8 -62 -56 95 -128 245 115 -99 -68 -91 35 177 188 -12 99 216 -16 73 83 -42
7754 -42 -108 -112 -66 219 -140 -309 -325 -26 -55 -41 14 -66 254 20 -35 37 51 102 -471 150 158 -84 203 -87 63
7779 63 276 58 -246 -188 78 144 1 -14 -59 262 209 -347 -74 48 -210 10 -185 11 -310 204 -19 106
7801 106 166 207 -292 226 -167 -63 -124 -61 35 102 213 -77 -39 -190 191 -89 -68 -30 -81 -94 57 96 -4 -46
7825 -46 62 47 5 -74 60 14 -37 161 -37 -349 297 226 24 -95 108 239 301 90 -546 -25 -104 -18 103
7848 103 -18 -55 160 167 -50 49 138 -43 -194 -93 -139 42 118 -197 35 53 139 334 192 -191 -157 -158 -86 104
7872 104 -114 56 181 -12 -59 58 38 299 185 12 -38 -103 -202 159 98 -131 -231 -198 105 16 220 -222 128
$$ packed form
7710b53L83j24Pq6J88l60K44k16P4j17J57J33J58j45j00J90k59J87k42M77k63
7731C3j76M08l00K7n4OJ51k23L73j30k14L1k3J26J42J1k00J11J17k32Q9J0j25
7754d2o6mM6K85l59j69j6K99k9J4N5q0L20k34n5P2J4N1n73O21Qk42K87k90J50
7779F3K13k18l04N8K66O6j43j5m5L21n3n56K73J22k58K20j95J96l21N14k23J25
7801A06O0M1m99N18l93J04o1O3R6O7J11k90L8j51L81k80K1L8n1j3J51L9j00m2
7825d6J08j5m2p9J34m6n1J98j98l12O46p1k02j19K03J31O2k11o36N21p9Q6J21
7848A03j21l7K15Pk17R9Q9j81j51J01m6J81P6l15K32J8Q6J95j42l83L4jP2J90
7872A04k18J70J25j93m7J17k0K61j14j73n0o5r9L61o1k29j00L3L03q9K04m42L50
$$ plain form
7895 128 145 -46 -140 118 33 237 27 188 29 177 94 -32 -248 138 198 -173 15 45 177 194 -179 55
7917 55 -1 -55 104 411 -41 -237 -123 -62 60 33 5 45 237 -99 -240 -5 84 28 104 -248 -99 69 -369
7940 -369 181 -16 -235 -61 270 -127 -87 -134 77 -429 343 108 -74 300 -230 158 42 31 -62 115 -169
7961 -169 105 80 -38 -80 -170 -182 79 186 247 -95 -26 -16 -6 -59 -128 -226 135 -274 -3 -159 79 -147 -325 -13
7985 -13 -149 -124 -82 95 213 248 -76 -101 184 68 81 -149 -237 -262 -30 109 -43 -204 135 -81 263 -195 115
8008 115 174 -132 -272 28 99 -14 -73 343 -21 62 376 -134 -18 -78 165 -238 468 -10 -146 -128 -102 218
8030 218 115 275 0 103 -259 -146 -33 419 -76 259 214 11 -14 -4 369 -10 159 -230 39 35 -386 214
8052 214 -226 -243 25 53 206 -282 118 61 -218 85 -159 223 34 -80 183 -144 24 261 18 -6 40 -153
$$ packed form
7895A28J7j91r4K58q5K04k10J61j59J48q3j26k16L86O0l71J88L0J32J7l73K34
7917E5n6n4J59L07m52j96J14O1J22k7k8M0J92l36j41K35Q9n6P6l52J49J68m38
7940c69N50j97k19J74L31l97M0m7K11n06P72k35j82L74n30L88j16j1r3J77k84
7961a69K74k5j18m2r0j2K61J07O1l42O9J0J0n3o9r8L61m09K71j56K38k26j78L12
7985a3j36K5M2J77J18L5l24k5K85j16J3k30q8k5K32J39j52j61L39k16L44m58L10
8008A15N9l06j40L00P1j13n9M16l64Q3L14n10J16o0K43m03P06m78j36J8K6L20
8030B18j03J60k75J03l62J13J13M52m95L35m5k03k5J0L73l79J69l89K69mm21O00
8052B14m40j7K68K8J53m88M00n7k79L03k44L82j89j14K63l27J68K37k43k4M6j93
$$ plain form
8074 -153 59 183 -101 27 33 -83 204 69 37 -52 130 -74 -119 83 124 70 317 -45 139 262 535 -73
8096 -73 -177 -162 -219 225 -226 -13 225 164 132 162 95 6 -42 -103 -228 -165 7 -18 -109 -138 -119 108 -146 -110 80
8121 80 142 118 -57 108 -14 310 55 -146 126 245 166 9 159 -100 47 210 -10 203 16 -76 104 -247
8143 -247 -160 246 -44 -262 -146 31 -110 2 -301 -192 -114 -159 63 -198 -96 97 -68 -192 86 174 -110
8164 -110 214 -261 -8 -315 -66 40 14 -28 -87 -76 -19 284 -324 45 100 -290 8 100 -11 77 367 256 -1
8187 -1 217 -84 118 29
$$ packed form
8074a53K12J24k84J28Oj16K87j35l2q9J82k04m5K02M1n4K47l62J84J23K73o08
8096g3j04J5n7M44m51K13K38o1l2L0o7q9m8o1j25O3J72k5r1k9J9K27k54L6J90
8121H0O2k4j75J65j22L24k55k01K72J19p9j57J50k59J47J63k20K13j87r2J80l51
8143b47Q7M06k90k18J16J77j41J12l03J09P8m5K22k61J02J93j65j24K78Q8k84
8164a10L24m75K53l07K49J06k6m2n9J1N7L03o08L69N5l90K98R2j11Q8K90j11k57
8187aK18l01K02q9
8191B9
$$ Imaginary data points
##PAGE= N=2
##DATA TABLE= (X++(I..I)), XYDATA
$$ plain form
0 0 0 0 0 0 8 -8 8 -8 10 -16 24 -24 32 -40 48 -56 65 -80 96 -112 129 -152 176 -201 233 -265 303 -343
28 -343 388 -439 494 -554 621 -694 774 -863 960 -1065 1180 -1309 1449 -1604 1776 -1965
44 -1965 2179 -2417 2687 -2993 3346 -3759 4247 -4831 5552 -6463 7659 -9299 11692 -15533
58 -15533 22653 -40167 166028 138937 -273543 39088 72921 -30706 60243 -66862 -85205
69 -85205 166808 -23910 -142191 67809 54796 4373 23573 -115247 -241 131946 -44712
80 -44712 -55410 29119 -35016 38301 20772 -74852 56472 41473 -76112 35723 105 -50107
92 -50107 92481 -10652 -103262 49362 5644 222 75448 -103213 -36450 163133 -65451
103 -65451 -98473 107982 -22302 -28728 58947 -118751 14749 179432 -112380 -99359 129176
$$ packed form
0@%%%%Qj6J6j6J8k6M0m8N6p2Q8j04J21j45J76k08K41k81L28l77M34m98N68o46
28c43P31q27R33j048J175j315J468j637J823k025K245k489K758l053L380l741
44a965M144m596N104n680O339p105Q006r078J0383j2015J4122j6958K0991k7225
58a5533L8186o2820K06195k7091m12480L12631L3833j03627R0949j27105j8343
69h5205K52013j90718j18281K10000j3013n0423J9200j38820J15006J32187j76658
80d4712j0698Q4529o4135P3317j7529r5624J31324j4999j17585J11835l5618n0212
92e0107J42588j03133r2610J52624m3718n422P5226j78661O6763J99583k28584
103f5451l3022K06455j30284o426Q7675j77698J33500J64683k91812J3021K28535
$$ plain form
114 129176 -9985 -31719 38982 -74470 27251 82193 -107596 -24697 99036 -13241 -21351
125 -21351 -14221 -19891 74041 -7362 -75478 52407 7203 -48553 36996 -18987 -5419 64010
137 64010 -65577 -22585 93746 -49297 -27210 67271 -60213 -6545 55412 -76207 32721
148 32721 75781 -108938 13614 91849 -80479 14302 57221 -90413 30870 52128 -97509
159 -97509 41110 66734 -89720 19832 51332 -57676 32121 27192 -59735 23019 8417
170 8417 -36871 41865 -913 -38971 29432 1590 -2384 17668 -34900 21928 35258 -70655
182 -70655 1602 55330 -30424 7252 -4524 -49884 79821 28095 -105602 39583 56019
193 56019 -63095 16945 -2259 -42428 85412 -12993 -108055 80875 54371 -71418 21518
$$ packed form
114A29176j39161k1734P0701j13452J01721N4942j89789Q2899J23733j12277q110
125b1351P130n670R3932q1403o8116J27885m5204n5756Q5549n5983J3568O9429
137F4010j29587M2992J16331j43043K2087R4481j27484N3668O1957j31619J08928
148C2721M3060j84719J22552P8235j72328R4781M2919j47634J21283K1258j49637
159i7509J38619K5624j56454J09552L1500j09008Q9797m929q6927Q2754j4602
170H417m5288P8736m2778l8058O8403k7842l974K0052n2568N6828J3330j05913
182g0655P2257N3728q5754L7676j1776m5360J29705n1726j33697J45185J6436
193E6019j19114Q0040j9204m0169J27840r8405r5062J88930k6504j25789R2936
$$ plain form
204 21518 -3768 -33245 72433 -25033 -77976 70825 22158 -57127 21194 2463 -3389 42520
216 42520 -34166 -34225 40931 3137 -11264 -4099 -25731 28218 22764 -36360 9421 12505 -9532
229 -9532 30021 -28423 -38729 62921 138 -54332 27127 -4507 -5130 54589 -48695 -38318
241 -38318 86266 -13424 -59283 38666 -9263 -9051 42757 -56113 -21457 86928 -20455 -50971
253 -50971 36590 -987 -1674 20945 -46665 -3654 53811 -25846 -29444 22246 7814 9867 -5512
266 -5512 -25748 19636 16318 -17702 -4215 -9525 6689 23666 -28680 -7775 37477 -16044 -5794
279 -5794 22144 -31883 8728 36850 -47216 -6739 41175 -31351 3704 31414 -42294 12322
291 12322 43522 -46932 -3710 38728 -33009 -536 22838 -36534 12854 34683 -36226 -2219
$$ packed form
204B1518k5286k9477J05678r7466n2943J48801m8667p9285P8321j8731n852M5909
216D2520p6686n9P5156l7794j4401P165k1632N3949n454n9124M5781L084k2037
229i532L9553n8444j0306J01650o2783n4470Q1459l1634o23N9719j03284J0377
241c8318J24584r9690m5859R7949m7929K12N1808r8870L4656J08385j07383l0516
253e0971Q7561l7577o87K2619o7610M3011N7465p9657l598N1690j4432K053j5379
266e512k0236M5384l318l4020J3487n310J6214J6977n2346K0905M5252n3521J0250
279e794K7938n4027M0611K8122q4066M0477M7914p2526L5055K7710p3708N4616
291A2322L1200r0454M3222M2438p1737L2473K3374n9372M9388K1829p0909L4007
$$ plain form
303 -2219 30631 -15352 -1292 8493 -17018 7469 8684 -18245 862 11156 1014 -2178 -5445
316 -5445 8450 7432 -13289 3549 3001 -14235 11495 426 -19692 22250 5469 -26791 24024
329 24024 10218 -29790 18937 6216 -30119 21158 4558 -32066 26511 11658 -33170 21189
341 21189 15097 -26586 14692 6750 -26388 16376 7811 -26257 11034 14164 -15688 5375 9436
354 9436 -8943 4715 5191 -10885 -3135 6969 -1737 -7571 2211 6681 -4317 1959 8458 -9775
368 -9775 439 14142 -14737 -8568 17376 -10005 -8440 17219 -10386 -5157 25025 -11546 -14590
381 -14590 23065 -5038 -16755 15402 -6537 -12458 20202 -5507 -16817 21235 5218 -17448
393 -17448 10291 3852 -13434 7919 1493 -16591 8490 10716 -13886 1376 13977 -6717 -2106
$$ packed form
303b219L2850m5983J4060R785k5511K4487J215k6929J9107J0294j0142l192l267
316e445J3895j018k0721J6838n48j7236K5730j1069k0118M1942j6781l2260N0815
329B4024j3806m0008M8727j2721l6335N1277j6600l6624N8577j4853m4828N4359
341B1189o092m1683M1278p942l3138M2764q565l4068L7291L130k9852K1063M061
354I436j8379J3658M76j6076P750J0104q706n834R782M470j0998O276O499j8233
368i775J0214J3703k8879O169K5944k7381J565K5659k7605N229L0182l6571l044
381a4590L7655k8103j1717L2157k1939n921L2660k5709j1310L8052j6017k2666
393a7448K7739o439j7286K1353o426j8084K5081K226k4602J5262J2601k0694M611
$$ plain form
406 -2106 9393 -8610 -4700 11530 -8303 -10706 13346 202 -10865 11531 3292 -10050 10014
419 10014 2721 -14309 6369 5701 -15579 3308 10521 -10862 2090 12523 -9021 -968 12481
432 12481 -9533 -7149 12620 -7211 -11226 13723 -1383 -11179 14567 1671 -13245 14092 3383
445 3383 -18998 10499 6501 -19774 7634 8472 -16683 10033 11766 -18168 7561 14496 -17603
458 -17603 462 10976 -14578 1426 9927 -13421 1602 13882 -7718 -2685 9474 -2419
470 -2419 -3361 2644 -4107 -4077 3985 1789 -6683 704 10642 -2938 -5390 9624 -2970 -6966 11592
485 11592 -8316 -12241 17800 -2921 -15989 17839 100 -12982 19516 -4301 -18573 21731
497 21731 -1514 -22806 17321 749 -16675 18731 -940 -16611 20604 2709 -18123 11851
$$ packed form
406b106J1499j8003L910J6230j9833k403K4052j3144j1067K2396q239j3342K0064
419A0014p293j7030K0678o68k1280J8887P213k1383J2952J0433k1544Q053J3449
432A2481k2014K384J9769j9831m015K4949j5106r796K5746j2896j4916K7337j0709
445C383k2381K9497l998k6275K7408Q38k5155K6716J733k9934K5729O935l2099
458a7603J8065J0514k5554J6004Q501k3348J5023J2280k1600N033J2159j1893
470b419r42O005o751L0Q062k196q472P387R938j3580k452J5014j2594l996J8558
485A1592j9908l925L0041k0721j3068L3828j7739j3082L2498k3817j4272M0304
497B1731k3245k1292M0127j6572j7424L5406j9671j5671L7215j7895k0832K9974
$$ plain form
509 11851 1259 -12240 9075 -2946 -9903 11349 2495 -5865 4043 1438 2383 -158 -5721 2363
523 2363 -1520 -3041 6017 -8320 -2541 17290 -8083 -7278 17767 -9413 -5660 18242 -17784 -8495
537 -8495 25563 -15899 -11553 24533 -13024 -5519 25410 -19218 -8637 28011 -16822 -12572 20608
550 20608 -14082 -4535 19960 -17159 -3484 23003 -10825 -6102 11507 -8853 1326 6326 -13716
563 -13716 1940 8247 -4904 2175 -1942 263 11976 -8180 -6017 10022 -8897 513 8529
576 8529 -19251 5704 20104 -21414 1803 18851 -18749 7604 14132 -30094 9555 21824
588 21824 -29999 3964 19061 -21788 12300 14318 -28837 14079 19134 -27555 4676 10983 -18614
601 -18614 11723 4127 -20947 15182 9799 -14775 6545 375 -4875 11119 -10243 -8493 12692
$$ packed form
509A1851j0592j3499K1315j2021o957K1252q854q360R908k605R45k541n563Q084
523B363l883j521R058j4337N779J9831k5373Q05K5045k7180L753K3902l6026R289
537h495L4058m1462M346L6086l7557P505L0929m4628J0581L6648m4833M250L3180
550B0608l4690R547K4495l7119J3675K6487l3828M723J7609k0360J0179N000k0042
563a3716J5656O307j3151P079m117K205J1713k0156K163J6039j8919R410Q016
576H529k7780K4955J4400m1518K3217J7048l7600K6353O528m4226L9649J2269
588B1824n1823L3963J5097m0849L4088K018m3155M2916N055m6689L2231O307k9597
601a8614L0337p596k5074L6129n383k4574K1320o170n250J5994k1362J750K1185
$$ plain form
614 12692 -4715 -1336 5306 -11297 11407 11156 -20736 6661 9822 -16304 11139 145 -22981
627 -22981 23208 6748 -28291 19647 8129 -21099 21647 -2054 -26356 27272 1583 -29586
639 -29586 20331 2360 -18298 22928 -5583 -18482 26551 -2280 -19174 15242 -5015 -8063
651 -8063 15114 -12821 -6613 18403 -6611 -2803 7069 -9198 9070 5522 -18651 7786 5007
664 5007 -11701 11496 -5392 -12295 25111 -4431 -18932 21614 -4930 -12233 21552 -18147 -12818
677 -12818 32620 -15722 -16949 28515 -12269 -7224 27189 -22771 -8865 32198 -19699 -13980 22937
690 22937 -14727 -1719 19676 -20449 624 22482 -14552 -2667 8536 -11525 8714 3072
702 3072 -18445 10745 6722 -9652 10022 -5500 -5674 20844 -10563 -13650 17060 -7582 -3750
$$ packed form
614A2692j7407L379O642j6603K2704k51l1892K7397L161k6126K7443j0994k3126
627b2981M6189j6460l5039M7938j1518k9228M2746k3701k4302N3628k5689l1169
639b9586M9917j7971k0658M1226k8511j2899M5033k8831j6894L4416k0257l048
651h063K3177k7935O208K5016k5014L808R872j6267J8268l548k4173K6437k779
664E007j6708K3197j6888o903L7406k9542j4501M0546k6544p303L3785l9699N329
677a2818M5438m8342j227M5464m0784N045L4413m9960J3906M1063n1897N719L6917
690B2937l7664J3008K1395m0125K1073K1858l7034J1885J1203k0061K0239n642
702C072k1517K9190m023j6374J9674j5522j74K6518l1407l087L0710k4642L832
$$ plain form
715 -3750 13071 -20122 3466 26116 -21992 -3574 21501 -16923 4935 12791 -30480 11246
727 11246 24157 -31512 2731 21000 -19709 11822 10784 -28761 16669 17696 -29324 5383
739 5383 12240 -15617 10948 1123 -17068 17905 5145 -14149 8434 -2740 -2952 11376 -15086
752 -15086 -4276 16398 -11178 616 10311 -16478 11382 14740 -25397 5734 14792 -19172 8756
765 8756 3671 -22570 20884 8840 -27789 16025 9932 -18657 17003 -4404 -21804 27900 -1517
778 -1517 -28820 21552 4084 -17077 18425 -6341 -13646 25329 -6772 -18831 16943 -2506
790 -2506 -8944 9790 -9177 -63 13290 -10599 813 8667 -10246 7307 1978 -15468 12262
803 12262 1304 -15765 16488 -1290 -15616 21682 -2150 -17847 19916 -5286 -14316 20957
$$ packed form
715c750J6821l3193K3588K2650m8108J8418K5075l8424K1858P856m3271M1726
727A1246J2911n5669L4243J8269m0709L1531j038l9545M5430J027m7020L4707
739E383O857k7857K6565r825j8191L4973j2760j9294K2583j1174k12J4328k6462
752a5086J0810K0674k7576J1794R695k6789K7860L358m0137L1131R058l3964K7928
765H756n085k6241M3454j2044l6629M3814o093k8589L5660k1407j7400M9704k9417
778a517k7303N0372j7468k1161L5502k4766p305L8975l2101j2059L5774j9449
790b506o438J8734j8967R114J3353k3889J1412P854j8913J7553n329j7446K7730
803A2262j0958j7069L2253j7778j4326L7298k3832j5697L7763k5202r030L5273
$$ plain form
815 20957 -11802 -14633 26332 -9239 -14286 22631 -8918 -6667 20824 -17940 -6239 24093 -17223
828 -17223 -8059 19767 -13447 -1103 16322 -15345 2394 15395 -14961 1089 9511 -12909
840 -12909 3806 4263 -10439 7400 79 -5611 13506 -6384 -8468 16145 -6815 -7996 11421
853 11421 -12671 345 17865 -20368 -3275 25617 -13340 -5805 14169 -13898 5841 13234
865 13234 -27039 4064 23636 -18777 -2660 13393 -10856 9855 6614 -22362 10921 13834
877 13834 -19722 1478 6283 -8492 10185 -899 -12434 13407 3604 -9496 5800 -4060 -2417
890 -2417 10177 -9731 -4563 9590 -5962 4212 5578 -15455 9845 13142 -18124 1895 7925
903 7925 -11627 10946 85 -21611 19421 12760 -23691 6574 9752 -10151 10708 -5742 -17609
$$ packed form
815B0957l2759k831M0965l5571n047L6917l1549K251K7491l8764J1701L0332m1316
828a7223R164K7826l3214J2344J7425l1667J7739J3001l0356J6050Q422k2420
840a2909J6715M57j4702J7839p321n690J9117j9890k084K4613k2960j181J9417
853A1421k4092J3016J7520l8233J7093K8892l8957P535J9974k8067J9739P393
865A3234m0273L1103J9572m2413J6117J6053k4249K0711l241k8976L3283K913
877A3834l3556K1200M805j4775J8677j1084j1535K5841r803j3100J5296r860J643
890b417J2594j9908N168J4153j5552J0174J366k1033K5300L297l1266K0019O030
903G925j9552K2573j0861k1696M1032o661l6451L0265L178j9903K0859j6450j1867
$$ plain form
916 -17609 21744 3870 -23788 8730 8852 -5890 7500 -7784 -6519 18995 -4461 -16442 8598
929 8598 2734 -2419 1911 -8472 4430 11235 -8380 -2147 5118 -3340 4847 -2013 -11110 10169
943 10169 2485 -10566 8298 -613 -6669 14782 -4275 -12469 13981 -2042 -10084 10919 -7314
956 -7314 -6629 18547 -7912 -12231 17295 -1270 -7780 8593 -8166 -2043 13718 -12168 -8327
969 -8327 14757 -1674 -5705 3919 -2965 4918 4766 -11357 367 8170 -4615 -2473 -1469 162
983 162 8105 -4898 -5608 10298 -101 -5483 3835 -5022 545 7702 -11814 -1544 13647 -8110
997 -8110 -3688 10879 -6105 766 7914 -12163 1017 11143 -12067 -1869 10473 -7521 609
1010 609 7810 -8259 2575 7841 -8659 -254 5395 -6264 980 2900 -5531 2571 3883 -2386
$$ packed form
916a7609L9353j7874k7658L2518J22j4742J3390j5284J265K5514k3456j1981K5040
929H598n864n153M330j0383J2902O805j9615O233P265q458Q187o860r097K1279
943A0169p684j3051J8864q911o056K1451j9057q194K6450j6023q042K1003j8233
956g314O85K5176k6459m319K9526j8565o510J6373j6759O123J5761k5886L841
969h327K3084j6431m031R624o884P883j52j6123J1724P803j2785K142J004J631
983A62P943j3003p10J5906j0399n382R318q857N567P157j9516J0270J5191k1757
997h110M422J4567j6984O871P148k0077J3180J0126k3210J0198J2342j7994Q130
1010F09P201j6069J0834N266j6500Q405N649j1659P244J920q431Q102J312o269
$$ plain form
1024 -2386 1030 -343 202 2868 -4167 -2672 2859 -1377 1015 -67 -4715 7194 4737 -9818 2037
1039 2037 6753 -5288 1136 -1142 -7024 9246 2320 -13438 6062 9436 -7083 998 1617 -4722
1053 -4722 7634 -815 -12793 6286 7473 -7831 -801 3136 -576 4705 -1552 -7024 4959 4414
1067 4414 -5874 -3246 1575 2541 772 -2635 -127 3186 1887 -95 -3996 -653 4924 -2192 -5322
1082 -5322 2804 371 -489 3653 -3932 -1736 8246 -1852 -6644 3678 175 -2458 3133 -4297 -2905
1097 -2905 9320 -366 -7095 4599 3701 -2384 559 -2835 -2338 5750 -628 -7546 2736 6091 -2112
1112 -2112 -1886 924 1100 2143 -923 -5482 629 5139 -2154 -5150 3107 3955 -895 -223 -622 61
1128 61 3859 -1412 -6469 2135 4228 -3837 -1789 3040 485 1558 1531 -3616 895 4655 -3475 -4102
$$ packed form
1024b386L416j373N45K666p035J495N531m236K392j082m648J1909k457j4555J1855
1039B037M716j2041O424k278n882J6270o926j5758J9500L374j6519Q081O19o339
1053d722J2356q449j1978J9079J187j5304P030L937l712N281o257n472J1983n45
1067D414j0288K628M821R66j769l407K508L313j299j982l901L343N577p116l130
1082e322Q126k433q60M142p585K196R982j0098m792J0322l503k633N591p430J392
1097b905J2225r686o729J1694q98o085K943l394M97Q088o378o918J0282L355q203
1112b112K26K810J76J043l066m559O111M510p293k996Q257Q48m850O72l99O83
1128F1L798n271n057Q604K093q065K048M829k555J073k7n147M511L760q130o27
$$ plain form
1144 -4102 2536 736 -1665 1426 -989 -719 5221 -255 -4898 3362 2831 -4391 -192 962 -2952
1159 -2952 3585 1807 -5524 3029 6020 -4224 -1304 2626 -2438 1141 1003 -5646 1888 5461 -3410
1174 -3410 -2054 3871 1052 80 -332 -3340 1117 2697 -2776 -3220 2085 3035 -996 -1992 1556 1997
1190 1997 -236 3 -2321 -1356 4275 -1905 -5907 4565 2536 -3629 2935 -85 -2904 5828 -1258
1205 -1258 -7402 5173 1837 -6270 3270 192 -3716 6540 -22 -6233 5431 2113 -5700 1984
1219 1984 -677 -3034 4175 -995 -4006 4086 1926 -1575 863 -721 556 1745 -3099 -935 956
1234 956 -713 1733 -1036 -1773 5288 -230 -3732 3851 -1433 -2806 4529 -3976 -3726 7247 -2675
1249 -2675 -4291 7544 -2468 -3051 7229 -4495 -4345 7555 -4530 -4470 7052 -3790 -2593 6931
$$ packed form
1144d102O638j800k401L091k415K70N940n476m643Q260n31p222M199J154l914
1159b952O537j778p331Q553K991j0244K920L930n064L579j38o649P534L573q871
1174c410J356N925k819r72m12l008M457J580n473m44N305R50m031r96L548M41
1190A997k233K39k324R65N631o180m002J0472k029o165O564l020k819Q732p086
1205a258o144J2575l336q107R540l078l908J0256o562o211J1664l318p813P684
1219A984k661k357P209n170l011Q092k160l501K438j584J277J189m844K164J891
1234I56j669K446k769p37P061n518l502P583n284j373P335q505K50J0973r922
1249b675j616J1835j0012n83J0280j1724J50J1900j2085O0J1522j0842J197R524
$$ plain form
1263 6931 -3712 -1881 6288 -3768 -1912 4349 -4087 -1092 3105 -3343 730 2541 -2365 2159
1277 2159 1283 -2500 2655 -870 -2241 3025 -3529 -1310 5549 -3646 -1236 6341 -4151 172 6290
1292 6290 -6887 -215 7217 -7877 -839 7143 -6917 1195 6531 -7985 2613 7720 -8462
1305 -8462 829 5413 -7355 2150 3828 -7952 3456 5110 -6345 2679 3350 -4131 3898 -343
1319 -343 -5137 3958 -464 -3581 2979 -1971 463 5008 -4747 -201 5257 -4582 665 2528 -6754
1334 -6754 3556 4178 -8605 3632 5298 -6956 4745 2565 -8518 6765 2603 -11038 5572
1347 5572 3182 -8063 6149 1026 -7549 8795 1128 -8514 6552 816 -6146 5328 -2782 -4614
1361 -4614 7306 -2192 -4259 5748 -1643 -276 4315 -5250 225 4553 -5334 807 1855 -4760
$$ packed form
1263F931j0643J831Q169j0056J856O261q436K995M197o448M073J811m906M524
1277B159q76l783N155l525j371N266o554K219O859r195K410P577j0492M323O118
1292F290j3177O672P432j5094P038P982j4060Q112N336j4516J0598N107j6182
1305h462R291M584j2768R505J678j1780J1408J654j1455R024O71p481Q029m241
1319c43m794R095m422l117O560m950K434M545r755M546N458r839N247J863r282
1334f754J0310O22j2783J2237J666j2254J1701k180j1083J5283m162j3641J6610
1347E572k390j1245J4212n123q575J6344p667r642J5066n736o962J1474q110j832
1361d614J1920r498k067J0007p391J367M591r565N475M328r887O141J048o615
$$ plain form
1375 -4760 4968 1620 -6495 6505 2046 -6972 6223 -1516 -6946 8565 -2180 -8389 9691 -954
1389 -954 -6500 9013 -3149 -5389 10163 -4282 -6721 8871 -3903 -4202 8214 -5552 -2030
1402 -2030 9384 -5490 -2494 6924 -4739 -621 4071 -6934 862 4865 -5396 1583 2987 -3456
1416 -3456 4620 -110 -5571 5822 -637 -5127 5015 -3573 -2647 8596 -5077 -3756 9746 -4350
1430 -4350 -2768 7464 -7343 -1273 9186 -9132 -2283 9621 -7014 119 7667 -8180 2083
1443 2083 7939 -9473 493 6445 -7571 2280 3135 -7834 4905 4174 -7346 3856 2352 -4213
1457 -4213 4820 -1872 -5621 6207 -1171 -4484 4761 -1817 -99 5725 -5896 -361 6897 -6169
1471 -6169 -287 3793 -7419 3302 5485 -9949 3848 6933 -8590 3629 4172 -8717 5747
$$ packed form
1375d760R728l348q115J3000m459r018J3195p739n430J5511j0745o209J8080j0645
1389i54n546J5513j2162k240J5552j4445k439J5592j2774k99J2416j3766L522
1402b030J1414j4874K996R418j1663M118M692j1005P796M003j0261O979J404o443
1416c456Q076m730n461J1393o459m490J0142q588R26J1243j3673J321J3502j4096
1430d350J582J0232j4807O070J0459j8318O849J1904j6635P133P548j5847J0263
1443B083N856j7412R966N952j4016R851Q55j0969J2739p31j1520J1202j504o565
1457d213R033o692l749J1828p378l313R245o578J718N824j1621N535P258j3066
1471f169N882M080j1212J0721K183j5434J3797L085j5523J2219N43j2889J4464
$$ plain form
1484 5747 3443 -11183 4834 4272 -8120 5212 2104 -6503 7354 958 -7881 5860 452 -5417
1498 -5417 4970 -2835 -3753 6960 -2589 -2962 5459 -2560 26 4125 -5910 591 4571 -6315
1512 -6315 985 2846 -5177 5038 1709 -7251 6310 1798 -7647 5305 -458 -6802 7841 -1433
1526 -1433 -7772 9227 -174 -6330 8424 -2134 -5620 8818 -3393 -6603 7759 -2166 -4442
1539 -4442 6811 -3515 -1650 7418 -3800 -2101 5249 -4358 -342 3148 -5635 1606 3345 -4949
1553 -4949 2570 2072 -3585 4641 -291 -5455 5207 -1045 -4873 4908 -2704 -2763 7571 -3747 -3388
1568 -3388 8349 -3654 -2671 6416 -5944 -1796 7580 -7011 -2227 8201 -5110 -342 6308 -6252
1582 -6252 670 6299 -6974 -365 5018 -5190 1199 3050 -5093 3131 3229 -4569 2778 1013 -3173
$$ packed form
1484E747k304j4626J6017n62j2392J3332l108q607J3857o396q839J3741n408n869
1498e417J0387p805r18J0713r549l73Q421q019K586M099j0035O501L980j0886
1512f315P300J861q023J0215l329q960J3561m512r445J2952n763o344J4643r274
1526a433o339J6999r401o156J4754j0558l486J4438j2211l210J4362r925k276
1539d442J1253j0326J865R068j1218J699P350r607M016L490q783P241J739q294
1553d949P519m98n657Q226m932n164J0662o252l828R781p612n9J0334j1318L59
1568c388J1737j2003R83R087j2360M148R376j4591M784J0428j3311M768O650j2560
1582f252O922N629j3273O609N383j0208O389J851q143Q224R8p798P347j765m186
$$ plain form
1597 -3173 3231 -1575 -3257 4527 -1822 -2425 4074 -2581 420 5165 -4912 -599 5694 -5090 -228
1612 -228 3817 -6126 2456 5291 -7502 2360 5643 -5773 2389 3160 -6809 3735 3132 -8054 3159
1627 3159 3500 -5857 3414 1964 -4809 4592 1404 -5568 2995 555 -3656 2863 -1361 -1847 3889
1642 3889 -1358 -1249 3115 -1868 439 2169 -4028 945 2183 -4116 1600 1443 -3974 3764 1370
1657 1370 -5418 4238 1167 -5160 4025 -262 -5632 5505 -360 -5806 5823 354 -4442 5258
1671 5258 -917 -4025 5416 -1541 -4490 4541 -790 -2782 4156 -1499 -1044 4073 -1925 -1653 2789
1686 2789 -1949 -385 1077 -2227 1147 1440 -2202 1805 558 -1675 2972 -612 -2938 2963 -1592
1701 -1592 -2714 3827 -2062 -1981 5083 -2102 -2330 5015 -2481 -1956 3911 -3758 -1961 4840 -3287 -1624
$$ packed form
1597c173O404m806j682P784o349o03O499o655L001M745j0077M313O293j0784M862
1612b28M045r943Q582K835j2793R862L283j1416Q162P71r969J0544o03j1186J1213
1627C159L41r357R271j450o773R401l188o972Q563k440m211O519m224m86N736
1642C889n247J09M364m983K307J730o197M973J238o299N716j57n417P738k394
1657A370o788R656l071o327R185m287n370J1137n865n446J1629n469m796R700
1671E258o175l108R441o957k949R031n331j992O938n655M55N117n998K72M442
1686B789m738J564J462l304L374K93l642M007j247k233M647l584k326N901m555
1701a592j122O541n889Q1P064p185k28P345p496N25N867p669J797O801q127J663
$$ plain form
1717 -1624 4779 -1821 -586 3473 -3044 -335 3669 -3338 -1683 2403 -1665 -386 1536 -1790 1142
1732 1142 1859 -1630 198 582 -413 632 -1449 -714 2014 -1482 -342 2121 -1492 925 2381 -2971
1748 -2971 322 2540 -2967 298 2016 -3625 1270 3039 -3715 927 3207 -2968 659 1979 -3893
1763 -3893 1011 2417 -3847 431 3083 -1673 610 1333 -1610 1291 1148 -2487 -402 1254 -1220
1778 -1220 -828 -239 254 803 -53 -90 874 294 533 -1097 -1612 1635 41 -2182 1202 621 -1185 2303
1796 2303 171 -1899 2847 192 -2971 1517 391 -2836 1583 435 -1937 2309 1050 -2254 1245
1811 1245 731 -2306 391 169 -2049 1238 1256 -1597 273 1540 -244 52 490 -939 -9 696 -846
1828 -846 -928 1265 503 -1100 434 1234 -433 461 -91 -1205 836 683 -1961 -295 2066 -644 -838
$$ packed form
1717a624O403o600J235M059o517K709M004p007J655M086m068J279J922l326K932
1732A142P17l489J828L84r95J045k081P35K728l496J140K463l613K417J456n352
1748b971L293K218n507L265J718n641M895J769o754M642K280o175L627J320n872
1763c893M904J406o264M278K652m756K283P23k943K901j43l635K085J656k474
1778a220L92N89M93N49q56l7R64n80K39j630n15L247j594k223L384n81j806L488
1796B303k132k070M746k655l163M488j126l227M419j148k372M246j259l304L499
1811A245n14l037K697k22k218L287J8k853J870J267j784K96M38j429R30P05j542
1828h46q2K193p62j603J534Q00j667Q94n52j114K041j53k644J666K361k710j94
$$ plain form
1845 -838 1522 -405 138 1278 -1337 -1066 2005 -686 -1937 1154 394 -863 1216 709 -771 1428
1861 1428 485 -2074 570 1391 -2140 -233 915 -1332 711 1383 -1592 74 2117 -1563 -736 1114
1877 1114 -1099 -552 1127 -1284 -561 2289 -185 -1172 1309 -53 -928 509 -733 -1065 1063 421
1893 421 -1250 -111 1361 467 -593 433 78 -318 379 -439 -1761 2092 437 -2111 1161 1732 -1431
1910 -1431 1315 467 -1837 2057 693 -3386 1118 1656 -2234 844 1244 -2019 1725 1207 -2694 1015
$$ packed form
1845h38K360j927N43J140k615K71L071k691j251L091p60j257K079n07j480K199
1861A428r43k559K644Q21l531J907J148k247K043O72k975J666K043l680Q27J850
1877A114k213N47J679k411P23K850k474r87K481j362q75J437j242l32K128o42
1893D21j671J139J472q94j060J026l55l96O97q18j322L853j655k548L272N71l163
1910a431K746q48k304L894j364m079M504N38l890L078M00l263L744n18l901L709
$$ [...]
8191A01
##END NTUPLES=NMR FID
##END=
