##TITLE=1H_Ser EL-16
 CDCl3
 8 sc, 
 13.8.2024
##JCAMPDX= 6.0         $$ Bruker NMR JCAMP-DX V2.0
##DATA TYPE= NMR FID
##DATA CLASS= NTUPLES
##ORIGIN= UXNMR, Bruker Analytische Messtechnik GmbH
##OWNER= root
$$ XWIN-NMR		Version 3.5
$$ Tue Aug 13 16:26:20 2024 Russian Standard Time (UT+4h)  she@DPX200
##.OBSERVE FREQUENCY= 200.1313
##.OBSERVE NUCLEUS= ^1H
##.DELAY= (6, 6)
##.ACQUISITION MODE= SIMULTANEOUS
##.ACQUISITION SCHEME= undefined
##.AVERAGES= 8
##.DIGITISER RES= 18
##SPECTROMETER/DATA SYSTEM= spect
##.PULSE SEQUENCE= zg30
##.SOLVENT NAME= DMSO
##.SHIFT REFERENCE= (INTERNAL, DMSO, 0, 15.7039)
##AUDIT TRAIL= $$ (NUMBER, WHEN, WHO, WHERE, WHAT)
$$ ##TITLE= Audit trail, XWIN-NMR		Version 3.5
$$ ##JCAMPDX= 5.01
$$ ##ORIGIN= Bruker BioSpin GmbH
$$ ##OWNER= she
$$ F:/spectra/data/she/nmr/H-F/1/audita.txt
$$ ##AUDIT TRAIL=  $$ (NUMBER, WHEN, WHO, WHERE, WHAT)
(   1,<2024-08-13 16:25:13.62 +0400>,<she>,<DPX200>,
      <created by zg, POWCHK disabled, PULCHK disabled
       configuration hash MD5:
       00 E9 B6 7A A2 85 ED C7 34 08 36 98 17 FE 4E 26
       data hash MD5: 16K
       FD D0 0E 1B 85 FA 54 08 77 4A 21 92 27 90 0D D4>)
$$ ##END=
$$ 
$$ hash MD5
$$ EB 31 8E 0D 45 B2 30 83 AE B5 29 D4 65 8E 66 77
##$RELAX= 
##$RELAX= 
##$RELAX= 
##$RELAX= 
##$RELAX= 
##$RELAX= 
$$ Bruker specific parameters
$$ --------------------------
##$DU= <F:/spectra>
##$EXPNO= 1
##$NAME= <H-F>
##$PROCNO= 1
##$TYPE= <nmr>
##$USER= <she>
##$AMP= (0..31)
100 100 100 100 100 100 100 100 100 100 100 100 100 100 100 100 100 100 
100 100 100 100 100 100 100 100 100 100 100 100 100 100 
##$AQSEQ= 0
##$AQ_mod= 1
##$AUNM= <au_zg>
##$AUTOPOS= <>
##$BF1= 200.13
##$BF2= 200.13
##$BF3= 200.13
##$BF4= 200.13
##$BF5= 200.13
##$BF6= 200.13
##$BF7= 200.13
##$BF8= 200.13
##$BYTORDA= 1
##$CFDGTYP= 0
##$CFRGTYP= 5
##$CHEMSTR= <none>
##$CNST= (0..31)
1 1 145 1 1 1 1 1 1 1 1 1 1 1 1 1 1 1 1 1 1 1 1 1 1 1 1 1 1 1 1 1 
##$CPDPRG= <>
##$CPDPRG1= <>
##$CPDPRG2= <>
##$CPDPRG3= <>
##$CPDPRG4= <mlev>
##$CPDPRG5= <mlev>
##$CPDPRG6= <mlev>
##$CPDPRG7= <mlev>
##$CPDPRG8= <mlev>
##$CPDPRGB= <>
##$CPDPRGT= <>
##$D= (0..31)
0 1.2 0 0 0 0 0 0 0 0.06 0 0.03 0 0 0 0 0.0002 0 0 0 0 0 0 0 0 0 0 0 0 
0 0 0 
##$DATE= 1723551913
##$DBL= (0..7)
120 120 120 120 120 120 120 120 
##$DBP= (0..7)
150 150 150 150 150 150 150 150 
##$DBP07= 0
##$DBPNAM0= <>
##$DBPNAM1= <>
##$DBPNAM2= <>
##$DBPNAM3= <>
##$DBPNAM4= <>
##$DBPNAM5= <>
##$DBPNAM6= <>
##$DBPNAM7= <>
##$DBPOAL= (0..7)
0.5 0.5 0.5 0.5 0.5 0.5 0.5 0.5 
##$DBPOFFS= (0..7)
0 0 0 0 0 0 0 0 
##$DE= 6
##$DECBNUC= <off>
##$DECIM= 24
##$DECNUC= <off>
##$DECSTAT= 4
##$DIGMOD= 1
##$DIGTYP= 9
##$DL= (0..7)
0 120 120 120 120 120 120 120 
##$DP= (0..7)
150 150 150 150 150 150 150 150 
##$DP07= 0
##$DPNAME0= <>
##$DPNAME1= <>
##$DPNAME2= <>
##$DPNAME3= <>
##$DPNAME4= <>
##$DPNAME5= <>
##$DPNAME6= <>
##$DPNAME7= <>
##$DPOAL= (0..7)
0.5 0.5 0.5 0.5 0.5 0.5 0.5 0.5 
##$DPOFFS= (0..7)
0 0 0 0 0 0 0 0 
##$DQDMODE= 0
##$DR= 18
##$DS= 0
##$DSLIST= <SSSSSSSSSSSSSSS>
$$ [...]
##$SUBNAM2= <"">
##$SUBNAM3= <"">
##$SUBNAM4= <"">
##$SUBNAM5= <"">
##$SUBNAM6= <"">
##$SUBNAM7= <"">
##$SUBNAM8= <"">
##$SUBNAM9= <"">
##$SW= 24.0689771365484
##$SWIBOX= (0..15)
0 0 2 0 0 0 0 0 0 0 0 0 0 0 0 0 
##$SW_h= 4816.95568400771
##$TD= 16384
##$TD0= 1
##$TE= 0
##$TE2= 300
##$TE3= 300
##$TEG= 300
##$TL= (0..7)
0 120 120 120 120 120 120 120 
##$TP= (0..7)
150 150 150 150 150 150 150 150 
##$TP07= 0
##$TPNAME0= <>
##$TPNAME1= <>
##$TPNAME2= <>
##$TPNAME3= <>
##$TPNAME4= <>
##$TPNAME5= <>
##$TPNAME6= <>
##$TPNAME7= <>
##$TPOAL= (0..7)
0.5 0.5 0.5 0.5 0.5 0.5 0.5 0.5 
##$TPOFFS= (0..7)
0 0 0 0 0 0 0 0 
##$TUNHIN= 0
##$TUNHOUT= 0
##$TUNXOUT= 0
##$USERA1= <user>
##$USERA2= <user>
##$USERA3= <user>
##$USERA4= <user>
##$USERA5= <user>
##$V9= 5
##$VALIST= <valist>
##$VCLIST= <CCCCCCCCCCCCCCC>
##$VD= 0
##$VDLIST= <DDDDDDDDDDDDDDD>
##$VPLIST= <PPPPPPPPPPPPPPP>
##$VTLIST= <TTTTTTTTTTTTTTT>
##$WBST= 1024
##$WBSW= 4
##$XGAIN= (0..3)
0 0 0 0 
##$XL= 0
##$YL= 0
##$YMAX_a= 93534
##$YMIN_a= -95562
##$ZGOPTNS= <>
##$ZL1= 120
##$ZL2= 120
##$ZL3= 120
##$ZL4= 120
##$ABSF1= 10
##$ABSF2= 0
##$ABSG= 5
##$ABSL= 3
##$ALPHA= 0
##$AQORDER= 0
##$ASSFAC= 0
##$ASSFACI= 0
##$ASSFACX= 0
##$ASSWID= 0
##$AUNMP= <proc_1d>
##$AZFE= 0.1
##$AZFW= 0.1
##$BCFW= 1
##$BC_mod= 2
##$BYTORDP= 1
##$COROFFS= 0
##$CY= 11.3945322036743
##$DATMOD= 1
##$DC= 2
##$DFILT= <>
##$DTYPP= 0
##$F1P= 15.6554695791079
##$F2P= 12.8336369535428
##$FCOR= 0.5
##$FTSIZE= 0
##$FT_mod= 4
##$GAMMA= 1
##$GB= 0.15
##$INTBC= 1
##$INTSCL= 1
##$ISEN= 128
##$LB= 0.24
##$LEV0= 0
##$LPBIN= 0
##$MAXI= 10000
##$MC2= 0
##$MEAN= 0
##$ME_mod= 0
##$MI= 1.114404
##$NCOEF= 0
##$NC_proc= 0
##$NLEV= 6
##$NOISF1= 3.799351
##$NOISF2= 2.8
##$NSP= 1
##$NTH_PI= 0
##$NZP= 0
##$OFFSET= 15.70392
##$PC= 1
##$PHC0= -25995.1
##$PHC1= 13.38748
##$PH_mod= 1
##$PKNL= yes
##$PPARMOD= 0
##$PSCAL= 0
##$PSIGN= 0
##$REVERSE= no
##$SF= 200.130013532006
##$SI= 16384
##$SIGF1= 3
##$SIGF2= 2
##$SINO= 400
##$SIOLD= 16384
##$SREGLST= <1H.CDCl3>
##$SSB= 0
##$STSI= 0
##$STSR= 0
##$SW_p= 3612.71676300578
##$SYMM= 0
##$S_DEV= 0
##$TDeff= 0
##$TDoff= 0
##$TI= <>
##$TILT= no
##$TM1= 0
##$TM2= 0
##$TOPLEV= 0
##$USERP1= <user>
##$USERP2= <user>
##$USERP3= <user>
##$USERP4= <user>
##$USERP5= <user>
##$WDW= 1
##$XDIM= 8192
##$YMAX_p= 0
##$YMIN_p= 0
$$ End of Bruker specific parameters
$$ ---------------------------------
##NTUPLES= NMR FID
##VAR_NAME=  TIME,          FID/REAL,        FID/IMAG
##SYMBOL=    X,             R,               I
##VAR_TYPE=  INDEPENDENT,   DEPENDENT,       DEPENDENT
##VAR_FORM=  AFFN,          ASDF,            ASDF
##VAR_DIM=   8192,          8192,            8192
##UNITS=     SECONDS,       ARBITRARY UNITS, ARBITRARY UNITS
##FACTOR=    0.0002076,     1,               1
##FIRST=     0,             0,               0
##LAST=      1.7004516,     0,               0
##MIN=       0,             -95562,          0
##MAX=       1.7004516,     93534,           0
$$ Real data points
##PAGE= N=1
##DATA TABLE= (X++(R..R)), XYDATA
$$ [...]
1926A01j58L23q1K6J32k1k35n92P72l72o68M99L37o97P50K82n67O66k17n58L40
$$ 101 -57 266 185 211 343 322 87 -505 267 -105 -773 -274 63 -634 116 398 -169 497 280 -278 62
1947F2J28r50L68M61l06n6O56q2p6K69m38N2K96p12j40O25j47n64P58J29m83L81
$$ 62 190 -760 -392 69 -237 -293 363 281 205 474 36 88 384 -328 -468 157 10 -554 204 333 -150 231
1969B31L10p69L56j99r06R33M31j142O45J028j310N73M04m67l15L67l60j62M46
$$ 231 541 -228 128 -71 -977 -44 387 -755 -110 918 -392 181 585 118 -197 170 -190 -352 94
1988I4m28p0J158p04m89J075rj252O64n0m46N39m17l19J029J68j201J086P0j018
$$ 94 -334 -404 754 50 -439 636 627 -625 39 -11 -457 82 -335 -654 375 543 -658 428 498 -520
2008e20M87K83l88l46L60m06L36N95r80N43J019r26m50P41m30m85L77P6k58L38
$$ -520 -33 250 -138 -484 -124 -530 -194 401 -579 -36 983 57 -393 348 -82 -567 -190 -114 -372 -34
2028c4P7o9O06k80o24O60M79j386L11M67p95J83N64n09P23J66o01j3Q44j068l26
$$ -34 43 -26 580 300 -324 336 815 -571 -260 207 -588 -405 159 -350 373 539 -62 -75 769 -299 -625
2049f25R51l36q31P00K6J81K46n57L20N29k67q82Q05j96o87N70L35n02L7N42k37
$$ -625 326 -10 -841 -141 -115 66 312 -245 75 604 337 -545 260 64 -623 -53 282 -220 -183 359 122
2070A22N7M18r99M49j80n08q3J103n28l39J382k81m85L04j21k10J47n04k17N20
$$ 122 179 597 -402 47 -133 -641 -724 379 -149 -488 894 613 128 432 311 101 248 -256 -473 47
2090D7q1r01J133K53n10l5O36m67j03j59m93Q83J48j130J109K83q32K90L08m5
$$ 47 -34 -935 198 451 -59 -94 542 75 -28 -187 -680 203 351 -779 330 613 -219 71 379 334
2110C34m29NQj79R0m7n11J255j30q46N83M67q60L51J21o01J73J44n20O32M30o47
$$ 334 -95 -90 -82 -261 -171 -218 -729 526 396 -450 133 600 -260 91 212 -389 -216 -72 -592 40 470 -177
2132a77K17Q32j137j9P98m20n24N72o15K89M77p20M24P14k09o12N58n00k9j94
$$ -177 40 872 -265 -284 514 94 -430 142 -473 -184 293 -427 -3 711 502 -110 448 -52 -81 -275
2152b75J17k81K32L06j48K00K57m96L71N0m92k61N52n28l4N28l39O33J01l44k9
$$ -275 -158 -439 -207 99 -49 151 408 -88 283 333 -159 -420 132 -396 -430 98 -241 392 493 149 120
2173A20L17n29l53N26l38K3K66J4r9K72o0k3j9K81o58J10L27m08K04O6j81J67
$$ 120 437 -92 -445 81 -257 -234 32 46 -53 219 159 136 117 398 -260 -150 177 -231 -27 39 -142 25
2195B5M70k77N4k25j5q2p3r1l47K70J85j2K57L2N8J25k90n89O66k46l60N46j95
$$ 25 495 218 272 47 32 -50 -123 -214 -561 -291 -106 -118 139 171 229 354 64 -525 141 -105 -465 81 -114
2218a14k40K87K01p7K08J53m02j84K22n61L05m0r7O7M20k4R5R9p5j72m10J66k72
$$ -114 -354 -67 134 57 265 418 16 -168 54 -507 -202 -242 -339 -272 148 124 219 318 243 71 -339 -173 -445
2241d45K79l18K73R2qK09K47o1j23k11q7J19l45M61k05p8O18k53j2K3R4j44J90
$$ -445 -166 -484 -211 -119 -127 82 329 268 145 -66 -153 -34 -379 82 -123 -201 417 164 152 175 269 125 315
2264C15j98l24k24K53J20L02m06K78K52o0k24k1k25j37J49M9K43k44J25J15n0
$$ 315 117 -207 -431 -178 -58 244 -162 116 368 308 84 63 -162 -299 -150 -101 142 -102 23 138 88
2285H8K04K39m60J81k49R0k02m0j90J79N25k27K36o4k48N2j2r9k96K07j60K01
$$ 88 292 531 71 252 3 93 -109 -149 -339 -160 365 138 374 310 62 114 102 3 -293 -86 -246 -45
2307d5L00j63p6L52m62R4P7n6J13j54qj74R7K14N1j66L31n6M4m39K7K11l45K43
$$ -45 255 92 16 368 -94 0 77 21 134 -20 -28 -202 -105 109 160 -6 325 269 313 -126 -99 112 -233 10
2331A0j03r1L06O1J0J18k0j91m5n48L14k16J98j9M13l37K90M3J14j98k46Q9j12
$$ 10 -93 -184 122 183 193 311 291 100 55 -493 -179 -395 -197 -216 197 -140 150 193 307 109 -137 -48 -160
2354a60O2J5J18k10k4K94P0L42j89j85o3k09N7J32k36l5K05L08k58R5M70o13J57
$$ -160 -98 -83 35 -175 -199 95 165 507 318 133 70 -139 -82 50 -186 -221 -16 292 34 129 599 -14 143
2377A43k93J45j13k05M73k94J3K50K51l5j25l98L28k18l2j07K93m86L6L70QK64
$$ 143 -150 -5 -118 -323 150 -144 -131 119 370 335 210 -188 140 -78 -110 -217 76 -410 -374 -4 4 268
2399B68O4l03J73l12r5j10O0J76m34M22Q0M59j88j8j8j55j59R9l10P9L0L6M6j45
$$ 268 332 29 202 -110 -205 -315 -255 -79 -513 -91 -11 448 260 242 224 69 -90 9 -301 -222 -192 -156 -110 -255
2423b55R2M22K01m08L0j62J00j92j41Q1K15J61j14J54J50m60j50J89P2k89k6J86
$$ -255 -163 259 460 52 82 -80 20 -172 -313 -232 -17 144 30 184 334 -126 -276 -87 -15 -304 -330 -144
2445a44o6M22k39m0L42K03m09q5K6R5n76N58k30O1J25j02n0K91J66j14l37m8J67
$$ -144 -210 212 -27 -67 275 478 69 -16 10 105 -471 87 -143 -82 43 -59 -109 182 348 234 -103 -151 16
2468A6l03k82M45L9K76k21k9L49k9R6k90m84M33j47k40J52K2M8L12k9K42j7j5
$$ 16 -287 -569 -124 -85 191 -30 -59 290 261 357 67 -417 16 -131 -371 -219 -197 -149 163 134 376 359 344
2491C44l55l0j8l10N32O7k85k66N75k54p7L93l57M71l3n88j16M32j57j57M33j06
$$ 344 -11 -41 -59 -369 163 230 -55 -321 254 0 -77 316 -41 430 397 -191 -307 125 -32 -189 244 138
2513A38p8k0N5J1j55o5l08N37j80j55K08N65n53N9N05n75k60N10n78J58J53l16
$$ 138 60 40 95 106 -49 -114 -422 115 -65 -220 -12 553 0 59 564 -11 -271 239 -339 -181 -28 -344
2535c44J81L04m5m0K29m9l65J39r0l34K84K2n6M74k81k04L39K02k20J9M2m87L8
$$ -344 -163 141 96 56 285 236 -129 10 -80 -414 -130 -108 -164 310 29 -175 164 366 146 165 207 -280 -242
2558b42N4k75N04J7l44N30K04k00j40p2j87j29K05k6n02N52J55l50L41J61l54
$$ -242 -188 -463 41 58 -286 244 448 248 108 36 -151 -280 -75 -101 -603 -51 104 -246 95 256 -98
2579i8J45J1m34N2K90j19j03J83k82M85Q1l89J70L81n91r7L04l69QM53o0P7K86
$$ -98 47 58 -376 -324 -34 -153 -256 -73 -355 130 211 -178 -8 373 -218 -315 -11 -380 -372 81 21 98 384
2602C84m22k41Q54n07m03M71k3n90N12n4n8L00Jj41J12ro82O03K4k59m92J025
$$ 384 -38 -279 575 68 -335 136 113 -477 35 -19 -77 223 224 83 195 186 -496 107 131 -128 -620 405
2624D05o53n2N02k59R8K50l60k5M72m66m3J04q0l00N10K08O6q6l86m9K26N6n22
$$ 405 -248 -300 202 -57 41 291 -69 -94 378 -88 -131 -27 -107 -407 103 311 377 291 -95 -144 82 138 -384
2647c84L09K83p24N00L53p1j76K40l09J67r2k52p7K61k78l38R45j71l03M50r8
$$ -384 -75 208 -516 -16 337 266 90 330 21 188 96 -156 -233 28 -250 -588 357 186 -117 333 235
2668B35m44L62m23j50N53n72J50L05J88j76m9L13m23q4L14r2j27K86l92R3O63
$$ 235 -209 153 -270 -420 133 -439 -289 16 204 28 -21 292 -131 -215 99 7 -120 166 -226 -133 530
2689E30m82J95R8J5n08M52n70k39L09j28M14K9Nj37L60p2m34L83k36l31K21L83
$$ 530 48 243 341 356 -152 300 -270 -509 -200 -328 86 115 120 -17 343 271 -163 220 -16 -347 -126 257
2711B57m43P4N33m94J34M62n31j63L79p0m14L11K08o85K15J37N8O54n43j63K22
$$ 257 -186 -112 421 -73 61 523 -8 -171 208 138 -276 35 243 -442 -227 -90 -32 622 79 -84 138
2732A38J27m26o9L59o42K88M30k65k95M88n5L1L47o38M06j56K1q00Q91j59q7K25
$$ 138 265 -161 -230 129 -513 -225 205 -60 -355 133 78 109 456 -182 224 68 89 -711 180 21 -66 159
2754A59l2l39M30k79j11J32m24K16K97j60k81K83P52m80O3R3n27j13J7j30M81
$$ 159 127 -212 218 -61 -172 -40 -464 -248 49 -111 -392 -109 643 163 226 319 -208 -321 -304 -434 47
2775D7j88R3k05P44m02L7N6l7l14Q6J05j82O7n3j03L94J15l04M09k05l84L83q6
$$ 47 -141 -48 -253 491 89 126 182 145 -169 -83 22 -160 -93 -146 -249 145 260 -44 365 160 -224 159 73
2798G3j82l69K54J89J62J32k78K56m1p2l81K91j60L3J28l78L10J93l15m4L77l4
$$ 73 -109 -478 -224 -35 127 259 -19 237 196 124 -257 34 -126 -93 35 -343 -33 160 -155 -199 178 144
2820A44j68K18o1l01J25l91L75M9j88L31P9p7k06J72j00k31lK96j87l3K75p1j93
$$ 144 -24 194 133 -168 -43 -434 -59 -10 -198 133 212 135 -71 101 1 -230 -233 63 -124 -157 118 47 -146
2843a46K42j42K55o6k99N4Q0L58n77m5J79L41L2m3Rk53J93k23j26K31l17K51K05
$$ -146 96 -46 209 143 -156 -102 -22 336 -241 -286 -107 234 266 223 232 -21 172 -51 -177 54 -263 -12 193
2866A93P6m44J61J61J53k56J35j17J55m05Q1K39m5N3j29K03l48K22j52J37j95
$$ 193 269 -175 -14 147 300 44 179 62 217 -188 -107 132 87 140 11 214 -134 88 -64 73 -122
2887a22N2k6J4J45L5o0J53N3o3P2k44j83M30m26q4j2K98j26K59K64k20m31O05
$$ -122 -70 -96 -82 63 98 38 191 244 181 253 9 -174 256 -170 -254 -266 32 -94 165 429 209 -222 383
2910C83m22J91j71j32N3j18K10j20M82l70k2J50J28k61J14k64R3q8q5L60l5J75
$$ 383 -39 152 -19 -151 -98 -216 -6 -126 356 -14 -36 114 242 -19 95 -169 -76 -164 -249 111 76 251
2932B51l45K86J63p24K22L4J02j34K6pN01m22K6j60M50k84L20k08k09l05J04M28
$$ 251 -94 192 355 -369 -147 -113 -11 -145 -119 -126 375 -47 -21 -181 269 -15 305 97 -112 -417 -313 115
2954A15r2O9j26K03p7m6J41k9N0k22r2j09j77J70j68M92j45L97j37k47J00p2n40
$$ 115 23 92 -34 169 92 46 187 158 208 -14 -106 -215 -392 -222 -390 102 -43 354 217 -30 70 -2 -542
2977e42N71k44K32j62J85J55k57K31j75P4k94K86k5k80M44m41K47J17m2j63m3
$$ -542 29 -215 17 -145 40 195 -62 169 -6 68 -226 60 35 -245 199 -242 5 122 80 -83 -126
2998a26j22K35l4J28l70O0L31n9N4k07J81K26O0m45R6j68q1K04j52k7j53K42L16
$$ -126 -248 -13 -47 81 -289 -229 102 43 97 -110 71 297 357 -88 8 -160 -241 -37 -189 -216 -369 -127 189
3021A89J55l49M4n4n1j73J9K8N0Q8j03K1K70J29j90J37j76K22m45K22j76J05J40
$$ 189 344 -5 39 -15 -66 -239 -220 -192 -142 -54 -157 -136 134 263 73 210 34 256 -189 33 -143 -38 102
3044A02O1K1K41k54K18m72K78k69j22J0K69j29M7J90j42K31k86J53k09J37ok8
$$ 102 163 184 425 171 389 -83 195 -74 -196 -186 83 -46 1 191 49 280 -6 147 -62 75 69 41
3066D1J53k71J31j00L55n26R3K36j74o8k20M17J42l70K68j78J48J9r1LM1J63N
$$ 41 194 -77 54 -46 309 -217 -124 112 -62 -130 -350 67 209 -161 107 -71 77 96 5 8 49 212 217
3089B17k32r9m6j18m2N45k13k06L48m8r9k61K4O9J48O1%m17J34L49n4Q9m1J52
$$ 217 -15 -114 -160 -278 -320 225 12 -194 154 106 7 -254 -230 -161 -13 48 48 -369 -235 114 60 149 108 260
3113B60j65K36o91J06N38k48j60J54l2j8J81l53J55q2j16O6j35K78J18r6P9q5
$$ 260 95 331 -360 -254 284 36 -124 30 -2 -20 161 -192 -37 -119 -235 -169 -304 -26 92 -4 75 -10
3135a0k18L63k42K5K03l06J15o7k86M71jK04K30m96J91Q5L7l86p8K01j44J48j86
$$ -10 -228 135 -107 -82 121 -185 -70 -137 -423 48 47 251 481 -15 176 261 298 -88 -166 35 -109 39 -147
3158a47R6L13j76oL02o06J74l53M42m5L2q7N1j40L89k29j45n0L28M5j8j57l66
$$ -147 -51 262 86 80 382 -224 -50 -403 39 -6 26 -61 -10 -150 239 10 -135 -185 143 188 170 13 -353
3181c53L58k82J27L5J38PM2J17k73K30j61k81K09N9m81L67M80k87L9j2O6k89N7
$$ -353 5 -277 -150 -115 23 30 72 189 -84 146 -15 -296 -87 -28 -509 -142 338 51 90 78 144 -145 -88
3204h8j8j63K48p7m13K54M66l44J42NK8k51J14Q8J12j06r9n4J51p8L04M7l21l4
$$ -88 -106 -269 -21 -98 -511 -257 209 -135 7 12 40 -211 -97 -9 103 -3 -102 -156 -5 -83 221 268 -53 -87
3228h7J01k6k12L00k10K63J20l16L52k43K93n51K16K6J36j81J77j68p5J67n6M
$$ -87 14 -12 -224 76 -134 129 249 -67 285 42 335 -216 0 26 162 -19 158 -10 -85 82 26 30
3250C0K10k94l44O96n67M38k74j88L68j52j66L11l6K57m03K97l32L2J78j35N0
$$ 30 240 -54 -398 298 -269 169 -105 -293 75 -77 -243 68 32 289 -114 183 -149 -117 61 -74 -24
3271b4j67L17J37O2j68j53l80M00k08L00j29k15J77k2K53j52N8k68L82%q3P9k26
$$ -24 -191 126 263 325 157 4 -376 24 -184 116 -13 -228 -51 -73 180 28 86 -182 200 200 117 196 -30
3294c0q6K42r5J16p0j88K27J8J40n77O1K23k09K3J02K20R3j64K12l23J90J04m0
$$ -30 -116 126 31 147 77 -111 116 134 274 -303 -242 -19 -228 -205 -103 117 210 46 258 -65 125 229 189
3317A89n22J25J33J50J79m07k4K59l6J23M8j63j64L31j2l56m6J34m9J46K06j54
$$ 189 -333 -208 -75 75 254 -153 -177 82 46 169 217 54 -110 221 209 -147 -193 -59 -108 38 244 90
3339I0j96J33L1j37L81n64J4M89n40M38M57p85K42O6j40LK98m25J6J01k3oo1K90
$$ 90 -106 27 58 -79 302 -262 -248 241 -299 139 596 -189 53 119 -21 -18 280 -145 -129 -28 -51 -57 -118 172
3363A72k8K53j28l40qk7j71K12n2J66j50J46r7K41m9n02K94K40m50J31M72n60
$$ 172 144 397 269 -71 -79 -106 -277 -65 -117 49 -101 45 -52 189 140 -362 -68 172 -278 -147 325 -235
3385b35O6J02j06M92j07n3m77O80k03n08J54L23l29K70n2P2R7n5p9O6J40o72L87
$$ -235 -169 -67 -173 319 212 159 -318 362 159 -349 -195 128 -201 69 17 89 186 131 52 118 258 -414 -27
3408b7P2l01K92j22J2J90J24l01J44Jk12P0J24l42J64m5J21K67m1l6o4K72m85
$$ -27 45 -256 36 -86 -74 116 240 -61 83 84 -128 -58 66 -276 -112 -157 -36 231 190 154 90 362 -123
3431a23J46J88k14j27J08k6m4o6L08lm8p5k24K03J46m03K35J29k24J75k4J35q1
$$ -123 23 211 -3 -130 -22 -48 -92 -158 150 147 99 24 -200 3 149 -254 -19 110 -114 61 37 172 91
3454I1l3m2l30J46K24J6j75L30j64L83k35j37l27K89j73O0J61n1K0p0J43K1k13
$$ 91 58 16 -314 -168 56 72 -103 227 63 446 211 74 -253 36 -137 -77 84 33 53 -17 126 147 -66
3477f6N2K08K36l19k55r7K99l25n9M39k63J27q8J35K85k50K0K19k44l04L89o1
$$ -66 -14 194 430 111 -144 -241 58 -267 -326 113 -150 -23 -111 24 309 59 79 298 54 -250 139 78
3499G8K36l71l2J80j32M8K60l12L55m21K05k66J09j19K13m0L18j98J3j13r9J63
$$ 78 314 -57 -89 91 -41 7 267 -45 310 -111 94 -172 -63 -182 31 -9 309 111 124 11 -88 75
3521G5k06J49l94L19Q4k92J73J21J07p4r3K50m18L86Ok76J22j69J01Q1K11m5m32
$$ 75 -131 18 -376 -57 27 -265 -92 29 136 62 -31 219 -199 187 193 -83 39 -130 -29 52 263 218 -214
3544b14L01j3n3p1j9J18j10l9L26j24k28N17j73m11L25j63l8O0j51N45m78J07
$$ -214 87 74 21 -50 -69 49 -61 -100 226 102 -126 391 218 -193 132 -31 -69 -9 -160 385 -93 14
3566A4R3l87O11l61j9j07L7OrK69j27j25J16J55j46nkj74L9k18J5K23k6j29L17
$$ 14 107 -280 331 -30 -49 -156 -119 -113 -122 147 20 -105 11 166 20 15 13 -161 -122 -340 -325 -102 -128 -257 60
3591F0J77o7J05k11l25J84K43r5l29K63J64k18l5R1L3J8k4m6q9K11k34k51J32
$$ 60 237 170 275 64 -261 -77 166 71 -258 5 169 -49 -84 7 40 58 34 -12 -101 110 -124 -375 -243
3614b43l14O06j03Q7l9J26J08l90j14L08M1j12M1n0K07J1k73P0j4K07J0m24J27
$$ -243 -557 49 -54 33 -6 120 228 -162 -276 32 73 -39 2 -48 159 170 -103 -33 -47 160 170 -254 -127
3637a27K29k38J85j98L27r5j16n9M4Q6P9k06j97J7K81r9j23K08K36m13K24J36
$$ -127 102 -136 49 -149 178 83 -33 -92 -48 38 117 -89 -286 -269 12 -87 -210 -2 234 -179 45 181
3659A81j39n7J03l9j80K96n9l1MK81m43Q2j38M29k64J84l16j46N41k17J50Q5l45
$$ 181 42 -15 88 49 -131 165 106 75 79 360 -83 -1 -139 290 26 210 -106 -252 289 72 222 307 -38
3682c8J11%j48K24l77M05j74k38M05j15J85j29J86j84Q5j82j81N8j67K51l6l8
$$ -38 73 73 -75 149 -228 177 3 -235 170 55 240 111 297 113 198 16 -165 -107 -274 -23 -59 -97
3704i7M00k80K3pp7k4k91L86K70o60L01J97J1L0k00j34K10n0o5K56j86o3r8K58
$$ -97 303 23 46 39 -38 -62 -353 33 303 -357 -56 141 152 182 -18 -152 58 8 -57 199 13 -50 -148 110
3728A10o1oJ72m06K63l10L02p0j11J34j11j31p1L65J52k15J71k87N7J48j97n1
$$ 110 49 43 215 -191 72 -238 64 -6 -117 17 -94 -225 -296 69 221 6 177 -110 -53 95 -102 -153
3750a53n4L51pp2p3j68P2K54k87K95k54PqJ76l77M31k16J02J63l33l0O8J50N4
$$ -153 -207 144 137 65 -8 -176 -104 150 -137 158 -96 -89 -97 79 -298 133 -83 19 182 -151 -181 -113 37 91
3774I1L3N5J52l61k44K00J48q2J39j33K26R7J17l98j28L59n41J25Q8J25k29RM58
$$ 91 124 179 331 -30 -274 -74 74 -8 131 -2 224 321 438 40 -88 271 -270 -145 -57 68 -161 -152 306
3797C06o71Q06n30J10J02r4j47l2J97k31M62j03k18k1L05k80p2M3j19K86j75j24
$$ 306 -365 441 -89 21 123 29 -118 -150 47 -184 278 175 -43 -64 241 -39 -111 -68 -187 99 -76 -200
3819b00L14r0JK26l5k39j71oP8l38L98J62q5J33l94K48k05K52J9k10j80M00l95
$$ -200 114 24 25 251 216 -23 -194 -200 -122 -460 -62 100 15 148 -246 2 -203 49 68 -142 -322 78 -317
3842c17K68K44j60j70J62j22q0K2N5J97k59j91K19K52L6L7k43J12m2j42K25k01
$$ -317 -49 195 35 -135 27 -95 -175 -153 -98 99 -160 -351 -132 120 156 193 -50 62 20 -122 103 -98
3864i8M4K41k53R4r0P6o9J42j33N12l81L1j69K96p8p6L1l25L46Kr3j1oQ9J49k71
$$ -98 -54 187 -66 28 -62 14 -55 87 -46 466 85 116 -53 243 165 89 120 -205 141 143 50 39 33 122 271 0
3890@nj02O2N0P7j23J19qJ6P1l10J51M6J22l5P8p4k47K07m05M59L5j55n9j33J54
$$ 0 -5 -107 -45 5 82 -41 78 70 86 157 -153 -2 44 166 131 209 135 -112 95 -310 149 184 29 -30 -163 -9
3916iL14l55K18j5k43L08p2k25J64kM8j52l08K52J8L15l77J52q1M3q6J40J70j29
$$ -9 305 -50 168 153 -90 218 146 -79 85 83 131 -21 -329 -77 -59 256 -121 31 -50 -7 -93 47 217 88
3940H8R1k03j18l45O53l07L23j43J56p2K3L19n49K00k13K01j93J54j18K66o3k14
$$ 88 179 -24 -142 -487 166 -141 182 39 195 123 146 465 -84 116 -97 104 -89 65 -53 213 150 -64
3962f4L62j12l34J85k57R2R2k21K47q2K65j70L47k14q4K19j24j59o4L2P9J32m20
$$ -64 298 186 -148 37 -220 -128 -36 -257 -10 -92 173 3 350 136 52 271 147 -12 -76 -44 35 167 -253
3985b53J50L38J33k24p1j63J5l2l1L27n69O14ln6k04J56r6o5K0n5N3J2k0j20R8
$$ -253 -103 235 368 144 73 -90 -75 -107 -138 189 -380 234 231 175 -29 127 31 -34 -14 -69 -16 -4 -24 -144 -46
4010d6L21l67p1j6lJ32j74L02J8r9k86K68k61K70LL81n22Kn6J14QK47m6k63J60
$$ -46 275 -92 -163 -179 -182 -50 -224 78 96 -3 -289 -21 -282 -12 -9 372 -150 -148 -204 -90 -82 165 119 -144 16
4035A6P8j68PK73P2j82j37j18L8Q8K73l90Q7K95p2J58k12J17m0j58P7n7jj15R7
$$ 16 94 -74 -67 206 278 96 -41 -159 -121 -33 240 -150 -63 232 160 318 106 223 183 25 102 45 44 -71 26
4060B6k47P9L3K62l27J15l2J68j26k96K55k7L03k47K6J76l5k97O39m29r7k44L50
$$ 26 -221 -142 -109 153 -174 -59 -91 77 -49 -345 -90 -117 186 -61 -35 141 106 -191 448 19 -78 -322 28
4083B8M6k17j9j74J60j92O72k39k85K93J91k83r6K51K4j93J13j13q7K66lk8m12
$$ 28 74 -143 -162 -336 -176 -368 304 65 -220 73 264 -19 -115 136 160 -33 80 -33 -120 146 143 115 -297
4106b97j65L40j24L16k45M4j19J23N05l19j54K8k12K21J14K01J49o21L68j03O1
$$ -297 -462 -122 -246 70 -175 -131 -250 -127 378 59 -95 -67 -279 -58 56 257 406 -215 153 50 111
4127A11j0j79q4M9MK6J62j01j7J5K00r9J67l07l08K48M46n96N37n74K62J52K59
$$ 111 101 -78 -162 -113 -109 -83 79 -22 -39 -24 176 77 244 -63 -371 -123 323 -273 264 -310 -48 104 363
4150C63l53q5L10k53J04RJ35k78J54j01l37J57J46l7j67M34k31J22L6k41k06M65
$$ 363 10 -75 235 -18 86 95 230 -48 106 5 -332 -175 -29 -66 -233 201 -30 92 128 -113 -319 146
4172A46n2J14k68K07J19m09K30K61l30J11l7l87L54l3rO4L80k06j99j23m01L13
$$ 146 94 208 -60 147 266 -143 87 348 18 129 92 -295 59 26 17 81 461 255 56 -67 -468 -155
4194a55J07k44L39Q5k51j2J62M9J98l50K30k55K58P0l52K60m01K69r3P6KJ3l6
$$ -155 -48 -292 47 132 -119 -131 31 80 278 -72 158 -97 161 231 -121 139 -262 7 -86 -10 -8 5 -31
4217c1p4K05Q9j5j05m21L08j38O8K98k90J29L1N0l1K6q8k06J51q1Q7j00J15j53
$$ -31 -105 100 189 174 69 -352 -44 -182 -114 184 -106 23 54 104 73 99 11 -195 -44 -125 -38 -138 -23 -176
4241a76K90j6k1j1k6j34R1J15K00r7m32M99l33J88j06k32L68j57j9j21L14J2j32
$$ -176 114 98 77 66 40 -94 -3 112 312 215 -217 282 -51 137 31 -201 167 10 -9 -130 184 196 64
4264F4j18k08q2M31k2K9k65J5p4j2K12qK80j43Q0N6j43k75M3l33M79j08K13J16
$$ 64 -54 -262 -344 87 65 94 -171 -156 -230 -242 -30 -38 242 99 179 235 92 -183 -140 -473 6 -102 111 227
4288B27j74L12n9l16j42J90j44K19j15k14J48j42M9J47J39j88J97j64j12O4J77
$$ 227 53 365 306 -10 -152 38 -106 113 -2 -216 -68 -210 -161 -14 125 -63 134 -30 -142 -78 99
4309I9J0Q3p7q7j0j3K28k42J43kj02K05l72K8J03j48J4M12l34K5J29r7K23k94
$$ 99 109 192 115 28 18 5 233 -9 134 132 30 235 -137 -109 -6 -154 -140 272 -62 -37 92 -5 218 -76
4333g6k75N1L48p9O3J07p5n9J02n7J48%k14O0r7j75J20k21M01j5p4M7j61n5L09
$$ -76 -351 -300 48 -31 32 139 64 5 107 50 198 198 -16 44 -53 -228 -108 -329 72 57 -17 30 -131 -186 123
4358A23k92R6K15j30k08J43L2mK97j17R2l15J17j82k9K43kk28k06K15K61j05o2
$$ 123 -169 -73 142 12 -196 -53 -21 -25 272 155 247 -68 49 -133 -162 81 79 -149 -355 -140 121 16 -46
4381d6J46j6R9j55P7j9o4K17o9m40L0K58n0m4L31m14R3J82l13J35K2j43K69l3
$$ -46 100 84 183 28 105 86 22 239 170 -270 -240 18 -32 -76 255 -159 -66 116 -197 -62 -40 -183 86 53
4405E3J28l1j16Q4l75L75l60R9K48J26l93Q8J80j45J53j07m9J0j17P1P6L21n07
$$ 53 181 150 34 118 -257 118 -242 -143 105 231 -162 -74 106 -39 114 7 -42 -32 -149 -78 -2 319 -188
4428a88L09j3k17j07K47R9LJ12m90L70j35J12QPJ9n34L96l32L10j04j47j82P92
$$ -188 121 108 -109 -216 31 130 133 245 -245 125 -10 102 110 117 136 -398 -2 -334 -24 -128 -275 -457 335
4451C35m62n0J42l7j02K54j89o4L89o7j64j87K07n0R1j27K77J01m58K28q8L10
$$ 335 -127 -177 -35 -72 -174 80 -109 -173 216 149 -15 -202 5 -45 46 -81 196 297 -161 67 -21 289
4473B89k22l19M66p3O1j35l3J31j4r0K82p2j38j90o0K95j91l26J51L03k09L71
$$ 289 67 -252 214 141 202 67 34 165 151 61 343 271 133 -57 -117 178 -13 -339 -188 115 -94 277
4495B77j87o8L1m82L08j53L50p3jo7mk0L3J28O1k47K04j74J95O9j86m0J89m10
$$ 277 90 22 53 -429 -121 -274 76 3 2 -65 -69 -89 -56 72 133 -114 90 -84 111 180 -6 -46 143 -267
4519b67K26K45O2j50p1j51L16n66O00l47m8L39j43J05M5l87M4j62N96k98J47j5
$$ -267 -41 204 266 116 45 -106 210 -356 244 -103 -151 188 45 150 195 -192 -148 -310 286 -12 135 120
4541A20l06J89J83q0K16J3k82j45K01R1m86M73l75k26M82q1K23J18m65L26l0j90
$$ 120 -186 3 186 106 322 335 53 -92 109 200 -286 187 -188 -414 68 -13 210 328 -137 189 159 -31
4563c1M7J35j60Q2l6J03o1K7k1K93l30r6PO7J86o8j64l3J22K7J47j5j98k68J34
$$ -31 16 151 -9 73 37 140 79 106 85 378 48 -48 -41 26 212 144 -20 -53 69 96 243 228 30 -238 -104
4588a04L77q5m29K44j55N5M5K62k42J92P7l29r9J82P1R2j59J35k01K56j39K60
$$ -104 273 188 -241 3 -152 -97 -52 210 -32 160 237 -92 -191 -9 62 154 -5 130 -71 185 46 306
4610C06k82j06k22K19J41R9l07mj03K07O5k54N13j9l62J52Q8l3k08J02q6K02J8
$$ 306 24 -82 -304 -85 56 155 -152 -156 -259 -52 13 -241 272 253 -109 43 131 98 -110 -8 -94 108 126
4633A26j45n3J29J45l60K14O1r9j89oL90n7J1m27J21R7J69j38j31J45n0R5j16
$$ 126 -19 -72 57 202 -158 56 117 18 -171 -177 213 156 167 -260 -139 -42 127 -11 -142 3 -47 48 -68
4656f8J63j85K16n4M4m2K2j59J32j09l67J54K85j21J16k78L11j58n0L87k89L09
$$ -68 95 -90 126 72 116 74 96 -63 69 -40 -407 -253 32 -89 27 -251 60 -98 -148 239 -50 259
4678B59l77N4k14J96J59J83j17k60K46j16j91O7J29l30N51j18k45K28K7J72n58
$$ 259 -118 -64 -278 -82 77 260 143 -117 129 13 -178 -111 18 -312 239 121 -124 104 131 303 -255
4699b55M82l61J12j30j35M20l27L44k97J54kL9j45K39p9k85J3p0J09N08m19L63
$$ -255 227 -134 -22 -152 -287 133 -194 150 -147 7 5 44 -101 138 59 -226 -213 -283 -174 334 -85 278
4721B78k25q5j03R4J18k34r0L07j17m0rJ33j40J00J04o5L5j29L12m52L54k37J84
$$ 278 53 -32 -135 -41 77 -157 -247 60 -57 -97 -106 27 -113 -13 91 26 61 -68 244 -208 146 -91 93
4744I3l44K98Q0j67k38M3L42J50kj28j02l0l2l2m2J22K9J98j77r4K26l99J17j13
$$ 93 -251 47 127 -40 -278 -235 107 257 255 127 25 -5 -37 -69 -111 11 40 238 61 -33 193 -206 -89 -202
4768b02kK17o2K7J21j36qK82k32J5m3l2qO7M9J75j51o0j88J61J08j81J64j4n3
$$ -202 -204 13 -49 -22 99 -37 -45 237 5 20 -23 -55 -63 4 53 228 77 17 -171 -10 98 -83 81 67 14
4793A4k55J96p5J48m8J55k87L02j00J14k75j6Pl6N6Q2J3p7M38n81L64N8k50k1
$$ 14 -241 -45 -120 28 -20 135 -152 150 50 164 -111 -127 -120 -156 -100 -18 -5 -82 356 -225 139 197 -53 -74
4817g4k75J75k4K18l6j41k6m2O87n03lK17j81r4K07j70M8K63r8n8J22k65L12j78
$$ -74 -349 -174 -198 20 -16 -157 -183 -225 462 -41 -44 173 -8 -102 105 -65 -17 246 148 90 212 -53 259 81
4841H1p1J28k21J02k61J25J75j00K81J6l10J86m9j93J64r1J59R9l91J57m3j37
$$ 81 10 138 -83 19 -242 -117 58 -42 239 255 -55 131 82 -111 53 -38 121 220 -171 -14 -57 -194
4863a94J21K23j58L90m51p5j05K41q5K33l22L88j64k00N4k42K74j41J11j6l4J10
$$ -194 -73 150 -8 382 -69 -144 -249 -8 -93 140 -182 206 42 -158 -104 -346 -72 -213 -102 -118 -152 -42
4885d2P1o3K97k90Q4k26J87J57K3j93k97J91K18k89L42j55K90j43K56l93o4J36
$$ -42 29 -34 263 -27 57 -169 18 175 198 5 -292 -101 117 -172 170 15 305 162 418 25 -39 97
4907I7l3r2J32K37m96K88N8m75L41j34R6r5R5n6P4j46J8J45k10N84l86O5M0j15
$$ 97 64 -28 104 341 -155 133 191 -284 57 -77 19 -76 19 -37 37 -109 -91 54 -156 428 42 107 147 32
4931C2l58J87rJ93qp9m8K45k06J75m8K8j9l18J44K4R0j35L79m41J85l49K30J52
$$ 32 -326 -139 -148 45 37 -42 -90 155 -51 124 76 104 85 -233 -89 -65 25 -110 269 -172 13 -336 -106 46
4955D6l73K14K82k94K43K7j72q9L56l58K66np5k3o1j82L77j60k16J61l3j98K09
$$ 46 -327 -113 169 -125 118 145 -27 -116 240 -118 148 143 68 45 -16 -198 179 19 -197 -36 -69 -267 -58
4978e8K70k79k93M15j26L04k61Q2j3j4j67K52l61n6p5K62K27q9L22m54j53J57
$$ -58 212 -67 -360 55 -71 233 -28 54 41 27 -140 112 -249 -305 -380 -118 109 20 342 -112 -265 -108
5000a08p5J96j04L24j80J77j12n1j09r4j3N2J65m6J13j55K10l54L40k45k5J45
$$ -108 -183 13 -91 233 53 230 118 67 -42 -136 -149 -97 68 22 135 -20 190 -164 176 -69 -94 51
5022E1J38j84j34n1L44L3j33J30jk76J94k35o8J84M1l79J48J55RJ37n7j90Q7O3
$$ 51 189 5 -129 -180 164 197 64 194 193 -83 111 -124 -192 -8 33 -346 -198 -43 -34 103 46 -144 -57 6
5046FNp0L6K72k81q2J82K4j14K1l77K76J8J21jk10J98Q5r8Q4m01K66K96k73M5
$$ 6 11 -59 -23 249 -32 -114 68 92 -22 -1 -378 -102 -84 37 36 -174 24 109 11 95 -306 -40 256 -17 28
5071B8Lj11K88j67J33m0j3n8k61m5M80j55l17J24J5k46O02l44n1K22p6J80l58
$$ 28 31 -80 208 41 174 134 121 63 -198 -243 237 82 -235 -111 -96 -342 260 -84 -135 87 11 191 -167
5094a67L31j99K6q9K08l41K95j04p3J25K55k46K9n0j37L79k17r6M9j3j27n8O4
$$ -167 164 -35 -9 -98 110 -231 64 -40 -113 12 267 21 50 0 -137 242 25 -71 -22 -35 -162 -220 -156
5117a56L5K51L7j51J07j86l4L51j99j53o0K87j51m2o5r1L62Ml49j29N31k59K21
$$ -156 -121 130 167 16 123 -63 -97 254 55 -98 -158 129 -22 -64 -129 -220 142 146 -203 -332 199 -60 161
5140A61j91N3p7N2J89q7r9Pk73N73l20K22r5j16K81k71L2J68j21p3j64P4P5j67
$$ 161 -30 23 -54 -2 187 100 1 8 -265 308 -12 210 115 -1 280 9 41 209 88 15 -149 -75 0 -167
5164a67J27J42j65J7NL07j44k91J54L3o6K53j90K60l71Q3L50l27J27j12J29k35
$$ -167 -40 102 -63 -46 -41 266 122 -169 -15 18 -48 205 15 275 -96 -13 337 10 137 25 154 -81
5186h1J23k71L17j14N5M7L2j17j58N71l65j6K10k78k39J75q2K31k3j88L86K50
$$ -81 42 -229 88 -26 29 76 108 -9 -167 404 39 23 233 -45 -284 -109 -191 40 17 -171 215 465
5208D65n05p0J53j41j82J04L70k54J01p9K5J12J39m94J69j65K59j02K41j60m9
$$ 465 -40 -110 43 -98 -280 -176 194 -60 41 -38 -13 99 238 -256 -87 -252 7 -95 146 -14 -63
5229f3K25kk9Q5m2J4m48p3L91O4n2m02J32J80K05n0K66j23l47O5N0j82J88q6n
$$ -63 162 160 131 216 174 188 -260 -333 58 122 70 -332 -200 -20 185 135 401 278 -69 -4 46 -136 52 -34 -39
5254c9j79O6J52J74j5j51j05J84k66r9M97l37M73l77o8J50l0P7j56J08k53J22
$$ -39 -218 -152 0 174 159 8 -97 87 -179 -278 219 -118 355 -22 -90 60 30 107 -49 59 -194 -72
5276g2j12L15j41L8J06nJ2K2N2l16J50j86K32j79O5k43K08J99k88J21J82J94l27
$$ -72 -184 131 -10 28 134 129 141 163 215 -101 49 -137 95 -84 -19 -262 -54 145 -143 -22 160 354 27
5299B7l57M58R5l39N4R5k6J67k36j99N71k49r8J40p7m57J44N35k64j40L64l78
$$ 27 -330 128 223 -116 -62 33 7 174 -62 -261 310 61 -37 103 26 -431 -287 248 -16 -156 208 -170
5321a70q7M81m12N41l66m2j09N76l4j51l84J94l50M00o7o9L50l52K65r3j63Q5
$$ -170 -257 224 -188 353 -13 -55 -164 412 378 227 -157 37 -313 87 20 -49 301 -51 214 121 -42 43
5343D3J9j34K29m85M34l93L84r8K8j74J9K54j12J97r7j31J64j37J14m74M03j70
$$ 43 62 -72 157 -328 106 -287 97 -1 27 -147 -128 126 14 211 114 -17 147 10 124 -350 53 -117
5365a17J95l1k14J81j51O8L27j91J67p3l73J48J31k06K18l08N5J89j93J14J60
$$ -117 78 47 -167 14 -137 -69 258 67 234 161 -212 -64 67 -139 79 -229 -174 15 -178 -64 96
5386I6L5m06J50m8J53J37k98M47j93n7K28j07j98L96k22rk00k2k1K42J45o13M18
$$ 96 131 -275 -125 -173 -20 117 -181 266 73 16 244 137 -61 335 113 104 -96 -118 -139 103 248 -365 53
5409E3r5P9j69j90Q5J84J1j61R0m4o9M25m77N64n52M47j29m06L00l17L88j2K0
$$ 53 -42 37 -132 -322 -237 -53 -42 -203 -113 -157 -226 199 -278 286 -266 181 52 -354 -54 -371 17 5 25
5432B5O8k72K31r9P7k4J95p2k48k60K60K21l17O61o10K61j41j18L44q0Q8m41K42
$$ 25 93 -179 52 -47 30 6 201 129 -119 -379 -119 102 -215 446 -164 97 -44 -162 182 102 190 -251 -9
5455ik0o8l1O2k31L85q0J80k55k23J24O6J70r9l42M60m6q3N9k7J67j3l00J40q6
$$ -9 -29 -97 -128 -66 -297 88 8 188 -67 -290 -166 -100 70 -29 -371 89 43 -40 19 -8 159 146 -154 -14 -100
5480a00L37j45j34K95k98j81M89l20J76l4k39P3j15K72m04J45M97m57K42K19k35
$$ -100 237 92 -42 253 -45 -226 263 -57 119 85 -154 -81 -196 76 -328 -183 314 -143 99 318 83
5501H3m5l14j46N52k55Q6o7K51k14j84M03r1k12M06j63l3J8j97j01J83J02j33
$$ 83 38 -276 -422 130 -125 -39 -106 145 -69 -253 150 59 -153 253 90 57 75 -122 -223 -40 62 -71
5523g1P9n8K7M8l65K59J11J3J22l80QQ7K31j69J30o1M0j73j59L23k48J16k7M6
$$ -71 8 -50 -23 25 -340 -81 30 43 165 -215 -207 -120 111 -58 72 11 51 -122 -281 42 -206 -90 -117 -71
5547g1j13k9L23k56J91q7K72j75M1j01j40J62J11L4j68N7j63N3O6p7K51l80Q1
$$ -71 -184 -213 110 -146 45 -42 230 55 96 -5 -145 17 128 162 -6 51 -112 -59 7 -70 181 -199 -118
5570a18k4M2j69J80P6J7r8K54r3n9K00j71j35P9J55k62J01K74j97M55n54J4R2
$$ -118 -142 -100 -269 -89 -13 4 -94 160 67 8 208 37 -98 -19 136 -126 -25 249 52 507 -47 -33 59
5593E9m28K0J75R5J45j46L05j45j57L07m49J95L44k36k08K52M1j82J1N9j86K04
$$ 59 -369 -349 -174 -79 66 -80 225 80 -77 230 -219 -24 320 84 -124 128 169 -13 -2 57 -129 75
5615G5k33Q4J57L12n42J87j60N2J43j62J53j24J93R7j39o4l40M35l04QK55q5J47
$$ 75 -158 -74 83 395 -147 40 -120 -68 75 -87 66 -58 135 232 93 29 -311 124 -180 -172 83 -2 145
5638A45k47K88j14J84j40J19j83k0K99k98j03K60J9j2K76m10j68k48M22k6o7l2
$$ 145 -102 186 72 256 116 235 52 32 331 33 -70 190 209 197 473 63 -105 -353 69 43 -24 -56
5660e6PK48k11O4k63L38m49M32j42K37k15k81L68k30L04l48K89j87K62l4l54K19
$$ -56 -49 199 -12 52 -211 127 -322 110 -32 205 -10 -291 77 -153 151 -197 92 -95 167 133 -221 -2
5682bl5LQ0k1PM9j70L2K41J70k83j33O9j52K2J0K07J50m12P7J07J37k05J7r1J27
$$ -2 -37 -34 46 25 32 81 -89 -57 184 354 71 -62 7 -145 -123 -113 94 244 -168 -91 16 153 -52 -35 -126 1
5708AMk22J09L19o8o0l5L8Q8m33J66k19L13j64j14J54j69K71Q9p7L6L2j88J83
$$ 1 5 -217 -108 211 143 83 48 86 174 -259 -93 -312 1 -163 -277 -123 -292 -21 68 -9 27 59 -129 54
5732E4j55J15J74l97K17ql3k32L12Q2j16l55K31j91M15Q1k72J43k44L0K93j20
$$ 54 -101 14 188 -209 8 0 -33 -265 47 129 13 -342 -111 -302 113 194 -78 65 -179 -149 144 24
5754B4j16l2J45j02j35J98l92M46j21J72q1j38J47j89j24J68LK41j87P6OK02m60
$$ 24 -92 -124 21 -81 -216 -18 -410 36 -85 87 6 -132 15 -174 -298 -130 -127 114 -73 3 9 211 -249
5777b49j8L26pK6J0m2o8K14k17l10K66M12n58J51M80j44j29l27L71K46m33j3k03
$$ -249 -267 59 52 78 88 46 -22 192 -25 -335 -69 343 -215 -64 416 272 143 -184 187 433 0 -13 -216
5800b16L50k50K74k27K13q2k69L95m16K65p9Nr4K55N7k88L25k60K25k55L4M2m57
$$ -216 134 -116 158 -69 144 62 -207 188 -228 37 -42 -37 -131 124 181 -107 218 -42 183 -72 -38 4 -453
5823d53N13N1k70k12L74j00J13P5j03J16j05K44j88j47JjL5N2J08j61p7NK22j44
$$ -453 60 111 -159 -371 3 -97 16 91 -12 104 -1 243 55 -92 -91 -92 -57 -5 103 -58 -135 -130 92 -52
5847e2p5N3K93ll06K84l07J60l40L18K08k70L6n7J44J1k08L00k7j73O7J08n0j82
$$ -52 -127 -74 219 216 -90 194 -113 47 -293 25 233 -37 -1 -58 86 97 -111 189 162 -11 56 164 114 -68
5871f8m9p9L60l30N02l25O7j10k9j47M62l14J1M6%k73L36j0k5q1j64L65l74L55
$$ -68 -117 -196 164 -166 336 11 78 -32 -61 -208 254 -60 -49 -3 -3 -276 60 50 25 -56 -220 145 -229 126
5895A26J35j98N2J49l09J06j14K63J58j85q7J0j47M62n32k30K74o7J04m4R6K24
$$ 126 261 63 115 264 -45 61 -53 210 368 183 96 106 -41 421 -111 -341 -67 -134 -30 -74 22 246
5917B46j11k36j30O09L0l89J60J9k13K37l20J54M45m07j30j38K41l84M12k13r8
$$ 246 135 -101 -231 378 408 19 179 198 -15 222 -98 56 501 94 -36 -174 67 -317 95 -118 -216
5938b16J24L63j8j57o6j19L43k84K9J57j2j83k2k47K35j1L04n4k35J00J70O1k95
$$ -216 -92 271 253 96 30 -89 254 -30 -1 156 144 -39 -61 -308 -73 -84 220 166 -69 31 201 262 -33
5961c3J50J04k00j32L4J05K74k21O6j94K33k02Q3j45N2j43k2R4L31j03j22K35
$$ -33 117 221 21 -111 -77 28 302 81 147 -47 186 -16 67 -78 -26 -169 -191 -97 234 131 9 244
5983B44pl91O5j19l4O1L31k41P6r9K62r6N7M7N8k85J27j06K32m06P17q4p0k19
$$ 244 237 -154 -89 -208 -242 -181 150 -91 -15 -114 148 52 109 156 214 -71 56 -50 182 -224 493 409 339 120
6007A20K0k90L60N4j76k23M9J53j38K40l70M69k84K73n39J72L58k42j5j4l2K5
$$ 120 140 -150 210 264 88 -135 -86 67 -71 169 -201 268 -16 257 -282 -110 248 6 -9 -23 -55 -30
6029c0J24j1j50O5P4J04j43J8N6q0j52j1k9L02j49L36l18p5L83j26q2k65j72L86
$$ -30 94 83 -67 -2 72 176 33 51 107 27 -125 -136 -165 137 -12 324 6 -69 314 188 106 -159 -331 55
6053E5j60m6K25N7j95L30j54k97L02k82N23l91J24m51L80J90k40l3M1j34J89k03
$$ 55 -105 -151 74 131 -64 266 112 -185 117 -165 358 -33 91 -360 20 210 -30 -63 -22 -156 33 -170
6075a70J53J0k16N7L09k18K96j70K00l90J97k94J46j01K50Ljl06k9l7K34j59L23
$$ -170 -17 -7 -223 -166 143 -75 221 51 251 -139 58 -236 -90 -191 59 62 61 -245 -274 -311 -77 -236 87
6098H7J77m84M04m73N46n40L09m1k68N87j13j41P5J27j57j26l26K76K25n01L38
$$ 87 264 -220 184 -289 257 -283 26 -15 -283 304 191 50 125 252 95 -31 -357 -81 144 -357 -19
6119a9L70l16K10k59L46m91R5l9J82J13j83l5j42K4L8J68n7k8K16m90Q2K18jJ03
$$ -19 351 35 245 -14 332 -159 -64 -103 79 192 9 -26 -168 -144 -106 62 5 -23 193 -297 -215 3 2 105
6143A05k47J24L32l19j60l5K25M36n07o4R0N0j26K85k16Q3LK15l05j48K92m0k37
$$ 105 -142 -18 314 -5 -165 -200 25 461 -46 -110 -20 30 -96 189 -27 56 59 274 -31 -179 113 73 -164
6166a64o2j71M67L23k26k08j13N18n89J92K0L4rl23M46j13J0L12m12o1K77k04
$$ -164 -226 -397 70 393 167 -41 -154 364 -225 -33 -13 21 12 -311 135 22 32 344 -68 -129 148 -56
6188e6K48j47o9K45k73J67O5R3R4l50J13J12l0oj01j65r2J62l0j0J12j00j95J32
$$ -56 192 45 -24 221 -52 115 180 273 367 17 130 242 212 206 105 -60 -152 10 -20 -30 82 -18 -213 -81
6212h1lL4K5K65l61J00j12N26m30j9m1L11k11o3K09R9k54o3l37N72q3j24J23P6
$$ -81 -84 -50 -25 240 -121 -21 -133 393 -37 -56 -97 214 3 -60 149 248 -6 -69 -406 166 83 -41 82 158
6236A58k30J01k36J24L64l34J57j03k88O25q1j78j0k41K73k81J75j53L11k22K06
$$ 158 -72 29 -207 -83 281 -53 104 1 -287 338 257 79 69 -172 101 -180 -5 -158 153 -69 137
6257A37J53l61J92j10J18J10m06J46m72L29N0mM0J71k66J24j7J68J71k18k2j5
$$ 137 290 -71 121 11 129 239 -167 -21 -493 -164 -114 -118 -78 93 -173 -49 -66 102 273 55 33 18
6279A8k26M22j82p3lJ09mk72J33N0k51q0N68l29J12j29K28n6N9k06J20j37K37
$$ 18 -208 214 32 -41 -44 65 61 -211 -78 -28 -279 -359 209 -120 -8 -137 91 35 94 -112 8 -129 108
6302A08j20J04l01K90K7j69k05J86K44l69J40P6N3j2J31l67P9r7L17Jj09K6kj94
$$ 108 -12 92 -209 81 108 -61 -266 -80 164 -205 -65 11 64 52 183 -184 -105 -202 115 116 7 33 31 -163
6326a63L21k73N5K28j40j77L29j44q7Q7p5Q2k81K91J61k80n8Q7J31O3R7p2J03
$$ -163 158 -115 -60 168 28 -149 180 36 -51 36 -39 43 -238 53 214 -66 -124 -37 94 157 254 182 285
6349B85k06J36n9j82p7J57p9j53J56J80n5k29R0J5Q4k03j21K20K70k30J88n3l18
$$ 285 79 215 156 -26 -103 54 -25 -178 -22 158 103 -126 -36 -21 63 -140 -261 -41 229 -1 187 134 -184
6372a84K75o4n1J23j8k63J13Q5j97K67m39J24L56r9J78J97l86K11j14P0k94K03
$$ -184 91 27 -24 99 81 -182 -69 16 -181 86 -353 -229 127 28 206 403 17 228 114 184 -110 93
6394I3k67J66O8J90p0j41K10n18M54k3p9k43K66k78j42K79K77j96n7P5l1o0j15
$$ 93 -174 -8 60 250 180 39 249 -269 185 162 83 -160 106 -172 -314 -35 242 46 -11 64 33 -27 -142
6417a42M1J48j64L12M7l57K84L2l02J60R3o0K7k33o6p6M17k43R2J69J35k39l21
$$ -142 -101 47 -117 195 242 -115 169 201 -101 59 152 92 119 -114 -180 -256 161 -82 10 179 314 75 -246
6440b46K94rl89L05l0o9J76j21J5R9J5P2j67l7K08j65M6J40m3J18k62J19K6k2
$$ -246 48 39 -350 -45 -75 -144 32 -89 -74 25 40 112 -55 -92 116 -49 -3 137 94 212 -50 69 95 73
6464G3l5M0J39l90K89J20j5k10L24j6j78J2l38K81K89m02j58K60j57J18k35K74
$$ 73 38 78 217 -173 116 236 221 11 335 319 141 153 -185 96 385 -17 -175 85 -72 46 -189 85
6486H5M4pp2J00j78K81j5k29k33M26N6k22K43k79J48j11N6K67n48L70j74r2j19
$$ 85 129 122 50 150 -28 253 238 9 -224 202 258 36 279 0 148 37 93 360 -188 182 8 -84 -203
6509b03K16J37mj60K32M9k10K63o38N34j38K88l46j02K10L4o8r3K11l62L24l95
$$ -203 13 150 146 -14 218 267 57 320 -318 216 78 366 20 -82 128 162 94 1 212 -150 174 -221
6531b21J09L01k87l0J16R2k33K87k60K80k7j54r5m7P2J01m8nJ57q9m10J81N9o7
$$ -221 -112 189 -98 -128 -12 80 -153 134 -126 154 127 -27 -122 -169 -97 4 -44 -49 108 19 -391 -210 -151 -218
6555b18L61k44K53k51q3K22K91j79k68n3J83M4q3Q4j35J00j34L3P6J5MP6l5j53
$$ -218 143 -101 152 -99 -182 40 331 152 -116 -169 14 58 -25 59 -76 24 -110 -77 -1 14 18 94 59 -94
6579i4M84l09j44J35j22LJ01P5j52J44m15L82J78k98K0J72j39Q3j1k15J77K58
$$ -94 390 81 -63 72 -50 -47 54 129 -23 121 -294 88 266 -32 -12 160 21 104 93 -122 55 313
6601C13j81j64k35M46k87m1J14P1q5p9j53j00N08j7j8j19l96L13K75p0j02k35
$$ 313 132 -32 -267 179 -108 -149 -35 36 -49 -128 -281 -381 127 110 92 -27 -423 -110 165 95 -7 -242
6623b42K02O4j48M44k94M4k95J71Q8k83M82l55j9k3M7p3K21KJ27k13K44l66K01
$$ -242 -40 24 -124 320 26 70 -225 -54 34 -249 233 -122 -141 -164 -117 -190 31 33 160 -53 191 -175 26
6646B6Jn7m0K50j21k36J49L7J90l21J17q0J18P1l46L12M20m74O9k82L07m04j4
$$ 26 27 -30 -70 180 59 -177 -28 9 199 -122 -5 -85 33 104 -242 70 490 16 85 -197 110 -294 -308
6669c08J91K55n5k29Q8N4%J87j29l70J11J23J71j91J25l7j11J66M9r4K01k10Q5
$$ -308 -117 138 83 -146 -58 -4 -4 183 54 -316 -205 -82 89 -102 23 -14 -125 41 90 -4 197 -13 72
6692G2j79j24K28l44K67J25J77q7L23j94o8l03j03M19l45J08M0J00J90l56j56
$$ 72 -107 -231 -3 -347 -80 45 222 135 458 264 196 -107 -210 209 -136 -28 12 112 302 -54 -210
6713b10J80q4J55N8m7k1M8m3l3j59K06k73J81J91q6j86L9j71N26m74L77n3l94
$$ -210 -30 -114 41 99 52 31 79 36 3 -156 50 -223 -42 149 63 -123 -84 -255 271 -203 174 121 -273
6736b73M04k88P6K10j14m4Q6P1j25M7r3j8J76J79m16J53J0l8J7k52N07Rk05j49
$$ -273 131 -157 -81 129 15 -29 57 128 3 50 -43 -61 115 294 -122 31 41 3 20 -232 275 284 79 -70
6760g0J33qN8m74J99K34qK54k97M0M5j65Q5j91P2P7j09m0J33K3p4q0J54J16l56
$$ -70 63 55 113 -361 -162 72 64 318 21 61 106 -59 26 -165 -93 -16 -125 -165 -32 -9 -83 -163 -9 107 -249
6785b49L63j40j23L37L2j57K16l59r6M64n01L49j75J63l40L08j98k49K45Q8N8
$$ -249 114 -26 -149 188 220 63 279 -80 -176 288 -213 136 -39 124 -216 92 -106 -355 -110 -22 36
6806C6O8LJ96k76J52o0m56O20j61Rj60K7K99Q9k77l24J69k07L82j28j24L2KJ25
$$ 36 104 107 303 27 179 119 -337 283 122 131 -29 -2 297 386 109 -215 -46 -253 129 1 -123 -91 -89 36
6830C6l25M68k00k79p1O01j94k11J07k46K91M33k25j19R5J70n02K30j27J73k75
$$ 36 -289 179 -21 -300 -371 230 36 -175 -68 -314 -23 410 185 66 161 331 -171 59 -68 105 -170
6851a70J76k35J69O2J54n4J51j11l02M63n50M75k70M10l60j08J69q8j64P9J30
$$ -170 6 -229 -60 2 156 102 253 142 -160 303 -247 228 -42 368 8 -100 69 -19 -183 -104 26
6872B6j59K02l31K96m2l21L68j49q0Q5L63k30j69M51r5l90p5L30l06J29K16j86
$$ 26 -133 69 -262 34 -8 -329 39 -110 -190 -105 258 28 -141 310 215 -175 -250 80 -226 -97 119 -67
6894f7p7K03j7m6J5J90k2k33M6j7j58J42J34K67k25pK9k54M78l65K5r8l4o9J74
$$ -67 -144 59 42 -4 11 201 179 -54 -8 -25 -183 -41 93 360 135 128 157 -97 381 16 41 -57 -91 -160 14
6919A4J94j27K07l52o0O3K28J65m18N5l60L91J20k00m4L39J1j19k35J88j21j74
$$ 14 208 81 288 -64 -124 -61 167 332 -86 -31 -391 0 120 -80 -124 215 226 107 -128 60 -61 -235
6941b35m9N48j54j90k1N8J57l33J16J31L10l26q6J34j63p0m0N1K38R5M4j94q0
$$ -235 -284 264 110 -80 -101 -43 114 -219 -103 28 338 12 -74 60 -103 -173 -213 -162 76 171 215 21 -59
6964e9K68j16o3L91m48J70p9p0P4p4m1K07k82J16N3m00M52n9j16l07L04o0J78
$$ -59 209 93 30 421 -27 143 64 -6 68 -6 -47 160 -122 -6 47 -353 99 40 -76 -383 -79 -139 39
6987C9J57j08q8k6J36J60l36J52k71K23M20o80J17J42j28r5J39j96J82M92k20
$$ 39 196 88 0 -26 110 270 -66 86 -185 38 458 -222 -105 37 -91 -186 -47 -243 -61 431 211
7008B11l09K9J29K25l73K50k71R2q4L66l84K61k67K5K3R3j7J04l27K29M6J72j25
$$ 211 -98 -69 60 285 -88 162 -109 -17 -101 265 -119 142 -125 -100 -77 16 -1 103 -224 5 51 223 98
7031I8j78p3R0j4P1n6J72k80j83L51j14J97j47P0M2P0j27j0OJ09Q5l78J31K17
$$ 98 -80 -153 -63 -77 -6 -62 110 -170 -353 -2 -116 81 -66 4 46 116 -11 -21 -15 94 179 -199 -68 149
7055A49j19M5K07n06M34l36K17k32j28K21Q8k04K09N2q6L7R7J54j8k71n9J30k7
$$ 149 30 75 282 -224 210 -126 91 -141 -269 -48 40 -164 45 97 11 48 145 299 281 10 -49 81 54
7078E4o1m9K05p7K13l43R5J11O7k15m04N47j83j87J69j90L76k96M60o73K63K04
$$ 54 -7 -56 149 72 285 -58 37 148 215 0 -404 143 -40 -227 -58 -248 128 -168 292 -381 -118 86
7100H6r1k06J65J01m28K74J15k81K72J88r5J45k34j30J67k68KL81m99J08L65k55
$$ 86 -5 -211 -46 55 -373 -99 16 -265 7 195 100 245 11 -119 48 -220 -218 163 -336 -228 137 -118
7122a18N1R9L0k60m0oJ53J41j7M0K2k52K63j9j38q9K36k47K01j38l8J88r5K24
$$ -118 -67 32 62 -198 -238 -244 -91 50 33 73 95 -157 106 87 -51 -140 96 -151 50 -88 -126 62 -33 191
7146A91j34R6J17j85j87K79j64JK0j7k66M8J65L27m47L94Lk47M05m66j44J16J66
$$ 191 57 153 270 85 -102 177 13 14 34 17 -249 -201 -36 291 -156 238 241 -6 399 -67 -211 -95 71
7169G1J28j92k4J69j72J45j68rL06j15l00LJ85rJ14n6j29n1P7J6J37k32M79k39
$$ 71 199 7 -17 152 -20 125 -43 -52 254 139 -161 -158 27 18 132 76 -53 -104 -27 -11 126 -106 373 134
7193A34q7j41L16k45k94N80o00%K49K44O3k31n2J43j63k1j71M48k60p0l1L06p
$$ 134 47 -94 222 -23 -317 263 -337 -337 -88 156 219 -12 -64 79 -84 -105 -276 172 -88 -158 -189 117 110
7216A10k83j4L17kk21m9Q3j31J93k96J89k2M8Q4k38j07J64O1%L9k23K87J66R3
$$ 110 -173 -187 130 128 -93 -142 -59 -190 3 -293 -104 -126 -78 6 -232 -339 -175 -114 -114 -75 -298 -11 155 248
7240B48k79J13q1Q8l16M66Rk59L9k76L8K12J91k21n7K38k65L45k40j37o9k40N36
$$ 248 -31 82 1 89 -227 239 248 -11 28 -248 -210 2 193 -28 -85 153 -112 233 -7 -144 -213 -453 83
7263H3N5j29j35N20m66O0K50m80J27K46j98N5j38L82k18J46k95K17k65M18n46
$$ 83 138 9 -126 394 -72 -12 238 -242 -115 131 -67 -12 -150 232 14 160 -135 82 -183 235 -311
7284c11K80J40k66N6K25M6k34o6L16k04K40q1j68J37k18K48k6m0j07O3N1q9m9
$$ -311 -31 109 -157 -101 124 170 -64 -130 186 -18 222 141 -27 110 -108 140 114 74 -33 30 81 -8 -57
7307e7j02K34l14J85J11J9N2p3j76L41k58q9J72l5L7r2K27j63J03R2k16J86j85
$$ -57 -159 75 -239 -54 57 76 128 55 -121 220 -38 -127 45 10 47 -45 182 19 122 214 -2 184 -1
7330ak78L2L08k96L46Q8j33Q6O9l44J25k12L33k8j24J76q4P8l46K03Q1K75p4k44
$$ -1 -279 -247 61 -235 111 199 66 152 221 -123 2 -210 123 95 -29 147 63 141 -205 -2 79 354 280 36
7354C6m5QJ77k11k81N92l47Q9j79K39J25j96M8M9k49J59J4k61J89K1j03J89N0
$$ 36 -9 -1 176 -35 -316 276 -71 18 -161 78 203 7 55 104 -145 14 28 -233 -44 -23 -126 63 113
7377A13L1j77K89j19j44k4L9j18L45n39m7L41M7J9k07L44j99L16j75j18q6j45
$$ 113 144 -33 256 137 -7 -31 8 -110 235 -304 -351 -10 37 56 -151 193 -6 310 135 17 -69 -214
7399b14M8Q1K84j89J2L3K12l6p5k13K47m0j38jJ3m4q6O58l28k98J95J41o73L05
$$ -214 -166 -85 199 10 22 55 267 231 156 -57 190 150 12 11 24 -20 -106 552 224 -74 121 262 -411 -106
7423a06R0K55O1j75j3m04O85q2l11j09K05k06j18K50J17k21M53n10L5K65K04l28
$$ -106 -16 239 300 125 112 -292 393 311 0 -109 96 -110 -228 22 139 -82 371 -139 -104 161 365 37
7445C7j38K93o24O71o6k78K44l22K40k52K83r7K48n32M81j49rk25K80j14J88Q2
$$ 37 -101 192 -432 239 173 -105 139 -183 57 -195 88 -9 239 -293 188 39 30 -195 85 -29 159 241
7467B41l18K49J5n5P6j13r2K29j78O0j60L68r4l00L62l05j50j51L82J32m4N9j33
$$ 241 -77 172 187 132 208 95 3 232 54 114 -46 322 228 -72 290 -15 -165 -316 66 198 154 213 80
7490H0J20qj26N1q9j39j47L35J89m70L73J76m63L4R7J72P5l03k50L41L0l41M23
$$ 80 200 192 66 117 28 -111 -258 77 266 -204 169 345 -118 -84 13 185 260 -43 -293 48 78 -263 160
7513A60k15or8O29o76J95j5J37q7r4L1j34M80k35K13n21M32j53r2K37j23j78Q5
$$ 160 -55 -61 -159 470 -206 -11 -26 111 24 -70 -39 -173 307 72 285 -236 196 43 -49 188 65 -113 -28
7536b8J88q4J05p3j45N1l00N02k40rL32p95M24K08k86R7r2M56j78j97Q1K2k35
$$ -28 160 76 181 108 -37 14 -286 216 -24 -33 299 -496 -72 136 -150 -53 -145 311 133 -64 17 39 -196
7559a96M78j88q2j73L10o1j54J78r1K0K29j52j82J32P4j94J21j31K2k62J03L49
$$ -196 282 94 12 -161 149 88 -66 112 21 41 270 118 -64 68 142 -52 69 -62 -40 -302 -199 150
7581A50r7J3j3j80O6J00l31J66K67r2Pk8q0P6j08%J46j14K60m00o7K67j31l2J19
$$ 150 53 66 53 -127 -61 39 -292 -126 141 49 56 28 -52 24 -84 -84 62 -52 208 -192 -259 8 -123 -155 -36
7606c6J37j37l5J40l12K69j32N5kQ6K06m58L71p9K5l14K11k12J79j12L11J00l18
$$ -36 101 -36 -71 69 -243 26 -106 -51 -53 33 239 -219 152 73 98 -216 -5 -217 -38 -150 161 261 -57
7629e7N23o67L48o8J53o12K79J65m4m05K37K43q8k38J40J24j32o2j12L68r2j58
$$ -57 466 -201 147 79 232 -380 -101 64 20 -385 -148 95 7 -231 -91 33 -99 -161 -273 95 3 -155
7651a55Q1j12L21m3o1j4j4J24j77q4p4j0K22K29l70m2K08OJ39l30J90k95L54j40
$$ -155 -74 -186 135 92 31 17 3 127 -50 -134 -208 -218 4 233 -137 -179 29 35 174 -156 34 -261 93 -47
7675d7J13M1j74K38j40J06l41J27j05j3L07l2k06N2K0QK33j36J1K62m02K07j81
$$ -47 66 107 -67 171 31 137 -204 -77 -182 -195 112 80 -126 -74 -54 -46 187 51 62 324 -78 129 -52
7698e2l4j10J93j89K09J46l42J53J5Q3J07k46L53k78J7k23K94k14J69J06n29N94
$$ -52 -86 -196 -3 -192 17 163 -179 -26 -11 72 179 -67 286 8 25 -198 96 -118 51 157 -372 222
7720B22l39L17m24K58j90L13k63j64J30M1L43k04qk51J82QJ37j45J81l10L8J35
$$ 222 -117 200 -224 34 -156 157 -106 -270 -140 -99 244 40 32 -219 -37 -29 108 -37 144 -166 -128 7
7742GQ3J12k53J68j94M2P1q2k7o9l3K28j52J70k11N08m88J65Q3J94k01j73L15
$$ 7 90 202 -51 117 -77 -35 36 -46 -73 -142 -175 53 -99 71 -140 368 -120 45 128 322 121 -52 263
7765B63k86J56m1j25L06k45J78j60J39j05r7j53Q3k8O0K5K97k09l36M92k65nN2
$$ 263 -23 133 92 -33 273 28 206 46 185 80 -17 -170 -87 -115 -55 -30 267 58 -278 214 -51 -56 -4
7788dJ24m55M01j0N3J36l45J59K4J74k63J26l16j5J24r2O5K30r4J37j86J61j18
$$ -4 120 -335 66 56 109 245 -100 59 83 257 -6 120 -196 -211 -87 -179 -114 116 22 159 -27 134 16
7811A6o0k68L13Rk68L79p5K92j11p6k78J86P7m6q9j4r5k00KJ58J49L07k67L05
$$ 16 -44 -312 1 10 -258 121 46 338 227 151 -127 59 136 90 1 -13 -108 -308 -306 -148 1 308 41 346
7835C46n24K18o1j48K09m9l0J88o4j4M8K8q4J07k96j16M30k73j09J44L9L8k5p5
$$ 346 -178 40 -21 -169 40 -9 -39 149 85 71 119 147 63 170 -126 -242 188 -85 -194 -50 -11 27 2 -73
7859g3J7J10J00j42J78m29L39J39p7k12j63M0J16K27k34N5k5M3M4j59K38l3m16
$$ -73 -56 54 154 12 190 -239 100 239 162 -50 -213 -173 -57 170 -64 -9 -34 9 53 -106 132 99 -317
7882c17K89J7Q9KJ35O2l74K25j60Jq2J2K23j99J94l48J93M04k62J30n39L48k02
$$ -317 -28 -11 78 80 215 277 -97 128 -32 -31 -113 -101 122 -77 117 -231 -38 366 104 234 -305 43 -159
7905a59K51k65J41lK09k71k76M45k07l2p2l6M88p0R9n7k73Q8J85n31N31j79k04
$$ -159 92 -173 -32 -35 174 -97 -373 72 -135 -167 -239 -275 213 143 242 185 -88 0 185 -346 185 6 -198
7928a98J15P8K22l5k64J76J29l74M31k96j89J91K19k32K42j91l07O5J00Q1J79
$$ -198 -83 -5 217 182 -82 94 223 -151 280 -16 -205 -14 205 -27 215 24 -283 -218 -118 -37 142
7949A42l09K71m0j64J91k74J08k2L73m06k02L40j17J30p4l1K1R5l2lj05R5J90
$$ 142 -167 104 64 -100 91 -183 -75 -97 276 -130 -332 8 -109 21 -53 -84 -63 32 0 -3 -108 -13 177
7972A77k55l2M70l56J2q4Q0R4n68M44J86j42J17K8k96R1L58j32k69j82j44M40
$$ 177 -78 -110 360 4 16 -68 12 106 -462 -18 168 26 143 171 -125 -34 324 192 -77 -259 -403 37
7994C7j09J57l3j01jK31Pl63p8J87K38m76L45j08M3N4K34k15J4m2J38Mp0j37k79
$$ 37 -72 85 52 -49 -50 181 188 -175 -253 -66 172 -304 41 -67 -24 30 264 49 63 21 159 163 93 -44 -323
8019c23N69k53N5k57L27L4n18M65j86k06%O34l20n3R8l94K27R0j39J71K4k26K28
$$ -323 246 -7 48 -209 118 152 -366 99 -87 -293 -293 341 21 -32 66 -328 -101 -11 -150 21 45 -181 47
8042D7ll7n2k51K20J15k94J79j52N13n65K07J29J05k90j5Q0K83k86p5K62j95M2
$$ 47 44 7 -45 -296 -76 39 -255 -76 -228 285 -280 -73 56 161 -129 -144 -64 219 -67 -142 120 -75 -33
8065c3m3j13j69M44k55KM28l53o1q0M4M13mj72m7k96P16l80k26L00l70N6K90J40
$$ -33 -76 -189 -358 86 -169 -167 261 -92 -153 -233 -189 224 220 48 1 -295 421 41 -185 115 -255 -199 91 231
8089B31m75J57%J09m70M82K05l4Q9n06J47Q4k34P9L36j62j8P9j30J91j92J23k05
$$ 231 -244 -87 -87 22 -448 34 239 205 294 -212 -65 19 -215 -136 200 38 20 99 -31 160 -32 91 -114
8112a14l1J15P2n1J44j61O9p0J68j48J17l5oj31K49k92R0M10l78J82j49k78L41
$$ -114 -145 -30 42 -9 135 -26 43 -27 141 -7 110 75 69 -62 187 -105 -15 395 17 199 50 -228 113
8135A13k7j93K49O0j35k50J6L58k12J01k8p5K06J83k7k22k34m8r4J08M4K11l4
$$ 113 86 -107 142 202 67 -183 -167 191 -21 80 52 -23 183 366 339 117 -117 -165 -259 -151 -107 104 70
8158G0n2q2J42K1k81L59j78N2K17k07Kn9j45R0J30p3k39Q0L41k39K48l30J33k72
$$ 70 18 -64 78 99 -182 177 -1 51 268 61 63 4 -141 -51 79 6 -233 -153 188 -51 197 -133 0 -272
8182b72N15j37k63K10QJ42j5k49K70
$$ -272 243 106 -157 53 61 203 188 -61 209
8191B09
$$ Imaginary data points
##PAGE= N=2
##DATA TABLE= (X++(I..I)), XYDATA
0@%%%%%%%%Qj6J6j6K4l2L2m0N1n9P2q7J02j18J35j53J76k02K30k62K98l37L80
$$ 0 0 0 0 0 0 0 0 0 8 -8 8 -8 16 -16 16 -24 27 -32 40 -47 55 -63 72 -81 95 -107 123 -139 159 -178 202
31B02m28M77n33N97o66P41q25R18j016J124j244J378j527J689j872K079k314K585
$$ 202 -226 251 -282 315 -351 390 -435 483 -533 591 -653 725 -802 887 -985 1094 -1220 1365
49A365k897L261l696M228m891N745o892Q519j1028J5423k5252Q4049k4775j38721
$$ 1365 -1532 1729 -1967 2261 -2630 3115 -3777 4742 -6286 9137 -16115 67934 43159 -95562
63i5562J51842l2775q6838Q7993j2289o3237Q7405k9643m8715P9004j4259o2915
$$ -95562 56280 23505 -63333 24660 12371 -50866 36539 6896 -41819 37185 22926 -39989
75c9989N4538L065l7131K0606J63j0946K1861j4811j2328K2450L034j7090L962
$$ -39989 14549 17614 -19517 1089 1252 -9694 12167 -2644 -14972 7478 10512 -6578 -2616
88b616J4545o387k0252J5377J2150k3283K738J0981j2991J5942M641k4333K3395
$$ -2616 11929 5542 -14710 667 12817 -10466 -7728 3253 -9738 6204 10845 -13488 9907
101I907J0142m0449J5881K6215l7090j42K9826k0965n29K1118j9772O667K1752
$$ 9907 20049 -20400 -4519 21696 -15394 -15536 14290 -6675 -7204 13914 -5858 809 22561
114B2561l4119k932L6664k5612k0349L3415k539k1921J5242Q420n376K089p498
$$ 22561 -11558 -14490 22174 -3438 -23787 9628 7089 -14832 410 8830 3454 5543 -1955
127a955j434J1755j0346j1948J6554M091j5803L492J4351l520p484M099j46l013
$$ -1955 -3389 8366 -1980 -13928 2626 6717 -9086 -5594 8757 5237 -2247 1852 1706 -1307
141a307M036p063k875J7024r710j7461K4674L199k1208J4678M266j2327J0622
$$ -1307 2729 -4334 -7209 9815 105 -17356 7318 10517 -10691 3987 8253 -4074 6548
154F548q994q705K2860j2757j8645K6641R31j8343J6396K707j0639O621p178m921
$$ 6548 -2446 -11151 11709 -1048 -19693 6948 7879 -10464 5932 8639 -2000 4621 -2557 -7478
168g478J4547q755j1003J4407M835q142q68Q195K241j2619M67J0586r228k185
$$ -7478 7069 -1686 -12689 1718 6553 -1589 -2457 5738 7979 -4640 -4173 6413 -2815 -5000
182e000P359p718O018M182j4872J3916R434k1877P578J2289j9002M824Q739j4413
$$ -5000 2359 -5359 659 4841 -10031 3885 13319 -8558 -980 11309 -7693 -2869 5870 -8543
196h543O814N652j2527J2438O743j5286N578O072j1153K516J986n001M448q12
$$ -8543 -1729 3923 -8604 3834 10577 -4709 869 6941 -4212 -1696 290 -4711 -263 -1075
210a075k656O514J341l725n45K795J096q154M70R494q409l750R905m843n23P965
$$ -1075 -3731 2783 4124 399 -146 2649 3745 -4409 -3939 5555 -2854 -6604 3301 -1542 -2065 5900
226E900o752R54P896j2087j002J2595j0031o450J2166l746l560R054l622j549
$$ 5900 -852 102 7998 -4089 -5091 7504 -2527 -8977 3189 -557 -4117 4937 1315 -234
240b34P685q620l661J0650p225p176J0956k191n696Q745k42m016O018l500n243
$$ -234 7451 -1169 -4830 5820 -1405 -8581 2375 184 -5512 3233 2991 -1025 4993 1493 -3750
255c750O792k661o511P060j337m086O030q92r45N786n263j300M499m828j126L139
$$ -3750 3042 381 -6130 930 -407 -4493 1537 645 -300 5486 223 -1077 3422 -1406 -2532 607
271F07l166J325Q93j947N116n02l732M454j700l479L405k558j551L823l877J17
$$ 607 -2559 -1234 -341 -2288 2828 2326 -1406 3048 1348 -2131 1274 -1284 -2835 988 -2889 -2772
287b772O619m344O6O099n594r62M053n684O43L008n690K870L438k970K806J841
$$ -2772 3847 -497 -431 5668 74 -888 3165 -2519 -1876 1132 -4558 -1688 1750 -1220 1586 3427
303C427k849P30o13j865K90j599Q32P25n38K250O69l11J331j735j162J178j750
$$ 3427 578 1308 695 -1170 -880 -2479 -1647 -922 -1460 790 1459 1148 2479 744 -418 760 -990
320i90o47J595k107L66K566j637J286K288k544Q07O37k452J131j064j536K095
$$ -990 -1637 -42 -2149 -1783 783 -854 432 2720 176 983 1620 -832 299 -765 -2301 -206
336b06j800q2M389j624j37K860l353N02Q67m158J613N35k939M057j26j840M708
$$ -206 -2006 -2088 2301 677 540 3400 47 549 1416 -2742 -1129 -594 -3533 524 398 -1442 3266
353C266j369k791L582k420l098L808k391j892M163j258p03L932j763r83K076j987
$$ 3266 1897 -894 2688 268 -2830 978 -1413 -3305 858 -400 -1103 2829 1066 83 2159 172
369A72j408K359k713P2J402j393P95J528m7M07j2j18j58q53k53j115k32P03o37
$$ 172 -1236 1123 -1590 -1518 -116 -1509 -714 814 767 1174 1162 1044 886 33 -220 -1335 -1567 -864 -1501
388a501J379J650p35R10J13j553K38l87j879P16Q5m91J325O18K82O03l87K17o12
$$ -1501 -122 1528 793 1703 1816 263 501 114 -1765 -1049 -964 -1455 -130 488 770 1373 986 1203 591
407E91j258O09m92j836K162m3j362L024l19j603L337j985k099L165k766j549L004
$$ 591 -667 -58 -550 -2386 -224 -267 -1629 1395 1076 -527 2810 825 -1274 1891 -875 -2424 580
424E80k862O29L315k192J281K139k997O36J351l445J306M05k395J229J143j212
$$ 580 -2282 -1653 1662 -530 751 2890 -107 529 1880 -1565 -259 146 -2249 -1020 123 -1089
440a089K157M09j213J777j057j747R95j414n77J017k00M14J602o01J009J30j258
$$ -1089 1068 1477 264 2041 984 -763 232 -1182 -1759 -742 -942 -528 1074 473 1482 1612 354
457C54M0p00r50P41p22k29J239K57M09QR43k69j199Q64o82j711J429o35p03K273
$$ 354 394 -306 -1256 -515 -1237 -1466 -227 30 439 447 1390 1121 -78 786 104 -1607 -178 -813 -1516 757
477G57q02j562M024p84k496K998j507k571K789k106j616L545j418j163N088k307
$$ 757 -45 -1607 2417 1633 -863 2135 628 -1943 846 -1260 -2876 669 -749 -1912 3176 869
493H69j014L031k797p64J533k977Q13J804k612K311J618j858J659q26n70J024
$$ 869 -145 2886 89 -675 858 -2119 -1306 498 -2114 197 1815 -43 1616 790 220 1244
509A244k395M6J527k278O75K154k284K483Q08l480L426O51n363L239J117m808
$$ 1244 -1151 -1105 422 -1856 -1181 973 -1311 1172 1980 -1500 1926 2577 -2786 453 1570 -3238
525c238K381J819l284L151J002l659M247K30n132K717J373m062Q49J860j419P55
$$ -3238 -857 962 -2322 829 1831 -1828 2419 2649 -2483 234 1607 -2455 -1606 254 -1165 -410
541d10J173p96J274J142k676n17K829k532k530L075M23k459K340J186j811K111
$$ -410 763 -33 1241 2383 -293 -810 2019 -513 -3043 32 455 -2004 336 1522 -289 1822
557A822m33k565K309j43m339K281K477l769R41L766j994n7J609k201L49J897m330
$$ 1822 1389 -1176 1133 990 -3349 -1068 1409 -2360 -1419 2347 353 296 1905 -296 53 1950 -2380
574b380l98M728k786k862N974r76l439M045k7k859K980k354k086M432k781l473
$$ -2380 -2778 1950 -836 -3698 2276 1300 -2139 1906 1879 -980 2000 -354 -2440 1992 -789 -4262
590d262N500K20l499K585K369k165p48L62j009l4K69j726O77L868l066j671N467
$$ -4262 1238 1458 -2041 544 2913 748 0 362 -647 -681 -412 -2138 -1461 2407 -659 -2330 3137
607C137l97n111L426J081m875K965p47k953N466j020n509P914N01p687N305J611
$$ 3137 2740 -2371 1055 2136 -2739 226 -521 -3474 1992 972 -4537 3377 3878 -3809 1496 3107
623C107n578K682k91l198M784j451l725O237M92m773J752K396k244j766O83J259
$$ 3107 -2471 211 -80 -3278 1506 55 -3670 2567 3059 -1714 38 2434 190 -1576 -893 366
639C66r56r73J406K45J310j94k837L394J696p235J929N775o689k94N818m438P96
$$ 366 -590 -1563 -157 88 1398 1204 -1633 1761 3457 -3778 -1849 3926 -2763 -3057 2761 -1677 -881
656h81M234n874L011N350r690J670P501p845j645O752l665o49M226l400R31M281
$$ -881 3353 -2521 490 5840 -3850 -2180 5321 -2524 -4169 2583 -1082 -1731 2495 -905 26 4307
672D307n753j144O527m509m805O086O20l487K069J345j068J395p86k209K861K
$$ 4307 -1446 -2590 3937 -572 -5377 709 1329 -2158 -89 1256 188 1583 797 -1412 1449 1451
688A451n122J929M970m178k722O332q61l165K637j19j384K234l257k749O984k806
$$ 1451 -3671 -1742 3228 -950 -3672 2660 1799 -1366 1271 1152 -232 2002 -1255 -4004 2980 174
704A74n924P662K706q414M371L129n224K635jn438N999m9p344N944M199p671K461
$$ 174 -5750 1912 4618 -3796 575 3704 -1520 1115 1114 -4324 1675 1626 -5718 226 4425 -3246 -785
721g85N015m662L45J432l237J929J337n379K945M009l983j280N001j12l936J380
$$ -785 4230 -432 -87 1345 -1892 37 1374 -4005 -1060 2949 -1034 -2314 2687 2575 -1361 19
737A9J801k560l70Q28j755K626J341n064M068M617p790N89N543n408r94M041l368
$$ 19 1820 -740 -1110 -282 -2037 589 1930 -3134 934 5551 -2239 -1650 3893 -1515 -2509 1532 -1836
754a836J388K374m693K834M812o561l69N974l804k896L104l09j385J084p78J152
$$ -1836 -448 1926 -2767 67 4879 -1682 -2051 3923 119 -2777 327 18 -1367 -283 -1061 91
770I1J663j294j244K402Q81m537M17L589k987k147L852p37n77L074k762L20M062
$$ 91 1754 460 -784 1618 2499 -2038 -1621 1968 -1019 -3166 686 -51 -628 2446 -316 4 4066
787D066n034j828O105l699l719N199k71k410K906q79q32L610l215k477M573j489
$$ 4066 -968 -2796 3309 -390 -4109 1090 819 -1591 1315 436 -396 3214 -1 -2478 2095 606
803F06m450L574J735l010J011J796m36M02m71j358J094P14l264K40L544k223k239
$$ 606 -3844 -270 1465 -1545 -534 1262 826 1228 757 -601 493 1207 -2057 -1817 1727 -496 -2735
820b735M118J50k275J573L33j512O70m48k158K697K40l645L105K893m478J338
$$ -2735 1383 1533 -742 831 1164 -348 322 -126 -2284 413 653 -2992 113 3006 -1472 -134
836a34K876l289L14J632l970J830J825m176K114L977m016J9L914k392j398K137
$$ -134 2742 -547 -233 1399 -2571 -741 1084 -3092 -978 2999 -1017 -998 2916 524 -874 1263
852A263k637K28J991k930J349K706k594l62K625k16j626K17O89p41r14M45K95
$$ 1263 -1374 -1146 845 -2085 -736 1970 -624 -986 1639 1423 -203 14 703 -38 -952 -507 -212
869b12o78J818j251j37L542k679j521L473k024l108L369j111j542L254j457j254
$$ -212 -890 928 -323 -460 3082 403 -1118 2355 331 -2777 592 -519 -2061 1193 -264 -1518
885a518M368j993k285L674j922k611K697r61j328K581j088k65K082q43q11J366
$$ -1518 2850 857 -1428 2246 324 -2287 410 -551 -1879 702 -386 -651 1431 588 -223 1143
901A143o54q83k66L66p9o81Q36O74n97P72Q1o06R78n20k113J651K21k372J594
$$ 1143 489 -394 -660 -294 -373 -1054 -218 456 -141 631 712 106 1084 564 -1549 102 323 -2049 -455
920d55J312j953J541P92j559J470k98j657J101p7k223J693M81q84J160J10l44
$$ -455 857 -1096 445 1237 -322 1148 850 -807 294 217 -2006 -313 168 -716 444 554 210
937B10Q26o98k10r0k47m56j49O80j09k74O64M32J38n05P62p17p55L00k38n98P27
$$ 210 1036 338 128 38 -209 -665 -814 -134 -243 -517 147 579 717 212 974 257 -498 -198 -436 -1034 -307
958c07N8l44J869l51j122J321n33j041R12o13j102J056j00o86J995m06p36J656
$$ -307 -249 -593 1276 925 -197 1124 591 -450 462 -151 -1253 -197 -297 -983 1012 606 -130 1526
976A526p61j010Q67j013q48J195r92J13J476j203R04J135j334N67r6j701J099
$$ 1526 765 -245 622 -391 -1239 -44 -1036 -923 553 -650 254 1389 55 622 526 -1175 -76
993g6j54j332J319l28j57J360j10l80J188r62r19J223j296k99J186j136K74J516
$$ -76 -230 -1562 -243 -571 -728 632 522 142 1330 368 -551 672 -624 -923 263 -873 -599 917
1011I17j322R65P75j731P94M38k218J276r8j326J624j10m93J462j88q98J035l86
$$ 917 -405 560 1335 -396 398 836 -1382 -106 -204 -1530 94 -16 -509 953 765 -133 902 516
1029E16j257P67q49k54N26L8l1J298n35J62P11q36m58L93p86J33L38p67J068P4
$$ 516 -741 26 -823 -1077 -551 -513 -544 754 219 381 1092 256 -202 191 -595 -462 -124 -891 177 251
1049B51l41P53l22K09J08r73n65P02n60K52L1K70J19N23O6l1R2l89n79R1k67m75
$$ 251 -90 663 341 550 658 -315 -880 -178 -738 -486 -455 -185 -66 457 523 492 584 195 -384 -293 -560 -1035
1071a035N53N7J27R74k56o2O01n90o77L35n74m23L65J77J15M32K65o4N19n45j73
$$ -1035 -482 -425 -298 676 420 358 959 369 -308 27 -547 -970 -605 -428 -313 119 384 320 839 294 121
1092A21K74n92m23L53m17M47j57K05Q20j36j43L40m42m01J38q99L29M21p59J299
$$ 121 395 -197 -620 -267 -684 -237 -394 -189 631 495 352 692 250 -151 -13 -912 -583 -162 -921 378
1112C78J02m57P11j51k79R5j41r73K29k9j55O05K19O5K68m6r0J21l54o01K21k53
$$ 378 480 23 734 583 304 399 258 -715 -486 -515 -670 -65 154 219 487 441 351 472 118 -483 -262 -515
1134e15R0m6L43Q56n00j22J023o16k44P6j184M71K69r24L63J319q91L35Q74m89
$$ -515 -425 -471 -128 728 228 106 1129 513 269 345 -839 -368 -99 -1023 -660 659 -232 103 977 488
1154D88n9J57n29m58J63n66K18Q86k25k99P87M82q64J99p9m65j73J83q56M51J112
$$ 488 429 586 57 -401 -238 -804 -586 300 75 -224 563 1045 181 380 301 -164 -337 -154 -1010 -559 553
1175E53q47P26J043j293k93J205j369m14Q03q45R0N36n31N93J196n92o16R75m01
$$ 553 -294 432 1475 182 -111 1094 -275 -689 114 -731 -641 -105 -636 -43 1153 561 -55 920 519
1194E19p57l9K60q95N99M8L7O30p2l78O86P13k065J28J159j445n07J572m59P0
$$ 519 -238 -277 -17 -912 -313 -265 -228 402 330 -48 638 1351 -714 -586 573 -872 -1379 193 -266 -196
1214a96J112j192N51J421j707n13J547j593r50J970p10l97J175k06J33Q58j017
$$ -196 916 -276 275 1696 -11 -524 1023 -570 -1520 450 -260 -657 518 312 445 1303 286
1231B86q10R25p0j469M24J004j047L69J344n54k5M45q70J70Q31j748l11J991j160
$$ 286 -524 401 331 -1138 -714 290 -757 -388 956 402 377 822 -48 122 953 -795 -1106 885 -275
1250b75j059J857M48j276Q49J10j136R59o57q38J133R8j575J020J420j587N91
$$ -275 -1334 523 971 -305 544 654 -482 477 -180 -1018 115 213 -1362 -342 1078 -509 82
1267H2J173j269L23K44j801J060P17j894M10K172j426m74J839n37q59N43l08m11
$$ 82 1255 -14 309 553 -1248 -188 529 -1365 -955 1217 -209 -683 1156 619 -240 303 -5 -416
1285d16N80j057k98J788k12j243J523R22j975K51J307j454l85O81p93M15J302
$$ -416 164 -893 -1191 597 385 -858 665 1587 -388 -137 1170 -284 -669 12 -781 -366 936
1302I36j508K76K461k295p90K576j419j582J646o84p85J642j129J02K384j367
$$ 936 -572 -296 2165 -130 -920 1656 237 -1345 301 -383 -1168 474 -655 -553 1831 464
1318D64j417K334n24k044R66N29j132L66N51m49J026K53j543J217J072k147o87
$$ 464 -953 1381 857 -1187 -221 308 -824 -458 93 -356 670 923 -620 597 1669 -478 -1165
1335a165K025q58k117K130L15j224J902o17n36J853j675j646K718n65k580K128
$$ -1165 860 2 -2115 15 330 -894 1008 391 -145 1708 33 -1613 1105 540 -2040 88
1351H8Q07j827J014P69r96J158l43j865J628M76k845J059J797j360jJ221p40N5
$$ 88 895 -932 82 851 -145 1013 670 -1195 433 909 -1936 -877 920 -440 -441 780 40 95
1369I5Q23q56l50J057j071j468K348k90j805J588J055j371K89O75j050M58Nj642
$$ 95 918 62 -288 769 -302 -1770 578 288 -1517 71 1126 -245 44 719 -331 127 132 -1510
1387a510J651O45k507J273K056j783m05K151j567m31Q11j203J12J619k126K49
$$ -1510 141 786 -1721 -448 1608 -175 -580 1571 4 -427 384 -819 -707 912 -1214 -965
1403i65K888j761j045K589q75j478J039k29o59P26j187k19J814j78j406J411J154
$$ -965 1923 162 -883 1706 831 -647 392 163 -496 230 -957 -1176 638 460 -946 465 1619
1420A619j642o28J239o05r38M17M17n04J376j196j22K092q56j788K287j35k441
$$ 1619 -23 -651 588 -17 -955 -538 -121 -625 751 -445 -567 1525 669 -1119 1168 1033 -1408
1437a408J736Q5j559J215j17r23K298k03k339K015K53k652J235M68p18M81K30
$$ -1408 328 413 -1146 69 -48 -971 1327 1124 -1215 800 1053 -1599 -364 104 -614 -133 97
1454I7o84J184J68j177P74N17j086o87J089k01j021N96J051p76L57L63o21P98
$$ 97 -587 597 765 -412 362 879 -207 -894 195 -6 -1027 -431 620 -156 201 564 -57 741
1472G41l79j326J001P96k184N10J641j565M98J236q19M5R39k288J135J019k477
$$ 741 362 -964 37 833 -1351 -841 800 -765 -267 969 150 195 1134 -1154 -19 1000 -1477
1489a477L79J703r81m2J325o51o9O14r50l24J153j177j39N95l1p30O26Q77n45
$$ -1477 -1098 605 -376 -418 907 256 187 801 -149 -473 680 -497 -636 -41 -72 -802 -176 701 156
1508A56J72M2m04O8l3n15K15L68l96m15J373m39o16J399j72j223O73m77p80J112
$$ 156 328 370 -34 34 1 -514 -299 69 -327 -742 631 192 -424 975 803 -420 253 -224 -1004 108
1528A08k39p26J489J61j275J104O3p12K55m4j293J186k49o51J129N4r90J026L86
$$ 108 -131 -857 632 793 -482 622 685 -27 228 184 -1109 77 -172 -823 306 360 -630 396 782
1547G82n75k8p7l64J0j7q0J79j63N56l12N03J65n46k85N08o78k78R78n78j14O14
$$ 782 207 179 102 -262 -252 -269 -349 -170 -333 223 -89 414 579 33 -252 256 -422 -700 278 -300 -414 200
1569B00m57M45P57r64l0O45p04m18O16o06o4O58p01P36Q67j191L30L42p25p1K17
$$ 200 -257 188 945 -19 -49 596 -108 -526 90 -516 -580 78 -623 113 980 -211 119 461 -264 -335 -118
1590a18n00L47L3K04M27k37R8J97m0k99N2o19K85J4m99N01K96m84O83Lo22O59
$$ -118 -618 -271 -238 -34 393 156 254 451 411 112 164 -455 -170 -156 -655 -154 142 -342 341 344 -278 381
1612C81l96n07K97Mm69O24M6m88P71K16m41L17j46n12M85l65o46J036l69m46P87
$$ 381 -15 -522 -225 -221 -690 -66 -20 -508 263 479 38 355 209 -303 182 -183 -829 207 -162 -608 179
1633A79Q7O7r6k86J98j69R8o5l10j42N90j60lL26or3K70l32k78K9n01J24L70p0
$$ 179 266 333 237 -49 149 -20 78 13 -297 -439 151 -9 -12 314 308 215 485 153 -125 -96 -597 -473 -103 -173
1657a73j4L48o4J27O17m64n17L17l31k00L92n10L72M85m97L41K36j83k26J94n35
$$ -173 -187 161 97 224 841 377 -140 177 -154 -354 38 -472 -100 385 -112 229 465 282 56 250 -285
1678b85K74j04n93P24P8o3M39j43k5J04l33k94J25j79m21O14RJ75p8J4M06Kj58
$$ -285 -11 -115 -708 16 94 31 470 327 302 406 73 -221 -96 -275 -696 -82 -73 102 24 38 444 446 288
1701B88k90L5n85L08K8m31N98K61n2N05o2m21p9J41n33K2q5J6J30m6M4M58k14
$$ 288 -2 33 -552 -244 -216 -647 -49 212 160 665 603 182 103 244 -289 -267 -352 -336 -206 -252 -208 250 36
1724C6L28k9k09lk28j31J19k91L89K74n7k30N35l28n1l9k85K22k05k48K56J83
$$ 36 364 335 126 123 -105 -236 -117 -408 -19 255 198 -32 503 175 124 85 -200 22 -183 -431 -175 8
1746HmL07l8m4j7J43R5k91o10J33j58M51j46N1O48j59j65M26m68l93J55q7k44
$$ 8 4 311 273 229 212 355 450 159 -451 -318 -476 -25 -171 -120 528 369 204 630 162 -231 -76 -163 -407
1769d07K07j91N36P8n1J56k8k96k04K44m6m46Q9j77J38L86n2N52r1j27J1k91k93
$$ -407 -200 -391 145 223 172 328 300 4 -200 44 -2 -448 -359 -536 -398 -12 -64 488 397 270 281 -10 -303
1792c03J43n28Q37m80M1M50p1j83L65K83o84L21l39n36O36j16P7J73p6JL31k67
$$ -303 -160 -688 149 -331 -290 160 89 -94 271 554 -130 191 -148 -684 -48 -164 -87 86 10 11 342 75
1814G5K93l5l33k74K88l38k58L36N71j36j32K86k43R1R6m90j48J20J50k88N18
$$ 75 368 333 0 -274 14 -324 -582 -246 325 189 57 343 100 191 287 -203 -351 -231 -81 -369 149
1835A49K18l05K64O5k22O9o5j90l8j86k73L97J57j80N45J21o55M50J08n94l18
$$ 149 367 62 326 391 169 238 173 -17 -55 -241 -514 -117 40 -140 405 526 -129 321 429 -165 -483
1856d83N09m77K64K61k06K02P29m99n65Q35k95q49P94n1n80P11l15k73M90J98
$$ -483 26 -451 -187 74 -132 70 799 300 -265 570 275 -574 220 169 -411 300 -15 -288 202 400
1876D00o33Q28k17o96O8M77n94MM15l43J33M88l64R1O71o47n1J28j2r39P34K08
$$ 400 -233 595 378 -318 -250 227 -367 -363 52 -291 -158 330 -34 57 728 81 30 158 146 -793 -59 149
1898A49k86K72N50o03L54k12m64M95j95q03L49P71p13N06K17j41j27L95n13q1
$$ 149 -137 135 685 82 436 224 -240 255 60 -743 -394 377 -336 170 387 246 119 514 1 -80
1918h0k6l22j78N40m2k62Q52L3l52M81k63o68L01j07n91P03L6r82Q76O04m27K24
$$ -80 -106 -428 -606 -66 -108 -370 482 515 163 644 381 -287 14 -93 -684 19 55 -927 -51 553 126 350
1940C50N48p98J11j07o48L83K33q35K72P95k7n66O95O9o11M84m42Q9R9o38p8J074
$$ 350 898 100 211 104 -544 -161 72 -763 -491 304 277 -289 406 475 -136 348 -94 -5 94 -544 -622 452
1962D52k12o95J097J39p00K94j01l64j86M5m79N77N01o70M52N47m70m15Q47o65
$$ 452 240 -455 642 781 81 375 274 -90 -276 -231 -710 -133 368 -302 150 697 227 -188 659 -6
1982fq8Lj30m2M61k46k14Q25J29j164N37O31j182N90L63j035O44K09n87M96N63
$$ -6 -94 -91 -221 -263 198 -48 -262 563 692 -472 65 696 -486 104 467 -568 76 285 -302 194 757
2003G57j432J002L51j171J23Q23o63n2M12l61Q5L35J33m19R21q36p13P87K24q63
$$ 757 -675 327 678 -493 -370 453 -210 -262 150 -211 -126 209 342 -77 844 8 -705 82 306 -557
2023e57O7N44p5L32O6m39L44K41j257M86P11j017k10J235p14J1N42m26J76N59
$$ -557 -490 54 -21 311 377 -62 282 523 -734 -248 463 -554 -764 471 -243 -232 310 -116 60 619
2043F19n64l92M79m36m69R45J9m73M86K54j65j18j32j72K45j17n57K13O87r55
$$ 619 55 -337 142 -294 -763 182 201 -272 214 468 303 185 53 -119 126 9 -548 -335 352 -603
2063f03L59P94o17J42N57n03q5K62q02K49N04o70k57J429n60m42O47k2p66O98
$$ -603 -244 550 -67 75 632 129 44 306 -496 -247 257 -413 -670 759 199 -243 404 382 -384 314
2083C14k7r17O31l25j54O54L12p73P73K31o48k29K81m86j70M61l54L91L99m64
$$ 314 287 -630 1 -324 -478 176 488 -285 488 719 71 -158 123 -363 -533 -72 -426 -35 364 -100
2103a00k29J150k93r72P43l22k83L24j87j37L89J11l71O50J20r01M87J13o46K72
$$ -100 -329 821 528 -444 299 -23 -306 18 -169 -306 83 194 -177 473 593 -308 179 292 -354 -82
2123h2P8k07j59K28J89K11M51n55j47O33m96p36R63n59k98O11m78K35Q24l03o27
$$ -82 -4 -211 -370 -142 47 258 709 154 7 640 144 -592 371 -188 -486 125 -353 -118 706 403 -224
2144b24O66k86n04M96m62r0J55K79j4P8J41l38J98L35o22P0K92m95l72R22J30
$$ -224 442 156 -348 148 -314 -404 -249 30 16 94 235 -103 95 430 -192 -122 170 -325 -697 225 355
2165C55o57M62J1l01N63o65j66N26j89l85L00O2k41J59O57k81j2M1m20L19j80
$$ 355 -302 160 171 -130 433 -232 -398 128 -61 -446 -146 -84 -325 -166 491 210 198 239 -181 138 -42
2186d2l77J26M70m68K9Q09l79k43K21o7q5mm14J37Q9R4k01O27P7l73J51O9J5j71
$$ -42 -419 -293 177 -291 -262 547 168 -75 146 79 -6 -10 -424 -287 -198 -104 -305 322 399 26 177 246 261 90
2210I0k20j43j16K82k64N24j61r8L78r7J30m39L43l74k58L0L35j50R5N5JL08j67
$$ 90 -130 -273 -389 -107 -371 153 -8 -106 272 175 305 -134 209 -165 -423 -393 -58 -208 -113 -58 -57 251 84
2233H4k95R6K12k52p7r2j75L30N79m77M68K03l94j41Q7k25k29K12j02J12L21o6
$$ 84 -211 -115 97 -155 -232 -324 -499 -169 410 -67 401 604 210 69 156 -69 -298 -86 -188 -76 245 179
2255A79L0J03K10n04R7N0n12j29J63l66N49J12J11J50k12J61J41l14j30J00m62
$$ 179 209 312 522 18 115 165 -347 -476 -313 -679 -130 -18 93 243 31 192 333 19 -111 -11 -473
2276d73J20J75j34L76k64K83k8J61J59m19l86K68j81K73k9K38k30L1P52n47K36
$$ -473 -353 -178 -312 64 -200 83 55 216 375 -44 -430 -162 -343 -70 -99 139 -91 -60 692 145 381
2297C81k4j45l28l9k42K92K02l69K66L58j39J97k16K35p04K98r7q7Q1J25j4J72
$$ 381 357 212 -116 -155 -397 -105 97 -272 -6 352 213 410 194 429 -275 23 -74 -161 -80 45 31 203
2319B03K57k31l1k60M3J95n15M6J24P8l11M71J57L3o2k34J08O7n0m37R8J26p5
$$ 203 460 229 198 -62 -19 176 -339 -293 -169 -91 -402 69 226 259 197 -37 71 138 88 -349 -251 -125 -200
2342b00M16N4k03pK37J14l54k30j66J31n2J69J37O4l29L30J25m6l28L3L82j95
$$ -200 216 270 67 60 297 411 57 -173 -339 -208 -260 -91 46 110 -219 111 236 190 -138 -105 277 82
2364H2l18j61J79M51k69J42K38J68p59M51j95j17L31n66Q2J03o6M10j86J20J73
$$ 82 -236 -397 -218 233 -36 106 344 512 -247 204 9 -108 223 -343 -261 -158 -224 186 0 120 293
2385B93l56O6J17l36R1m69N05M3K67l80OL88n8k5P4J21n24j7p2J53j50L18K8K72
$$ 293 -63 3 120 -216 -125 -594 -89 -46 221 -159 -153 235 177 152 226 347 -177 -194 -266 -113 -263 55 83 355
2409C55n3k8k19j4rl57K33R8k57J76J10m3J12j11Q3J45q8j72j30j51j65M00J1
$$ 355 302 274 55 41 32 -325 -92 6 -251 -75 35 -8 104 -7 76 221 133 -39 -169 -320 -485 -85 -74
2432g4j03M30j58j36K79m23Q6J31j41M5k90J55jM17k04k21L87O6l39J51r7k51
$$ -74 -177 253 95 -41 238 -185 -99 32 -109 -64 -354 -199 -200 217 13 -208 179 245 -94 57 -40 -291
2454b91K05l40R1K14P3L37J1m24j6Q1K12j92j46K29l09K39J89l02M31j46J19k79
$$ -291 -86 -426 -335 -121 -48 289 300 -124 -140 -59 153 -39 -185 44 -265 -26 163 -139 292 146 265 -14
2476a4Jq6k72P3K38J3L5L01k73L70j50k81L49j60k26J28l1J99j66j50K26J88j09
$$ -14 -13 -99 -371 -298 -60 -47 -12 289 16 386 236 -45 304 144 -82 46 15 214 48 -102 124 312 203
2499B03l49L01N5n22L06j79k4K88j28J94J87r3M06q32M58k81n73K24Q4J52%L47
$$ 203 -146 155 210 -312 -6 -185 -209 79 -49 145 332 239 645 -187 271 -10 -583 -359 -275 -123 -123 224
2521B24m00M62L11q37L45l02K1L20m70N1j81L34Q3Q7L43k02l33M09J04q54L87
$$ 224 -176 286 597 -240 105 -197 -176 144 -326 -275 -456 -122 -39 48 391 189 -144 265 369 -485 -98
2542i8j64M0L43k51J76J80J86l22q7J06j80l31K03m7o9L35j43q6N87k42l18N81
$$ -98 -262 -222 121 -130 46 226 412 90 3 109 -71 -402 -199 -246 -315 20 -123 -209 378 136 -182 399
2564C99l54j97J70J61l71K51k1O8J06k58M0K38J96j98J14j64l84k29L68J22j94
$$ 399 45 -152 18 179 -192 59 38 106 212 -46 -6 232 428 230 344 180 -204 -433 -65 57 -137
2585a37L00j74L16K38m70j19J86k63m19M06k6j69P11O3m51M14l96L6O1l6o14M79
$$ -137 163 -11 305 543 73 -46 140 -123 -542 -136 -162 -331 380 443 -8 406 10 46 107 71 -543 -64
2607f4j9l65L37K96j48J02J34j97n6M8kk52L16m95L55K60k25R6K43J96n20j64
$$ -64 -83 -448 -111 185 37 139 273 76 20 68 66 -186 130 -365 -10 250 25 121 364 560 40 -124
2629a24j47j32L24J19l85P88l70l49M19J12k78r1K23k55PK33k21O3K92j98j59
$$ -124 -271 -403 -79 40 -345 443 73 -276 143 255 -23 -114 109 -146 -139 94 -127 -64 228 30 -129
2650a29N61m23j75L55R0o89n9R3M30M7p6o5L70j18k72L04j22k83L49j67m18L35
$$ -129 432 9 -166 189 279 -410 -469 -376 54 101 25 -40 330 212 -60 244 122 -161 188 21 -397 -62
2672f2q4J62J27J09m17N29k55k14k06N34l61o2K97k99Q2J96K10l97P10q22N9m9
$$ -62 -146 16 143 252 -165 364 109 -105 -311 223 -138 -200 97 -202 -120 76 286 -111 599 -223 -164 -213
2694b13M65l96q7Q9N0J6L34j83J08K88j054K78J52j03j27N85j56k50J43j28M49
$$ -213 252 -144 -231 -142 -92 -76 258 75 183 471 -583 -305 -153 -256 -383 202 46 -204 -61 -189 260
2715B60L40o61j84P70p91j30N83j19j55L10J32n04L08J6p32M53j39J5K3N06q02
$$ 260 600 -61 -245 525 -266 -396 187 68 -87 223 355 -149 159 175 -557 -104 -243 -228 -205 301 -501
2736e01L36M29n7p0K9K96m90J18k67o3L09j82m75P43J75k74j83K03kj25K82o87
$$ -501 -165 264 207 137 166 462 -28 90 -177 -240 69 -113 -588 155 330 56 -127 76 74 -51 231 -456
2758d56M93k93l7J15M34k44J27K38k71k92K11n5j78L85n03K26J15P3k53L04K2
$$ -456 37 -256 -293 -178 256 12 139 377 106 -186 25 -30 -208 177 -326 -100 15 88 -165 139 161
2779A61j25O0j21l15K99j96M0J53K18j17R0M49m82O7P9n33K87K45p12L56m6j56
$$ 161 36 96 -25 -340 -41 -237 -197 -44 174 57 147 596 114 181 260 -273 14 259 -453 -97 -143 -299
2801b99J87L55K17n78J67l42j51K88j65L77k30L97o6o6M16m72K38N0o88L47K01
$$ -299 -112 243 460 -118 49 -293 -444 -156 -321 56 -174 223 157 91 507 35 273 323 -365 -18 183
2822A83k20r2j37R2M61K1R0j60P8m38K37qj76k53K0K36q8K73J21N1j97O7j86J07
$$ 183 -37 -129 -266 -174 287 308 398 238 316 -122 115 107 -69 -322 -302 -66 -154 119 240 291 94 161 -25 82
2846H2j20k17R8K56KpN8K88k89q9j15N9q6k52K69J69nJ27k43R8J67k1j40q7k2
$$ 82 -38 -255 -157 99 101 94 152 440 151 62 -53 6 -80 -332 -63 106 101 228 -15 83 250 229 89 2 -20
2871b0n5j50J58p6j04J79J37J12j54M27l45j40M61q25L22j69J16q0K5K82j06N26
$$ -20 -75 -225 -67 -143 -247 -68 69 181 27 454 109 -31 430 -395 -73 -242 -126 -206 -181 101 -5 521
2893E21o15J83J29p3k32r8k4QL34j95P6Q3J31j17m47K05J74k32L89l7k11j04q1
$$ 521 -94 89 218 145 -87 -185 -209 -201 133 -62 14 97 228 111 -336 -131 43 -189 200 163 -48 -152 -233
2916b33M06P6L0j04k44J30k05N7l45L90J30j54R2J95j76Q9l53K68l13j36K22j61
$$ -233 173 249 279 175 -69 61 -144 -87 -432 -42 88 -66 26 221 45 134 -219 49 -264 -400 -178 -339
2938c39J25N29k65l17N22l3j6N5l09k06K75l48R1o6l2L08j9L26j85J01k45k52
$$ -339 -214 315 50 -267 255 222 206 261 -48 -254 21 -327 -236 -302 -334 -26 -45 281 96 197 -48 -300
2960c00K98p3pk38J75J08J14J05j14j80L70q4k50r1n2K77j94j14L53J94o1k74
$$ -300 -2 -75 -82 -320 -145 -37 77 182 68 -112 258 174 -76 -167 -219 58 -136 -250 103 297 236 -38
2982c8J87m00K01Qr3r1K22l9l6J2O2J08P1k50J69k05J41J37l87J10M7q6M01k14
$$ -38 149 -251 -50 -42 -135 -226 -4 -43 -79 -67 -5 103 174 -76 93 -112 29 166 -221 -111 -64 -150 251 37
3006C7J93m2j40J44m0j30k31J0O4l0K55j55K6K35j0k14J48k3l44J33o1%J1K09
$$ 37 230 188 48 192 152 22 -209 -199 -135 -165 90 -65 -39 196 186 -28 120 97 -247 -114 -175 -175 -164 45
3030D5M1M64o71M42k84k92K98k2J2j50m6K31L15k49k09j18L77l53J20j43M54m44
$$ 45 86 550 -121 321 37 -255 43 21 33 -117 -163 68 383 134 -75 -193 184 -169 -49 -192 262 -182
3052a82j0J60k10M3L07K83l50j08J60n53L12o7n8K26P8j11K22j6K4l6j78l9J95
$$ -182 -192 -32 -242 -199 108 391 41 -67 93 -460 -148 -215 -273 -47 31 -80 142 126 150 114 -64 -103 92
3075I2On79L35L25k77J4J58l3k15J16l7L8j1n4M5oL5J80J69j89m3j86r1J63j82
$$ 92 98 -481 -146 179 -98 -84 74 41 -174 -58 -95 -57 -68 -122 -77 -83 -48 132 301 112 69 -117 -208 -45 -227
3100b27j51K67l24L95j49l7K55J46l08L37k39L19k2n55J31k25K11L03K94m58M25
$$ -227 -378 -111 -435 -40 -189 -226 29 175 -133 204 -35 284 262 -293 -162 -387 -176 127 421 -37 388
3121C88l81Q4N1J2k44O1J1R2j03j59L36j34pK62m58K96m6j73J47J25j46j63J48
$$ 388 7 91 142 154 -90 -29 -18 74 -29 -188 148 14 7 269 -189 107 61 -112 35 160 14 -149 -1
3144an1J60k06pK87o4j01k98J19RN9L27q7pJ45k2J7p9k09l6r0K78m54K56K3K34
$$ -1 -52 108 -98 -105 182 118 17 -281 -162 -153 -94 233 146 139 284 262 279 200 -9 -45 -135 143 -311 -55 -32 202
3170B02l29N68m23o3K60k74p7r0QK12j00K66J8k35mL3k68L96k56J59k53j36K57
$$ 202 -127 441 18 -45 215 -59 -136 -226 -218 -6 -106 160 178 -57 -61 -28 -296 100 -156 3 -250 -386 -129
3193a29K2J42j53M20j87m54M68j19K0J60k87j66K26k1K23l5l5Rm9j8j85J22j55
$$ -129 -107 35 -118 302 115 -339 129 10 30 190 -97 -263 -37 -58 165 130 95 104 55 37 -148 -26 -181
3216a81J42p3L9k8j78K43L9J28p6j22Q6K10l83L4n2M48k49J5K55k30j27L33l52
$$ -181 -39 -112 -73 -101 -279 -36 3 131 55 -67 19 229 -154 -120 -172 276 27 42 297 67 -60 273 -79
3239g9J18M09l86M4k78J85J39k82N29k08O5l52j24K15k4k6K41r4m5K63m43J46
$$ -79 39 448 62 106 -172 13 152 -130 399 191 256 -96 -220 -5 -29 -55 186 92 47 310 -133 13
3261A3K78m31l08M03l05J40J70K9m0k20M75k21o6J22k00M05j15l97N1K03K61k98
$$ 13 291 -140 -448 -45 -350 -210 -40 -11 -51 -271 204 -17 -83 39 -161 244 129 -268 -217 -14 247 -51
3283e1O5k4Q1O6k11P6N9j76L2O3j01m3P2L88l14L70l29l7J84j41k05K05m19K88
$$ -51 14 -10 71 137 -74 2 61 -115 -83 -20 -121 -164 -92 296 -18 352 23 -14 170 29 -176 29 -390 -102
3307a02j6M63m52M18k44k1J29P3k80k03N09l89N11j08l99K62j1j1l48N18m06l7
$$ -102 -118 345 -107 311 67 46 175 248 -32 -235 274 -115 396 288 -111 151 140 129 -219 299 -107 -144
3329a44K25j77J40j0L3l34M91l02OJ51l0Q4j20P6l22k7J90J31O8m8l5J27j13k20
$$ -144 81 -96 44 34 67 -267 224 -78 -72 79 49 133 13 89 -233 -260 -70 61 129 81 46 173 60 -160
3353a60L2K15j62o8J20M1Q7K97j49l13Q2Q9m68N23j04j14K62j5p2J05m2m00N9
$$ -160 -128 87 -75 -143 -23 18 105 402 253 -60 22 111 -357 166 62 -52 210 195 123 228 186 -214 -155
3376a55L19k63J99j01P7K55l03j38kR1o8J77q9N5k95pn2n9l1O38k95R0p7K46J50
$$ -155 164 -99 100 -1 76 331 28 -110 -112 -21 -89 88 -1 54 -241 -248 -300 -359 -390 248 -47 43 -34 212 362
3401C62l21J15l69J95l49J20O7j%N66l91K84Qo02K25J46k41j01L15n3J20j11J5
$$ 362 41 156 -213 -18 -367 -247 -180 -181 -181 385 -6 278 286 -316 -91 55 -186 -287 28 -25 95 -16 -1
3424aJ58m6p6K46k26J81n04K09M2l21J51K86J31l39O23n12lj2M4k19m0K42k23
$$ -1 157 111 35 281 55 236 -268 -59 -17 -338 -187 99 230 -109 514 2 -1 -13 31 -188 -228 14 -209
3447b09J36L09n9O8N5m46P0K64j27j87J39k8Q1k48K46L61l26J22m17L84l61j25
$$ -209 -73 236 177 245 300 -146 -76 188 61 -126 13 -15 66 -182 64 425 99 221 -196 188 -173 -298
3469b98L02J5j73K38J99l29M99k37l02R0M3p7j52J91k61J33k08K88M46l36j25
$$ -298 4 19 -154 84 283 -46 453 216 -86 4 47 -30 -182 9 -252 -119 -327 -39 407 71 -54
3490e4M01m42k06J37J05m2K09l35j58L01l9J43q0L59m47j7M91l34j56K2K37j00
$$ -54 347 -95 -301 -164 -59 -101 108 -227 -385 -84 -123 20 -60 299 -148 -165 326 -8 -164 -142 95 -5
3512eO2M05l55M7j03o8p5J00j12M0nK54k42K17O4l36L10m08K37QR4l94N30k16
$$ -5 57 462 107 154 51 -17 -92 8 -104 -64 -69 185 -57 160 224 -112 198 -210 27 35 129 -265 265 49
3536D9k13K12K4j60j40K04k07K00j99j78N54l05p4K07K57l56J8L94j69k29J9J39
$$ 49 -164 48 72 -88 -228 -24 -231 -31 -230 -408 146 -159 -233 -26 231 -125 -107 287 118 -111 -92 47
3558D7k52L66m42J60O4K04j39K44k06J74k46Lk67M05L2j04k75L50j22N35m83j53
$$ 47 -205 161 -281 -121 -57 147 8 252 46 220 -26 -23 -290 115 147 43 -232 118 -4 531 48 -105
3580a05L83m06n6J29j91J20O2O0l7K82k41J08J37l95K92j46r7J07j08n9K24j59
$$ -105 278 -128 -184 -55 -246 -126 -64 -4 -41 241 0 108 245 -150 142 -4 -101 6 -102 -161 63 -96
3602i6L36k23j99L27l39k2Q7j77K12p5K18O6k23N19k08n4l01L38k06q5p9q4M25
$$ -96 240 17 -182 145 -194 -216 -129 -306 -94 -169 49 115 -108 411 203 149 -152 186 -20 -105 -184 -268 157
3625A57o4l81M05k29K78j05l32L74j65K35l04J93l19K91Q9j72M73k12j42p6mJ4
$$ 157 93 -288 117 -112 166 61 -271 103 -62 173 -131 62 -257 34 123 -49 424 212 70 -6 -10 4
3647Dj25K4K12j77L58m75J18q3J13O6m4l25K03J06j88J87J11N7l90M78K01k18
$$ 4 -121 -97 115 -62 296 -179 -61 -144 -31 35 -9 -334 -131 -25 -213 -26 85 142 -248 230 431 213
3669B13o29N79K16m36j90n1l0M85j75P3k27J58O6n3k6j15j16O2J81J39r5k6Kn8
$$ 213 -416 163 379 -57 -247 -298 -328 157 -18 55 -172 -14 52 -1 -27 -142 -258 -196 -15 124 29 3 5 -53
3693e3K95O6k45j12M13n42J17oj16J20J82l06N34l40j06M11m97m5L56k71J16J83
$$ -53 242 308 63 -49 364 -178 -61 -67 -183 -63 119 -187 347 7 -99 312 -185 -230 126 -145 -29 154
3715A54j26j0K90k47k20k01M13O2j45l9r6R2ql9L39l42J03j57N44l47j96L34L7
$$ 154 28 18 308 61 -159 -360 53 115 -30 -69 -165 -73 -81 -120 219 -123 -20 -177 367 20 -176 158 195
3738A95k71K08N9j33%o1R9J5q2J02j59L00n27P2J11r5K14J95k8m08M15j99R4l56
$$ 195 -76 132 191 58 58 -3 96 111 29 131 -28 272 -255 -183 -72 -167 47 242 214 -194 221 22 116 -240
3762b40J74K10Q7k62J45p7q4K35l5k95l42L19K9j27J95K32k44N05k04j23k4j96
$$ -240 -66 144 231 -31 114 37 -47 188 153 -142 -484 -165 -136 -263 -68 164 -80 425 221 98 74 -122
3784a22L0l10K29L40l08m4L6K25o2M5R1J51j43l72K41J0j22J5J19k02K51j01J20
$$ -122 -92 -402 -173 167 -141 -185 -149 76 14 59 150 301 158 -214 27 37 -85 -70 49 -153 98 -3 117
3807A17m09L69J20j8km43K36J86j91j08K39p3J56r8j21J11j09K6n0K6k79K20J26
$$ 117 -292 77 197 179 177 -266 -30 156 -35 -143 96 23 179 81 -40 71 -38 -12 -62 -36 -315 -95 31
3830C1L89j57k1k66jr8j44K89j11O0k30K79J5O1j9j51j37l8K82R0J11j90k73J02
$$ 31 420 263 242 -24 -25 -123 -267 22 -89 -29 -259 20 35 96 77 -74 -211 -249 33 123 234 44 -229 -127
3854a27J56J01N4J77m75L37k19L8j15K58l19o3J63P9L0L0j14L7R8j38j78J54o
$$ -127 29 130 184 361 -114 223 4 42 -73 185 -134 -197 -34 45 75 105 -9 28 126 -12 -190 -36 -42
3877d2j08J56K07k65K56M5j6k94J07J17R9o1k24N7P7k03J03L98l06j16L3J39k51
$$ -42 -150 6 213 -52 204 249 233 -61 46 163 262 201 -23 34 111 -92 11 409 103 -13 20 159 -92
3900i2J63k09m2L85k40M79n97K49m3K37k20l23M3J84Q0k17K42J25l64L50J05k88
$$ -92 71 -138 -180 205 -35 444 -153 96 53 290 70 -253 -210 -26 54 -163 79 204 -160 190 295 7
3922GO0j08J75O5j57R7n8j98j33M84k86k11N46l58n7P0K4j19N6j50j5J86J92n0
$$ 7 67 -41 134 199 42 139 81 -117 -250 234 -52 -263 283 -75 -132 -62 -38 -157 -101 -251 -266 -80 112 62
3946F2j34J46K49j97j62j52k5K24Nj15QJ99n2j78r2K67N19n65j43J10M4j18J16
$$ 62 -72 74 323 126 -36 -188 -213 11 16 -99 -91 108 56 -122 -214 53 572 7 -136 -26 18 -100 16
3969A6J4O1j7j44K52m08K28k54J30k53R2M56l12q9j04K49P0j63Q9j2J31j66oJ52
$$ 16 30 91 74 -70 182 -226 2 -252 -122 -375 -283 173 -139 -228 -332 -83 -13 -176 -87 -99 32 -134 -140 12
3993A2j97K12K87n04L27l58J67J7K57l47J30J6k12L58q0N3K35n78J62j68K02o7
$$ 12 -185 27 314 -190 137 -221 -54 -37 220 -127 3 19 -193 165 85 138 373 -205 -43 -211 -9 -76
4015g6p6o2K41J87j40q6K45k39j23j9J37k15L81j50j37N0J71j09Q9j12oK35j8
$$ -76 -152 -214 27 214 74 -12 233 -6 -129 -148 -11 -226 155 5 -132 -82 89 -20 69 -43 -49 186 168
4038A68M4j54j68l30O47l07K09J63k87j7o3L00k52Qp8J2q3L16R8k03JJ07k11J47
$$ 168 212 58 -110 -440 207 -100 109 272 -15 -32 -95 205 -47 -39 -117 -105 -188 128 226 23 24 131 -80 67
4062F7k13kj9K5q3L72k65N0L4J66O3j77J87m02j51O37m75k0j8J81L06j7k71J28
$$ 67 -146 -148 -167 -142 -225 147 -118 -68 -34 132 195 18 205 -197 -348 289 -186 -206 -224 -43 263 246 -25 103
4086A03J72l31j16M3K89l96J68J3N7p4O1K0M21k61k17k49M03q5j24L35r3J36j5
$$ 103 275 -56 -172 -129 160 -236 -68 -55 2 -72 -11 9 430 169 -48 -297 106 21 -103 232 139 275 260
4109B60l83L43O6n87L35r1p9K03j05P7K34J24m09J04J17O1m00k44P0L23J27j31
$$ 260 -123 220 286 -301 34 -57 -136 67 -38 39 273 397 -12 92 209 270 -130 -374 -304 19 146 15
4131A5o3J61N6p7j98L93l00O2m0j26L18l63J34k08J52l1j1J81j88L06p0r8L5P0
$$ 15 -48 113 169 92 -106 287 -13 49 9 -117 201 -162 -28 -236 -84 -115 -126 55 -133 173 103 5 40 110
4155A10j32j67J4L17k47j18L91q7j8J02j20J80m19j39J71M5M27m57J39P6l6k03
$$ 110 -22 -189 -175 142 -105 -223 168 81 63 165 45 225 -194 -333 -162 -117 310 -147 -8 68 32 -171
4177a71L79k62Qr0R9j03K71q1J71k61R1J20%l70K40Mj94L14n7J9l76M4L92j51
$$ -171 208 -54 -46 -136 -37 -140 131 50 221 -40 51 171 171 -199 41 45 -149 165 108 127 -249 -205 187 36
4201C6j62J77K08K8l24K08j24J16j13J38l16J92j11RN5m4K34k15k36L66p4J65
$$ 36 -126 51 259 287 -37 171 47 163 50 188 -128 64 -47 -38 17 -27 207 -8 -244 122 48 213
4223B13l06J35n6J13J87j58k69j47L86l7p7q5L04j60K3j37k5J58KpL6M7k48K9
$$ 213 -93 42 -14 99 286 128 -141 -288 98 61 -16 -101 203 43 66 -71 -96 62 64 57 93 140 -108 -79
4247g9R8k13N43n64n1K12qP5jp9m0M15k83M3j90j67J95L10n7j69k54O4J94J1L6
$$ -79 19 -194 349 -215 -266 -54 -62 13 12 -67 -107 308 25 68 -122 -289 -94 216 159 -10 -264 -200 -6 5 41
4272D1Q6j27K42k00J65K47n47mN4J9j48j00K92qMl0l9J81J66j48k77J01L05k87
$$ 41 127 0 242 42 207 454 -93 -97 -43 -24 -172 -272 20 12 16 -14 -53 128 294 146 -131 -30 275 -12
4296a2l0L16j87J4j62j18K56k82J2J87K42l49Q1Q6J09R8k57j20N34m63O6K40l76
$$ -12 -42 274 87 101 -61 -179 77 -205 -193 -6 236 -113 -32 54 163 261 4 -116 418 -45 21 261 -115
4319a15n9n9P6j5L12R2j65r3R0K81m60J82j69K46r4j34r7L8K06k69J67q2J89k45
$$ -115 -174 -233 -157 -172 140 232 67 -26 64 345 -115 67 -102 144 50 -84 -181 -143 63 -206 -39 -121 68 -177
4343a77M20l09J89m18M46j04N5r3K05m70L61j52J13r8o8NK25K3j44PJ77j86R4
$$ -177 243 -66 123 -295 151 47 102 9 214 -256 105 -47 66 -32 -100 -95 130 153 9 16 193 7 101
4366A01k07j06K46j72J06j72J83l15N35k94J80jp3j00n6K16j8l91P15l90j13P8
$$ 101 -106 -212 34 -138 -32 -204 -21 -336 199 -95 85 84 11 -89 -145 71 53 -338 377 -13 -126 -48
4388d8R7j51J23n9l6J39J88j60j68k28M32j08j61K06k6k0l8J55l31N59m30J14
$$ -48 49 -102 21 -38 -74 65 253 93 -75 -303 129 21 -140 66 40 20 -18 137 -194 365 -65 49
4410D9k32L33j97J02p4j0K8L34m30M0j53J09J80j40J70k65L13l15K99j96j18J75
$$ 49 -183 150 -47 55 -19 -29 -1 333 -97 -57 -210 -101 79 -61 109 -156 157 -158 141 -55 -173 2
4432BK43m43J44j33O0M6o7J94K7j24J80j27R8k57Q1P9l3n5N4L4J47j74L0m2j30
$$ 2 245 -198 -54 -187 -127 -81 -148 46 73 -51 129 2 100 -157 -76 3 -30 -85 -31 3 150 -24 6 -36 -166
4457a66K19l34K73m5J5J12l12O02l06l3q2J19j92J76L45k37J06j32j09k2n79N61
$$ -166 53 -281 -8 -53 -38 74 -238 364 58 25 -57 62 -130 46 391 154 260 128 19 -3 -582 -21
4479b1j96J01k8K12k69o5K80J73r9j99P0l6jJ44K02l41k7K0K28n02L2L67J33K7
$$ -21 -217 -116 -144 68 -201 -266 14 187 88 -111 -41 -77 -78 66 268 -73 -100 -80 148 -354 -322 45 178 205
4503B05l38L17j71J71n02M37j57Q7r7K1L2J10K0k21J94n1J67j69k31L62l20J41
$$ 205 -133 184 13 184 -318 119 -38 49 -48 -27 5 115 135 -86 108 57 224 55 -176 186 -134 7
4525Gn1j6J65k30J29o3l8R3L06k14q3mq9L43j35k95K83j27K33n59L37r1j88M04
$$ 7 -44 -60 105 -125 4 -59 -97 -4 302 88 5 1 -88 255 120 -175 108 -19 214 -345 -8 -99 -287 117
4549A17k54j50M31l78K53OJ02j69j31J96j3j43O2N0J63k19k68M70l9L9j63L21
$$ 117 -137 -287 144 -234 19 25 127 -42 -173 23 10 -133 -71 -21 142 -77 -345 125 86 125 -38 283
4571B83j08r4M7k58L5j33M75l05q7K19L01o23M08j43j65K5j67L00K73j77m6J16
$$ 283 175 81 128 -130 -95 -228 247 -58 -145 74 375 -248 160 17 -148 -123 -290 10 283 106 60 176
4593A76k28J70J9j90M2k41J75q4L4j20J4K90l25K58J70N2l6k46j84M08n01O36
$$ 176 -52 118 137 -53 -11 -252 -77 -161 -127 -247 -233 57 -268 -10 160 212 176 -70 -254 154 -347 289
4615B89q9k11K08k56J8k1j60J4J67k13J51J28l44J9J74J46l79J53L18k16K30j50
$$ 289 200 -11 197 -59 -41 -62 -222 -208 -41 -254 -103 25 -319 -300 -126 20 -359 -206 112 -104 126 -24
4637b4j51M05n83n5M74l28M49j99J50k00K43m48L46j57l8j21J63K10q1J42j61
$$ -24 -175 230 -353 -408 66 -262 187 -12 138 -62 181 -267 79 -78 -116 -237 -74 136 55 197 36
4658C6j1j41J08j04J8n7L0O2n6mJ71l57P3L2K03K5J11k21k65J50%K69j02K00l9
$$ 36 25 -116 -8 -112 -94 -151 -121 -59 -115 -119 52 -305 -232 -200 3 28 139 -82 -347 -197 -197 72 -30 170 131
4683A31l38m4M58k88J11O7q3J33P0J21l35j7r8P5L5J1k11L29J44k17J06r2k8L4
$$ 131 -207 -251 207 -81 30 97 14 147 217 338 3 -14 -112 -37 -2 9 -202 127 271 54 160 68 40 74
4707G4j63K0k02K51R3R8j53p1Mj29K21K56K6m75J95k20N0o5J3K51n55N59k21K02
$$ 74 -89 -69 -271 -20 73 171 18 -53 -49 -178 43 299 325 -150 45 -175 -125 -190 -177 74 -481 78 -143 59
4731E9k35K01J22r3j22K95k57N9p6pk7k97K64q4nJ10M93m22o8r6M04l60KK45j01
$$ 59 -176 25 147 54 -68 227 -30 29 -47 -54 -81 -378 -114 -198 -203 -93 400 -22 -90 -186 218 -142 -140 105 4
4756DN9kj99J92j21K5P5l1L26m03K1j9o1L65L4j70M9r2J73j81N9n9L9M8K0j34
$$ 4 63 61 -138 54 -67 -42 33 2 328 -75 -54 -73 -134 231 265 95 144 52 225 44 103 44 83 131 151 17
4782A7r3OL30k58k92N13l67L4j73L67J87m83L63k24K30j92Qk3K76n48K92k0Q8
$$ 17 -76 -70 260 2 -290 223 -144 -110 -283 84 271 -212 151 -73 157 -35 -27 -50 226 -322 -30 -50 38
4805C8J67j24j29K35j52l12j36K77J4M7p6J1M5J69m13O1J85Q4J27m24K73J8L09
$$ 38 205 81 -48 187 35 -277 -413 -136 -122 -75 -151 -140 -95 74 -339 -278 -93 -9 118 -306 -33 -15 294
4828B94k88j99j19M81K2l51R1q7K84l31L74j1k07L0J20k1l79L80j29J20k33K96
$$ 294 6 -193 -312 169 191 -160 -69 -156 128 -203 171 160 -47 -17 103 82 -297 83 -46 74 -159 137
4850A37j81j55L95l12L77l88k5L99l95K30ok02j76K78J44l64jK84K20l52K31l3
$$ 137 -44 -199 196 -116 261 -127 -152 247 -148 82 76 -126 -302 -24 120 -244 -245 39 259 -93 138 105
4872A05k41K39l8j49l07J85J76M83q12L27l4K8K44r4k17J36q5k09M38q8k63K7
$$ 105 -136 103 65 -84 -391 -206 -30 453 -359 -32 -66 -38 206 112 -105 31 -54 -263 175 87 -176 -149
4894a49J78n3K90p0k72J43k0m6j62J16j15k20K75J00k19K99O3Q1l8J19k99L4J8
$$ -149 29 -24 266 196 -76 67 47 1 -161 -45 -160 -380 -105 -5 -224 75 138 219 181 300 1 35 53
4917E3k3k57K12k5J20j46q5K07l5j30k91Q26p69J07Q2o4M20n27M78k07J40J8J0
$$ 53 30 -227 -15 -40 80 -66 -151 56 21 -109 -400 426 -343 -236 -154 -218 202 -325 153 -54 86 104 114
4940A14l2l9q6K61k44J51k78K72j54J03J07j87j05M55j6l72J10K8j46J25J06n
$$ 114 82 43 -43 218 -26 125 -153 119 -35 68 175 -12 -117 338 322 -50 60 88 -58 67 173 168
4962A68O2o82N81j29M4j44J27l2j50J97K4m5l55J28N16l15J24l62J92j84J99R2
$$ 168 230 -452 129 0 44 -100 27 -5 -155 42 66 21 -334 -206 310 -5 119 -243 -51 -235 -36 56
4984E6Pk61L51O7k57M49k04m1l01K32j63j06M1j71M51j9j42K3j81K04k69K49k65
$$ 56 63 -198 153 220 -37 412 208 167 -134 98 -65 -171 -130 -301 150 131 -11 12 -169 35 -234 15 -250
5007b50P2K20J31l69L5L15r0L0R5l21J72J48m10L27J09j85K48j66l38K35j9M8
$$ -250 -178 42 173 -196 -161 154 64 94 189 -132 40 188 -222 105 214 29 277 111 -227 8 -11 37
5029C7j46J10K19l26J98j66J12k53K86J47NL2q0m74M64l7lr1k17O0j2O4l2K21
$$ 37 -109 1 220 -106 92 -74 38 -215 71 218 223 255 175 -299 165 128 125 34 -183 -123 -135 -71 -103 118
5053A18l27J65J9k30K09R1m9mRj26K64k17J5J05j38L96l57p0q8R1J54Q2p4J28
$$ 118 -209 -44 -25 -255 -46 45 -4 -8 1 -125 139 -78 -63 42 -96 300 -57 -127 -215 -124 30 112 38 166
5077A66n8k25K56k5j60P4j88J06j20Q9j93K52k12k27K94J07j31K08k47K97J75
$$ 166 108 -117 139 114 -46 28 -160 -54 -174 -85 -278 -26 -238 -465 -171 -64 -195 13 -234 63 238
5098B38j38Q2j19K01l83L84j85l66K68j33q2J03J76pj24K72k38OJ17p9K66k67
$$ 238 100 182 63 264 -119 265 80 -286 -18 -151 -233 -130 46 39 -85 187 -51 -45 72 -7 259 -8
5120hl3M31j30l29L12m49n9J64K31J37k14J86l43N3J77p2oj30K93p4k43N9J3L24
$$ -8 -41 390 260 -69 243 -206 -265 -101 130 267 53 239 -104 -51 126 54 48 -82 211 137 -106 -47 -34 290
5144B90r8k70l29L30j69O7m2K71n0R4j2j98L05j17Q3l40J08nP5l39L44L41k62
$$ 290 192 -78 -407 -77 -246 -179 -221 50 0 94 82 -116 189 72 155 -185 -77 -82 -7 -346 -2 339 77
5167G7k96K69J90l83O4j43K2K66J26k09j99L57l8j59J52j64P6l64L13ok4J17O9
$$ 77 -219 50 240 -143 -79 -222 -200 66 192 -17 -216 141 103 -56 96 -68 8 -356 -43 -49 -73 44 113
5190A13Q2P2m5m59J36j80K17J18l46K69j5N1o5J01n3j5J39j13j34R5j01o1L30
$$ 113 195 267 222 -237 -101 -281 -64 54 -292 -23 -38 13 -52 49 -4 -19 120 7 -127 -32 -133 -194 136
5213A36j92Rk26K01J47%ol0j36r0J57o8J34J52j42k51K3N16m67L72l53l4j82L62
$$ 136 -56 -47 -273 -72 75 75 69 39 -97 -187 -30 -98 36 188 46 -205 -182 334 -133 239 -114 -148 -330 32
5237C2j38k3J06N1K41R5l35l33M14k51J80j74N1O4oQ5j42J28j5j35J59p2j47Q0
$$ 32 -106 -129 -23 28 269 364 29 -304 110 -141 39 -135 -84 -20 -26 59 -83 45 30 -105 54 -18 -165 -85
5261h5r0M29j83Q7k00J00r7N0J04j44J49j32J46l88K92O8po1N8r1j69L14j94n7
$$ -85 -175 254 71 158 -42 58 -39 11 115 -29 120 -12 134 -254 38 106 99 38 96 5 -164 150 -44 -101
5285a01l1M17k77k63K93l9m8K36k38P4k85J73J87l50O17m33q2J32K6J54n7j92
$$ -101 -132 285 8 -255 38 -1 -49 187 -51 23 -262 -89 98 -252 365 -68 -150 -18 8 162 105 -87
5307h7N3j01r7L17J17j58J89l2L9j70J56m36K47m6o4j80K91K5k2R5j11q6N8j41
$$ -87 -34 -135 -232 85 202 44 233 201 240 70 226 -210 37 -9 -73 -253 38 63 41 136 25 -61 -3 -144
5331a44J07k62L66R9l35J95o3J23l31K11J25m2j89q5L39M3J73J6j52r3J95j21
$$ -144 -37 -299 67 166 -169 26 -37 86 -245 -34 91 49 -140 -225 114 157 330 346 194 101 296 175
5353A75l15M7K80P6m16J34K14o17K61L24q0p8r8m9R5J11J65o3j16j24k11K94j75
$$ 175 -140 -93 187 263 -153 -19 195 -422 -161 163 83 5 -93 -142 -47 64 229 166 50 -74 -285 9 -166
5376a66K85j23P4Q5N2k02J32l42K49j09l7qJ25O8j58k8l0J31Q2l1j12j3K6lj92
$$ -166 119 -4 70 155 207 5 137 -205 44 -65 -102 -110 15 83 -75 -103 -133 -2 80 49 -63 -76 -50 -53 -245
5401b45J52J95n4Oj62J20k53J44r5P4J68p2K15k71l9J16O8P5k18N9J31l14L35
$$ -245 -93 102 48 54 -108 12 -241 -97 -192 -118 50 -22 193 -78 -117 -1 67 142 -76 -17 114 -200 135
5424A35j11L18m50R7k02N14k89m9j39M30j40q4k70K42p2K05N1j37l4r8LN10m36
$$ 135 24 342 -108 -11 -213 301 12 -37 -176 254 114 30 -240 2 -70 135 186 49 15 -83 -80 430 -6
5447fJ2J32m87K04J3M4j48K34J13j12j02L02k91j80K7L24K1l17J63M7K68k47R
$$ -6 6 138 -349 -145 -132 -88 -236 -2 111 -1 -103 199 -92 -272 -245 79 100 -217 -54 -7 261 14 23
5470B3L32j89j3j39j71J89n8K17j23P7k46N6K41n2kl94O61m94q9J96J28l03J50
$$ 23 355 166 153 14 -157 32 -26 191 68 145 -101 -45 196 144 142 -252 409 -85 -174 22 150 -153 -3
5493cJ90l72J36J87p9q2J55p1J37k41j90K36P5m16M97j30j91L35j16R5m75L90
$$ -3 187 -185 -49 138 59 -23 132 61 198 -43 -233 3 78 -338 159 29 -162 173 57 152 -323 67
5515F7o9K15p7m29M24q7J08J4j34J03k95J89L6L4k37K57m8K9J6nk47N0N9J77m05
$$ 67 -2 213 136 -293 131 44 152 166 32 135 -160 29 65 99 -138 119 71 100 116 111 -136 -86 -27 150 -255
5540b55l7L06k1q1L23j85L52k05l3j30L5K1j97j62K99o0j31K12j26K98k14Q4p6
$$ -255 -292 14 -7 -88 235 50 402 197 164 34 69 90 -107 -269 30 -30 -161 51 -75 223 9 93 17
5563A7J1M17n50O6J56k78M99n48J74J24o1j9n1P7k43j11M19M0J33l4j36R4k27
$$ 17 28 445 -105 -39 117 -161 338 -210 -36 88 27 8 -43 34 -209 -320 99 139 272 238 102 196 -31
5586c1J6Q7j40l1N0O8j6j46K00j14m4K63k53m2k83K96l0J97j10j5J90l28J31J22
$$ -31 -15 72 -68 -99 -49 19 3 -143 57 -57 -101 162 -91 -133 -416 -120 -150 47 -63 -78 112 -216 -85 37
5610C7J77k64J01R8n68M50j22K34j28L21j47j48J83l37K34j93J9Q6Lm36P61q9
$$ 37 214 -50 51 149 -419 31 -91 143 15 336 189 41 224 -113 121 -72 -53 33 36 -400 361 272
5632B72l72K27m7j11k7J19m7j18L71M4n55M90k86l5K81j16J1k23K33j16j36l2
$$ 272 -100 127 80 -31 -58 61 14 -104 267 311 -244 246 -40 -75 206 90 101 -122 111 -5 -141 -173
5654a73j60P11m11K56Nk79J20J04Oj9j78P0k78K56L3M0k38K26m1j3q9J24j27k3
$$ -173 -333 378 -33 223 228 -51 69 173 179 160 -18 52 -226 30 63 103 -135 91 50 37 -52 72 -55 -78
5678g8O2L5O7m10L43J11l30L49l52K06J2j93K24j56J38n7n6J34K66k75J24l23
$$ -78 -16 19 86 -324 19 130 -200 149 -203 3 15 -178 46 -110 28 -29 -85 49 315 40 164 -159
5700a59M42l04k04L51q7j57o4K53j0k81N26j19k76J29J62k73M3k2J36j3N4k07
$$ -159 283 -21 -225 126 39 -118 -182 71 61 -220 306 187 -89 40 202 -71 -28 -50 86 73 127 -80
5722h0K02j56J78k37L13j26Q2r6j42j89N14l07k9lK23MN8m03K0R7k01K07k02M04
$$ -80 122 -34 144 -93 220 94 176 80 -62 -251 263 -44 -73 -76 147 151 209 -194 -174 -77 -278 -71 -273 131
5746A31q9j60j98J22J82L06k52J03j24j18k0J02LJ16j26Qkj5K22l02L26n96K68
$$ 131 42 -118 -316 -194 -12 294 42 145 21 -97 -117 -15 -12 104 -22 -14 -16 -31 191 -111 215 -381 -113
5769a13J51j26o7R7L66l75J13k2r9J4j00L71o7j82J01J35l31P9j26L74K27n05
$$ -113 38 -88 -155 -58 308 -67 46 24 -75 -61 -161 210 143 -39 62 197 -134 -55 -181 193 420 -85
5791h5M49o4j10P9j17k12K37m5l1k93L97j72J45k07o4L33k27l15L11O7J13ll39
$$ -85 364 300 190 269 152 -60 177 132 101 -192 205 33 178 -29 -93 240 13 -302 9 76 189 186 -153
5814a53L15k79j66K77k42r0L52J29j46k46L34l22n9L74NJ3mJ09j54K0KN9j84j56
$$ -153 162 -117 -283 -6 -248 -338 14 143 -3 -249 85 -237 -296 78 83 96 92 201 47 67 69 128 -56 -212
5838b12K49J81O3k69R2l41m5L04J6j35K11l19J85J24N3ll48m4L27j11k68K89l03
$$ -212 37 218 281 12 104 -237 -282 22 38 -97 114 -205 -20 104 157 154 -194 -238 89 -22 -290 -1 -304
5861c04J92M3m8j00L07k67K87j30q5L25j58J2N0j97K71j63kJ57k14q9n9R6L01
$$ -304 -112 -69 -117 -217 90 -177 110 -20 -105 220 62 74 124 -73 198 35 33 190 -24 -113 -172 -76 225
5884B25k14l5m3K22l19J97K9J70k85l60J93L15k73p0K31P6J39L2n6n2j72L2l30
$$ 225 11 -24 -67 155 -164 33 62 232 -53 -413 -220 95 -178 -248 -17 59 198 230 174 122 -50 -18 -348
5907c48N50j48M7j57K64j2j02j77k1nQ4L40l38m0P2k23j8J0N42k17K24l10j56
$$ -348 202 54 101 -56 208 196 94 -83 -104 -109 -25 315 -23 -63 9 -214 -232 -222 320 103 327 17 -139
5930a39K83k21J46m34O53l65R7O5l95m3P7K07j46L74k12K3O3o8J71k2j00L0k90
$$ -139 144 -77 69 -365 288 -77 20 85 -310 -353 -276 -69 -215 159 -53 -30 33 -35 136 114 14 44 -246
5953b46J00L26l78K97q0j26j3K72J0p7J50j88j20pp3J55k14J31N34p48K43J74
$$ -246 -146 180 -198 99 19 -107 -120 152 162 85 235 47 -73 -80 -153 2 -212 -81 453 -295 -52 122
$$ [...]
8191b2
##END NTUPLES=NMR FID
##END=
