##TITLE=1H_Ser EL-1
 CDCl3
 8 sc, 
 28.11.2023
##JCAMPDX= 6.0         $$ Bruker NMR JCAMP-DX V2.0
##DATA TYPE= NMR FID
##DATA CLASS= NTUPLES
##ORIGIN= UXNMR, Bruker Analytische Messtechnik GmbH
##OWNER= root
$$ XWIN-NMR		Version 3.5
$$ Tue Nov 28 15:33:36 2023 Russian Standard Time (UT+4h)  she@DPX200
##.OBSERVE FREQUENCY= 200.1313
##.OBSERVE NUCLEUS= ^1H
##.DELAY= (6, 6)
##.ACQUISITION MODE= SIMULTANEOUS
##.ACQUISITION SCHEME= undefined
##.AVERAGES= 8
##.DIGITISER RES= 18
##SPECTROMETER/DATA SYSTEM= spect
##.PULSE SEQUENCE= zg30
##.SOLVENT NAME= Acetone
##.SHIFT REFERENCE= (INTERNAL, Acetone, 0, 15.7039)
##AUDIT TRAIL= $$ (NUMBER, WHEN, WHO, WHERE, WHAT)
$$ ##TITLE= Audit trail, XWIN-NMR		Version 3.5
$$ ##JCAMPDX= 5.01
$$ ##ORIGIN= Bruker BioSpin GmbH
$$ ##OWNER= she
$$ F:/spectra/data/she/nmr/H-F/1/audita.txt
$$ ##AUDIT TRAIL=  $$ (NUMBER, WHEN, WHO, WHERE, WHAT)
(   1,<2023-11-28 15:32:04.40 +0400>,<she>,<DPX200>,
      <created by zg, POWCHK disabled, PULCHK disabled
       configuration hash MD5:
       00 E9 B6 7A A2 85 ED C7 34 08 36 98 17 FE 4E 26
       data hash MD5: 16K
       D6 03 1B B2 92 FE 8E 5F 11 1D D5 E2 47 61 9C 9B>)
$$ ##END=
$$ 
$$ hash MD5
$$ 0A A2 CA 51 DB 65 05 41 7F FF CD 9B 85 5D FD DA
##$RELAX= 
##$RELAX= 
##$RELAX= 
##$RELAX= 
##$RELAX= 
##$RELAX= 
$$ Bruker specific parameters
$$ --------------------------
##$DU= <F:/spectra>
##$EXPNO= 1
##$NAME= <H-F>
##$PROCNO= 1
##$TYPE= <nmr>
##$USER= <she>
##$AMP= (0..31)
100 100 100 100 100 100 100 100 100 100 100 100 100 100 100 100 100 100 
100 100 100 100 100 100 100 100 100 100 100 100 100 100 
##$AQSEQ= 0
##$AQ_mod= 1
##$AUNM= <au_zg>
##$AUTOPOS= <>
##$BF1= 200.13
##$BF2= 200.13
##$BF3= 200.13
##$BF4= 200.13
##$BF5= 200.13
##$BF6= 200.13
##$BF7= 200.13
##$BF8= 200.13
##$BYTORDA= 1
##$CFDGTYP= 0
##$CFRGTYP= 5
##$CHEMSTR= <none>
##$CNST= (0..31)
1 1 145 1 1 1 1 1 1 1 1 1 1 1 1 1 1 1 1 1 1 1 1 1 1 1 1 1 1 1 1 1 
##$CPDPRG= <>
##$CPDPRG1= <>
##$CPDPRG2= <>
##$CPDPRG3= <>
##$CPDPRG4= <mlev>
##$CPDPRG5= <mlev>
##$CPDPRG6= <mlev>
##$CPDPRG7= <mlev>
##$CPDPRG8= <mlev>
##$CPDPRGB= <>
##$CPDPRGT= <>
##$D= (0..31)
0 1.2 0 0 0 0 0 0 0 0.06 0 0.03 0 0 0 0 0.0002 0 0 0 0 0 0 0 0 0 0 0 0 
0 0 0 
##$DATE= 1701171123
##$DBL= (0..7)
120 120 120 120 120 120 120 120 
##$DBP= (0..7)
150 150 150 150 150 150 150 150 
##$DBP07= 0
##$DBPNAM0= <>
##$DBPNAM1= <>
##$DBPNAM2= <>
##$DBPNAM3= <>
##$DBPNAM4= <>
##$DBPNAM5= <>
##$DBPNAM6= <>
##$DBPNAM7= <>
##$DBPOAL= (0..7)
0.5 0.5 0.5 0.5 0.5 0.5 0.5 0.5 
##$DBPOFFS= (0..7)
0 0 0 0 0 0 0 0 
##$DE= 6
##$DECBNUC= <off>
##$DECIM= 32
##$DECNUC= <off>
##$DECSTAT= 4
##$DIGMOD= 1
##$DIGTYP= 9
##$DL= (0..7)
0 120 120 120 120 120 120 120 
##$DP= (0..7)
150 150 150 150 150 150 150 150 
##$DP07= 0
##$DPNAME0= <>
##$DPNAME1= <>
##$DPNAME2= <>
##$DPNAME3= <>
##$DPNAME4= <>
##$DPNAME5= <>
##$DPNAME6= <>
##$DPNAME7= <>
##$DPOAL= (0..7)
0.5 0.5 0.5 0.5 0.5 0.5 0.5 0.5 
##$DPOFFS= (0..7)
0 0 0 0 0 0 0 0 
##$DQDMODE= 0
##$DR= 18
##$DS= 0
##$DSLIST= <SSSSSSSSSSSSSSS>
$$ [...]
##$SUBNAM2= <"">
##$SUBNAM3= <"">
##$SUBNAM4= <"">
##$SUBNAM5= <"">
##$SUBNAM6= <"">
##$SUBNAM7= <"">
##$SUBNAM8= <"">
##$SUBNAM9= <"">
##$SW= 18.0517328524113
##$SWIBOX= (0..15)
0 0 2 0 0 0 0 0 0 0 0 0 0 0 0 0 
##$SW_h= 3612.71676300578
##$TD= 16384
##$TD0= 1
##$TE= 0
##$TE2= 300
##$TE3= 300
##$TEG= 300
##$TL= (0..7)
0 120 120 120 120 120 120 120 
##$TP= (0..7)
150 150 150 150 150 150 150 150 
##$TP07= 0
##$TPNAME0= <>
##$TPNAME1= <>
##$TPNAME2= <>
##$TPNAME3= <>
##$TPNAME4= <>
##$TPNAME5= <>
##$TPNAME6= <>
##$TPNAME7= <>
##$TPOAL= (0..7)
0.5 0.5 0.5 0.5 0.5 0.5 0.5 0.5 
##$TPOFFS= (0..7)
0 0 0 0 0 0 0 0 
##$TUNHIN= 0
##$TUNHOUT= 0
##$TUNXOUT= 0
##$USERA1= <user>
##$USERA2= <user>
##$USERA3= <user>
##$USERA4= <user>
##$USERA5= <user>
##$V9= 5
##$VALIST= <valist>
##$VCLIST= <CCCCCCCCCCCCCCC>
##$VD= 0
##$VDLIST= <DDDDDDDDDDDDDDD>
##$VPLIST= <PPPPPPPPPPPPPPP>
##$VTLIST= <TTTTTTTTTTTTTTT>
##$WBST= 1024
##$WBSW= 4
##$XGAIN= (0..3)
0 0 0 0 
##$XL= 0
##$YL= 0
##$YMAX_a= 122058
##$YMIN_a= -154973
##$ZGOPTNS= <>
##$ZL1= 120
##$ZL2= 120
##$ZL3= 120
##$ZL4= 120
##$ABSF1= 10
##$ABSF2= 0
##$ABSG= 5
##$ABSL= 3
##$ALPHA= 0
##$AQORDER= 0
##$ASSFAC= 0
##$ASSFACI= 0
##$ASSFACX= 0
##$ASSWID= 0
##$AUNMP= <proc_1d>
##$AZFE= 0.1
##$AZFW= 0.1
##$BCFW= 1
##$BC_mod= 2
##$BYTORDP= 1
##$COROFFS= 0
##$CY= 11.3945322036743
##$DATMOD= 1
##$DC= 2
##$DFILT= <>
##$DTYPP= 0
##$F1P= 15.7292609196834
##$F2P= 12.9074282941183
##$FCOR= 0.5
##$FTSIZE= 0
##$FT_mod= 4
##$GAMMA= 1
##$GB= 0.15
##$INTBC= 1
##$INTSCL= 1
##$ISEN= 128
##$LB= 0.24
##$LEV0= 0
##$LPBIN= 0
##$MAXI= 10000
##$MC2= 0
##$MEAN= 0
##$ME_mod= 0
##$MI= 1.114404
##$NCOEF= 0
##$NC_proc= 0
##$NLEV= 6
##$NOISF1= 3.799351
##$NOISF2= 2.8
##$NSP= 1
##$NTH_PI= 0
##$NZP= 0
##$OFFSET= 15.70392
##$PC= 1
##$PHC0= -24215.46
##$PHC1= 1.2527
##$PH_mod= 1
##$PKNL= yes
##$PPARMOD= 0
##$PSCAL= 0
##$PSIGN= 0
##$REVERSE= no
##$SF= 200.130013532006
##$SI= 16384
##$SIGF1= 3
##$SIGF2= 2
##$SINO= 400
##$SIOLD= 16384
##$SREGLST= <1H.CDCl3>
##$SSB= 0
##$STSI= 0
##$STSR= 0
##$SW_p= 3612.71676300578
##$SYMM= 0
##$S_DEV= 0
##$TDeff= 0
##$TDoff= 0
##$TI= <>
##$TILT= no
##$TM1= 0
##$TM2= 0
##$TOPLEV= 0
##$USERP1= <user>
##$USERP2= <user>
##$USERP3= <user>
##$USERP4= <user>
##$USERP5= <user>
##$WDW= 1
##$XDIM= 8192
##$YMAX_p= 0
##$YMIN_p= 0
$$ End of Bruker specific parameters
$$ ---------------------------------
##NTUPLES= NMR FID
##VAR_NAME=  TIME,          FID/REAL,        FID/IMAG
##SYMBOL=    X,             R,               I
##VAR_TYPE=  INDEPENDENT,   DEPENDENT,       DEPENDENT
##VAR_FORM=  AFFN,          ASDF,            ASDF
##VAR_DIM=   8192,          8192,            8192
##UNITS=     SECONDS,       ARBITRARY UNITS, ARBITRARY UNITS
##FACTOR=    0.0002768,     1,               1
##FIRST=     0,             0,               0
##LAST=      2.2672688,     0,               0
##MIN=       0,             -154973,         0
##MAX=       2.2672688,     122058,          0
$$ Real data points
##PAGE= N=1
##DATA TABLE= (X++(R..R)), XYDATA
$$ [...]
2000c14J062q25K19L58p26k2K35m40N37j45m32Q12m63r7N22p83K67R74j022O07
2020C24K46r94P01j37m73P10o03k6N70n11k78P51n96L40L75p77M53k74j10R43
2040F34o17PN60p64K93J67n65P86n1q43J015o12n76R72n76l59R79n99J07K53o95
2061d84Q48l21k43M11j66j32L00k69qO61r06J92L88o92L49K11n79P18m26n23Q26
2082A55n38L64M49r45M92N33p26J65M67p40Q10l75k20K99j81k18O46q76N12Q1
2102A54p53R96m10o38Q68k61o79J462p12j67P76q65K99L70o24J00K43m56O20o72
2122c49j3O12q92M60N34q26O22M12p85R68m42o09Q90o33j78N17m43j02N03n82
2142c36N89l82l38O27j27m81O39n70K5O45p48Q06O8n29J67K36n82N03J1n64O80
$$ y = [-314, 748, -77, 142, 500, -226, -248, -13, -453, 84, -61, -493, 319, -144, -241, 281, -502, -235, 739, -283, 324, 570, -424, 277, 140, -333, 377, -226, -252, 318, -193, -471, 280, -316, 24, 399, -378, 75, -199, -309, 634, 17, 24, 584, -180, 113, 280, -285, 501, 450, -393, 622, 10, -566, 406, -170, -529, 450, -149, -42, 211, -484, 364, 43, -200, 211, 45, -87, 213, -56, -64, 597, -309, -117, 271, -421, -72, 139, -440, 278, -148, -671, 155, -383, -19, 430, -515, -23, 510, -216, -51, 416, -324, 486, 111, -109, 190, 9, -209, 437, -439, 73, 154, -599, 397, -13, -651, 217, -44, -723, 739, 27, -140, 636, -229, 70, 440, -184, -84, 159, -297, 323, -349, -362, 250, -642, -182, 352, -474, 148, 560, -225, 743, 301, -308, 582, -51, -229, 288, -155, -257, 246, -336, 253, -129, -467, 160, 33, -448, 191, -379, -354, 291, -457, 349, 417, -112, 55, 291, -291, 212, 223, -341, 339]
2163C39m67k96P52n69J37M80p30K89L11p74Q50r4l82N42o00k1P86p52M24L11q07
2184b71L06J66o13P11l81m76Q02n44j94R20o28K67J4m07N24j4k40N07l08r3K34
2205B82p16K35N74q73J86O60r59R82l58k91O60n58oO13m35j18O32q56L53O41r85
2226c37P32l23j47M14p67N1O56p40L29O65j082L04N93q35P85O4p53O66n54R5P94
2247F10o36J67N04p98J27j0m44R16n17n27J117o44o2M37n99L80M22q62O54j85
2267E0n97R57n2p12Q85m72OJ95n76J75N42q87O19O1q95J165n24m20R03m50l12
2288c39R25j153O62N29r33O50j71p38R85m33l06O81q22J54O42n37r0M94q27Q44
2308B17k06k61P82m74k83N99l23j65R01j023L64J98o37M43N1p83P57j68m52M72
$$ y = [339, -128, -424, 328, -241, -104, 376, -354, -65, 246, -528, 322, 228, -154, 388, -212, -233, 553, -199, 225, 536, -271, 35, 201, -412, 299, -82, -558, 244, -300, -494, 426, -202, 65, 79, -328, 196, 182, -58, 449, 141, 48, 282, -434, -199, 375, -498, -312, 348, -611, 371, 13, -278, 382, -176, -182, 431, -4, -122, 510, -346, 7, 648, -337, 395, 72, -75, 339, -428, -377, 279, -461, -132, 533, -549, -245, 348, -487, 298, 362, -391, 275, -279, -184, 610, -26, 141, 645, -153, -26, -36, -480, 436, -81, -608, 509, -135, -197, 240, -359, 21, 443, -419, 235, 50, -547, 410, 358, -354, 531, 59, 65, 260, -316, -141, 401, -486, 133, 194, -701, 464, -60, -480, 423, -27, -339, 586, -567, 95, 624, -309, 341, 170, -568, 417, -16, -322, 359, -463, -309, 333, -204, -294, 200, -627, 217, 11, -250, 532, 58, -225, 374, 51, -114, 787, -236, 128, 326, -311, 132, 183, -600, 157, -11, -463, 9]
2328Ik79J80J84m30N30l2o34Q93j62n07P90p39NO97q62M19O2n59M87R5n26Q05
2350D26k80l64L06m9j9M42m72K49lm03Q6L41o37P35k93m55O13l88r9N02p63J58
2372c67P18p37M16J32p77R72l01k26O60l10l00O55p41o4N87p24N69j55q07J170
2392C70n15j61Q15q66J89P97j013K36P09q80M69J56q56J006m04n11Q46p22J61
2411a74L25j09O7r8o07O38p9n36J063o25n2P83p60K52L75n61N06j9n86J42R1k42
2433b06L61j82m4K34o69L02L04n78O14K79q29N27M0l40O18m47l7K18j71j60M63
2454B97l86K3Q6l96L68j06l78Q86o07q3O38m69O6M66k79K6Rk23M48k25n54O63
2476B70j49m63O66p35K37O46o47J43N4m95P55o9n30P00k43j34O14q03K31K96n84
$$ y = [9, -270, -90, 94, -336, 194, 162, -472, 421, 259, -248, 542, -197, -192, 505, -357, 62, 124, -435, 52, 147, -379, 426, 146, -218, 88, 39, 20, 462, -10, 239, 236, -167, -81, 260, -377, 358, 65, -390, 223, -165, -264, 238, -525, -367, 351, -386, 30, 162, -615, 357, 56, -170, 490, 180, -120, 535, -206, -270, 317, -407, 162, 7, -800, 370, -145, -306, 509, -357, -168, 629, -384, -148, 561, -319, 150, 306, -550, 456, 52, -459, 387, -335, -174, 151, 42, 109, 11, -596, 42, -37, -573, 490, -135, -187, 596, -164, 88, 463, -98, 408, 389, -197, -55, 36, -206, 155, -27, -71, 163, -506, -204, 100, -478, 136, 415, -414, 113, 153, -187, 431, -16, -53, 165, -6, -166, 297, -89, -66, 20, -376, -8, -114, -492, 394, -213, -296, 342, -127, -61, 405, 126, 152, 161, -62, 386, 161, -393, 270, 121, -342, 324, -411, -174, 472, -175, -32, 22, -473, 282, 213, -317, 383, 140, 6, 620, -183, 48, 344, -240]
2497b40M04j6n93N90j82k21P27o37k41Q06p37J06N14q11Q90J85q11P64j77l74
2517e4O64m60m41M48m93L65k0n00L43L99m88P30n57l49N90K9k45Q27o77j81M28
2538C58n71O07j83l80N18j95m00O48o28K70j24m46P04o6l78L31j44l27J189o72
2558A11j61N60m25j35M04o70L61J97p45M96j0m65O18k10k92Q45p28K10O08o91
2578a22J31M17o40O08k29k92L72k21k15Q13j069J21O31k80r2J70o45O48r2j38
2598a24O99p25j70N04m41K63J54k63L00J94p50M47j70j08N29o26N1M06m41R8M10
2619B37o47P08k41n37R54l43n04P71m67J03M14m81O2R5l95M51m58P0N47m85k26
2640c72N88j62k97Q05q59K25O43q34N23P2n84M13k94j32Q84r91M8M89p25L82K51
$$ y = [-240, 164, 148, -445, 145, -37, -258, 469, -168, -409, 397, -340, -234, 280, -531, 359, 544, -267, 497, 320, -54, 610, 150, -291, 157, -336, 29, 9, -491, -148, 251, -237, 493, -64, -413, 177, 206, -39, 788, 111, -70, 358, -213, 394, 211, -169, 349, 154, -246, 402, -226, 44, -80, -526, 178, 112, -266, 65, -79, -406, 783, 111, -50, 510, 85, -50, 354, -316, 45, 242, -503, -7, -17, -482, 136, -74, -366, 479, -249, -39, 569, -122, 9, 426, -214, 394, 165, -127, 245, 24, -191, 622, -447, -326, 305, 25, -67, 103, -542, 106, 14, -124, 575, -150, -320, 184, -257, 6, 160, -103, 197, 391, -359, 88, -82, -190, 339, -287, -236, 170, -271, -173, 237, -410, 298, 57, -480, 474, 131, -373, 398, -69, 34, 448, -33, 29, 124, -271, 180, -278, -208, 339, -146, -372, 216, 54, -243, 562, -297, -72, 571, -263, 260, 332, -252, 161, -133, -265, 619, -372, -324, 165, -560, -178, 73]
2661G3m03K46J18n28N09J25m81P34q1q4j1k93K03J29o23O81j63m62O13k79m90
2682d67Q57o80j03O49m25L35J40o60M68K97m61L62l06n5M54j48j25K45o81K39
2702f5M33n99L64r8m11P34l82j49M87n27K64J34l05J59K2j82M81o0n52O83o29
2723a98K8M95n81j03P10p35K19M19o50O99l84p7N53k48j09Q68j017K51J00l82
2743a42J81k25q7M29q2o15P53j51n04P90o06J50L96k26k54N26o50O01q7j45K00
2764B52j93L2L05p29K74M50n12j10N59p38L85k8n34R61o52J60L25l43L7M62p30
2785c67L82J62o74N32J92p36Q64k99n38Q38n38R3M11m26L87j25l01M47l47m92
2805e35J052n77M6M30q58J91K55m22N44J82p64L20M5k05P07o53j5N70o39N44J32
$$ y = [73, -330, -84, 34, -494, 15, 140, -341, 393, 312, 228, 217, -76, 127, 256, -367, 314, 151, -311, 302, 23, -467, 390, -290, -393, 256, -169, 166, 306, -354, 114, 411, -50, 312, 6, -49, 405, 257, 132, 377, -304, -65, 368, -231, 133, 35, -376, 358, -24, -173, 314, -213, 51, 185, -120, 39, 61, -121, 360, 300, -252, 431, -198, -170, 325, -256, -359, 351, -384, -165, 254, -396, 303, -81, -158, 395, 147, 38, 906, -111, 140, 240, -142, 39, -186, -273, 156, 74, -541, 212, 61, -443, 347, -259, -109, 287, 61, -193, 333, -317, 284, 197, 52, 252, 59, 91, 396, -333, -59, 391, -121, -231, 328, -410, -25, -53, -587, 374, -278, -118, 207, -136, -99, 363, -367, 15, 177, -497, 35, 227, -509, 355, 56, -482, 356, -182, -89, 322, -104, 283, 158, -143, 304, -43, -535, 517, -60, -14, 416, -442, -251, 4, -418, 126, 308, -456, -136, -91, -296, 411, -242, -257, 313, -326, 218, 350]
2826C50n73N94q5n63O82k74l19M77m65j54P16l69k94O16q04N36J08m80M75j03
2846G1q3O32p51Q8N39r58L43O37p34M94k7o18P29k10l23N61n50j33O57q08O51
2867B07p2l14M97p8m08N59m05k21O86n32k64N12l35j04N54m82N55r1o12P80m74
2888d2k30P20n63Q7M10p17L58M95q21N67j35l24L83k93m62L67j32L37L13o88M58
2909H8J75q09O66K7n78R64n78m65O86m88K91J35l97M33j27n11N28q4l96P13n20
2930b47o3N63m30jO33o75L50K55m75K83Q4m16L50k96M4K88p83K96J27l25L36K60
2952A58m93P38m74n03Q61k60o7M47n67MN16p28O54k28k78K08K48m77M64m50n6
2973b83O09q09L36L25n06N42j1o64L79K85l23N18n56K22N65q37K42K11o59L02
$$ y = [350, -223, 371, 286, -277, 405, 131, -188, 289, -176, -330, 386, 17, -277, 339, -465, 71, 179, -301, 174, 71, -12, 620, -131, -43, 496, -462, -119, 518, -216, 278, 251, -367, 362, 152, -171, 390, -160, -293, 364, -444, 207, 135, -179, 318, 240, -168, 391, -14, -235, 451, -81, -345, 167, -168, -272, 282, -200, 355, 264, -348, 432, -42, -272, 448, -115, -28, 382, -335, 23, 518, -303, 264, 129, -195, 188, -105, -567, -200, -332, 5, 318, -370, 88, 263, -546, 120, 147, -431, 533, -45, -510, 176, -312, -21, 114, -283, 150, 23, -488, 40, -44, -440, 273, -247, -310, 253, -177, -178, 455, -220, 130, 385, -90, 193, 277, -139, 211, -85, -41, 247, -536, -240, -113, -438, -102, 158, -335, 403, -71, -574, 287, 27, -40, 407, -160, -156, 360, -368, 286, 58, -220, -12, 236, -241, 223, -227, -283, 326, -483, -147, 178, -328, 214, 203, -461, -82, 203, -120, 398, -158, 64, 629, -208, 34, 245, -414, -112]
2993a12K67p19N72k37jN18o41K15N01m43K04M2l03L89j48m29O65l71j47N54n61
3014a85n1M15m92M82R9o54P26l88m55P71k31j17L95m59K58L8k34N8j17o8O28o03
3036a84k34O58m96L60K98m98j44N46m02J08J09l18L85j05k52N67k80l21N60n46
3056a89J93L67o53L14j29k28P07m62m02R66n57j48O97m61n0L46m65N6L93m77O56
3077D74l69k69L18k96R6qk75ON19o99Q47j79m38M75l08O5N26n58L12K08m81L11
3099B77j29m34K36J08l37O36o90J03O34n16j8L14m81N04k2o26K69N08n54O02j37
3120B47m74O64n75k13N30l62L37m24rN04l45k24O78m11k66P07m96M87k73m82M68
3141F8J39k79K67r0k22K22j63k83Q66q31J90M70q71M80L82o81N03J65n00M49l04
$$ y = [-112, 155, -564, 8, -229, -230, 288, -353, -138, 363, -80, 124, 166, -137, 252, 104, -325, 340, -31, -178, 376, -185, -236, 179, -313, 169, 268, -386, 340, -48, -503, 268, 37, -80, 315, -144, 114, 152, -82, -24, -141, -209, 419, -184, -418, 240, -256, 104, 402, -96, -240, 306, -96, 12, 121, -197, 188, 83, -169, 398, 118, -203, 357, -189, 4, 371, -282, 32, -97, -325, 382, -80, -482, 484, -73, -221, 476, 15, -35, 311, -154, -98, 295, -182, 474, 105, -164, 154, -142, -46, -54, -329, -323, 196, -503, 344, 165, -273, 202, -106, -41, 485, -73, 239, 447, -34, 277, 148, -286, -50, 58, -279, 357, -333, -230, 404, -112, -130, 184, -297, 207, 185, -441, -172, 336, -218, 384, 247, -227, 437, -138, -351, 179, -183, 154, -270, -279, 225, -120, -344, 334, -77, -343, 364, -132, 355, 82, -400, 68, 207, -72, 195, 105, -117, 105, -58, -341, 525, -306, -116, 354, -517, -37, 345, -336, 167, 332, -168, 281, -23]
3162b3L4M22n13R4M12p35O87j60o87N75P3n42P54l54n20O36m96M92k9k76K13M5
3184A02m03N03l4l95M48k63j23L29m74K00O0m33M18K09o75Q30j90l54M51l66J91
3205C1K70l40n3L16o16M22M50n69L51m41j97O90q42J83N36p61N92J03j58j1j41
3226a85j48O04k69j05M79n02K02K40m90M10J33j008O72J91n76N42j96k79L71l36
3246b50K29L38m95K82P4l26M85j65n34O32m46m1N09k71k57P38q19J95K58l97L53
3267I2J21q04P57l23J12N29m65q8N13o03L10J30n48N63rp13M09J09m21L89j14
3288e4l00P07n01J06p1L4N23k24o7M3j54l26M25j53j65O14p51K22J71m09N50j71
3310D9k57K93m2p3L02n45J92M42m14K46J49p96P53m8k15R9k11L8L01k92j52N31
$$ y = [-23, 11, 433, -80, 14, 426, -309, 378, 218, -469, 106, 179, -363, 391, 37, -483, 153, -343, 149, 120, -156, 57, 102, -301, 202, 168, -227, 221, -42, -165, 164, -310, -110, -50, -483, -65, 144, -531, 299, 109, -245, 206, -160, 31, 301, -39, -92, 224, -392, 30, 480, -89, 262, -179, -376, 314, -528, -345, 191, -570, 22, 125, -33, -44, -185, -333, 271, 2, -103, 376, -126, 76, 316, -174, 236, 369, -639, 33, 224, -352, 190, -6, -285, 86, -250, -21, 317, -178, 104, 178, -148, 337, 172, -362, 270, -176, -217, 292, 21, -236, 502, -317, -122, 136, -261, 92, 213, -591, 166, -157, -45, 484, 19, -69, 444, -159, 151, 281, -267, 296, 287, -426, -17, 92, -329, 60, -54, -354, 353, -148, -42, -113, -79, 444, 220, 153, 196, 42, -284, 141, -12, -177, 437, -314, -92, 79, -330, 220, 49, -208, 85, 43, -30, 272, -273, -81, 361, -53, 193, 342, -454, 299, 251, 36, 135, -76, -38, 263, -29, -181, 350]
3332C50p21M59l4k65K47j35l83P55l57n8O99p47k1K01qJ89l06mL39l28J3K47l86
3355b54J63N18o12J91L80q53O69r1j37J50j05n72N46J8j30L55m29O7L78o32M95
3376A15J9o04P35m57j94Q97m70M9J45m13K91J21l88K58K02q80N37j70J40M03m49
3397a13KJ60m19J56K92l20M47j2k71L24k5m77P77m42k62N80p14K39L59n04Q4K15
3419G6m19N64l38l0L13o03N83J88n68K38J44l58M96m59L0M59l82M0K87n76K89
3440b6J75l50J13K13n84P00j47m89P22j12l98O83l51Q3j34J24r6J69o26O47l38
3461b2j22L27m21m4L35q7j81M11l45J73L30m56L16K5n57O26m72O8M21l69P8J04
3483A38n20N61J68p31M01L07p03L99j43P1M05n09M65P6p02M42K48n68O04k28j41
$$ y = [350, -371, 88, 54, -211, 36, -99, -482, 273, -84, -142, 557, -190, -211, -10, -18, 171, -135, -139, 200, -128, -115, 132, -254, -91, 427, -185, 6, 386, -467, 202, 111, -26, 124, 19, -553, -7, 11, -119, 236, -193, -126, 252, -380, 115, 134, -470, 265, -192, -386, 511, 41, 90, 235, -178, 113, 234, -154, 104, 306, -574, -37, -207, -67, 336, -113, -111, 49, -370, -214, 78, -242, 205, 193, -78, 246, 221, -256, 521, 79, -183, 397, -317, -78, 281, -223, -139, 76, -343, 221, -117, -147, 166, -437, 146, 334, -234, 4, 148, -210, 286, -173, -143, 316, -66, -26, 261, -315, -26, 149, -201, -88, 125, -459, 241, 94, -395, 327, 215, -183, 500, 149, 232, 98, 222, 126, 295, -331, 316, -22, -144, 183, -238, -282, 53, -34, -215, 196, -149, 24, 354, -102, 214, 239, -318, 308, -164, -96, 325, -44, 34, 138, -382, 179, 347, -384, 17, 324, -379, 20, -123, -52, 353, -156, 309, 385, -317, 125, 373, -195, 409, 181, 40]
3504D0J53l64J54K80n88L68Nm16M54l4j64M81l17q0M86m48M5K11k86j2K91n06
3526b47k5K34j71L03j22j45K07l06P2N33m94n4M88o33N39R7l83M89m55l4M80o43
3548b70L73J87l54r8J87m63M23R3l22K67J38m48N71k86p6L86m69J95J79m01L48
3569A60j36n85O71l53j42M54l42n1L96j38N7J21l86N38j68l72P01n04k12R70q01
3590a22J61J93p80Q01j2o47K95p8o5L12j63N4M15l44k14M22n94O29K85n73K17
3611A92P1m55M52j57n72O42m61J28K33m59P50j73m45L56o5l11N09m96O5P70p82
3632b08J14M12k58PK46q17O24O9m22L61k65%M11l85P4J56l18M63j92k70M16k36
3654a8j53N54l47r1K26m57J86L18n90M14q9m38N62p2m65O00j34m0L06m03j01L13
$$ y = [40, 193, -171, -17, 263, -325, 43, 48, -368, 86, 52, -112, 369, 52, -28, 458, 10, 55, 266, -20, -32, 259, -247, -272, -38, -209, 94, -28, -173, 34, -272, -200, 333, -161, -215, 273, -360, 179, 276, -107, 382, -73, -107, 373, -270, 103, 290, -64, -162, 25, -438, -15, 78, -244, 23, 161, -287, 284, -2, -78, 308, -161, 34, 213, -188, 160, 24, -561, 110, -243, -385, 69, -273, -324, 72, -66, -9, 112, -274, 264, 96, -276, 425, -79, -291, 679, -122, 39, 232, -548, 253, 241, -406, -111, -189, -254, 58, -105, -51, 364, 20, -194, 228, -366, 263, 548, -25, 192, 263, -192, 260, 103, -469, 173, -288, -160, 73, -386, 364, 191, -254, 102, 37, -274, 235, -261, -196, 574, -208, -94, 318, 60, 67, 313, -504, 120, 189, -233, 128, -137, -137, 274, -111, -37, 119, -199, 264, 72, -198, 218, -18, -171, 383, 36, -55, 171, -286, -100, 218, -372, 42, -47, -485, 77, 5, -460, 140, 6, -34, 272, -131, -232, 81]
3676H1j98M01r2m05N85n20j38N39k54l7j3J9k34J52j50K71J18n86Q68m33M8J07
3698A29l9j53L25k71J22J35l08N7m0k85K84j4J6K49m79M71J71n07L36l1l65J69
3720b8K69n09M58m66K06J39k06Q2L37n83N24k11l76L16N6n1J2j69J40J65n41L44
3742i2K54l04L45j33m30L90j19q7N58l89j60L16m34K18J73j67L8P2j87L80k84
3763d2q0L90j6n12Q57o02o4M46p14L32O5m26J96K21j73Q8k21L44J46j87P6j07
3785A7k46J07N53o82M07k90N4L79l20j76N11o28K68K67l98P0J25l20M53K33o38
3806b54L22j11K50j36j80J27K64n87M37k4l21Q4J49k63N13m40j71L48j63J61J69
3827A74m54K70n5p7K33M6k69L79l27k75P11m51k78N93l10L15o9l32N38n65q6N62
$$ y = [81, -117, 284, 192, -213, 372, -148, -286, 253, -1, -38, -51, -32, -266, -114, -264, 7, 125, -461, 407, -26, 22, 129, 90, -63, 262, -9, 113, 248, -60, -3, -43, -328, -44, -58, -42, 207, -272, 199, 370, -137, 199, 168, -197, -28, 241, -268, 190, -276, -70, 69, -137, -55, 282, -301, 223, 12, -364, -48, 8, -43, -31, -200, -60, 105, -436, -92, 162, -142, 203, 70, -360, 30, -89, -176, 382, -7, -167, 149, -285, -67, 106, -61, -23, 49, -138, 242, -42, -122, 268, 252, -260, 597, -5, -69, 377, -337, -5, 60, -366, -170, 51, -122, -34, -255, 89, 235, 48, 124, 17, -229, -122, 431, -251, 156, -134, -80, 299, -21, -197, 314, -314, -46, 221, -177, -107, 18, -302, 151, 384, -254, 68, -43, 207, 71, -109, 18, 282, -305, 132, 108, -213, -129, 20, -243, 270, -170, -341, 7, -156, 5, 174, -280, -10, -65, -142, 91, 137, -132, 247, -80, -355, 356, -95, -373, 220, -90, 225, 156, -176, 362, -203, -289, 273]
3849B73k54O1L31o74M13j37j24L15n4l17L87l42J2K70l87Q7L40j04k40N95n37
3870h6L01k46q0K53k69K73M40n76j30L58j76k3J62m95O53j97o15M81k29j10M82
3891A71l06MK41j87P0J92m29K98j6l40N40l03j60L62k75j82L81k77K36j24J11
3912Gj71J43j88L15o6j76N63o79L12J34r5K39l43k17K44J95l71j06P2p4N88m90
3934a64j19L08k23K26J14o54O24K89o33M63Pl57L80m57R0K48m25L34K18n05L98
3955A62l67m6O07l29o7L63n30J96L84n42P00m78K6j19P6k37K09k55K00K59l98
3976a86K31K47q26O49R0n03M70k85j98M54k00l1N82n24j44K84k06L91l80j60M66
3997B21m18J08R3r6j50L76k67J83N5l68M67j62j59M76n8r8K0k88j9L13l23J25
$$ y = [273, 19, 80, 411, -263, 150, 13, -111, 204, 150, -167, 220, -122, -110, 160, -227, -140, 200, 96, -144, 451, -86, 215, -31, -111, 142, -127, 146, 586, 10, -120, 238, 62, 39, 201, -294, 359, 162, -453, 28, -201, -311, 171, -135, -131, 110, -77, -7, 185, -244, 54, 38, -302, 238, -65, -225, 137, -138, -320, 61, -216, 20, -104, 7, -164, -21, -209, 106, 40, -136, 427, -252, 60, 194, 99, 338, -5, -222, 22, 217, -154, -260, -188, -262, 326, -164, -283, 25, -198, 28, 142, -512, 112, 401, -232, 231, 238, -119, 261, -196, -106, 142, -283, 51, 269, -236, 162, -205, -251, 356, 27, -40, 323, -207, -11, 373, -169, 531, 53, 79, -40, 36, -201, 8, -247, -47, 212, -186, 45, 292, -534, 115, 205, -298, 172, -113, -311, 143, -57, -88, 494, -30, -174, 110, -96, 295, -85, -245, 221, -197, -89, 4, -92, -242, 134, -133, 50, 105, -263, 204, 42, -117, 359, 301, 203, 223, -65, -84, 229, -94, 31]
4019C1j5j53J12j2l56N12r4n12O07j90J90J04m10K18J70l33M86l34k97K14j93
4040b55K51J39k35j17M09l53J43J46k66J61K04n22N96q5m95L58L8J8K47n08K05
4061G9L0p23M67J15k59L52J26j41K85l72O7K13k09K60q5k91L58j4l10K24J6k56
4083f8J78j23q6K96m86K79r6J42K2M0l61K42r4K53J41n63K99Q6m06L96J93o64
4105c80M83R3q0R5l56j8L89m14j84M72l79O99n7m73K03j29J35K89n21M4L41m46
4127a94M88l74K13o1J13l80J54K9k80K13k25O34k01l12J56K8j71L26j32qK68k46
4149C8j38M08m82J21J4R0l73M50m84J67K22p7J78k89P7L34m09K39K36m42M09k58
4171C1k37R9r7k8L61l55K37M0j07J14K85m84j8L77k78M02m29R5K83l35K14J29
$$ y = [31, 16, -137, -25, -37, -393, 119, 25, -487, 120, -70, 120, 224, -186, 32, 202, -131, 355, 21, -276, -62, -255, -4, 135, -100, -217, 192, -161, -18, 128, -138, 23, 227, -295, 301, 216, -279, 79, 117, 135, 382, -126, 79, 109, -614, -147, -32, -291, 61, 187, 46, 331, -41, 26, 239, 30, 290, 205, -86, 272, 258, -52, 172, 188, -68, 110, -13, -99, 197, -289, -10, -106, 36, 58, 98, -263, -21, -115, 138, 279, -284, 15, 101, -305, 91, 284, -380, 103, 196, 116, 211, -145, -163, 226, -188, -372, 100, -279, 420, 363, -110, 93, -36, 99, 388, -133, -89, 252, -194, 294, -80, 133, 72, 185, -195, -41, -12, -292, -79, -304, 330, 129, -183, -27, 1, -170, 156, 24, 16, 284, 38, -100, 308, -174, -53, -39, 51, -322, 128, -356, -189, 33, -44, 134, -155, -78, 256, -153, 86, 322, -120, 289, 31, -206, -107, -204, -232, 129, -226, 11, 51, -56, 58, 343, -141, -159, 218, -60, 342, -87, 8, 291, -44, 170, 299]
4193B99n59J61L76o70L67j50r7K41j08k2L75k95J51N1n1j67J74j34j03P3j08N98
4215D02l95o8K27j75l27K37PK06J14k56j08K66l26O1Q8j16K07p7j31L95m31K13
4237A3K4K04k28O9m4p1Q5l03K83J1n0K53m01P4L11l30NL35k57Q5n5r5r6o5J45
4262i8J55k74J44K89n07R8L04k91J92k62K36J31k05P8O30n02j40K30J6j71P6l08
4284a79K12Qk01L23j82J96k18j06K31N9m78M85M4n30M90k39n1J10P0k51N56o79
4306c30K94%r1L8J84k78K58j09j49L04o08L47L07k01j43L0J68K58m97n8N08m69
4328b37O4L21k30j50K76J60j45N4j30K46l96J33K83m19K21K68l38J59Q7l36J59
4349E0J31l45N59l62MJ86k37j49K88l70K91n2j81J55rQ9l1K53m89M59m34J90L29
$$ y = [299, -260, -99, 277, -393, -26, -176, -273, -32, -140, -162, 213, -82, 69, 120, 69, -98, 76, -58, -161, -88, -196, 402, 7, -61, 166, -9, -336, -99, -92, 114, 228, -28, -136, 130, -196, -135, -47, -163, 44, -33, -164, 231, -200, 13, 37, 241, 13, 82, 38, -33, 52, -251, 32, 43, -7, 246, -155, -81, 230, -100, -95, 240, -17, 68, 13, -82, -178, -243, -98, 57, -217, -73, 216, -291, -193, 111, -180, 12, -250, -14, 117, -88, -10, 620, 118, -22, 208, 224, 53, 129, -179, 33, 41, -160, 163, -19, 177, -41, -147, 84, 143, -335, 150, 194, -336, 154, -85, -136, -26, 44, -207, 349, -330, -36, -36, -127, -89, 95, -183, 75, -34, -183, 121, -487, -140, 167, -34, -177, -147, 21, 279, -218, -276, 232, -237, -173, 148, -82, -232, 44, 204, 59, 113, -17, 229, -167, -34, 249, -170, 51, 319, -19, 140, 227, -109, 50, 181, -164, 395, 33, 37, 223, -14, -163, 125, -245, 46, -6, -187, -32, -41, 48, 17, 270, -219, 240, -194, -4, 325]
4372C25l09M9j09j43N3j31K06j68M56k87N5j97N0K63l59K13K44k15K55Rk76L16
4394C00j16j81L22l95j8L36n06N8K65k51K06K7QM8k74K2L68k11q8L00n47L26k5
4417b6k60K77p8k1J45j55o4K71M7k54L82n29L13o2k82M82k4k35J96j29N7K14l83
4440a18L23n5k00P7q0Q0J44k91O1L74k47k58K63j79K16q7j9j8J77p9J03l53K5
4463a41J92k64J44R7j26OpK9n0J08m16O15k14M7J09j29N1r4J69L4R7j80j57k59
4487c39J3L28q8M4M4k91J00M66l96J32N8m38M16n4m7Q8J95l86K23j71k30O15j31
4510A51m04K16j71K07m5q0J40R6n23M43k26K05Q8j63K25n6k54J17j61L4L52l18
4532a27J39K19k81j70L48j08q4J02k29K03jk83K59Lj5J92j04K2J41k26K69j81
$$ y = [325, 16, 65, -44, -187, -134, -265, -59, -227, 229, -58, -3, -200, -150, 113, -246, -33, 211, -4, 251, 260, -16, 300, 184, 3, 325, -70, -88, 248, -258, -200, 65, -186, 20, 47, 55, 103, -171, -149, 219, 8, -80, 220, -327, -1, -26, -286, -9, -87, -108, 37, -118, -182, 89, 136, -118, 264, -265, 48, -14, -296, 186, 162, -73, 123, -6, 51, 265, -118, 205, 150, -50, 27, -53, 27, 171, -120, -59, 315, 68, -190, 73, -106, 110, 23, 4, -14, 163, 84, 187, -166, -141, 51, -213, -69, 28, -98, -92, -99, -70, -120, -12, -428, 187, -27, 20, 129, 0, 51, -43, 126, 160, 257, 77, -80, -339, -326, 2, -86, -42, 2, -289, -189, 277, -119, 13, 71, -367, 49, -5, -52, 36, 231, -155, 68, -103, -333, 282, 151, -253, -37, -208, -1, -46, -126, 14, 110, -413, 30, -196, 9, 97, -66, 159, 103, -151, -34, -195, -161, 191, -127, 12, 231, -50, -220, 128, 20, -64, 38, -191, 12, 11, -272, -13, -10, -25, 167, 63, 85, 226, 0, 269, 88]
4554H8n17N58j80r8K63j91J09R9j64o6J29k50K26N3l8n4J59k37K36m23J91J12
4576Ek38L45lk99R8L6q1n2J74j33L42j06K2K35o68N83j35j22JK21j63L7o2j52
4600a15K09j86J06j89J0j12N52n82L43N4l55N39l20k02N72k41k8J2m32M70J7j36
4622a4J9k5l67N59n9l55K20k01L50j8j09Q4N5k07M54k80k88K47r6J1J64j45m8
4645d9K37m79L46j84k0R3K66k55K39j80J01K01j95L2j16PJ9lj39J4J83j74K19
4668A63j15j41Q8P4o7J07k71K86o9j63K15r6k50L49k71K93O8k50K13j16j34k0
4690a07J27L7k21j04J07J86k26j22L41j05J88j00q9K5L98m45K54L2k96N13o35
4711b42k3O80o13J9K67k46K45k40j6N5K83n00K87K1j1K19p9K2k06j19L21l6m7
$$ y = [88, -429, 129, -51, -149, 114, -77, 32, 131, -33, -99, 30, -220, 6, 59, 21, -33, 126, -111, 125, -298, -107, 5, -233, 112, 109, -190, -92, -56, -137, -189, -15, -148, 194, 88, 110, 345, -323, 260, 125, 3, 4, 225, 62, 99, 37, -115, 94, -92, 14, -175, -165, -277, 275, -307, 36, 90, -265, 274, -46, -248, 324, 83, 55, 67, -365, 105, 122, -14, 5, -20, -387, 172, 113, -242, -22, -223, 127, 109, 0, 84, 139, -68, 386, 106, -182, 65, -31, -20, 144, -1, -49, 188, -291, 55, -129, -149, -56, 210, -45, 194, 14, 115, 316, 121, 153, 37, 44, 63, 60, -79, -65, 118, -56, 163, 48, -93, -5, 69, 2, 109, -162, 124, 55, -108, 107, 11, -239, 110, -161, 132, 200, -50, 163, 47, -87, -107, 20, 57, -164, -268, -161, 25, -201, -323, 18, -87, 101, 1, -88, -63, 335, -110, 144, 176, -120, 393, -242, -265, 415, -198, -179, 88, -158, 87, -153, -169, -114, 169, -331, -44, -23, -34, 185, 106, 128, -78, -197, 124, 88, 41]
4734D1O1j74n0p3R8K38Q9l89K19N9l23J3K88l36K91n6qj69K01M9J22j59j77kM5
4759a02J59K7j51l8J49l7L33n85J93P5j88K7Ln6K46r9k68M32k95J9M19k71j34
4782a42K67l21L59l11Q5J71m7j73K2p6J23J5J19r9l2o9O0n6J52j15j31L46k98
4805a51%J70O6k75J82K43l25K46j36l51L44j61%K39k19J31J76j97m6O9j37N6K9
4828d7K29N7r3j8J59k25l32N03l29K5J87l27J65J3o6J53l7j07M48m91K53m6k94
4851b20J35J69ro3J95m90L56j20J06k3K3q9P4m82M73k84l4K27j64m6N45m20M5
4874i6L55k87r1nn5K99J23l82J92L6P3k54K78k78J93k73J45J6M9j27jK60l0R8
4898B38k20M7M7R8k36o4J35j8r4L3J29j46o7R5J49r6j79O4K18j83M00l95J14M
$$ y = [41, 102, -72, -122, -195, -97, 141, 230, -159, 60, 119, -204, -191, 97, -239, 52, -4, -12, -181, 20, 69, 191, 32, -145, -147, -102, 57, 84, -67, -105, 44, 7, 340, -245, -52, 23, -165, -138, -135, -191, 55, -44, -312, 120, -175, -156, 263, -8, -142, 125, -196, 163, -148, -63, 108, 61, -112, -90, -166, -43, -28, 91, -8, -40, -109, -49, -105, 47, -68, -199, 147, -151, -151, 19, 85, -190, -8, 235, -90, 156, 20, -331, 13, -148, -148, 91, -128, 3, 179, -18, -64, 5, -132, -76, -47, 182, 239, 146, 128, 287, 62, -270, 233, -96, -71, 116, -211, -46, -33, -99, 54, 17, -90, 358, -133, 120, 74, -220, -85, 84, 75, 12, 207, -283, 73, -47, 59, 36, 59, -30, 44, -438, 35, -249, -283, -56, -220, -266, 279, -141, -96, 259, -28, -119, -124, -179, 120, 243, -139, 53, 89, 162, -92, 186, -92, 101, -172, -27, -11, 38, -89, -90, 170, 140, 238, 18, 65, 112, 210, -26, -90, 45, 27, -67, -34, 95, -51, -118, -23, 126, 30, -149, -85, 133, -50, 350, -45, 69, 73]
4922G3mN5k65o8L7J30K11k82m1J08P0J09k72L47j58k05J34J58j26k22K91o2R9
4945A17j12J59n7o3J39k6j48M0J58k78J05j01n8L08m2j14L33n76J11K75m91N96
4967B75j62j92L02m31J36J24o0J19q7k85L59k30k9N05n67J65J05k42K78L2m26
4988c11L86J13l42P4O1k07M77j5j65k19J36J9J70l23J58N6k66L6M62n46M35k54
5010f5O1K14l5k28O9o5j59L89l74L03j23K7R7k39P4O3P9r9j57k77N63r8l12K62
5034c0J2q3p9K36p6K5k9j30M31l63p0R6K69l52J85k81K49j68N3q7K44K9k7k9O2
5059H7J0k23L08l10J19J6j16J7j1j38J63J71j43j57J87P1J21j46j95L53k01J10
5081I3P1k62K66J38l62J79k40J07K55j59j27L23o45M41q4r6kJ24k30rNL14j03
$$ y = [73, 69, 124, -141, -209, -172, -42, 169, -113, -154, -46, 24, 133, -139, 208, 50, -155, -21, 137, 11, -211, 80, 18, 117, 5, 164, 107, 44, 183, 157, 9, 49, 207, -71, 34, -67, -125, 183, 141, 27, 360, -216, -105, 170, -321, 275, 113, -79, 223, -208, -72, 52, -8, 111, 24, -261, 98, -132, -161, 344, -223, -58, 47, -195, 83, 115, -311, 75, 188, -154, -80, -19, -226, 251, 236, 71, -148, -12, 7, 177, -146, 12, 68, -198, -162, 300, -246, 189, -65, -4, 210, 175, -53, 16, -49, -208, 181, -193, 110, -13, 14, 111, -128, -54, 9, 88, -11, -168, -445, 118, 20, -292, -30, -18, -101, -180, 56, -20, 5, -24, -154, 277, -86, -156, -60, 209, -143, 42, -239, 10, -158, -105, -192, 52, 81, 54, 25, 87, 97, -126, 182, -128, -9, 7, -109, -92, -103, -241, -78, 93, -50, -207, -20, 51, 172, 26, -169, 184, -17, 93, 164, -98, 168, 306, -56, 123, -117, -10, 245, 86, -41, 282, -363, 78, -6, -102, -104, 20, -210, -219, -214, 100, -3]
5104cj85K24K14l9l0q2j89j51L08qm7P2l68K21N5k66L84r2j10N0j12J81K50l16
5128c9K19j37j96L47l06Q9J7j93J84N31n94P2M2k07L26l3l83L77Q9k17l19K98
5150c3k17M27j39j4J76k91J88j20q7K76j55k12L39k73J3M0l1M0l7J36r2Lj12K80
5174A05j20L51j81k05K2J86l72J78MRQ7K20k69Ql9J20j03J77o4j91n2J86Qj62
5198i7J48n3J33j68M2J74J23n09K23o9k56M20L9k03Q1Q0m61M86j39k1M02o12J77
5221f0J71J00l01J20k14r5J67J2J45p1j67L78l96J22J50k22P0J48Ok52j53J47
5243a95P2l56M18J71N0j12J33m02K81r2o6J82m4M4r7J14k92N42l14j34J48k13
5265a62K77M6l15K06l47K93K0j67K35R4l76J31K57k64K1L19l27p0K41J34J55n64
$$ y = [-3, -188, 36, 250, 211, 181, 99, -90, -241, 67, 59, 12, 84, -284, -63, -8, -274, 110, 18, -92, -42, -154, 27, 277, -39, 180, 43, -153, 194, -112, -23, -6, -199, -15, 516, -78, -6, 36, -171, 155, 122, -261, 116, 205, -12, -331, -33, -250, 177, 38, 24, 200, -91, 97, -23, -110, 166, 11, -201, 138, -135, -122, -82, -113, -73, -110, 26, -66, -63, -175, 105, -15, 336, 155, -50, -28, 158, -214, -36, -32, -23, 64, 284, 15, 23, -16, 104, 1, 178, 114, -77, -129, 57, 65, -97, 51, -2, 131, -37, 5, 179, 302, -207, 16, -53, -309, 111, 150, -53, 28, 108, -353, 133, -6, -27, 375, -237, -60, 111, 211, -90, 30, -184, -279, -112, -100, 45, -26, -193, 185, -211, -89, 61, -161, -91, 57, 63, -189, -342, -195, -123, -479, -61, 110, 160, 48, 181, -221, 60, -32, -98, 84, 40, 84, -13, 101, -191, 351, 37, -97, 51, -162, 115, 161, -154, 52, -295, -2, 18, -149, 86, 180, -196, -65, 192, -72, -51, 268, -59, -129, 112, 246, 401, -163]
5287a63J47n7o7K2M74m21N5J04r3L2j41J35lk04J63j00J97K4Qq3J25J4k79L99
5311B88l29R6Rj69K4Q3J09k83J46q6J19J9J34j91k14K54P4j29n5J89l3j03MK35
5335A91k09J6q0O4n4l5K21j63P8K59p10L39J92k2k65J73j39K80r6l18L69J68m62
5358b03P9L4R4o1j23m0K09R0j37k2j4Kj63M00k44kj72K89m60L41O0RK24k04j03
5383a17J1O6J8n3k70M77n26K76J63j02j58J93J66k90M55k85RJ2j46K71j6k13K76
5406B17l15o0N5K96j62j80L52j10j04K69k75j7K0L1P2j1l9k65q7L00J52j37j5
5429a3P6q4P5k83K31k2J45l7k21J99K50k22P5p7l94J04L26j61K60l46O4ok39K71
5453b9K84k26q5O9J11j09j17N3L57k37j09K18P1j24p9j36j13L18j90jL1j47L13
$$ y = [-163, -16, -73, -140, -118, 356, -65, -10, 94, 1, 33, -108, 27, 24, -180, -17, -117, 80, 104, 112, 29, 154, 168, -111, 288, -41, 55, 64, -105, -81, 2, 111, -172, -26, -112, 7, 26, 160, -31, -245, 9, 83, -46, -101, 88, 55, -48, -44, 191, -18, -2, -82, -18, -72, -107, 114, -49, 29, 288, -422, -83, 109, 87, -178, -5, -144, 136, 40, -278, 91, 259, -203, -124, -90, 4, -57, -180, -220, -11, 79, -58, -80, -94, -92, -255, 145, -99, -101, -273, 16, -444, -103, -43, -34, 190, -14, -117, -106, -40, -22, -75, -345, 132, -394, -118, 45, -57, -215, -22, 144, -146, 309, 24, 33, 45, -101, 170, 154, -59, 217, -98, -158, -103, 193, 31, -149, 203, 93, -11, 258, -17, -34, -14, 17, 89, 78, 39, -226, -313, -13, 139, 2, -13, 63, -21, 54, -229, 2, -20, 125, 88, -133, 66, 316, 94, 169, 92, -302, -198, 128, -33, 227, -119, -55, -61, -300, -29, 255, 29, -56, 13, 124, 15, -102, -49, 308, 71, -38, 180, 251, 127, 48, -88, -201, 117, -73, -74, -43, -190, 123]
5476A23J10k80J39M4P2m77M3L3J24K23k26j64LL77k34l9J82k95J98J83l80L90
5498A49k21J82J21l13qK28J1p2j05j29J72j54m2J63K0n7J08m60N14J9j30l30J57
5521a77j18M35O4k00J99l51P8J16O2k44O1l7K9J39J3N9n3O1O9m88K61K76l57R4
5545iL4J00j8j64J96n6j53Q3Q1N2o9j33p6K1K48j10J4J08k19P9K90k20k29o2L14
5570A02l8J8r7K07k03J1j23j49M03J1q0k23K86J17j75j72j72K76k4j17J89JN9
5593A07l66N14L1l71J8PM4K3j92J72J14m18M29n9J29m28K85r4J57p1l08N02k37
5616a2q4J33J13n0j08l05J26K99j16J05j22j74K93J22l17Q2j25NJ17J34p2J56
5638B00Qm20J30K30O6j74j79K87j33pJ68k09k07N23l53K94k22Nk7J01j07j23J81
$$ y = [123, 233, -47, 92, 136, 208, -269, -226, -193, -69, 154, -72, -236, -233, 144, -90, -129, 53, -242, -44, 139, -241, 149, -72, 110, 231, -82, -90, 138, 149, 77, -28, -157, 15, -139, -181, -18, 2, -55, 53, -407, 107, 126, -4, -334, -177, -295, 140, 204, 4, 203, -148, -70, 46, 108, -136, -75, -112, -83, 56, 69, 128, 75, 136, 205, -283, -22, 254, -103, -9, 25, 125, 107, -57, 139, 83, -70, 13, 94, 146, 77, -56, -132, -111, 137, 27, 41, 149, -70, 9, 299, 79, -150, -212, 102, 64, 82, -15, 192, -11, 0, -123, -272, 131, 142, 62, -161, 125, 242, 67, -105, -277, -1, -25, -142, 47, 48, 107, -259, 255, 286, -85, -67, -60, -16, 7, -185, -13, 101, -317, 112, 53, 182, -246, 39, -55, 102, 31, -277, 225, -12, -96, 37, 150, 100, -8, -313, -187, 112, -4, 101, -21, -195, 98, 220, -97, -15, -140, -135, -18, 116, 44, 200, 208, -212, -82, 148, 214, 40, -139, 148, 15, 8, 176, -33, -240, 283, -70, 224, 2, 7, -20, 81, -26, -149, 32]
5661C2%J65j00l11L06j46j04J77O5Q7q4k30J12J29j86L15m21K42R4k98P9M86m52
5684d3MK06k71L9L13m45L83k27K7o4J44k36J70J73j76Q9jk4k48k34N39q1l04L01
5708C4O2k89J63m9J26J9l05K17K5k07K77N9j78K2L2K04j27l96J79K76o2N7o43
5731e04M54K17j96p9P6J51o8j40J0K18k09K43j19j33k8m7L06j21K02k82J3M8p4
5754f2J68o2O4J09k48L59k60k7n7Q5j90J56qj4o7j79Q1L33k16J71j76O9J6n3K1
5779A3r6j18O9L68j28J12j88j9j54J34K8P7pj78N3M5k85J88J90L9j55M0k46J29
5803h9O6J65R1q1j07k32L98mm15J54J18k28m4K03l5j87J19l0L20J23m13L49k69
5826b8p7N3N3P5k31K89K9J52m34J01o9K03o9k33J05K10j79L10k51r4J95j31J8
$$ y = [32, 32, 197, 97, -214, 92, -54, -158, 19, 84, 171, 87, -143, -31, 98, -88, 227, -194, 48, 142, -156, -77, 409, -43, -39, 167, -104, -65, 248, -197, 186, -41, -14, -78, 66, -170, 0, 173, -3, 86, 85, 61, -187, -421, 118, 37, -267, 34, 96, -193, -30, -79, 47, 66, -239, -22, 3, -204, 73, 132, -46, -24, 8, 212, 85, -311, -132, 144, 82, 139, -504, -50, 167, -29, -108, -32, 119, 51, -89, -79, 139, -70, 173, 54, -79, -107, -154, 152, 31, 233, -49, -36, 12, -62, 106, 44, 108, 217, -31, 328, 68, 41, -16, 69, -121, 35, 27, 13, -54, -233, -152, 181, -35, 136, -40, 29, 45, -8, 13, -83, -201, -132, 236, 108, 220, 32, 13, -141, -7, 21, 98, 91, -87, -34, 11, -274, -86, 104, 143, -12, 28, -218, -89, -23, 142, 233, 152, 45, -187, 211, 207, -208, -54, 64, -164, -208, -5, -40, -227, -108, -138, 182, 305, -108, 241, -28, -105, -52, 1, 76, -155, 134, 163, 315, -119, -18, -87, 116, 47, -186, -81, 129, -50, 260, 9, -85, 110, -21, -3]
5849cJ6J60l40O9N0K85l12J46l96J00RJ51J55k70L86k11K35j18j01q0j52J37j
5872h5K8j58%K91NJ01j31k15L46l24M17j96K9q5p5j96J52J25K27k47J04k21R6
5895a2N3m6K05j73J45k20r2l0L76l25J16L36l49K41%l61J2N7j37J03K60m1j34
5918a6r4j31J47J0J35m2m6M03l50j65R0j9L47m02L0J31M8L0j58j52K63R1J11k74
5942a3Lj09Q0l5p2J69k08J20J43k97J58r5Q8J82j7pnL6n7O7j48J53Mj83R9J26
5968A82k08m5J3L9Q8j95Oq1Q9L5J14J44k32K05j59j03j12J60K33k6k13K26j38
5991B2r9L9K3L5J40l27j31L41j22l7J97j79m6K52j82K11j24k35J60n5J91j07N5
6014B2q7P6j27N5L7k15L69p4j06J92j26R9R7k98K96%k13k76J71M7K38k59K0O0
$$ y = [-3, 13, 173, -167, -98, -48, 237, -75, 71, -325, -225, -216, -65, 90, -180, 206, -5, 230, 112, 11, -69, -221, -84, -85, -57, -215, -215, 76, 81, 182, 51, -164, 182, -142, 275, 79, 108, 23, -52, -248, -96, 29, 256, 9, 113, -108, -12, 41, -5, 200, 27, 172, -48, -140, -170, 206, -119, -3, 333, -16, 225, 225, -136, -124, -67, -204, -101, 159, 118, -16, -110, -241, -94, -84, 51, 9, -37, 366, 16, -149, -59, -78, 269, -133, -103, 28, 76, 106, -52, -204, 59, 150, 261, -13, -10, -119, -39, -74, -146, 23, -185, -65, 78, -219, -61, -156, -68, 114, 97, 90, 85, 121, 64, 131, -17, 136, 140, -43, 56, 182, -26, -71, -58, -19, 69, -126, -120, -201, -112, -77, 37, 181, -51, 154, -5, -108, -220, -60, 173, 147, -66, 160, 22, -77, -38, -15, 20, 160, -167, -298, 43, -79, -116, 81, -98, -144, 108, -74, 137, 13, -222, -62, -117, 74, -33, 22, -65, 11, -116, -61, -24, -239, 130, 56, -50, 142, 16, 115, 212, -86, 210, 210, -3, -279, -108, -61, 177, -82, -62, -2]
6038bl79M77Nj61l45K51J05K20j67O4j33l1J13K57l22q3K91l13J82k4j41L94k61
6061co7J31l63M19k61K12L8j43j30N11m11K05n7j47r4M2L37n38L30q2R0r0R1O9
6085H9q3O2n8j65M3K84p2j6j28M22k08p6k95J91n5J70j7l31L74j50J07k3j57j40
6109b32M86l41Q5Nj06j9l1R8K05K50n56QJ0k43K04P3P5Q1k35M70m04k64N39j96
6133c8%K85k27n1N8j09L2M3m0J24l1nK34j24m54J99O6k15J38J76k54J23K99j36
6157I3K14l78J70m3n8Q1J41j04l53Q3J89J66j24j41K42k74R9k2K3j4K18j90R2
6180A10k23J95j46M18l36O4O9m04o7K47J91k5p5J02J89l64o7K54n4q8N6j00J49
6203I5n2k10O6k0J06J44k66l1O9K6O1K5J4J53k01p4o6K65J49n0L2j81j35L0kO7
$$ y = [-2, -381, 96, 101, -60, -405, -154, -49, 171, 4, 68, -65, -96, 17, 274, -48, -131, 160, -153, 29, 5, -136, 258, -3, -70, 61, -302, 117, -144, 68, 106, -37, -167, 344, -67, 138, 81, -66, -160, -118, 219, -319, 11, -71, 19, -71, 20, 89, 6, 68, 10, -155, -112, 172, 100, 84, -44, 378, 170, 94, -201, -10, -65, 105, 88, -243, 131, -19, 88, 65, -92, -232, 254, -87, -2, 3, -103, -122, -153, -55, 150, 400, -156, -148, -138, -381, -177, -104, -29, 52, -183, 287, -117, -381, 158, -38, -38, 247, 20, -31, 27, -82, -50, -7, -47, 77, 46, 41, 275, 151, -303, -104, -38, -253, -115, 61, -193, -70, 229, 93, 307, -71, 99, 56, -2, 79, 220, 116, -237, -154, 35, 201, 77, -64, 178, -96, 3, -19, 4, -10, 208, 18, 110, -113, 82, -64, 354, 18, 82, 151, -253, -320, -73, 118, 93, 18, 120, 309, -55, -122, 132, 78, -10, 46, -54, 95, 43, -167, -101, -121, -15, 129, -137, -168, -99, -73, -12, 13, 27, 180, -21, -95, -161, 104, 253, 203, 235, 54, -81, -51, -53, 14]
6229A4P7J80l47R3J8j55J74j74J64K3K0j82K98l39j25J48j33M25j20o9k22K5M8
6252a59K68j89J89k75J04J83l30J12q5J46k12K02Q9j01R5p6K35j1k82M0K85l33
6274a05M1R4k75L18r9j89M06l13M6k4k11M35o0k44RK64p2k3P8j59j07J24Po0k6
6299a45M3K80k57J87k53K93M1l15J44K7N7j21j69K34M5j77k50N17Q6m0l60r7K73
6322D3Mk30L81j60j39K29k15R9J54Kk45m2L5M2J51m78O31p0l16N2m1L03O4k28
6346B6J84l00K61l22j1P3j16J97P3n7j05l8J65p8k66M70l11K65n3J51n0j74n6
6369g2l2k80M85Q4j41k01K38k81M92K6l80P9J4k32R2M10j29l84K48j65M01m06
6391a34j50K03n6J53j58J09o6J98k37J74l32M73k27l00K90R5k58K52J27k02K62
$$ y = [14, 91, 271, -76, 17, 35, -120, 54, -120, 44, 67, 87, -95, 203, -136, -261, -113, -246, 179, 59, -10, -232, -207, -159, 109, -80, 109, -166, -62, 121, -209, -97, -182, -36, -248, -46, 43, -58, 37, -39, 196, 185, -97, -57, 228, -105, -64, 30, -245, 73, -26, -215, 191, -122, -76, -100, -311, 124, 64, -180, -171, 93, 21, -2, 76, -83, -190, -66, -59, -119, -145, -102, 178, -79, 108, -145, 148, 189, -126, 18, 45, 102, -19, -188, 46, 91, -86, -336, 181, 267, 227, -133, -230, 43, 47, -183, 198, 38, -101, 128, -87, 12, 166, 168, -77, -119, -84, -42, 109, -369, 262, 192, -124, -72, -113, 190, 254, 26, 210, -90, 171, -151, -162, -89, -205, -8, 65, 8, -97, -135, 30, -48, -314, 156, -155, 110, 57, 208, 158, -16, -72, -104, -384, 101, 185, 44, -157, 81, -200, 292, 318, -62, 17, 31, -201, -109, 301, 172, -212, 36, -129, 272, -134, -284, -81, -137, 16, -142, -33, -99, 99, -138, 36, -296, 177, -50, -350, -60, 35, -223, 29, 156, -46, 216]
6412B16k29j1p7J23q2K59Kj64K1k10r5K27K57l28L8K2K15j61p3oo1l4L82j49j40
6437e8N48n31j15J43J33j85pj17K55j09O0J60k85j19K24k84K49O0J4O7k72o3J63
6460f9J28m04N71k09k57M10l50Q5J49k85K35j50J13L73m44J9L43n08M78O5l67
6481g4K01k14j70L56j14n2j05p1J36K93j06k08M06j54j56L3J0j64L05l97J46J79
6503H0l15L54j91Q1K6j72J94l0R6j06J68j13k96K57j73nJ99M5M3j85j68J25qJ13
6527A9j08J29J00K5l27K0O5J25O1l27L31Kj28j56J88q4L03k20j13P1J00j2k74
6550b10L11k40L9p8R4q9j56O14j64j47K05k43m7O1j58L70k6m18N64m23O8j45J59
6573e9K8k50N46j32o9j02L3M8j09J8J94P3j03l9J75l17rJ38Lj79L04k69k80L48
$$ y = [216, -13, -24, -101, 22, -60, 199, 201, 37, 58, -152, -247, -20, 237, -91, -53, -31, 184, 23, -50, -56, -117, -151, 231, 82, -58, 490, -41, -156, -13, 120, -65, -72, -189, 66, -43, 17, 177, -108, -227, -3, -287, -38, 22, 36, 103, -169, -232, -69, 59, -345, 226, 17, -240, 170, -180, -95, 54, -231, 4, -146, -33, 340, -104, -85, 258, -250, 228, 293, -74, 127, -87, -257, 99, -15, -67, -172, -243, -107, 186, 80, -128, 278, 124, -32, 1, 11, -153, 152, -245, -99, 80, -235, 119, -72, 9, 35, -137, 57, 27, 123, 17, 185, 72, -224, 33, -140, -145, 54, 99, 142, -43, -211, -86, -94, 19, -89, 40, 140, 165, -162, -142, -77, 48, 109, -218, 113, 115, -13, -169, 19, -65, 238, 18, -95, -24, 76, 64, -210, 101, -139, -100, -178, -84, -173, -329, 285, 121, -26, 179, -64, -111, -50, -208, 162, 136, -282, 282, -141, -73, -218, -59, -31, -281, 265, 133, 64, -38, -5, 43, -66, -48, 146, 219, 116, 77, 252, -65, -74, 64, 67, -112, 192, -77, -357, -9]
6597ij6j56M72m01j54K23K29k70K37l19J68j27K09j8k4o7l6o7K78k44K45k76K96
6620A73m54L50j05P9l5j10k2r6J78l2K29j14P9j80p1K51j9L0j51J69J0j27lj4
6644A5L3l9K05k36j14J13R7M1K27l73M6o2K24k55K07j14J12l8R9k27MK32P7l07
6668c3j14K80r3l14K6J36L32l75LP9K23r5J33k19K03o7j72L0O4L8l3o5J1j86M47
6693B39j79p8O2j51K37m42M12k08J78K8Qj06K4j72j88K11K75k8p0j55J08j39P4
6716f0K54j73L18k32j57P5r1J29j27l9L0q6K01j80J11J09k43K71j74n9L67r1n4
6739I9J2j30o3L68k36o2q8n2J80j11j92L91r0R2kp7M3o3r8q7J67J94j85k94K35
6764d9J64j38j00K07m0j60J67k11K0l4K52j53j67K79J41k01MQ8j39L98m59M5q4
$$ y = [-9, -25, -181, 291, -110, -264, -41, 188, -82, 155, -164, 4, -123, 86, 68, 44, -23, -59, -126, 152, -92, 153, -123, 173, -281, 69, -36, 43, 8, -102, -124, -220, -42, -74, 155, 41, 120, -60, -131, 120, 101, 131, -20, 149, 159, 32, 29, 15, 48, 9, 214, -22, -136, -23, 74, 115, 342, -31, 15, -47, 177, -78, 129, 15, 127, 89, 188, -39, -35, 197, 274, -33, -147, 133, 40, -274, -248, -112, 220, -155, -152, -73, 150, 55, 188, -31, 172, 105, -67, -37, 27, 65, 32, -33, -22, -208, 239, 60, -18, 44, -107, 130, -312, 100, -108, 70, 98, 106, 0, 24, -148, -336, -125, 150, 122, 52, -103, 5, -134, -60, 194, 21, 339, 107, -50, 25, -66, 63, -64, -103, -73, -159, 42, -138, -27, 82, -161, 110, -64, -123, 244, 153, 99, 111, -19, -82, 286, 50, -12, -100, -152, 28, -83, -275, 116, 26, 118, 116, 39, 82, 19, -79, -166, 1, 195, 10, -284, -49, 115, -23, -123, 84, 44, -116, 51, -160, -140, -174, 78, -75, -242, 37, 178, -23, -19, 69, -70, 328, -131, -86, -170]
6787a70J31Q8k03O1JJ13lJ47j01q7j28J0L04k46J15j38L24p2P8k55P2L25m26J98
6811A38n5J63l03m2r7J54r9J2n0J54n1j24K00M9k31R7O0r6J31K14m73L28J26l26
6835a21J75k38K15j64N1j73J86J84k38j7m8M40l01J3l85K97K39r0Lo5J5n9K1J47
6859H7K71l81l4K02n0O8O3k43K96p0l03K40l79J78n5l9K42k05J31O9P4k59P9m
6883b2J87j29j90K6L69k50J19J77m39K56q5J84J92m05j13K02m1j12Q2j51J06j6
6905e3j92K75N5l40K63r1J77j95L22l78k9L75j96J79j07k7K78m84L40k05j16K8
6927a21M8P6o7R8J45J48k92j38O7R1o0l4m2J00l69J24J24L7L24o2m85J41M1J34
6951B8J08p4j66M65n53P2N12m85J78r6qj68O5j00N63p5l77N6J09J6k84L84O4j39
$$ y = [-170, -39, 49, -154, -93, -92, 21, 18, 165, 64, -23, -151, -141, 163, -83, 32, -106, 218, 146, 224, -31, 41, 366, -60, 138, 83, 246, -57, -99, -196, -42, -141, -129, -179, -25, -76, -200, 0, 49, -182, -85, -25, -121, 10, 224, -249, 79, 205, -121, 54, -184, 31, -133, -82, -255, -69, 115, -123, -140, -188, 252, -49, -36, -421, -124, 115, 25, 28, -37, -22, -81, -60, 87, 358, -23, -57, 145, 95, 163, 226, -17, 279, 209, -94, 146, -233, -55, -110, -149, 93, -112, 19, 88, 162, -97, -18, -22, 165, 36, -154, -128, 241, -9, 110, 287, -152, 104, 19, 203, 395, -10, -123, 79, 38, -74, 8, -143, -37, -53, -245, 30, 85, -255, 8, -83, 94, -101, 221, -157, -186, 189, -7, 172, 65, 38, 316, -168, 172, -33, -149, -121, -73, 3, -64, 34, 179, 327, 35, -103, -36, 55, -5, -39, -81, 19, -350, -226, -102, -65, 259, 197, -288, -147, -106, 28, 136, 62, -104, 361, -192, -120, 392, -93, 85, -11, -19, -187, -122, -222, 341, 266, -111, -55, 54, 70, -214, 170, 234, 95]
6975I5L6j61Mq8L1J3K17M3j51k12N4J44j01J80J13k71R7l93N14o2o8k4j55J78
6999C3m2k51J42J57j49J23jj1P8p5J22j74Qn5J79j05O1j00J74o7k67J84J63k49
7023a22M3K36m3mj84K9p5R9L42k98l2k80M43j30JK34k39K25p2R5k21N4k35L40
7047B06k96Q5K09k43K43j9j38j81n6K43lj03k97M56j01Oj07M34m77K93k59k3M9
7070g9k53N59k53m3m2K87l08L27k04j5o5j47J15p4K29K3k42M0K19j72l9J42K04
7093B09Qm44J71Q6K25l34l7n7L04j24J4j07J96m04M9q2Q0J92J14j44RP6M2l93
7117c51L23N5j5j22q4L87q8L06l52k43J54p8J00j87K74n1M8k20n7K08k03M08j85
7140B7q3K94r7pj94J8J12N8j88o9K56J69o6j39k1o2l6q7J59m1O9J05r3r3N6L1
$$ y = [95, 131, -30, -26, -114, -83, -70, 147, 190, 39, -173, -119, 25, -76, 104, 217, -54, 43, -350, 164, 102, 34, 10, -145, 33, -9, -260, -118, 39, -110, 13, 12, 1, 79, 4, 126, -48, -40, -95, 84, -21, 40, -60, 114, 47, -220, -36, 127, -122, -79, 157, 114, 110, -74, -45, -120, -21, 321, 23, -9, -289, 154, 24, 25, 259, 20, 245, 173, 268, 47, 101, -134, 206, -90, -5, 204, -39, 204, 185, 47, -134, -190, 53, 50, -53, -350, 106, 5, 11, -96, 338, -139, 154, -105, -128, -79, -332, 227, -26, -69, -111, 176, -132, 195, -9, -24, -89, -236, -121, -195, 34, 57, -185, -145, 74, -98, -137, 5, 209, 217, -227, -56, 30, 255, -79, -116, -173, 131, 7, 21, -86, 110, -294, -245, -327, -247, -55, 59, -85, -76, 0, 42, -351, -28, 27, 12, -110, -194, 193, 105, 411, 59, -184, -30, -108, -8, -195, 79, 28, 76, -144, -201, 7, -196, 212, 27, -56, 238, 141, 134, -60, -42, 70, 128, -60, -129, 127, 296, 230, 91, 70, 8, -28, -115, 44, 3, 72, 177, 84, -9, 47, 78]
7166G8Q0m9j89Q1K4R9m2j27j99M07l03K13l91M57K48l33Pp4K17k05J6K05j78P
7190D9j23m5q9J90K2j53J47j38O8mn0J06N8L7J2l38L77j39o0J79K7p9Q5n5j00
7215a6J86l80J21J09j87J21J07K87m16K6p2j48L04j67L26j00P3l58K60m88L11
7236a01J73Lk29K05L8j47L9n4j21K81j72L50J27l29J14k08j05K29j71J04j44K06
7258H8Nl7k27P3J28p3N7J05j39N10k35l00K23n12N07j56j36K49k8k07K16o1J19
7281A69k35j63N8K15j14lj12j8M58j70j39J36j72K88O4KK7j57j62L79k41j68J2
7304d6K16j77NRn6p4L86l53J71lj78lO8J2J75p9K12k84j72K42j65mK2k99M54Q7
7330A66l43J11J6K32j15M0k20L59m01Q0p7J05j07J06j5P1o8J74j05J14k11L36
$$ y = [78, 158, 109, -80, 1, 25, 124, 82, -45, -244, 163, -140, 73, -318, 139, 387, 54, 61, -13, 204, -1, 15, 220, 42, 49, -74, -119, -208, -18, 4, -149, -2, -140, -72, -76, -126, -20, 38, 75, 87, -251, 126, -13, -73, 106, 133, 54, 139, 84, -16, 170, -210, -89, 20, -167, -46, 61, 348, -68, -42, -114, -262, 42, -125, 201, 101, 174, -184, 76, -412, -101, 72, 75, -154, 51, 89, -58, -19, -73, -194, 87, -85, 265, 392, 63, 177, -31, -136, 93, -78, 26, -118, 88, 93, 56, -171, -98, 30, -43, 14, 119, -20, 490, 255, -45, 178, -334, 173, 17, -119, 130, 102, -105, 111, 50, 169, -66, -229, -171, 44, -70, -73, -185, -203, 255, 85, -54, 82, -90, 198, 262, 264, 291, 134, -28, 351, 110, -58, -46, 170, -7, -2, 7, -49, -123, 263, -90, 81, 78, -100, -103, -35, -23, 152, 73, 285, 1, -171, 71, -94, -98, -76, -375, 79, 166, -177, -66, -50, 182, 67, 107, -113, 246, -155, -75, -152, -47, -154, -48, -63, 8, -60, 114, 9, 123, -88, 248]
7352B48l65L3Q3L46l10k5j72p7K61l5k30J72J29M9j95l8K93j80L4j13J46M1k03
7375a08Rp3j6K84J34j15j80K38k81K07J76l87K54k92P1K1J10j26J31j35K75k25
7397b8J26n0j16K5k4j64L07k09r5K76n1M5l07J14J6K53m9n3qk8k58J40R4j58K40
7422C8r9P4J36k42kk5K36k52L07k39k5R6k90M18j85M56m37j76M7K56P4p1k35O3
7446g7M24n35K00J62j2j02L8P0K3k46j02J33J32j60oj91L39L6j86R2k47K79K0
7469H4j42J54Q9j8k65J84J12l42J29l2k23M18j74J37q1o6K26k15m2K6J93k83K61
7492A30J6N8j28k54L06k28K1m0N7k6O4J05K2Q5m0L7j05k09K41j47l1M19j19j31
7516A03%J62k68J93j9n9p0r9r5J81p8J04L3k13j64o4J77M5K20q7j04J76J52j79
$$ y = [248, -117, -84, -1, 345, 35, 10, -162, -239, 22, -13, -243, -71, 58, 107, -88, -126, 167, -13, 21, -92, 54, 95, -108, -99, -172, -188, 96, 230, 115, -65, 173, -108, 99, 275, -112, 142, -150, -79, -58, 52, -74, 57, -78, 197, -28, 98, 48, -68, -43, -67, -231, 76, -133, -228, 48, -3, 42, -265, -151, -135, 118, 69, 16, 8, -20, -278, -138, -44, -202, 38, -61, 13, 149, -93, -95, -120, 116, -136, 171, -68, -93, 3, -287, 131, -54, 402, -35, -211, -164, 92, 166, 95, -140, -77, 347, -188, 12, 174, 162, 60, 98, 168, 191, -55, -157, -24, 108, -52, -58, -249, 90, 126, -60, 32, -215, 64, 84, -58, 96, 185, 167, -98, 86, 198, -144, -15, -47, -270, 148, -26, 111, 30, -36, 190, -25, -67, -41, 152, -131, 130, 146, 204, 76, -178, 128, -100, -79, -119, -62, -88, -24, 81, 103, 188, 148, 185, 80, -129, 112, -35, -66, 353, 234, 103, 103, 265, -3, 190, 171, 112, 42, -57, -152, 29, -49, 55, 88, -125, -289, -353, -176, -131, 89, 2, -102, 74, 226, 47]
7540D7J8j26j9P3J3J4j5J72mk01o4K06k73L72l10J75J5J08m65J05J8L83j87K37
7564B92l19k53N9J6M05l20J25J44k08N1R8k17J0J17k2l2j0P0K00j07k52J70mj56
7588a43o6n6L05K78l66J9J39m13K37K13k80K9J87M6o3l67L23K16l6n0J4l87J03
7611a18l8NJ65K93l76J64j6j20J26k65L49k67L75k50j08j14J58J04l09K35J26
7632A19k01K32j98K7K00l72J79q3Q7j07L4K50k81K0O5q8P2p4J33j00Q4J98j75
7655B1j72M49m00K33Qj20K2J71m02L23m1k65L29k56O7J24q1J29j43j14J76r0r
7678d1J56q6r9J30j87K39o5O8j32M4L7j74J14r6K85j12R3k81J05N9m7j08oK20
7702A16k16j19K23j43J57P0k65N3L08m11L79j68k17J72J86j37l7J82m2l37L40
$$ y = [47, 65, -61, -80, -7, 6, 20, 5, 177, 173, -28, -92, 114, -159, 213, -97, 78, 93, 201, -264, -159, -141, 242, 55, 292, -27, -280, -221, -205, 200, -120, 5, 149, -59, -8, 90, -127, -117, 0, -22, -54, -64, 6, 206, 99, -153, 17, 13, -143, -209, -265, 40, 318, -48, -29, 110, -303, -66, 147, -133, -104, 83, 129, 66, -301, 22, 238, 202, 152, 166, -221, -118, -156, -151, 14, 307, -69, 95, 79, -41, 85, -180, 169, -98, 277, 27, -81, -195, -37, 67, -242, -7, 119, -82, 150, -48, -21, 179, -193, -14, -97, -10, -117, -83, 167, -114, -94, -29, -117, -45, -119, 14, -86, -2, 196, 21, -151, 298, -102, 131, 139, 19, 41, 212, -190, 133, 92, -173, 156, -100, -33, 91, 10, 139, -4, -118, 58, -32, -41, 115, 29, -70, 60, -127, 112, 47, 115, -17, 27, 64, -110, 4, -92, 193, 81, 174, -107, -2, 57, 10, -98, -104, 116, -100, -219, 4, -139, 18, 88, -177, -124, 184, -227, 152, -16, -233, -61, 125, -12, -49, 133, 91, -246, 94]
7723I4j39Q4J46j08k24K41k13J9P0J00l93N11j32M7p7K40J81l55l46J21J84M5
7745I6n9j44J31k2r3Q9R7j55J40l19K18N0K36m41M18l53K94ml43K36n3KQ0m3j26
7770f8Q0r3P5J80q4j59P1L3j14j5J51p6q8J27k39J39l95P22k99n0J48j01l2J89
7794A02j97K4K10j23l2K0j74J45r4j10K42j37K11O3J8l51L8L40k91L56j87J48
7816B21k57R7Pm0k12L71j98N2M9j7J21j55L2l07L01L29j89l01m4K71j89K39p5
7839A06k95K06%J28l54J20p9L55o7r5m5j38M7NR6J44Ko9k06M24m14J96mk33J5
7864a55L21m3j40q0k4K50k46K24o6j84N35n05J79j57l8K30q2k20J72J42j99J53
7886F7L8j70M0J07k38J40k64L01p9O2K09p3l40J44r6m5K7K45l06L27j67J76k11
$$ y = [94, -45, 39, 185, 77, -147, 94, -119, -100, -30, 70, -323, 188, 56, 103, 26, 266, 447, 92, -254, -133, 51, 96, 37, -107, 24, 2, -91, -2, 95, -60, 80, -239, -21, 29, 265, -176, 242, -111, 183, 179, -164, 72, 19, 21, 101, 58, -68, 12, -81, -6, 174, 90, -69, 2, 35, -79, -94, 57, -19, -107, 20, -219, -80, -475, 247, -52, -102, 46, -55, -87, 102, -95, -71, 139, 16, -16, 4, -170, -25, -119, -229, 13, -124, 87, 150, 168, -183, -145, 195, -96, 260, 73, 221, -36, 61, 68, 28, -184, 187, -11, 41, 90, 73, 194, 39, 71, -236, 65, 394, 205, -96, -140, 131, -58, 181, 106, -189, 17, 17, 145, -209, -89, -168, 187, 120, 25, -20, -158, -111, -106, -10, 134, 136, 67, -139, 285, -129, 67, 63, -170, -155, 166, 123, -17, -97, -121, 129, -117, 107, 41, -143, 392, -113, 66, -91, -129, 101, 19, -201, -29, 113, -86, 67, 105, -65, -25, 82, -156, -16, -280, 21, -58, 4, 213, 140, -200, -56, -152, -197, -170, 75, -231, 96, -71, 105, -106]
7909a06J82J19l21J58j32J08J01j02J79k47P6j13J34j62p9J54l7L61l39J12j63
7930a17J76j85R1P5j15L18j14k54N9J37L6j81J8J89o2l08J13LJ27J63m6J9k21
7953g9J42m5K09l11j31P4K44l25OR4R6O6m44O24j83o8J25K22j65j46J45k39M1
7976d8r6K20o0r1j15K78j60K36j44J29j67J34l73L46j9Q6j47j18J35J13j75j52
7998a88J86j36j7q0L70k78j12J73L46k11K4m3j80K73o6j10P0J75j26l10L98q7
8020G1o1q9J57j85n9L01m2j68K09l9k7m3l81N57k10k14L94j88J31o4M1j6q1Q1
8044G5j7p9K0Q7q7J23j73k96K75Q9J27r5Q2k64K40j33L6L4k89K41p2J48q5N8j19
8069g4j0J30k8j90L02q2l22J25l7J5J70N5q8Q2k31L41Ql23J68p3J56j35K35J64
$$ y = [-106, 76, 195, -126, 32, -100, 8, 109, 7, 186, -61, 15, -98, 36, -126, -205, -51, -88, 273, -66, 46, -117, 59, -126, -35, 40, -75, 243, 129, -125, -66, 71, 107, -74, -56, 133, 71, -237, -124, -121, 6, 169, 123, 142, -79, 63, 18, 227, -84, -215, -141, 103, -222, -216, -122, -26, 40, -404, 220, 37, -31, 94, 316, 151, 5, 150, -89, -48, -144, 76, 16, -75, -190, 88, -72, 164, 20, 149, -18, 116, -257, 89, 70, 156, 9, -109, 26, 139, -36, -188, -2, -138, -155, -235, 135, -143, -255, -82, 264, 53, 77, 34, -146, 127, 61, -49, 21, 196, 70, -240, 158, 71, 10, -79, 78, -107, -166, 135, 93, -75, 134, 95, 68, 25, -356, 201, -9, -223, 171, -17, 114, 50, 91, 75, -6, 75, 58, -21, -1, 86, -1, 122, -51, -347, -72, 17, 144, 49, 131, -133, 107, -26, 10, 44, -245, -4, -76, 72, -13, 45, -74, -84, 46, 18, -172, 130, 48, -274, -149, -186, -171, -1, 54, -34, 48, -183, 158, 166, -157, 11, -62, 94, -41, 194, 358]
8093C58k31l0N3r7P2k12j49K44K9l87K85O5J97l7k51J95j65J25l35L18k30j20
8115c03K67K46rk36Q4j76J14k57L06j25J52Qk68K34r8L34k42j08k11M52k88K18
8137I4k85J02K31k10J51j79J63m5l04J94K51j23j5Q7q7k90M11o6j06j79L51k33
8159h7L4J9KJ11k8l5k34K66j47o4J89Q5NM9p3p0j91K18j28q9J33j1n6k06K61k38
8185b85K64J20kq2oK2
$$ y = [358, 127, 97, 150, 53, 125, -87, -236, 8, 37, -350, -65, 0, 197, 160, -91, 104, -61, 64, -271, 47, -183, -303, -36, 210, 201, -35, 49, -127, -13, -270, 36, -89, 63, 71, -197, 37, -61, 273, 31, -77, -288, 164, -124, 94, -191, -89, 142, -68, 83, -96, 67, 22, -282, -88, 163, 40, 25, 112, 25, -265, 146, 80, -26, -205, 146, -87, -53, -34, -32, 79, 51, 16, -218, 48, -99, -163, 26, 111, 116, 165, 92, 22, -169, 49, -79, -168, -35, -46, -102, -308, -47, -285, -21, 99, 97, 15, 9, 31]
8191C1
$$ Imaginary data points
##PAGE= N=2
##DATA TABLE= (X++(I..I)), XYDATA
0@%%%%%%%%%%%%Qj6J6j6J6k4L2l3M1n3O1p2Q8j04J20j36J56j80K08k40K72l05
34a61L46l91M39m93N51o15O83p59Q44r37J037j145J266j396J538j696J867k056
52a078K266k498K759l052L382l758M191m701N308o039O946q107R649j1814J5090
67H544k0682L2740j07028J00472J08012k24825P7578J22117r7493o2270R7378
78C4543n015o1420K3552M5062n8773J3995N8858n7982k4471N8024n0178p920O3188
91C1463l4944j7008M7571l0764j5452K9561m953j2508P30J1519N109j9312K5110
104A6122N588n4554K0950L6744m0718Q122L1539j6608p893r710K236K1554k4502
117a1130j2349K5875j252K135K065m080J7658k3149j8944M0275j2144j8470L7146
$$ y = [0, 0, 0, 0, 0, 0, 0, 0, 0, 0, 0, 0, 0, 8, -8, 8, -8, 8, -16, 16, -17, 24, -29, 32, -40, 48, -56, 64, -72, 84, -96, 112, -128, 144, -161, 185, -206, 233, -260, 291, -324, 359, -400, 444, -493, 544, -601, 665, -731, 807, -889, 978, -1078, 1188, -1310, 1449, -1603, 1779, -1979, 2212, -2489, 2819, -3220, 3726, -4381, 5268, -6546, 8544, -12138, 20602, -86426, 14046, 122058, -102767, -25189, 96928, -565, -62835, 34543, 29528, -31892, -8340, 36722, -22051, -8056, 50802, -7180, -31651, 26373, -23805, -31725, 31463, -3481, -20489, 27082, -3682, -19134, 10427, 5474, -7034, -6304, 5215, 10324, -8988, 16122, 21710, -32844, -11894, 24850, -15868, -7746, 23793, 7185, -708, -10418, -8182, 13372, -11130, -23479, 2396, 1144, 3279, 5344, 1264, 18922, -4227, -23171, 17104, 4960, -13510, 23636]
130B3636j8218k1043K8370j1669j2503J1132j3278N370J1505q339P032M783k685
143D093q120q932K8236J21l2403L0868M903m1974K9798Q963l9807K4261P908k8058
157b0143K2980J0205j7648N741q76p553J722P229N907j2941O638J5597k5706O226
171b622K1904l3130N185K3658l0548J3682K5746l3724L536J8221k2721L333J2089
184D609r062L78L648M330n702k076J9324j5596j7103L3158o837k3046K8042n096
198H971k1687J5391m190o185Q556o475M866L15p661J5554o304r326J6339j0910
212b746k434K1096j6380k508J8662j8573o933J5022m676o823j67R405J066j6809
226a2798J6755R809l2035J4879J9518k9885J0789J9955k2640M842Q172j2254P978
$$ y = [23636, 5418, -15625, 12745, 1076, -11427, -295, -13573, -8203, 3302, -5037, 1995, 6778, 4093, -4027, -12959, 15277, 15398, -17005, 13863, 18766, -23208, 6590, 15553, -24254, 7, 7915, -20143, 2837, 13042, -4606, 1135, 259, -7294, -5572, 1657, 7564, -5377, 1261, 16858, -8848, -2622, 19282, -13848, -8663, 14995, -15553, -1871, 23875, -9849, -6313, 11908, -10813, -7480, 4609, -4453, -4075, -427, 3903, -1799, -3875, 15449, -147, -17250, 15908, 9071, -13975, 14067, 8971, -12716, 2675, -1515, -7700, 856, -5619, -753, -438, -8099, 7455, 1151, -8175, 8164, -2746, -5180, 15916, -464, -2972, 15690, -2883, -9816, 5206, 530, -6293, -6460, 2945, 4011, -12798, 3957, 13766, -18269, -3390, 16128, -13757, -2968, 16987, -5653, -811, 7361, -4893, 3085]
239C085l07o802O656k641R92N64n527Q854p148q173J6430q571o012J8310j2598
254b888l721J5086j2177K908P782j2886J2042J554j6154J6649o48j8043J1901
267A405L46r607O704K92j3j084k259Q731p150k562J4869j2375p60J6642j7280
282d101K657J6238k2895K977J8268k0746M88J4971j1150j419M542k37L03n390
296e494P247K564j2213J1718L556j4326J1378M4j0868J2875n499o688J3708q874
310h72l230Q741r334M689K658j2166J2140J012j3179J2883r3r283R848k590l185
325a961O009l729K629j170m391R261p584n045J2878j1010k052J3451j4759J878
339e595J4487j7081L072J4782j4307K039R753p058J13J526J502l14q023Q578J650
$$ y = [3085, 2778, -4024, 2632, -9, 983, 1547, -3980, 4874, -2274, -10447, 5983, -2588, -8600, 9710, -2888, -6609, 8477, -3700, -792, 6990, -5896, 6146, 7700, -8454, 8195, 7547, -10496, 1405, 1751, -7856, -1152, -860, -873, -1957, -4216, 4515, -2635, -5197, 9672, -2703, -3463, 13179, -4101, -1444, 14794, -8101, -5124, 13144, -7602, -7114, 7857, -3293, -4712, -170, -407, -104, -5494, 1753, 4317, -7896, 3822, 7378, -6948, 4430, 4474, -6394, 6481, 982, -5706, 8002, -872, -4102, 4639, -4695, -6, 2652, -9514, 2626, 3638, -9541, 3342, 3249, -6034, 3814, 1224, -1961, 4048, 319, 2948, 1778, -2613, 6648, -936, -5981, 6897, -4113, -6165, 7286, -7473, -5595, 8892, -8189, -5117, 9665, -4642, -2603, 7150, 92, 205, 1731, 3233, 2919, -5104, 3474, 5124]
354E124j3908J0574K924j2861R612q06p489J1012o245l338J1735q542q4Q286r113
369c119M985K994r639R629j728r155J1253l489q779J0258k064n398K302J212L318
384B580p704N7J3889j2529l887J9315j3390m726J7323j2243k840J3240j1489m09
398b813Q841q818N80M357m043j3o99L409j027o664J0968j176j1755J4644p5j3691
414g975J3631r76r987J0889m096m791Q625q110P5O914q621K082M426n951L378
429d87o03r09N191o261K952N432q825N554K796r106R139k094r026J1876m455q518
445g344J1483m470n303Q073m467r3K897m100N355j885m272J0041n568m122J0435
460F660o425k515P352o137P46K827n387M086j627l170O000o072J121P411j1270
$$ y = [5124, -8784, 1790, 4714, -8147, 1465, 659, -6830, 4182, -2063, -5401, 6334, -2208, -2292, 5994, -3119, 1866, 4860, -4779, 4850, 3122, -6033, 5220, 1731, -7048, 3210, 1146, -4252, -1950, -738, 2580, -5124, -5067, 8822, -3707, -7594, 11721, -1669, -6395, 10928, -1315, -4155, 9085, -2404, -2813, 6028, -2790, -2210, 2147, -1896, -1909, -2608, 801, -226, -6890, 4078, 2902, -8853, 5791, 5716, -7975, 5656, 4680, -5307, 5582, 1486, -3305, 5320, -2790, -2715, 4199, -4422, -2340, 2086, -3865, -487, -1090, -1999, 3192, -3069, -117, 5315, -3510, 2044, 4840, -4266, 4873, 2779, -6247, 5629, 1174, -7344, 4139, -331, -5634, 2439, -2028, -2121, 776, -3324, 2031, 146, -4126, 5915, 347, -3775, 6660, 235, -2280, 5072, -1065, -319, 2508, -2879, 1207, -420, -3590, 2410, -3662, -2541, 4870, -6400]
475f400M885R342j5192O125J1298j5587L569J0786j0430j024O600k043m219K18
489b072O529n937n565J3014o716q962J6961o909j1284J9386o264j2394J7919l369
503D337j1658J1763J073q505K808M478k814o541N944L923j2582N851Q562j4338
517g699N461R377j3994N550P996j2240N451N621p818L326J978k375P47k656L442
532B167q53o578Q289j263q973R848l17q187O911o61l217M429k960J479L032n430
548b284M597j34m336O508m137k923Q011p619q72R038j0368K34Q704q000L94N952
564B765m181R94K39j22L197m360K255L141o125M780R12o673O475k214p113R724
580C694m391n887J1189n439n706J0239l713l619O181k820l04K085o52J214j968
$$ y = [-6400, -1515, 7827, -7365, -1240, 10058, -5529, -1960, 8826, -1604, -2628, 3972, 1929, -2290, -2072, 4457, -1480, -7045, 5969, -747, -9709, 7252, 343, -10941, 8445, 2181, -10213, 7706, 4337, -7321, 4442, 5515, -2990, -182, 4296, 1482, -5059, 885, 4808, -7774, -1923, 6639, -7699, -2238, 7139, -6855, -1305, 6691, -5549, -98, 5523, -2295, 1031, 3009, 634, 1381, -1275, 2167, 1314, -5264, 3025, 1762, -7211, 2637, 2320, -5867, 1044, 383, -2834, 1595, -1365, 114, 3146, -2284, 2313, 2179, -2157, 4351, 214, -2709, 5302, -2317, -3189, 5849, -4519, -4285, 4419, -3581, -3187, 2765, -1416, -422, -183, -305, 2892, -1468, 787, 3928, -2197, 2583, 3495, -3178, 3297, 1083, -6030, 3694, -697, -6584, 4605, -834, -6540, 3699, -14, -3633, 2548, -272, -576, 1509, 857, 2071, 103]
595A03J371M89n876O129J379j0107R325J094j2920J0781L024j3127Q396M309r565
610e195N071L110l242P58p68J702j352j356N306m323j595P193p447p27Q266r132
626c731n47Q652q415Q72P376n431KJ600j180L034l538J537M796p120K170N056
642E133p127J722K996o148L240O40l434M474k296k329M197l248J618K106l855
657b311N098j007n473Q556k401o920Q014k936m437P443l416j946L811m090M52
672a563J638k671L069o59j423L173k657K019K107o478N093J450p601P530J425
687D452q931O861j51p161O351n26m976N232j369k034K943n14q15p46J031K357
703B004m219L405N620r998K609O887j0121K350O780r441K561M996o866K815K708
$$ y = [103, 1474, 1963, -3913, 2216, 3595, -6512, 2813, 3907, -9013, 1768, 4792, -8335, 61, 4370, -5195, -124, 2986, -256, 502, -266, 1436, 84, -1272, 4034, -289, -1884, 5309, -2138, -2865, 5401, -3731, -4278, 4374, -4041, -3169, 4207, -1224, -1222, 378, -802, 2232, -1306, 231, 5027, -2093, 77, 5133, -1994, -272, 2724, -3424, -184, 456, -2978, 1496, -800, -3129, 1068, -2180, -562, 1544, -2311, 2787, 1780, -3693, 4863, 2462, -4458, 3556, 620, -3817, 3626, 210, -1736, 2075, -2015, -1563, 75, -2596, 473, -186, -1609, 1564, -1093, 926, 3033, -3445, 1648, 3098, -4503, 3027, 4452, -4479, 2382, 2231, -4930, 1421, 895, -4081, 1151, -218, -2252, 691, 177, -638, -1384, -353, 2004, -2215, 1190, 6810, -3188, -579, 6308, -3813, -1463, 5317, -4124, -1563, 3433, -3433, -618, 2090]
718B090m722Q35J256L06J23l25L795k903l675P824l591n223Q886l039o214P936
734C359j815m068M131k802m14P31r89L365j645j867N147m476p83O420n899K45
750a360O105o608J389N074n210k63K005j761l43m87K516K90n689M852K024p831
766e297O154K430q389O318K447o507N732N4n695M142m01k314J682J32P8k233J
783a666M201n180m68O787o469n02P848n826mN478n833R93L225m148K741Q62l466
800a427K817j163j639K034k310Q81P61k671M165p96l269N095k824k509N909l411
816c57p89N127m951L89M208n304J679K039l892J380O61j285K370k900N08K789
832A672m611K448K792m716L079J286l126L309j378j676L577l845L4L812m260J280
$$ y = [2090, -2632, -1797, -541, -235, -112, -437, 3358, 455, -3220, 4604, 1013, -4210, 4676, 1637, -4577, 3359, 1544, -2524, 1607, -1195, -1609, -878, -1867, 1498, -147, -2014, 3133, -1343, -2126, 4294, -1605, -1360, 4745, -1863, -474, 4600, -610, -873, 1132, -629, -972, -1459, 1057, 1347, -4342, 510, 2534, -5297, 857, 3287, -5102, 1216, 3663, -2844, 2888, 2942, -2753, 1389, 988, -1326, 356, 488, 566, -1667, -1666, 2535, -2645, -3113, 3674, -2795, -3297, 4551, -1275, -1279, 4199, -1634, -641, 2584, -1564, 1177, 2039, -1427, 1390, 227, -1412, 622, -1688, -807, -46, -2717, 1448, 652, -2617, 2478, -346, -2855, 3054, -357, -1146, 3981, -970, -581, 3627, -1677, 2, 2041, -1851, -471, 190, -1095, 1275, -1625, -1117, 1672, -2939, -491, 2301, -2415, 664, 1950, -1176, 2133, 755, -921, 2656, -1189, -1155, 2657, -1603, -323]
848c23K155m865L171J54l848M832r50l401N168j339k114L113j539J31L77j549
864h27L079j901j709M231l910j493M959m302k63M378m629J426L709n053J895K546
880B136l856K106R63j127J181j702J308P11m031L698J55m473M188l49l516L787
896A179j614j745L805l533N75L537l542J694J915l679K806k7k764L501j588j737
912a217L105j806r23J464j994J192m8j753L378k235j113M788l770o40N333n068
928a307K99M212m123P85K305l166J329M97k220J292o48O1Q18j864K617k87l880
945c280M726k38m291N018j77l495L731j405j261K377k639O66J711l251J883P53
961H28k905K657n72j911L107k103j39K631k822J239J868k923K039j42k161L325
$$ y = [-323, 1832, -3033, 138, 292, -3556, 1276, 326, -3075, 2093, 754, -1360, 1753, 214, 345, 722, -827, 2252, 351, -1358, 2873, -1037, -2530, 2429, -1873, -2136, 2242, -2387, -961, 2748, -2305, -410, 2136, -1720, 386, 1349, 222, 1403, -299, 1009, 1720, -2311, 1387, 1542, -2931, 1257, 908, -2608, 1179, -435, -2180, 1625, -1908, -1333, 2204, -1338, 356, 2271, -1408, 1398, 1371, -1393, 2108, 520, -1217, 1888, 82, -841, 623, -1371, -179, -227, -1980, 1398, -837, -1950, 2838, -932, -1572, 3761, -1307, -1008, 3204, -919, -134, 2171, -995, 334, 831, -1389, -97, -745, -684, 134, -1730, 887, 600, -3280, 1446, 1208, -3083, 1935, 1758, -1737, 1994, 589, -672, 1705, -934, -268, 1443, -1808, 75, 828, -2077, 580, 8, -1903, 1204, -899, -1038, 1593, -1229, 10, 1878, -1045, 994, 852, -1309, 2016]
977B016j994j375L966l601p92L878l942O16K812l196J415O19j709K046o17j189
993a047K958k006k05J843k100J568L00k940L040p09k564L219j773j506L456l035
1009a501J91L010l629J972J769l897K661J212l098K170N32j819J092j032Q96K29
1025G58k412K729o32k887L917j615k494M841k639j997N129l176j318M483k778
1040i1q31K355q71m04n2Q6J354l233J213K174m144J875K433m557K651J309l564
1057b297L131M09k957L113p22j567K461j431o9O95j621K045n63k849L289p34k896
1074b563L560j267j540K784j830K64J451j722J593J90j732K591j476j014L012
1089B301l105J06K705l819J157K408l718J412J662k697J370P55j510J687j575
$$ y = [2016, 22, -1353, 2613, -988, -1780, 2098, -1844, -1228, 1584, -1612, -197, 422, -1287, 759, 142, -1047, 1911, -95, -300, 1543, -557, 1011, 1311, -1629, 1411, 702, -1862, 1357, -416, -1922, 1534, -1501, -1310, 1700, -1929, 43, 1812, -2085, 576, 1788, -1310, 860, 1392, -427, 665, -367, 529, 758, -1654, 1075, 443, -2444, 1473, -142, -2636, 2205, -434, -2431, 2698, -478, -1796, 2687, -91, -922, 1433, 562, 158, 106, 192, 1546, -1687, -474, 1700, -2444, -569, 1864, -2693, -42, 1267, -2297, 834, 1243, -1714, 1399, 677, -890, 1571, 140, 71, 766, -855, 1190, 627, -2222, 1067, 333, -2563, 997, -270, -1810, 974, -856, -592, 859, -863, 730, 920, -812, 1779, 303, -711, 2301, -804, -698, 2007, -1812, -655, 1753, -1965, -553, 1109, -1588, -218, 537, -973, 714, -861]
1104h61R13J239k471K311K32k604K588m28k754L721k071j968M406k887j516M059
1120A909k985o96K793j169j27R77q92Q11o13R6J283k047J284J203l663K927N07
1137A598m645M009R8l780L471R2l035K570k36j160J336p06J174m45q81K075j822
1154b87o23L161k650o90L344l323r8L047l106Q7K189k318Q14O26p47R03j173J046
1172B02J636l286J566K236m168J824K020l693J923Q68k603J908l90r46J204j059
1188g58N33K84j256K506j251j665L754k179k142M900k372k259L974j475j921K643
1204A316j191o60N26k82N72j104M16J531k105P68J520l041K373J210l766K537
1220F20J426l853K482O10k609K048o29j021J146j073Q31N15j855J803n95j297
$$ y = [-861, 52, 1291, -1180, 1131, 1363, -1241, 1347, 919, -1835, 1886, -185, -2153, 2253, -634, -2150, 1909, -1076, -1772, 1021, -148, -275, 702, -190, 621, 8, 104, 1387, -660, 624, 1827, -1836, 1091, 1598, -3047, 962, 1060, -2720, 751, 843, -2192, 378, 142, -1018, 318, -388, 786, 341, -540, 1535, -287, -910, 2251, -399, -1089, 2255, -1068, -1166, 1881, -1225, -1138, 1051, -1267, -453, 173, -574, 329, -844, 202, 1838, -1448, 118, 2354, -1814, 10, 2030, -1663, 260, 1128, -1475, 433, 43, -903, 301, -758, -225, 59, -1197, 1309, 58, -1607, 2147, -32, -2174, 2726, 354, -1905, 2069, 594, -1327, 1316, 125, -535, -9, -291, 281, -823, -407, 1124, -981, -213, 1307, -1734, 639, 1849, -1917, 620, 2046, -1807, 675, 1285, -1324, 724, 95, -926, 220, -853, -22, 493, -1362, 441, -154, -1451]
1236a451K613j393n50K549k543O33K174k715Q39J477k681R94P48j927J579p37
1252c91o50J571j491K12J617j995J248N46j843K202m95j382K608j374j117K099
1268A365j497k27R06j361J004L5j821K424j116j439K640j253j243L014k070o7
1284g06K047j766M67J293j929J235k12r04J111j091M03O62k032J505Q30l190K515
1301B38O45k755K018O55k102K069j44j081J558j145K04O04j030Q35o23p65J766
1318I47j516n38K258k048j04K348k311K91J752j592N02Q75j288J218m99q11J635
1335A119j184k75J498j746L59L99j537J632m15j250K033p71q61J665j070K15J415
1352A226k076J346P51k401J650M89k324K076M2j760J778r10k69Q22j296N07N74
$$ y = [-1451, 1162, -231, -781, 1768, -775, -142, 2032, -683, 156, 1633, -1048, -54, 694, -1233, 346, -391, -1041, 530, -961, -749, 868, -1127, 121, 667, -1176, 1026, 531, -851, 1757, 383, -734, 1365, -132, -359, 547, -814, 190, 225, -1596, 828, -288, -1727, 913, -340, -1583, 1431, -639, -706, 1341, -425, 42, 1335, -594, 641, 429, -475, 636, -455, -52, 610, -1422, 83, 913, -2277, 238, 883, -1872, 146, 801, -1301, 768, 624, -457, 1101, -44, 160, 764, -266, 569, -54, -819, 947, -569, -1107, 1151, -897, -1001, 1347, -964, -673, 1079, -513, -11, 864, -424, 794, 295, -516, 1119, -65, -340, 1158, -588, -229, 170, -1367, 265, -150, -1400, 633, -138, -999, 666, -404, -189, 1226, -850, 496, 1247, -1154, 496, 985, -1339, 737, 779, -981, 797, -113, -382, 440, -856, -349, 225]
1369B25j177J323k4j049J845j166l20J701j821M49J385k102N37J151j816J082
1385B23P6j464J622r48l57J619j256j16J471j606O30P50r63Q20j34p55J568j210
1403c0m09J637k056M93J656k285Q72N28j880J657K91j893J899j20j101J296q89
1420c34N71K70j070J377j61j428J522n81j421K212j475l38J791j828M57J156j815
1437a095J191L92j290J320j01o85J157r05j77R86j227L39O04j192O75L05q20Q55
1455C32o88n70J554j594J22K015j910M91J506j778O59R25j695J223j00q99J047
1472F40p36j86O76j172O28L42j088J449o16j167J743n33q22J655n67l70J085j464
1490e03P93N05j252N63L05j096J160m13o79R61r53J26R78j178N33O80j254Q92
$$ y = [225, -952, 371, 347, -702, 1143, -23, -343, 1358, -463, -14, 1371, -731, -194, 957, -859, 223, 299, -1165, 457, -491, -848, 771, -485, -601, 870, -736, -106, 644, -319, 501, 367, -388, 1180, -30, -439, 1198, -858, -365, 1291, -994, -122, 406, -1474, 183, 474, -1419, 480, 360, -741, 555, -334, 237, 507, -563, 814, 653, -775, 747, 166, -1255, 957, -518, -856, 935, -893, -436, 720, -1095, 96, 488, -802, 518, 417, -268, 889, -16, -193, 793, -434, -95, 509, -683, -8, 297, -523, 332, -356, -926, 628, -966, -844, 1171, -739, -248, 1258, -520, 139, 1064, -631, 592, 492, -407, 640, -96, -282, 394, -778, -150, 192, -896, 553, -63, -1230, 513, -20, -842, 813, 246, -124, 961, -503, 290, 795, -457, 106, 411, -685, 475, 62, -617, 344, -609, -483, 495, -683, -150, 530, -724, 168]
1508A68J03o85J214p18k29J063j426L11J194j791P18Q80j728J006J52j121J111
1525B22m48m00J290r66N1P27r38Q13J21r18J208n08o96J407j274j90J400j475
1543e74L0J111j274O16N02j064Q99l2r22J301m28l35N25k63R7K98j062J152m23
1562A54j065J662n11j156J688j061l87J539j723O59J033j361P69M38j130O02J01
1579B51m14Q37p59R1O07j459Q90M87j672J331k02j031J329n15m51J116q33M3J074
1598G20r49N38K54j006J075l91q05J281q19n16J320r57j79Q78j204M95P1m54Q31
1617A83k19n92J663j065l40J253j207K56J160j534N56P32j680J102R4j061N18
1634a81J1l99O93p08O13M13r85P66L55j150J352o46o50J407q05l91J297j200j46
$$ y = [168, 271, -414, 800, 82, -147, 916, -510, -199, 995, -796, -78, 802, -926, 80, 232, -889, 222, -226, -626, 664, -302, -251, 476, -462, 351, 472, -446, 762, 254, -442, 965, -309, -499, 901, -574, -544, 567, -707, -91, 411, -653, 246, 214, -708, 593, 165, -170, 355, 92, 189, 487, -575, 577, 154, -911, 751, 240, -916, 772, -289, -676, 863, -860, -201, 832, -529, 240, 678, -452, 150, 251, -163, 674, -85, 6, 613, -846, 44, 531, -1141, 190, -12, -1043, 286, -229, -680, 436, -397, -354, 720, -229, 309, 563, -443, 632, 241, -564, 717, -102, -618, 702, -255, -434, 444, -760, -265, -194, -648, 183, -36, -628, 1035, -30, -370, 883, -324, -68, 1092, -442, 114, 846, -834, 268, 362, -699, -181, -170, -569, 124, -584, 29, 442, -543, 223, 578, -572, 780, 134, -516, 891, 86, -305, 992, -208, -354]
1653c54P45r42K76O59j034P00P3o12J068j075L14J017j218M09N34p93K84L63o78
1672b64P03k74p75J160n60p18J345q62k8O49r31L38M30p68R95m22j87K64k46N9
1692i2Q11r29J98M92j366J189Q3j215J093l05o09Q55n12j58R49r41M36M42p84
1711c63P64r2n51P97m18o36J034p51K19N94j120K58Q12j337R32Jr64J467r58p5
1731c87J163q09j86R52r53J60M29o82L81J15m52Q85j001k80Q00o86L76L95q82
1750f62O55L76r17J109l89k37Q35p07l50Q41o40m7N79r92O75R8p66Q19k15m82
1770d17P78k75m96Q64q80N21L59q19O17r4r09J586o72m42J021o22j16M05o30J6
1790b05M91p57N74m7n01P56k78k02P71r42P4R29r40L03N20j062Q71j2p22J068
$$ y = [-354, 391, -551, -275, 384, -650, 50, 123, -489, 579, -496, -182, 835, -383, 26, 560, -233, 51, 414, -264, 439, 165, -610, 550, -10, -728, 617, -245, -273, 376, -555, -217, 213, -555, 440, 18, -169, 95, -151, -92, 719, -210, -12, 480, -886, 303, 386, -829, 264, -41, -650, 205, -307, -465, 484, -457, -21, 421, -363, 401, 309, -242, 555, 137, -499, 535, -216, 3, 597, -523, -265, 547, -790, 142, 143, -821, 646, -312, -387, 776, -33, -219, 733, -220, -60, 369, -313, 68, 183, -269, 616, -385, -665, 135, -551, -175, 220, -662, -7, 369, -548, 561, 172, -65, 770, 63, -287, 554, -86, -133, 446, -546, 129, 227, -539, 280, 65, -417, 361, 86, -410, 454, -426, 95, 454, -365, 252, 158, -751, 835, 163, -279, 742, 120, 4, 409, -221, -205, 286, -471, 103, 56, -445, 311, 33, -169, 602, -340, -266, 663, -277, 26, 546, -516, 355, 343, -379, 689]
1810F89r34l68R27n72k05P15p65O24J71n72N38K4p24R66l13p9M16n82p7N11q56
1831d66O67m9q83J374n99o03Q05m55l28Q40p54J69L81m73P50p5m53P69o27k82
1851b92O87p64M94K21j006O58N90j319P57K08j046J061m13l94J042m25k81Q63
1869F41o86J15O28q45N01j10o65N79j2o42Q23o93J2N93n79R2M65n68N03No00Q57
1891D14l61k28R17o91k70P67p63J89K04o28M43R6m06P43m81m09R51q04j78Q60
1911C65o63M21M82j031P61K76r77J017m09m11N77p50K55J81n74K89N31q38P84
1930B86%n02L96k34j7O35q21L62J70l03N05j93p68N28K16p02P27m04m44Q53m49
1951a59j86N52k69k16O88n99L13p8l69P16m14n13Q87o00N8N36q24M72L62j202
$$ y = [689, -245, -613, 314, -258, -463, 252, -513, 111, 282, -290, 248, 272, -452, 514, 201, 122, 538, -44, -121, 390, -466, 201, 152, -731, 643, 44, -559, 246, -209, -537, 303, -451, -282, 99, -374, 376, 301, -152, 617, -10, -292, 395, -369, 125, 346, -660, -2, 588, -731, 26, 234, -812, 249, -164, -558, 484, 59, -222, 641, -45, 70, 698, -147, 354, 244, -421, 158, 146, -496, 327, -366, -354, 239, -340, -248, 217, -351, 152, 157, -443, 414, 53, -175, 742, 51, -219, 548, -215, -26, 178, -450, -7, 89, -317, 426, -55, -464, 487, -317, -495, 365, -298, 123, 605, -426, 335, 611, -366, 651, 242, -169, 408, -342, -87, 94, -480, -191, 340, -498, 286, 286, -216, 180, -54, -71, 564, -257, 105, 275, -28, 477, 284, -484, 44, 260, -442, 285, -119, -563, 290, -159, -345, 207, -62, -278, 410, -189, 124, 46, -323, 393, -21, -534, 353, -247, -189, 347, -477, -5, 357, -845]
1971h45Q60L1p15Q84m54J25M00l49K75L17o94M23K7k94O20m80n63Q08l79j79M65
1992B83r08P09M78j059N93M4r91J081j34l82O75k97j14N06o07J17N30q23N72j31
2012A42n98J052q95j66Q98p61K10M97j032Q31Q2n39M51Ql16M64j17l65P98q06
2032a62K51J94n24J60K28p03Q56m05l25O40j22l82P51n94J38L24o36M72L29j203
2052g13J201k41o65Q79p38j45N59j78j7J09l71M36k6m18O76l77k10O17j91m78
2072b91Q84q54L23N20q94M40J33n36L00k5j73O44q58q5R75r22Q0M86k91K28K38
2093C22n09P82l12m16N57n01k26O52n70J28M49r32O08M68j095P26l31j83R09p43
2113b17l0O12p31L07M93o51K51L8m29O13l78l00Q13n77m8M35q44O01K82o42M86
$$ y = [-845, 15, 46, -669, 215, -239, -114, 286, -63, 212, 529, -165, 258, 285, -9, 611, 131, -432, 376, -3, -182, 283, -625, 84, 562, -497, 96, 140, -851, 230, 96, -286, 389, 92, -22, 484, -123, -6, 524, -299, 273, 142, -456, 596, -299, -465, 433, -328, -118, 379, -653, 178, 260, -279, 172, 180, -136, 328, 211, -154, 644, -162, 89, 283, -241, -81, 147, -556, 300, -105, -430, 210, 88, -294, 457, -137, 1, 325, -311, 161, 490, -713, 488, 247, -418, 461, -277, -422, 137, -41, -58, 51, -320, 116, 90, -328, 348, -29, -239, 378, 187, -291, 593, -261, 62, 582, -312, 128, 261, -275, 25, 0, -173, 471, -387, -472, 503, -419, -339, 147, -144, 84, 322, -187, 595, 283, -133, 424, -77, -303, 349, -221, -93, 356, -576, 32, 500, -595, 131, -200, -383, 526, -217, -247, 365, -366, -59, 434, -217, 34, 72, -357, 256, -122, -422, 391, -186, -234, 201, -643, -42, 240, -402, 84]
2134H4K71o69P15l67k51N00n60J47O99r23K27L85r89R77k66o11J002n57q1O59
2154C92p54J54O67p28L86J80r28J110l09m62O95l84l08P65p27O3M27n29Q2L67
2174A59r22R95k64m54Q72l38j47M06n78M52N0l63M80l3l97L46J7q24R38m70k90
2195c65P35o11q1O63q36O62m2l92N20j23k32Q97n72j36Q69j266K12M88q38K25
2215b23M92r63P40q0j27L51l18o6N32p01M80K55o14L14K29n89M36j02n41R98j018
2236e15K55N16n72o5O77p42M95L8o06R46k73k92O46q59P22O9p96P87m61k92N44
2257B22k84m20O87j87l76M83n09J95N86q73P66j26n98O59k34k85Q75k90m16N90
2277D65m63m3M25o29K69J55p36O08R8m87P40r67L08P15r13K13P38n85K05J27n67
$$ y = [84, 355, -314, 401, 34, -217, 283, -277, -130, 569, -354, -127, 258, -731, 246, -20, -631, 371, -186, -267, 392, -362, -208, 459, -269, 117, 297, -631, 479, 170, -292, 403, 19, -289, 476, -251, -188, 239, -290, -208, 159, -763, 232, -32, -486, 386, 48, -99, 307, -271, 181, 231, -132, 348, 315, -82, 264, 281, -543, 395, -75, -365, 370, -241, -322, 341, -495, 167, 125, -267, 253, 130, -102, 795, 223, 87, 956, -310, -98, 390, -448, -223, 269, -694, 46, -34, -161, 190, -128, -194, 338, -363, 117, 372, -242, 72, 301, -288, 148, 46, -495, 503, -515, -260, 256, -316, -381, 296, -446, 49, 87, -519, 427, 154, -138, 508, -351, 371, 440, -356, 431, -30, -322, 222, -62, -482, 205, 18, -358, 125, -384, -189, 397, -476, 290, 164, -434, 225, -9, -294, 581, 291, -125, 465, 2, -41, 384, -245, 24, 179, -557, 51, 149, -338, 402, -565, -257, 458, -455, -242, 496, -89, 116, 243, -324]
2298c24M57Ql35N58o33p7O14q07J24N38n18K50M3l03N55R4l95P84r36n5J065q28
2320a21J02J95k73K89j22p76Q79j80n03O98k14j27M90o00L18J89o68N70J63p86
2340d77J109n35n25R02n06l18P43o35kN38p87M57J75l19L59l67j99O87n47J73
2360g4L47m04L20L07p78N42k24l18J019q34l1N93o80j2O12j050N47K91q29R22
2380B66l78m36R87n20n2N53l50m03P67o99L51J99o65N00Nn55N02q6m44P51r13
2401f20N36N26q87O40J30q73R54j86o68Q91j99k27L49o16J89K07p45N68K22j011
2421h20R13O4p84J006m50m88J034q66J25R23q56K74L81o81K75j7n30P54n45%N26
2442B38m11r4M49n42N40R1q61M38J81k95P48n18p9P93q83L41J59n04J42J19n37
$$ y = [-324, 133, 141, -194, 364, -269, -346, 268, -539, -415, 123, -395, -145, -102, -405, 150, 244, -151, 633, -303, -358, 707, -121, -19, 176, -97, 192, 70, -706, 173, -7, -510, 188, -26, -153, 337, -263, 55, 244, -424, 146, 309, -477, 632, 97, -428, 474, -32, -350, 393, -242, -244, 294, -493, -36, 139, -180, 179, -188, -387, 300, -247, -74, 273, -131, 189, 496, -282, 260, 36, -282, 737, -97, -128, 465, -215, -227, 385, -665, -118, 173, -656, 266, -112, -548, 439, -81, -133, 420, 70, -333, 434, -265, 86, 285, -380, 120, 125, -430, 72, -14, -458, 293, -620, -84, 442, -445, 195, 325, -548, 406, 220, -448, 443, 244, 17, 366, -250, -61, 146, -599, -31, 191, -820, 93, 157, -627, 379, -71, -559, 475, -391, -266, 657, -199, 75, 456, -225, 50, 33, -497, 257, -288, -288, 238, -173, -267, 182, -360, 180, 271, -590, -152, 29, -266, 482, -36, -115, 678, -205, 136, 295, -209, -67, 52, -485]
2463d85O95n3n32L67j26l86J020m94J51K64o62N57r3k73N10l80o84P31n28J93
2483b08O76p41K88K37n69K64L02p56O65r5k43M72m52J44N44o18L90O9p36M33R4
2504A60m97N45j96j13K49l07j23P30q91K64J83rJ56J1k55M67n40M5P23p70J24
2525d4L63o99M34K14r23R32k53m45N02j80j73O05n75K67O58q58L26L72r09P31
2545C45j33n48O44m45k95Q84o48o0O72r16N42J66m66L12O7n16R09m03l91P80m14
2566H6k7L24r13Q34j47o77P90k50l83N67p25r0Q55m78nO07p05M05L19r35R69l56
2588F5k15N19k02l09N17q24M65Q3n85M98J59p31R35n18k20O24l27m10O08m20N14
2609B26J75o39L34J87p87P76l27k62N40m12j01N00o25L31J19l83M55j7j58L57
$$ y = [-485, 210, 157, -375, -8, -134, -520, 500, 6, 157, 421, -241, 316, 223, -50, 460, 80, -604, 127, -401, -208, 468, -273, 15, 252, -317, -53, 249, -507, 158, 63, -180, 292, -160, -16, 528, -90, 300, 369, -367, 66, 160, -337, 208, 12, -101, 148, -159, -282, 448, -443, -179, 4, -5, 151, 162, -93, 374, -166, -121, 602, -168, -44, 319, -380, 54, 268, -655, 277, 24, -421, 81, -99, -272, 333, -242, 25, 683, -175, 151, 523, -386, 345, 212, -336, 308, -137, -432, 452, -196, -256, 416, -500, 42, 208, -258, 54, 121, -395, 514, 111, -280, 500, 86, 59, 383, -530, 304, 157, -520, 270, 20, -363, 204, -521, -611, 244, -234, -239, 368, -337, 68, 387, -548, 421, 65, -150, 369, 167, -142, 375, -449, 16, 99, -486, 12, 171, -560, 375, -143, -363, 261, -66, -476, 132, -288, 226, 401, -238, 96, 283, -504, 272, -55, -317, 223, -189, -290, 210, -415, -84, 35, -348, 107, 90, -68, 289]
2629B89k20m69Q40n55J42J87m10J32K93p54P78m6q23Q67k75j47M65o29J20L78
2649A63n53O96j8n16M54ql46M98m46l12Q79o14k77O95q50M95J11n26O34j23m28
2670c92Q53m88k67N53o05L24M06o85K57N64j006P88n3n84L75n1n46Q07m99j22
2690c71M62k61J55K73p25P08j9k68N56n10r3L56o27R8P13r12P35j27n39N41j55
2711a0k28K99k99K51K77m82J38N51q39O61l1m03K76j09m99O83n59J17M18l97J80
2732eO8o86P68q5l86O59l49j33M30k18K11J54q09M50L72q29P07J49p86N57m85
2753b46L0M74m18%L56n96M14J44n85P38p2j04L38m93P1N94r33J75O99r52L36L31
2775C01p87M98o8l89N12m03j8M02l4n4K89n44L29L34l96L19J47r45P28l7l13K24
$$ y = [289, 69, -400, 440, -115, 27, 214, -196, -64, 229, -525, 253, 207, -616, 251, -24, -171, 294, -335, -215, 163, -390, 306, 288, -228, 226, 218, -128, 370, -76, -388, 491, -123, -400, 295, -555, -60, 51, -475, 159, 36, -392, 461, -27, -294, 259, -346, -22, 384, -301, -44, 520, -486, 302, 249, -335, 40, -11, -557, 250, -249, -371, 91, -170, -15, 258, -467, 241, 222, -46, 510, 0, -93, 263, -364, -266, 447, -465, 270, 143, -396, 145, -10, -238, 61, -238, 13, 290, -192, -54, 497, -342, 319, 288, -115, 161, 52, -447, 236, -323, -206, 212, -185, -5, 63, -623, 145, 60, -326, 333, -16, -149, 281, 63, 274, 428, -381, 69, 441, -388, 319, 468, -318, 239, -246, -216, 258, -160, -160, 196, -400, 14, 158, -427, 311, 239, 135, 473, -20, 51, 645, -288, -113, 586, -366, -30, 301, -486, 12, -56, -445, 67, -336, -354, 48, 14, -40, 249, -295, 34, 368, -28, 291, 438, -507, 221, 184, -129, 95]
2797I5j86M23j20m95L11J48o04O35l90k95R58l00l15N58q32M72K20m13L77j68
2817G9m18L88M1o02P28n43J34Q45p54j43P93p93K63L36n82L85R1n06M39j3l01
2838a33L01m10J15K36m79N47k05k68L31k74j90Q98n39m08J046m82oJ76k21J05
2858A40j2m79L94j2j89M22m86k6J10j5K85J22m93L24L72q44P76k01k44M44l25
2879F3R4K32n21K32P7m24L88j15j33L26m97j89P89n42L66K96o49K94R7n99O55
2900B40j56o9L14l27j22K97j00k52J70l53K36N28r07N23o1l17O30l54j1J53j21
2921e9K1M49l81L71l01l57N88k24q62J062k51m47O87m38L9p5l95M84M92n30J91
2942F4j36r2M87j24k95M99n39R2L02o35N34j02k56M90k99m91P55l19k02P52n83
$$ y = [95, -91, 332, 212, -283, 28, 176, -428, 207, -183, -478, 480, 180, -135, 423, -409, 63, 283, -130, 247, 79, -339, 49, 90, -512, 216, -327, -193, 652, -102, -245, 548, -245, 18, 354, -228, 157, 248, -258, 181, 168, -133, 168, -242, -127, 109, -370, 177, -28, -296, 35, -239, -429, 469, -70, -478, 568, 86, 80, 256, 35, 140, 128, -351, 43, 31, -158, 264, -222, -248, -138, -153, 132, 254, -239, 85, 457, -387, 389, 188, -56, 388, 63, 157, 389, -132, 100, 177, -247, 141, 26, -107, 219, -278, -467, 322, -220, 146, 442, -207, 87, 184, -415, 240, 84, 15, 329, 2, -120, 177, 77, -175, -5, -358, -122, 406, -501, 22, -39, -356, 274, -80, -91, 62, -59, -38, 411, 30, 401, 100, -257, 331, 107, -755, 307, 56, -391, 296, -142, -103, -178, -573, -89, 403, -127, 64, -72, -164, 323, 199, -96, 403, -136, -44, 258, -377, 157, 55, -201, 289, -10, -501, 254, -65, -267, 485, -98]
2963i8N6K65l87L39M3m42M41j35n34O05k49QM16p28K58L89m91L85j0l32K74N7
2985A30k11P03o97m7M93l56R4K16l85J5K27m96N59m15l60Q43m77j60N27l83K09
3006B9O5r4O9j00l24M82J31k57R6q7j54N43o98K00M74q14N66Rl53L01j21k20O19
3029C62m46P9L55n04K60L47l82ml8j31K83j87l56L59k70J30M84o20Q4M83n00K66
3051E4J9k82O26l86k55M82l60l6M15l90J37L03p82L43J31l01N55k35l13L88m31
3072c18P4O09n83O01N9o84L68J56n07M49k80k11M81l72J41K62o59J95L59k03M43
3093C80m56k45M17j47j80N60j77m3J60l76K13M2l60N28l35j37K83j62l30M97m59
3114c27L2O34n42R5K81o83P92j74k78O43l38k34O62p30J80J36l54K60J98l55J08
$$ y = [-98, -42, 223, -164, 175, 218, -224, 217, 82, -452, 153, -96, -88, 328, -400, -142, 247, -244, 141, 131, -201, 73, 130, -81, 622, -75, -122, 371, 15, 109, 325, -60, -45, 182, -314, 245, -170, -530, 313, -164, -324, 203, -180, 29, 94, 0, 69, -31, -355, 127, 258, 1, 97, 10, -144, 399, -299, -99, 375, -439, 127, 136, -217, 84, -37, -257, 362, -84, -5, 350, -154, 106, 453, 71, 67, 29, -102, 181, -6, -362, -3, -273, -143, 341, -279, -195, 288, -212, 54, 73, -209, 417, 31, -224, 258, -102, -138, 277, -113, 24, 327, -455, -112, 19, -282, 273, 38, -275, 113, -318, -244, 365, -218, 383, 442, -242, 126, 282, -225, 224, -56, -267, 214, -158, -17, 245, -414, -219, 140, -63, 380, -76, -321, 96, -51, -231, 329, 152, 109, 269, -107, 106, 148, -212, 316, -19, -156, 127, -35, -365, 132, -327, -295, 339, -203, -108, 173, -510, 282, 108, -170, 473, 135, -99, 563, -167, 13, 149, -205, 55, 253, -102, 6]
3135Fq0l38P44n64j7O09m36j01O90p52M53K09o32M75j96j00K20l42k2K31m05K56
3157i2M48r33Q43j11n32O10l55K2O27m52k63N81o51M00M16r42M86M7m69N53m45
3178b12j89O06m42j6P94p77J67K37m32N39j75m11O31o01Q1N09m46j82O89o15Q3
3199a62N2k31M18Rl84L22J44k87L81m13oM15l98L50J47p36Q74m65m92N77m01R6
3221a90L60k86N2L15p66O72J13n34M04q5k82N99k07l02O15p24j21P05o17K58r7
3242a18p1J1J77l66N60k76k32N54l93J35L79m68q8M64m41N61j86k96M51n78J39
3263h2L63m78K60q9k57K67J76m20P33l86l89R03l71k66L74k21k44K71m52N62J62
3284D16p32N04n6m72N67m31J52L71l04K8N8n89Q65l10m02Q93q11m2N36k35j22
$$ y = [6, -74, -412, 332, -232, -249, 360, -76, -177, 513, -239, 214, 423, -209, 266, 70, -30, 190, -152, -174, 57, -348, -92, 356, -577, 266, 155, -377, 233, -122, -100, 527, 75, -188, 393, -258, 142, 558, -384, 102, 149, -320, 233, -212, -401, 205, -237, -253, 541, -236, -69, 168, -264, 275, 100, -311, 320, -281, -200, 309, -137, -319, 370, -245, -162, -110, -341, 77, 86, -298, 24, 168, -119, 262, -151, -157, 258, -140, 210, 357, -379, 495, 30, -462, 115, -286, -190, 170, -116, -64, 251, -515, 157, 270, -264, 140, 55, -227, 372, 165, -137, 478, -246, -367, 338, -279, -21, -118, -189, -178, -1, -367, 193, -83, -315, 239, -154, -19, 360, -108, -196, 268, -173, 388, 202, -94, 357, -221, -82, 281, -197, 63, -26, -283, -16, 160, -260, 473, 87, -302, 601, 230, -36, 338, 117, -127, 144, -308, 254, 416, -316, 188, 132, -340, 227, -204, -52, 319, 15, 43, 101, -488, 377, 67, -335, 558, -253, -295, 241, 6, -116]
3305a16N52o41j74M97l05R6L39o37N18k92j40O05o89K47M74m64J80O46n90O3K18
3326C87l45K58J08o21M06k87J29J20o78M38R5n63N39P1m01M65j23m30P27m75L72
3347A92L17o33k9L27o16N17K13p33L76j82k4M08j27r8N18p38K50O51p29L90J36
3368C86m67J32j27o5K20l69J63L09o10N23j45m22O33j64k21O07m54KL43J3m93
3389b06O59q10O19k10p3K02J81l96L76k50m77N77l05K0K10n64O48J06n85N13k70
3410c5j96O18l52k04O61o72L5M62m66L27J11n23N15k21k81L43k13k53P07n93J63
3431f7M71n15K20K29m83L24n6m18O92n85K14N83r47K21N02p62K29L80q08N21m5
3452a00k23O61k56l24O75o03K27K05p42P17Qk11J65k34l31N48k22l99O67m95J57
$$ y = [-116, 436, -205, -379, 118, -187, -91, 248, -389, 129, -163, -303, 302, -387, -140, 334, -130, 50, 696, 106, 169, 387, 42, 300, 408, -213, 193, -94, 35, 155, -523, -85, 10, -553, -14, 57, -344, 121, -2, -432, 295, -180, 192, 509, -124, -153, 174, -442, 75, 288, -445, -69, -251, -275, 133, 6, -92, 426, -312, -62, 589, -140, 250, 386, -81, 51, -76, -141, 79, -290, -127, 182, -428, 95, -50, -472, 161, -3, -224, 383, -71, -69, 274, 287, -206, 453, -357, 262, 52, -21, 181, 362, -34, 342, 92, -385, 192, -113, -93, 117, -447, 201, 307, -278, 235, -35, -231, 387, 35, -169, 492, -180, -145, 317, -149, 178, 289, -234, 281, 60, -221, 122, -91, -344, 363, -230, -67, 404, -111, 109, 338, -145, 179, 123, -295, 397, -188, 26, 609, -338, -117, 385, -377, -148, 232, -576, -55, -100, -323, 338, 82, -242, 433, -170, 57, 262, -480, 237, 245, 34, 199, -35, -366, 182, -40, -439, 228, -267, -110]
3473a10L49m89M26K19m25J87k19k89P68n02R5L92n18O5K41o58N67P7l35K08j85
3494a36j78M80l25M5L67oj71L46l45p2J28l58N07J40l03K33o68L92J58o23L74
3515a5K5j91M43k73r3K16k17J49M09o69K79K22l78J02J68k74L6J53l57L11k81
3536b35N6L47j48r0J89o97O78Jl61M57m6M1J12k78k33O30o77K95J15l79J53K64
3558A94p77N73j50j99O70m17L1M89o62L11K70m92M67l9n55M97j48j92M38m17k
3579a10L99m61J38J32k75L64j6l30K21l1j18L25n16K73K21k85K52M7k23J81j02
3600H6m32N76n53m6M45l51J6N12q5l04L71k48j06K88n60N75k32k5L47l77J90j65
3622g8j19L52k3l92M75J2m49K58L7k25L81m63M69L66o80J60N4k7m9L6m75L86q4
$$ y = [-110, 239, -250, 176, 395, -30, 157, -62, -351, 417, -85, 10, 402, -116, -51, 190, -468, 99, 176, -159, 49, -136, -314, 166, -159, -114, 253, 247, 76, 422, 77, 5, 133, -225, 282, 422, 119, 352, -316, 76, 234, -389, -15, 10, -181, 262, -11, -104, 112, -105, 44, 453, -216, 63, 285, -93, 9, 177, -97, -61, 92, -265, 46, -235, -179, 168, 20, -70, 119, -578, 100, 101, -260, 197, 151, 192, 304, 26, -207, 423, -254, 41, 156, -223, -70, 194, -583, -10, -160, -359, 311, -106, -75, 414, -248, 63, 333, -159, 308, 269, -286, 211, 63, -129, 309, -108, -110, 289, -172, -34, 98, -177, 187, 171, -159, 62, 31, -87, 238, -278, -5, 216, -69, 183, 230, 7, 188, 86, -346, 230, -323, -369, 76, -275, -259, 253, 168, -136, 235, -13, -119, 169, -391, 184, -48, -73, 274, -103, 87, -78, -197, 155, 132, -260, 215, 227, -222, 36, 73, -152, 229, -234, 235, 601, -79, 81, 135, 108, 59, 95, -380, 6, -78]
3645g8J3L23k56r2Jk75M31r7l16L37N9k1K11p2l98M76l45K77k36m09M80J88m13
3668b12J66L7j46L40j53n50O47l43J97J22m03K21L51n42O00j80l26M46l71O6o7
3689a00n6p5O01m94J08J64m26J66M16k10J68k1l27K19l26K89J39m21K34kj29j18
3711b01J96k14K79k07l15P14m07J61K4k90K13K97l19J65J9j56P3r2j86N73m89
3732a62K0L65m48m1J29M9J85r6k05L52m33J68K53k94n9O31q61P28o8l15L60j07
3754A51o54M95l1j96O05n68N7K82l79M67K6m64L20k24j85L37L3j30L67n10J84
3775a7j46K2K34j48J9QR2l11P32o87N6K07k93L38K81m96K61m8m59N53k38l30N30
3798A60j91J19j30L5L6k12j79K78J50l32M79j47l15O66n47R2K07k10Q5J9j2J59
$$ y = [-78, -65, 258, 2, -90, -89, -364, 67, -30, -346, -9, 50, 29, 240, 168, -230, 246, -99, 178, -58, -467, 13, 201, -212, -46, -9, -155, 185, 32, -518, 129, -214, -17, 105, -298, -77, 274, -268, 332, 152, -174, 272, -99, -33, -100, -156, -231, 370, -124, -16, 148, -278, -112, 304, 94, 262, 241, -86, 133, -193, 96, 235, -186, 48, 46, -83, -201, -5, -219, 60, -147, -462, 252, -155, 6, 30, -260, -47, 250, -69, 96, 115, -41, 32, -60, -246, 327, -162, -142, 223, -225, -266, -137, -88, 97, 1, -204, 148, -285, -117, 136, -158, -217, 414, -447, 281, 213, -102, 258, 151, -503, -8, -39, -235, 370, -198, -141, 141, -238, 229, 255, -209, 111, -113, -298, 39, 72, -58, 309, -201, -17, -163, -141, 93, -55, -36, -28, 64, -247, 485, -202, -146, 61, -232, 106, 387, -109, 152, 104, -355, 198, -40, -370, 160, -31, 88, -42, -7, 29, -183, -362, -84, 66, -266, 213, 66, -249, 417, -130, -38, 169, -41, 44, 63, 51, 210]
3820B10k77k70L85L6l53L61q3k60L02k89L28K27p01N79m3k17J55J42m24M54k07
3841E5j32L96m13P2J20l24K15j85j97O14k38n7L62n00J5L71nj82L16k23K08j11
3863A77m34K92j99K14ol81L12K48m01K42O2n69N07j68o7J13qK06o0j21J6K53m52
3886b24L94q3l58L37l1j85K08o7O3Nl39j10L40l10L81L13m28K51p6J34N7m68J62
3909c4N14m89j14K36m26K52K87l19K59k39o4M57l77j67O27o62M51j83j94K09L01
3930C25l74K21j68k90J72j83J0K38k60J93L32l56K25j59o1N75l26j07K15m40K41
3951B3J28l90L85j1l23N89m24l80P14j77k13Q4J35l54L56n59N59j02j48j0J86
3972F8k69L77M9m03L71n34J27K70l03k57K30r0J77K04k48L34j45J35j28k3J60
$$ y = [210, -67, -337, 48, 84, -269, 92, 9, -251, 51, -238, 90, 317, -384, 195, 152, -65, 90, 232, -192, 262, 55, -77, 319, -94, -22, 98, -226, -11, -196, -393, 221, -17, -74, 288, -212, -197, 174, 169, -13, 303, 80, 288, 177, -257, 35, -164, 50, 44, -337, -25, 223, -178, 64, 126, -443, 64, -104, -171, -58, -66, 140, 80, -41, -25, 228, -224, 170, 87, -271, 66, 35, -150, 58, -9, 54, 59, -280, -390, -50, -360, 21, 334, -94, 157, 81, 215, 272, -196, -34, 480, -9, -123, 113, -313, -61, 226, -93, 166, -73, -137, 320, -57, -224, 403, -259, 192, 9, -185, 24, 325, -49, 172, 4, -286, -114, -297, -287, -49, -309, -116, 216, -140, 85, -74, -135, 440, 114, 7, 222, -218, 23, 151, -239, 146, 135, -188, 401, -23, -403, 311, 134, -79, 5, 140, -214, 142, -417, 142, 40, -108, -118, 68, -201, 176, 225, -178, 193, -341, -214, 56, -247, -504, -274, -364, -187, 17, -231, 103, -42, 93, -35, -58, 102]
3993A02N4m44L53P4l10K57J1k49J36m6k21J07q3m4M17j94N2nk01P13n63j09L95
4016B02k51j27L12k11J26J33l04M50r7n16L51J17m84N93k24k84L30k12J62k12
4036a46k6M41j73p6j9K19l82L45j39k90M23k41k53P3J09J35K43n42L65K7l20M34
4058B07k99j9M91n88L29J12m26K45j56L7K01j94k48M30j01J6O9k04R7J8P9k68
4080a72L74l71L19j00n4N30o80J37N8k90J36N2j12K16j89J19L25k58l86M13k53
4101a86K33j84k2K44l1l14O03j53l76L34l25R7k7P6j80J59k19K53J57m16K89R0
4123A02r0l0pK6K65j38M9J83n22J29K17m24M27l92O7J73j45k5K14l67J90L61m69
4146b06L11n6j57K88j3k57R5j36k0J92j39L9L78o10M37k12PM74l87j87K79l21
$$ y = [102, 156, -288, 65, 139, -171, 86, 97, -152, -16, -62, -283, -176, -259, -303, 114, -80, -28, -33, -234, 479, -84, -193, 202, -49, -176, 136, -75, 51, 184, -120, 330, 233, -283, 68, 185, -299, 294, 70, -214, 116, -96, 66, -146, -172, 269, 96, 20, 1, 220, -162, 183, 44, -246, 177, -64, -317, -244, -135, 0, 243, -299, 66, 93, -227, 207, -92, -111, 380, -208, 121, 233, -193, 52, -104, -67, 134, -60, -308, 122, 21, 37, 106, -98, -1, 17, 96, -172, 202, -169, 150, 50, -4, 526, -154, -17, 41, -249, -113, -61, -173, 43, -146, -27, 298, 40, -346, 67, -186, 47, -137, -159, 85, 54, -260, 343, 190, -186, 148, -177, -80, -107, -31, -211, -52, -271, -18, 139, -277, 12, 102, 12, -18, -25, 1, 266, 128, 177, 360, -162, -33, 184, -240, 187, -205, -138, 35, -110, -135, 79, -288, -98, 263, -206, 105, 49, -108, 180, 167, -90, 5, -131, -151, 41, -98, -59, 319, -291, 146, -66, -59, 415, 28, -159, 120, -201]
4168b01N9M12l30J76Q0l80O9K5j12J94J5j98M93j1j44k4m04K99P7m07L70Q3n18
4191c77N36k2k78L52l35Q8K11m17L18mj64K29n0j32Q0r5MK50k61PK87m17Q3j8
4215a25j8K41M22m98K03k16q0P3j15j22L40m93K37N5n1K64o7j56L65j90n08M46
4237Gj26J87K53l49J11Qm23L24nj99L65k13j81K82k81K35L9j85m4L13m0J43n5
4260A66r5K8j17k08M75l62j10K10m3r5K67m22O48r5k76J46n1k9O2l8m3L2k65J90
4284b5L81l42J17o6l07L64k15j00L76m45L44j64N2L19p9n34M90k70j5L45k45Q2
4306F3J96l40J60q8M4L2j32j68L47k64m5o9K34PJ09k73K52J30k81J02Q9j81L01
4329B25j58l50N76k82J61kk43lJ30m53K82l7j01L94p1j61J56r6R8r0K3J63N8k65
$$ y = [-201, -142, 270, -60, 116, 196, -184, -115, -90, -202, -8, 7, -191, 302, 291, 147, 123, -281, 18, 95, -312, 58, 141, -377, 159, 137, -141, 211, -124, -36, 175, -242, 76, 72, -92, 137, 87, -45, 35, -60, -56, 194, -67, -60, 227, -190, -107, -125, -143, 98, 520, 22, 225, 9, -71, 2, -113, -235, 105, -388, -151, -96, -147, 117, 50, -106, 259, 69, -439, 7, -119, 68, 321, -28, 83, 91, -332, -8, -13, -212, 153, -60, -241, 41, -240, -5, 34, -151, -195, 118, 78, 221, 166, 71, 99, -18, -226, 249, -113, -223, -13, -56, -151, 116, -306, 342, 247, -29, 117, 66, 37, 99, 61, 18, 50, -215, -25, 356, 14, 131, 65, -242, 122, -93, -193, 183, -262, 82, -82, -30, 289, 210, -324, 166, -104, -119, 226, -19, 63, 259, -81, 79, -9, 35, 67, -65, -233, 114, -150, -195, -264, -30, -23, 86, -187, 65, 195, -86, 16, 105, -76, 225, 67, -283, 293, 11, 172, 170, -73, -76, 54, -399, -117, -154, -255, 139, 68, -93, 63, -33, 65, -25, -2, 161, 219, -46]
4353d6L18r4l96J77k29J11K10o8rN2k58K79Lk66J82L18o49N73q5L5r9K35k46J49
4377A97k09RL16j58k83J90jj09lKL58m30j09K44k33L04K31k26J17j00k14M5k1
4400h3K0M87n95P8L77k76Oj29j71M54L1j59J73k38l79M79k27J65J89n00L81r6
4422a3o7N5j6N7J52l26J04L15m62M25l7o29O45k23j19M98Ol96L94m19J8Q1o5m1
4446f3L30m29J79K84n30L84l15p2K50J37k65K94j23J7L19o74K98p4j39L82O4j63
4468I1K02o84K76J51Lr4J40M0k75J02j26Q6j47j03M16j50L72k14l03J28L76l00
4490a3k21K29j4p2Oj51N65n09J09J35n7k2O1j88L77q3k16L2k84K71O9k25K43L33
4514C75m58L95k09m17M41l33j29N43k11k2K48j05r9K4m41J55M73l47O3j26l4N05
$$ y = [-46, 272, 178, -218, -41, -270, -159, 51, -17, -26, 26, -232, 47, 50, -216, -34, 284, -365, 208, 123, 158, 59, 294, 48, 197, -12, -3, 313, 155, -128, 62, 61, -48, -51, -49, 309, -121, -230, 14, -219, 85, 316, 90, 207, 107, -107, -62, -83, -63, 424, -171, -93, 284, 8, 14, -115, -286, 168, 199, 40, 213, -25, -404, 75, -152, 13, 202, -298, 83, -13, -80, -25, -41, 16, 168, -158, -54, 261, -201, 224, 187, -442, 203, -20, -139, 359, 365, -31, 363, -56, -38, 43, -22, -63, 267, -162, 17, 301, -229, 155, -160, -232, 18, 155, -110, 184, 61, 78, 397, -277, 21, -53, -192, 190, 254, 91, 293, -391, -115, 36, 39, -55, 85, 125, -150, -48, -174, -88, -235, -338, 78, -72, 300, 86, -217, -89, 287, -13, -234, -5, -19, -91, -85, -236, 329, -180, -71, 64, 7, -15, 46, -142, 235, 152, -64, -32, -316, -45, 24, -201, 42, 375, -83, 312, 103, -314, 127, -206, -335, 208, -3, -25, 223, 118, 19, 43, -398, -243, 230, -117, -54, -180, -214, 291]
4536B91l35j01M51k06o5o6k94N43l95j11J75J18qN4Q2j46O2k72L60j04j04K72
4558B01r8q2j50K45l88N91k79p1M25l89l60N38k48J94q5j62M79l18j02J10q9k00
4580b38K22O1Q2n5m30M39j84K03R1j42j66r7J68N8J28l56L68j60P0P7N0j86J94
4603A97m24O0no4K34j3l19L00R6l56L38pj90J60K05k92M20m56K27M4j72K30l42
4626a29j6J96K40o09J35K76q8J11k99N6L4J6J67K18n20L30j55J94o5k29r2K80
4648E1m12M97O0m07J82J90m2q7K9j49J96j30p8l4P5j09L40j90L93l20q1M6J10
4671A30m60L41j64Q9K0j94K4K23j72J45N8j76L1N3J97m7k63M52j30m9j17j4k3
4694d6J17M6m78L93j94O4J32l7l21K97r7R0J03n4K28m7k22J84k50K41j2m9j23
$$ y = [291, -44, -145, 306, 100, 35, -31, -325, 218, -177, -288, -113, 5, -3, 51, 133, -13, 49, -223, 137, 33, -71, 201, 103, 21, -129, 116, -272, 319, 40, -31, 394, 5, -355, 183, -65, 129, 44, -118, 361, 43, -59, 51, -38, -238, -16, 45, 127, 72, -358, 81, -103, 100, 191, 49, -117, -214, -46, 12, 140, -216, 152, -8, 62, 139, 189, 3, 197, -227, -167, -172, -236, -2, -15, -334, -34, 62, -294, 44, 37, -153, 7, 212, -80, 340, -116, 111, 155, -17, 213, -129, -145, 51, 291, -318, -183, 93, 5, 116, -183, -127, -93, -77, 90, 308, -212, 118, -37, 157, 92, -137, -229, 51, -361, 136, 196, -211, -29, 161, 119, 32, 61, -88, 108, -22, -100, -134, -59, -168, 172, -18, 375, 55, -26, 20, 130, -330, 11, -153, -64, -44, -238, -214, 9, -163, -18, 40, -136, -105, -52, 145, 98, -165, 287, 157, 108, -9, -23, -46, 71, 117, -361, 32, -162, -98, 34, -3, -324, -27, -124, -34, 69, 15, 243, 196, -26, 158, -92, 149, 137, 88, -35]
4717c5J32jj92L12k85R9J04l09L28m20K81n5q9K51J48l27R5J29m08L29K47m31
4739i7O9R2k99K70q0N8J13J01m93m8Q0m3K74M9j31j40L6J84qp2M63n35K70Q2n23
4764c28N25j35q6L31k82J83k40j06N4j05k38N51K0l11K46o0N5J0N1L9J3k52L48
4787B83k61k02J36J59m2K8q0P3J71m25K88J48l31q4L98j81J39m7N6p0p8l3k10
4810a65J35R6J37m10K61j18j36K90n1j23O02m54o5P2o3Q6j57K12Mj4l58K29l9
4833b9o5K35o0j59Q8k18K11j70l7O9J52j70M40k71L16k84j28J00j28K42r7l97
4855c60L10j0J83k01k13N94k01j57o9M0J39J64k95J44pl06K98j39L1l60L28O5
4877b2P6Q4mk43K70j43j96K31j1j42K13N9k60K28Nk4j62k98M30q2j36N1O6r6K7
$$ y = [-35, 97, 96, -96, 216, -69, 30, 134, -175, 153, -267, 14, -41, -130, 121, 269, -58, 37, 166, -242, 87, 334, -97, -28, 64, -235, 35, -45, 13, 126, 227, -266, -314, -234, -277, -3, 46, -85, -225, -189, -5, -13, -85, 378, -157, 113, 195, -328, 197, 62, -24, 307, 25, 208, -32, -138, -84, -189, -427, 124, 144, -167, 79, 19, 74, 84, 135, 174, 187, -65, 283, 22, -180, -44, 115, 73, 101, 21, 94, 265, -160, 128, 276, -55, -139, 259, 78, 217, 170, 226, 156, 78, 45, -165, -30, 66, 203, -207, 54, -64, -200, 90, 39, -84, 518, 64, -1, 71, 8, 94, -63, 149, 153, 139, -219, 10, -29, -94, 141, 81, -78, 10, -208, 3, -167, -204, -135, 17, -153, 287, 16, 332, 48, -80, 20, -108, 134, 37, -360, -50, -60, 123, -78, -291, 303, 102, -55, -124, -84, 55, 219, -76, 68, 61, -245, 53, -86, -55, -415, -87, -22, 54, 138, 134, -109, 161, 18, -178, 53, 42, -100, 113, 172, -88, 140, 145, 121, -41, -339, 91, 9, -127, -76, -10, -106, -79]
4902g9J19n1l6J15n6J37J30j0l4k63J00K5o7J19M1m2P6l65J12R7J70n05K16J9
4926c2ML6k05L53l79K6M9K83k38J11k97L61K7k17M5K24m13K75j84R9K05k27J44
4949E0K96n6q2k88Q4j80J21l3P5K47m16K71j46r3J5p0J1L3M6J6R9O4L7Q4m9k03
4975f7jJ26M1l96J76R2J19l58J62j9KK02J37k48j06n9L47l44J04J87j38K63l42
4998a20j3K24nj49J55j24j04K53k03P5j25LL6J93k82j79J50J23L53k44Q6onj10
5022a8k1J23j98L34n03L83P7m72K88j76J62J25k38l1J65j64L41J9j55j15J65j05
5044a4J89r1j60J41j08L3m6o8J03q2J48L4k11m0L56j19L3k0k67L45j27l02L22
5067D9MR2K6k35N3R3P6l6j43j67L90J3l04J27j23O5K38j51j29j7o4J41K10m14
$$ y = [-79, 40, -11, -47, 68, 12, 149, 279, 269, 235, -28, 72, 97, 30, 149, 190, 148, 224, -141, -29, 68, 238, -267, -51, -32, -28, 8, -197, 156, -223, -197, -148, 135, -103, 8, -289, 72, 99, -118, -73, 151, -262, 13, -171, -72, 133, -94, 50, 346, 290, 208, -80, 4, -176, -55, -88, -13, 234, -182, 89, -57, -150, -135, -205, -194, -161, -115, -99, 0, 64, 101, 185, 136, -67, -68, 58, 99, -297, -121, -29, 90, -268, -106, -125, -123, 79, 216, -32, -138, -197, 150, -194, -90, 97, -41, 222, -120, -133, 91, 86, -63, 92, -32, -136, 117, -86, -11, -136, -133, -97, 96, -186, -365, -215, -92, 261, 17, 103, 97, 92, -18, -39, 84, -114, 220, -283, 100, 177, -295, -7, -183, -21, 104, -134, -165, 0, -164, 177, 196, 41, -74, 91, -14, 175, 84, -76, 65, -43, -10, -56, -124, -21, -103, 45, 79, -132, -172, 184, 65, 98, 78, -189, 156, 29, -273, 49, 53, 145, 171, -64, -11, 82, 158, 122, -21, -188, 202, 215, -89, 38, -85, -20, 218, 67, -62, -79, -143, -2, 208, -206]
5091b06L65j64j06Q4L4R5k44J80m3J1O8Jk20NK81q6J6K05m08j26L37N5q7M5j89
5116i7k50L92R1m3nk49N5l94M28PJ64j1N3j73J67p1k41L36j98K7L48k79j7j07
5140f7J3k04L71m02M42J19p19M39j15J43j89J89k88O07j79k32K31j06m7J18k88
5161a64J12R6k44K81r3j12J84j1j51qj47R3Q3n7L54l9j21l9J16k95J37Q9m2J36
5185A58n95N10j41K52n8j14J66J24l60l60N20Mj17k6j12N9J29Q4M3j74L5K29j89
5208F7K18o0n09L74o7l61L09J74k29J37k4Qn0l91L50J18K26j69J31m41K45j47
5230i1j08O10m45qO8J65K0n8j05j19J11l15L19R4r8J65j4q6O8o0m5L50j69l74
5254a25L01k14j96K01rK3j30K99p6k05j96L25k72K36J96j34j76N6p8K02j3L3N7
$$ y = [-206, 159, -5, -111, -27, 7, 102, -142, 38, -5, 6, 74, 75, -145, -140, 141, 55, 71, 276, -132, -258, 79, 134, 47, 92, -97, -347, 45, 136, 93, 88, -161, -106, -500, -72, -65, 99, 88, 141, -32, 135, 64, -177, 159, -39, -12, 336, 57, 40, -67, -54, -258, 113, -289, 153, 272, -447, -8, -123, 20, -169, 20, -268, 339, 160, -72, 159, 53, 6, 124, -164, -52, 44, -200, 81, -12, -124, 60, 49, -102, -110, -257, -164, -81, -138, 216, 177, 56, 17, 133, -162, -25, 64, 22, 158, -437, 73, -68, 184, 126, 12, 178, 302, -58, -418, 102, 106, -11, -37, -149, -90, 39, 123, 166, -8, 27, 256, 67, 285, 225, -284, 90, 23, -338, -29, 145, -84, 53, 29, 37, -13, -404, -54, 64, 290, 121, 252, -189, 56, -91, -199, 411, -34, -42, 26, 191, 211, 153, 48, -71, 40, -275, 44, 138, 40, 205, 191, 105, 173, 113, 68, 418, 249, -125, 176, -38, -234, -33, -42, -19, -149, 150, 74, -131, -327, -2, -274, -38, 158, 24, -152, -96, -174, 28, 15, 48, 105]
5277A05l2P4k63k2J62p7L4J99m1j58M63l71k05K87j82m1L17m26K52j9q9P5jo6
5301b5J34j2k04K09n9k08k00J78P1K37j26j09K35r3K15k78k37J2J69J0qK5R6P1
5325A03j90R0K4j77P7r1j54M12j04j05K76k56K04k8n6O7J00j31k9R0j21Ok36N3
5349a76L09n9o7K04r4l13O7J92n9K02k83K19k57J5K55l51l4%J57K46m14J35J04
5372bL7j62J09J82k16K09r1J87j17l97J00J23K34j0j93M04l54m9qj80L8L92j40
5395I6q0o0M7l5o5k71J97K40j33J06j1J18k82M20l95O9J18k92K04P9m79L37r8
5418a70Q9K13k25L7j98J33L06k32n9J87k15J88L1j80L57q3j72J42K02m00M5N9
5440E5j62M78k77j69Q7l0J54j48j9J06j75N6P0n2KJ21m73P06k89Q5j28j09j29
$$ y = [105, 73, 147, -116, -138, 24, -53, -19, 180, 139, -19, 444, 73, -132, 155, -27, -68, 249, -177, 75, 56, -33, 42, 41, -25, 109, 97, -107, 102, 43, -165, -365, -187, -116, 121, -5, -114, 121, 28, 243, -35, -272, -260, -91, -81, -89, -64, 32, 103, -87, 3, 27, -150, -73, -164, -318, 94, -10, -115, 161, -95, 109, 81, 25, 92, 192, 61, 32, 122, 1, 7, -229, -176, 133, 74, 7, 211, 117, -196, -129, 63, 4, 206, -77, 142, -115, -100, 155, -196, -230, -230, -73, 173, -241, -106, -2, 35, -127, -18, 164, -52, 157, 66, 253, 136, -261, -161, -38, 196, 186, -7, 397, 43, -6, -14, -194, -156, 236, 96, 16, -44, 3, -32, -97, -368, -171, 69, -64, 42, 31, 149, -133, 287, -108, -39, 79, -213, -9, 70, -409, -72, -170, -81, 132, -93, -56, -254, -121, 185, -47, -106, 81, -134, 54, 85, -95, 262, 179, 7, 149, 351, -49, -4, 55, -107, 371, 94, -75, 12, -18, 136, -12, -31, 75, -100, -44, 26, -26, -24, 97, -376, 330, 41, 126, -2, -111, -240]
5463b40M87k98K74l34m5R5K7j2J55j52j77K56J2Kl5R7k01L92m69J85j4J93k10
5486a2J08l09n7J84J4l2P4L9Q8j04j79K60k04j40K94j00j8P3q7O7nJ74j20jr4
5511h7M12m52L02j56j21K38k70J84M9rJ36R5m76M5Q0L5J18k72R9j2j34K27Q0p1
5535D0J7k11L32k10j70n9N45l65K07k31L6j36R1m0K82k02p3K79l8l48N33k74J68
5558A73q9R7o5j00j57K56j53r9k15L47k25K42J75m45L34k40K40Qk74J30J31j73
5580a02J38KN2k86L5M11j50Lj04L1m7n8n4LK68J95m12K77j50k50M29k96Q2m1k9
5605e3K29k50pj22L06r7k88M61l14L97k52J47K6L4l22L68m27K35j90L72k35l65
5627c47J51L68q5m5k1j68J61Q5m7no3j69N6P7j88K13j28J22N3k12L33nj40ln0
$$ y = [-240, 247, -51, 223, -111, -156, -61, -34, -46, 109, -43, -220, 36, 48, 50, 15, 112, -89, 303, -166, 19, 5, 198, -12, 96, -213, -270, -86, -72, -104, -30, 9, 97, -7, -186, 74, -130, -270, 24, -76, -94, -21, -108, -41, -46, 128, 8, 7, -87, 325, -127, 175, 19, -102, 136, -134, 50, 99, 90, 226, 321, -155, -110, -30, 5, 123, -149, -50, -62, -196, 31, 111, 40, 57, -154, 178, -32, -202, -261, 284, -81, 126, -105, -69, -205, -114, -154, 128, -74, -147, 132, 94, -254, 279, 5, 173, 84, 181, 116, 16, -141, 115, -38, -137, -352, -5, -230, 12, 187, -258, 76, -164, 76, 84, -190, -60, 71, -102, 36, 38, 90, -196, -161, 250, 100, 103, -1, 30, -17, -75, -129, -126, 142, 337, -75, 202, 52, -198, 231, -65, 17, -24, -53, 176, -74, -81, -203, 103, 6, -282, 179, -135, 262, 10, 157, 183, 217, -105, 263, -164, 71, -119, 253, 18, -347, -196, 172, 87, 42, 21, -147, 14, 99, 52, 47, -16, -185, -129, -52, -240, -27, -155, -33, 20, -192, 141, 136, -4, -7, -57]
5652e7r2L20l15K22J52n88K72K6R6K00l72N0O4J73j25KJ24l03K77L1qk22q0k7
5676a80J79J39J5n2k03Q1Lj34J68J35n0l37J65J10k26K18n2r9O8j60J1L71j62
5699HJ44m43N26l20j76N30m72N6J73j58P7k19K70R0k83O17l93j47K8K74j93j17
$$ y = [-57, -149, 171, -144, 78, 230, -358, -86, -60, 36, 236, -136, -86, -22, 151, 26, 28, 152, -151, 126, 157, 149, -73, -153, -180, -1, 138, 153, 101, -102, -21, -18, -152, 16, 151, 101, -236, -71, 39, -187, 31, -21, -120, -52, -212, -201, 170, 8, 152, -291, 235, -85, -261, 269, -203, -147, 26, -132, -55, -274, -4, 86, -197, 420, 27, -120, -92, 182, -11, -128]
$$ [...]
8191a22
##END NTUPLES=NMR FID
##END=
