##TITLE=1H_Ser E1-24
 CDCl3+DMSO
 8 sc, 
 7.11.2024
##JCAMPDX= 6.0         $$ Bruker NMR JCAMP-DX V2.0
##DATA TYPE= NMR FID
##DATA CLASS= NTUPLES
##ORIGIN= UXNMR, Bruker Analytische Messtechnik GmbH
##OWNER= root
$$ XWIN-NMR		Version 3.5
$$ Thu Nov  7 14:24:48 2024 Russian Standard Time (UT+4h)  she@DPX200
##.OBSERVE FREQUENCY= 200.1318
##.OBSERVE NUCLEUS= ^1H
##.DELAY= (6, 6)
##.ACQUISITION MODE= SIMULTANEOUS
##.ACQUISITION SCHEME= undefined
##.AVERAGES= 8
##.DIGITISER RES= 18
##SPECTROMETER/DATA SYSTEM= spect
##.PULSE SEQUENCE= zg30
##.SOLVENT NAME= D2O
##.SHIFT REFERENCE= (INTERNAL, D2O, 0, 15.7039)
##AUDIT TRAIL= $$ (NUMBER, WHEN, WHO, WHERE, WHAT)
$$ ##TITLE= Audit trail, XWIN-NMR		Version 3.5
$$ ##JCAMPDX= 5.01
$$ ##ORIGIN= Bruker BioSpin GmbH
$$ ##OWNER= she
$$ F:/spectra/data/she/nmr/H-F/1/audita.txt
$$ ##AUDIT TRAIL=  $$ (NUMBER, WHEN, WHO, WHERE, WHAT)
(   1,<2024-11-07 14:23:21.95 +0400>,<she>,<DPX200>,
      <created by zg, POWCHK disabled, PULCHK disabled
       configuration hash MD5:
       00 E9 B6 7A A2 85 ED C7 34 08 36 98 17 FE 4E 26
       data hash MD5: 16K
       44 2E F1 C1 CF 83 36 FD BF B1 73 72 8B A1 C4 82>)
$$ ##END=
$$ 
$$ hash MD5
$$ E0 8F 51 D3 7E 37 41 73 78 DC DD 6C 32 3B 7D D7
##$RELAX= 
##$RELAX= 
##$RELAX= 
##$RELAX= 
##$RELAX= 
##$RELAX= 
$$ Bruker specific parameters
$$ --------------------------
##$DU= <F:/spectra>
##$EXPNO= 1
##$NAME= <H-F>
##$PROCNO= 1
##$TYPE= <nmr>
##$USER= <she>
##$AMP= (0..31)
100 100 100 100 100 100 100 100 100 100 100 100 100 100 100 100 100 100 
100 100 100 100 100 100 100 100 100 100 100 100 100 100 
##$AQSEQ= 0
##$AQ_mod= 1
##$AUNM= <au_zg>
##$AUTOPOS= <>
##$BF1= 200.13
##$BF2= 200.13
##$BF3= 200.13
##$BF4= 200.13
##$BF5= 200.13
##$BF6= 200.13
##$BF7= 200.13
##$BF8= 200.13
##$BYTORDA= 1
##$CFDGTYP= 0
##$CFRGTYP= 5
##$CHEMSTR= <none>
##$CNST= (0..31)
1 1 145 1 1 1 1 1 1 1 1 1 1 1 1 1 1 1 1 1 1 1 1 1 1 1 1 1 1 1 1 1 
##$CPDPRG= <>
##$CPDPRG1= <>
##$CPDPRG2= <>
##$CPDPRG3= <>
##$CPDPRG4= <mlev>
##$CPDPRG5= <mlev>
##$CPDPRG6= <mlev>
##$CPDPRG7= <mlev>
##$CPDPRG8= <mlev>
##$CPDPRGB= <>
##$CPDPRGT= <>
##$D= (0..31)
0 1.2 0 0 0 0 0 0 0 0.06 0 0.03 0 0 0 0 0.0002 0 0 0 0 0 0 0 0 0 0 0 0 
0 0 0 
##$DATE= 1730975001
##$DBL= (0..7)
120 120 120 120 120 120 120 120 
##$DBP= (0..7)
150 150 150 150 150 150 150 150 
##$DBP07= 0
##$DBPNAM0= <>
##$DBPNAM1= <>
##$DBPNAM2= <>
##$DBPNAM3= <>
##$DBPNAM4= <>
##$DBPNAM5= <>
##$DBPNAM6= <>
##$DBPNAM7= <>
##$DBPOAL= (0..7)
0.5 0.5 0.5 0.5 0.5 0.5 0.5 0.5 
##$DBPOFFS= (0..7)
0 0 0 0 0 0 0 0 
##$DE= 6
##$DECBNUC= <off>
##$DECIM= 24
##$DECNUC= <off>
##$DECSTAT= 4
##$DIGMOD= 1
##$DIGTYP= 9
##$DL= (0..7)
0 120 120 120 120 120 120 120 
##$DP= (0..7)
150 150 150 150 150 150 150 150 
##$DP07= 0
##$DPNAME0= <>
##$DPNAME1= <>
##$DPNAME2= <>
##$DPNAME3= <>
##$DPNAME4= <>
##$DPNAME5= <>
##$DPNAME6= <>
##$DPNAME7= <>
##$DPOAL= (0..7)
0.5 0.5 0.5 0.5 0.5 0.5 0.5 0.5 
##$DPOFFS= (0..7)
0 0 0 0 0 0 0 0 
##$DQDMODE= 0
##$DR= 18
##$DS= 0
##$DSLIST= <SSSSSSSSSSSSSSS>
$$ [...]
##$SUBNAM2= <"">
##$SUBNAM3= <"">
##$SUBNAM4= <"">
##$SUBNAM5= <"">
##$SUBNAM6= <"">
##$SUBNAM7= <"">
##$SUBNAM8= <"">
##$SUBNAM9= <"">
##$SW= 24.0689170037331
##$SWIBOX= (0..15)
0 0 2 0 0 0 0 0 0 0 0 0 0 0 0 0 
##$SW_h= 4816.95568400771
##$TD= 16384
##$TD0= 1
##$TE= 0
##$TE2= 300
##$TE3= 300
##$TEG= 300
##$TL= (0..7)
0 120 120 120 120 120 120 120 
##$TP= (0..7)
150 150 150 150 150 150 150 150 
##$TP07= 0
##$TPNAME0= <>
##$TPNAME1= <>
##$TPNAME2= <>
##$TPNAME3= <>
##$TPNAME4= <>
##$TPNAME5= <>
##$TPNAME6= <>
##$TPNAME7= <>
##$TPOAL= (0..7)
0.5 0.5 0.5 0.5 0.5 0.5 0.5 0.5 
##$TPOFFS= (0..7)
0 0 0 0 0 0 0 0 
##$TUNHIN= 0
##$TUNHOUT= 0
##$TUNXOUT= 0
##$USERA1= <user>
##$USERA2= <user>
##$USERA3= <user>
##$USERA4= <user>
##$USERA5= <user>
##$V9= 5
##$VALIST= <valist>
##$VCLIST= <CCCCCCCCCCCCCCC>
##$VD= 0
##$VDLIST= <DDDDDDDDDDDDDDD>
##$VPLIST= <PPPPPPPPPPPPPPP>
##$VTLIST= <TTTTTTTTTTTTTTT>
##$WBST= 1024
##$WBSW= 4
##$XGAIN= (0..3)
0 0 0 0 
##$XL= 0
##$YL= 0
##$YMAX_a= 99761
##$YMIN_a= -84774
##$ZGOPTNS= <>
##$ZL1= 120
##$ZL2= 120
##$ZL3= 120
##$ZL4= 120
##$ABSF1= 10
##$ABSF2= 0
##$ABSG= 5
##$ABSL= 3
##$ALPHA= 0
##$AQORDER= 0
##$ASSFAC= 0
##$ASSFACI= 0
##$ASSFACX= 0
##$ASSWID= 0
##$AUNMP= <proc_1d>
##$AZFE= 0.1
##$AZFW= 0.1
##$BCFW= 1
##$BC_mod= 2
##$BYTORDP= 1
##$COROFFS= 0
##$CY= 11.3945322036743
##$DATMOD= 1
##$DC= 2
##$DFILT= <>
##$DTYPP= 0
##$F1P= 15.6554695791079
##$F2P= 12.8336369535428
##$FCOR= 0.5
##$FTSIZE= 0
##$FT_mod= 4
##$GAMMA= 1
##$GB= 0.15
##$INTBC= 1
##$INTSCL= 1
##$ISEN= 128
##$LB= 0.24
##$LEV0= 0
##$LPBIN= 0
##$MAXI= 10000
##$MC2= 0
##$MEAN= 0
##$ME_mod= 0
##$MI= 1.114404
##$NCOEF= 0
##$NC_proc= 0
##$NLEV= 6
##$NOISF1= 3.799351
##$NOISF2= 2.8
##$NSP= 1
##$NTH_PI= 0
##$NZP= 0
##$OFFSET= 15.70392
##$PC= 1
##$PHC0= -26723.76
##$PHC1= 28.98744
##$PH_mod= 1
##$PKNL= yes
##$PPARMOD= 0
##$PSCAL= 0
##$PSIGN= 0
##$REVERSE= no
##$SF= 200.130013532006
##$SI= 16384
##$SIGF1= 3
##$SIGF2= 2
##$SINO= 400
##$SIOLD= 16384
##$SREGLST= <1H.CDCl3>
##$SSB= 0
##$STSI= 0
##$STSR= 0
##$SW_p= 3612.71676300578
##$SYMM= 0
##$S_DEV= 0
##$TDeff= 0
##$TDoff= 0
##$TI= <>
##$TILT= no
##$TM1= 0
##$TM2= 0
##$TOPLEV= 0
##$USERP1= <user>
##$USERP2= <user>
##$USERP3= <user>
##$USERP4= <user>
##$USERP5= <user>
##$WDW= 1
##$XDIM= 8192
##$YMAX_p= 0
##$YMIN_p= 0
$$ End of Bruker specific parameters
$$ ---------------------------------
##NTUPLES= NMR FID
##VAR_NAME=  TIME,          FID/REAL,        FID/IMAG
##SYMBOL=    X,             R,               I
##VAR_TYPE=  INDEPENDENT,   DEPENDENT,       DEPENDENT
##VAR_FORM=  AFFN,          ASDF,            ASDF
##VAR_DIM=   8192,          8192,            8192
##UNITS=     SECONDS,       ARBITRARY UNITS, ARBITRARY UNITS
##FACTOR=    0.0002076,     1,               1
##FIRST=     0,             0,               0
##LAST=      1.7004516,     0,               0
##MIN=       0,             -84774,          0
##MAX=       1.7004516,     99761,           0
$$ Real data points
##PAGE= N=1
##DATA TABLE= (X++(R..R)), XYDATA
$$ [...]
1880e2j2K14rJ19o34J06K81m09K02Q9L4j09K86j32j59M19l83j57L86rJ24j57n2
1903a4j16J08L03m75L30j44R0k25L09l37J71L31k92j64L3J55n7J97l16j72K43
1924d2K1j33P0k8N4nK32j55K07k06J01K4L9j86l9j94j9L91R2l52K72j87M3J4k42
1949b28J7lL12r8J39k16L48l88q1K12j30L59k52J11O6l19Q0K13j36O9l75K84L17
1972C01j66k49L24m24J11J00J06j45l3O50o90M02km63l20L57K71k63q3M60l00
1993e6L95m8m00o2j4J01K65p2m89L14K69k43j98L58l4j29J93j86q3J06m3K69k08
2016Er5L01l23J60J7Qj20p4j61K28k40L56L2k54KJ36j40K35k02m01N65j2k14j32
2040c23N71j08r0j5J04j97L44m30M34J11n87J15Q4qk83L76j60r6J64j31R8J11
$$ plain form
1880 -52 -64 150 141 260 -374 -268 13 -396 -194 -105 -71 -180 106 -26 -185 234 -149 -306 80 71 195 38 -14
1903 -14 -130 -22 281 -194 136 -8 82 -143 166 -171 0 331 39 -125 -92 63 6 203 -113 -285 -42
1924 -42 -21 -154 -84 -112 -58 -63 169 14 221 15 116 140 179 -7 -46 -240 -259 132 224 -128 144 -43 0 14 -228
1949 -228 -211 -214 98 0 139 -77 271 -117 -198 14 -116 243 -9 102 168 -151 -71 142 6 75 -300 -16 301
1972 301 135 -114 210 -214 -103 -3 103 -42 -75 575 -115 287 285 -178 -498 -141 130 -133 -216 244 -56
1993 -56 339 291 -109 -171 -185 -84 181 109 -380 -66 203 -40 -238 120 86 -43 150 -36 -119 -13 -56 213 5
2016 5 -90 211 -112 48 65 73 -47 -121 -282 -54 -294 62 94 -160 -158 -22 -162 73 -129 -530 35 23 -191 -323
2040 -323 248 140 50 35 139 -58 286 -144 290 401 -186 -71 13 5 -278 98 -62 -158 6 -125 -27 84
2062H4N4o5P9M1R9l06J62k54o3L96N4p35N36l16N2K88r5Rj56J49j51P3j03K42
2086G4j93Q9J65j52m8J01o2k1J28J05j29n5O0j18j09O7N6K4O4K25j98k58K52k43
2110a76J88J16k66L47j40k63M91j59k07p6K57j69L2L3L32l85P4R2j58J51J37l06
2132e5m6o4m7L12j42L39k37p9j79M75k97r9K10k60m3M72j7l25nK27j92M6O2p9
2156b3J11J89m2q7q1j50M5J07k55J10K16l76K41k78r1L04J48k00M15m45M11k71
2178bK26k78K31j63l37K37o0K29J78L6k40J24l02O2j47L21J27o25Q38m47k88N24
2200B44n94M84k24J36l3j95%P0J81l6O0J7j13q6O9K70j32j59P1j50Mo4J96J1J59
2225A86m68K47o6r6M63j50k33k0J56l53L91j27j73N41r5o27M29J89k25J34ml03
$$ plain form
2062 84 138 73 152 193 292 -14 148 -106 -169 227 281 -454 82 -234 -182 106 11 20 -136 13 -138 -65 -168 74
2086 74 -119 -30 135 -17 -65 36 -26 -47 81 186 57 2 62 -56 -165 -98 -42 -18 46 271 73 -185 67 -176
2110 -176 12 128 -138 209 69 -194 297 138 -69 -145 112 -57 -25 8 340 -45 29 121 -37 114 251 -55
2132 -55 -101 -165 -212 100 -42 297 60 -19 -198 277 -20 -119 91 -169 -212 260 243 -82 -87 140 -52 -6 56 -23
2156 -23 88 277 235 148 67 -83 -38 69 -186 -76 140 -236 5 -273 -364 -60 88 -112 303 -142 269 -2
2178 -2 224 -54 177 14 -323 -86 -146 83 261 297 57 181 -121 -59 -206 115 242 -383 455 8 -280 244
2200 244 -350 134 -90 46 13 -182 -182 -112 69 33 93 110 -3 -89 -20 250 118 -41 30 -120 -116 -180 16 27 186
2225 186 -282 -35 -101 -197 266 116 -117 -137 19 -334 57 -70 -243 298 203 -424 5 194 -31 103 99 -204
2247b04J59q8j37J31K45O2k28K60k14J84k41M6Q5k56L09M4r0k49K18j56J45O8
2269I3M5j50p2J9J30M1mk39j38M09J75p04N53K2k11j9K30n09J04J85K92l74J17
2292eJ65k68K19o4J00J44k30n6q2K95m17K06k06L36L3n06L17M2K23k87O8J0j65
2315a28M39n9l38L7Q9k88k5J76O7RJ00k49M2L26m15K11r3K43j49J91j60M4j34
2338f4K28k75P2j31K99k55L87k10j09L97m7j19k63L10j18l68N74o13j11K57j6
2359a75M5K22R7l98K52l03R9J21m3K18O6l76K99j27lM1kMl66N1qL78L5m27N13
2384B13k56j55k9M43l27J45j66K9j55O29k18k16L09k27K15j27j21j25L29l43j1
2405a64L42P6m08J28j66L04j89K89m27L42j93K35k81J29L5Q9j27J12j36m0K42
$$ plain form
2247 -204 -45 -133 -270 -139 106 168 -60 200 -14 170 -71 -25 60 -196 113 157 67 -182 36 -120 25 93
2269 93 138 -12 -84 -65 65 106 102 -137 -275 134 309 -395 158 180 -31 -50 180 -329 -225 -40 252 -122 -5
2292 -5 160 -108 111 47 147 291 61 5 -77 218 -199 7 -199 137 170 -336 -19 23 246 -41 27 37 -128
2315 -128 311 252 -86 -49 40 -248 -273 -97 -30 -21 79 -170 -128 198 -217 -6 -99 144 -5 186 26 70 -64
2338 -64 164 -111 -39 -170 129 -126 261 51 -58 339 292 173 -90 220 102 -266 308 -305 -416 -159 -175
2359 -175 -130 92 189 -209 43 -260 -161 -40 -83 135 201 -175 124 -3 -6 35 33 37 -329 -278 -286 92 127 -300 213
2384 213 -43 -198 -227 216 -111 34 -132 -103 -258 371 153 -63 246 19 234 107 -14 -139 190 -153 -164
2405 -164 178 254 -154 -26 -192 112 -77 212 -215 127 -66 169 -112 17 52 141 14 126 -10 -50 192
2426A92K29m21lO6l9k8Q7l74M43o6O0n0O0k98M8K84p0m8K5k2l17J70L8j7k05J36
2452a20m6K12j17o5O4p1M15o0m8l97M31j16j1K14m28M64k47J04j74J05j59k93
2474c43N70o7q6j08J16j76L6K0k3j54J14J65J08k74j03K23J12J1j67j5j96K35
2496bJ54j95K59k28j16K3K00r9l10M05k83L4J64Jj00k44K42N8l5l6J78l98L84
2519E6L3p4J37j54Q5l40L02p5N1m8K17k54K75k29J77r9j24l31N93j05k22l7pL17
2543A44l48J20Q3j4k53J90O3P8k71QJ22K56r9j71K87j74J18m9ml85L02K3j02o
2567h2L58k23P8J01l63j4L91k09k77N18m16Q8L07m00R8NJ90J0k80K75m01L90j57
2590a3r9L69n14K43k00M27k59k2J16Lk19L0J28k15K33j38J29j09P2P7J23p2l92
$$ plain form
2426 192 421 0 -3 63 24 -4 83 -291 152 86 146 96 156 -142 -94 190 120 72 97 75 -242 -72 -34 -51 -256 -120
2452 -120 -166 46 -71 -136 -72 -143 272 212 164 -233 198 82 71 285 -143 321 74 178 4 109 -50 -343
2474 -343 227 160 74 -34 82 -94 -58 -38 -61 -215 -101 64 172 -102 -205 18 130 141 -26 -41 -237 -2
2496 -2 152 -43 216 -12 -128 -105 95 -4 -314 91 -192 -158 6 7 -93 -337 -95 -37 -72 -108 70 -328 56
2519 56 89 15 152 -2 83 -257 45 -30 21 -27 190 -64 211 -18 159 60 -64 -395 198 93 -129 -166 -173 144
2543 144 -204 -84 -1 -15 -268 -78 -15 63 -208 -200 -78 178 79 -92 195 21 139 90 86 -299 3 26 -76 -82
2567 -82 276 53 131 232 -131 -145 246 37 -240 278 -138 -50 257 -143 -45 -40 150 160 -120 155 -246 144 -13
2590 -13 -112 257 -257 -14 -214 213 -46 -68 48 51 -168 -138 -10 -225 8 -130 -1 -110 -38 39 162 90 -302
2613c02M17k0l9k58m5O20l80j63O6K55j60j2P1m5lJ42L63n88R1K13M9l42j44J94
2637b0k57J81J1p8pM54l09J6K14j80r3r7L13k40O8r9O4M86k11r7Kl20o0J12J79
2662C2nJ25n0r4l8P3l09J14L22k10j80J99K5l40N22j44L2j43K40J39k25j86K2
2685g9J35K04k97L89m32j21K55J66j26j68K49l19k24M33l37M35k65p2O9L23k71
2706e3J47k36K46l93K95J81j14o2N3M3J12m94O4J87j63M27l74N3J75L9Q5l37K17
2729I8K4k9k37K70j43n8K51j96J66j01j22J82Qk98J79J68j66j7R7m37J50L59m39
2752b91L71J7j07j54M5J4K46j73J7L81m26K83j09o0J51k47J69J46j38j00J95k99
2774f9O1j51J74j15K59m9m32K93mr2K17l51L25J20k59K83j6k84J80j17q5QJ26
$$ plain form
2613 -302 115 95 56 -202 -247 373 -7 -170 -104 151 -9 -21 50 5 2 144 507 -81 10 223 272 -70 -214 -20
2637 -20 -277 -96 -85 -163 -170 284 -25 -9 205 25 -68 -165 148 -92 -24 -123 -59 427 216 119 121 -199 -259 -147 32
2662 32 27 152 102 8 -30 43 -266 -152 170 -40 -220 -21 4 -336 186 42 74 -69 171 310 85 -101 -79
2685 -79 56 260 -37 352 -80 -201 54 220 94 -74 175 -144 -368 65 -272 163 -102 -174 -105 218 -53
2706 -53 94 -142 104 -289 6 187 73 11 64 107 219 -275 -211 -24 -187 240 -134 -81 94 133 218 -119 98
2729 98 122 93 -144 126 -17 -75 176 -20 146 45 -77 105 113 -185 -6 162 -4 -21 76 -361 -211 148 -291
2752 -291 80 97 -10 -164 -119 -105 141 -32 -15 366 -60 223 114 54 205 -42 127 273 135 35 230 -69
2774 -69 -8 -159 15 -100 159 110 -322 -29 -33 -125 92 -259 66 186 -73 210 194 -90 90 -27 -112 -104 22
2797B2Mj53K32j68K86q4J26l69M32m81J59p6k21J66K9J54Oj42K58j81N3o0kK63
2821B53j55n10O35m74L85n2k00K57k66j7K44P6k96k5N55m66j99K00J50n45M51
2842Aj94r7L22j25Rj59K61k1rpJ64m92M94L7j81R5K2p7J17N9k64L36l76K30Kl05
2868a58J65K85k29j98L43j82m4l6L11k52j40L56k34p3l2j1K1J63j71J61R0k68
2890a33K5M0N3j48L15j18j4k48K46m0J21j5l2J28m74J32J48P1q8K65l23j08lL21
2914A21l49K40J55m84O6K72rl77K44l6j69M63j70J93K3qj55j19J12J43K57l65
2936D8p8L75l80r1K58k56J34r9k20L22l22n2M44j01L55n87M82N5l88Qq4N62k33
2959A52r8k27J87R6k73k9K6l9K84j75n6R5K41l90M79l0k47mno4M19m10j98L72
$$ plain form
2797 22 26 -127 105 -63 223 139 265 -104 328 -153 6 -70 -291 -125 -96 58 64 -78 180 -1 52 -8 -10 253
2821 253 98 -412 223 -251 134 82 -118 139 -127 -144 100 176 -120 -145 410 -56 -255 -55 95 -450 1
2842 1 -193 -290 32 -93 -84 -243 18 -3 -12 -19 145 -347 147 184 3 98 120 43 160 219 -45 291 -85 145 147 -158
2868 -158 7 292 63 -135 208 26 -18 -54 257 5 -135 221 -13 -86 -118 -129 -108 55 -116 45 135 -133
2890 -133 -108 -68 -15 -163 152 34 20 -228 18 -22 99 84 52 180 -294 -162 -14 57 -31 234 -89 -197 -200 121
2914 121 -228 12 167 -317 -251 21 12 -365 -121 -157 -326 137 -33 160 183 175 20 -99 13 156 413 48
2936 48 -30 345 -35 -126 132 -124 10 -89 -309 13 -309 -361 83 -18 337 -250 232 287 -101 -93 -177 385 152
2959 152 54 -173 14 110 -163 -192 -166 -205 79 -96 -152 -57 184 -206 273 243 -4 -8 -13 -77 342 -68 -266 106
2983A06K70m71L29j73n03L50J10o3j92M03j69l3K54l19J80k3M9l20M97m5k92k17
3005b72L07J34J48l66o3L32n41N0L65K01k68j15J04Rk2K89k96j42j37P3K10N5
3027E5k87L42r6l14L90j20J11L65k91k03L9J62l23K5O6j24K46J17k16K40nj80
3049ak8L28j29k54j05J16K40j84l2J76j32j69K89Rj49j79K40m2J9j19J4k10L09
3072GLk41K00J30j1k67M79n05M16q8p5p4J79l07L02p9R5l7K0j13N9K50m82k40
3096c79L71M38p8k10K3m71N4L17k44J18j27K82k8L05l44k21Q2K82j58m3L44m43
3118a30J55o3k13l0L74m2k64J18K63n44N34l83K82J18N8j74N8j3R7m3j88O9pj18
3142h6J12j49L15r5j08O8l21K35L28k32o9J03l74J0K74k25M30j08j97N85n76J48
$$ plain form
2983 106 376 -95 234 61 -442 -92 18 -45 -237 166 -3 -36 218 -101 79 56 105 -215 282 237 -55 -272
3005 -272 35 169 317 -49 -112 220 -321 -271 94 295 27 -88 16 25 3 292 -4 -146 -283 -210 0 55
3027 55 -232 110 14 -300 90 -30 81 446 155 -48 -9 153 -170 -145 -79 -203 43 160 -56 184 179 -1
3049 -1 -29 299 170 -84 -189 -73 167 -17 -49 127 -5 -174 115 124 -25 -204 36 -6 13 -106 -92 -302 7
3072 7 10 -231 -31 99 88 -179 300 -205 211 123 48 -26 153 -154 148 69 164 127 147 34 93 343 -139 -379
3096 -379 -8 430 352 142 165 -306 -252 65 -179 -61 -188 94 66 371 27 -194 -112 170 12 -31 313 -130
3118 -130 25 -38 -251 -281 93 51 -213 -95 168 -376 158 -225 57 175 233 59 117 104 201 158 -30 39 32 -86
3142 -86 26 -123 192 97 -11 57 -264 -29 299 67 -2 101 -273 -263 11 -214 216 108 -89 496 -80 68
3164F8J44j09J21j76j84K23k26j10L52m9j78J42k01P9j94L34j88O0j44L09m05
3185c32J28J05L47K7n8k71q2J19J06J95l50l08M97k84%L79l74J58R7J22m23L81
3207A79k95o0m05O87jl59R6N16m49J35j32J97j63r9N31k95K32m88J06L3J03o1
3229Ho3r3K05Lj13N2j14q5L0m1K02n9K0K2Q6J42k48j52K19j16j3N17m37m50K88
3254a90J98J36j82L37j26p1q4o1J12J4j61K61Rk82j26M92n13J21Q6j47N11j99
3276A35l74O55j65m69O8N1L90m43l6q9N13j93M5K58l25j19k61J54Q2J47J84l63
3298a55K62j75K12l53K06k12J51J40j11Lj25J34n9Q2R2m60N37J63m32J56k95L10
3320G1J03k14j05j99J99M02n54L91l54M59j06qK3j01Kr8K7K78j56P0K25n51L04
$$ plain form
3164 68 212 103 224 48 -136 87 -139 -249 103 54 -124 18 -183 -104 -298 36 -152 -92 -236 73 -332
3185 -332 -204 -99 248 275 217 -54 -136 -17 89 284 -66 -374 123 -161 -161 218 -156 2 99 221 -202 179
3207 179 -116 -176 -581 106 105 -254 -158 358 -91 44 -88 109 -54 -153 378 83 315 -173 -67 -34 69 8
3229 8 -55 -148 57 60 -53 -1 -115 -200 -170 -211 -9 -68 -48 -26 60 202 -46 -198 21 -95 -108 409 -28 -478 -190
3254 -190 8 144 -38 299 173 102 18 -43 69 83 -78 183 192 -90 -216 276 -237 -116 -30 -177 334 135
3276 135 -239 416 251 -218 -150 -99 291 -152 -188 -277 236 43 88 346 21 -98 -359 -205 -123 24 208 -155
3298 -155 107 -68 144 -209 -3 -215 -64 76 -35 -32 -157 -23 -82 0 92 -368 169 332 -100 56 -239 71
3320 71 174 -40 -145 -344 -145 257 -297 94 -260 199 93 85 108 7 9 -89 -62 216 60 130 355 -196 108
3343A08k19M6K32k50j8K6K53k29k07O6L89l24K9L35k88l23N01k24j13L88l38L31
3365A71j01P6k38J30j45J35j62M17k65k16J44J1L7j36N9j99J98J62R7k01q0K34
3387A28k25LM7J94j30k68L14K36k42N5k97K56J1k09P6K21l07K00l33J50k1Rk21
3410c53O28l69n0K2L28l27L29j73J07K0j45J74q7k69J95%J38L0J71l45j53K97
3432A68l07K85k11N2Q5j31K93q9q5j50L35j98k50P2J57l9R5%q0j51p6K95k27M42
3456B85k07K20j68K30o60K99oO3k67J02J38N6L6j57j07J66K57k64L1k20L49l02
3478a26Q3K89k31J69l05K51p6J59m01L21j14k4k1O6n7K38R4n75L07J21J3K02n24
3501a41K60q8l7K43k97R7M7Q5J0k74k17K19J70J63k78K91l44p1J01k54M85Q4l15
$$ plain form
3343 108 -111 -65 167 -83 -101 -75 178 -51 -258 -192 197 -127 -98 237 -51 -374 127 -97 -210 178 -160 171
3365 171 70 146 -92 38 -107 28 -134 283 18 -198 -54 -43 -6 -142 -83 -282 -84 78 175 -26 -106 128
3387 128 -97 -94 -47 147 17 -251 63 299 57 112 -185 71 82 -127 -51 170 -137 63 -270 -120 -141 -132 -353
3410 -353 275 -94 -144 -122 206 -121 208 35 142 162 17 191 104 -165 30 30 168 198 369 24 -129 168
3432 168 -139 146 -65 -13 72 -59 234 145 60 -90 245 47 -203 -131 26 -13 82 82 2 -149 -225 70 -157 285
3456 285 78 298 130 360 -300 -1 -7 56 -211 -109 29 85 121 -36 -143 23 280 16 47 -173 176 -126
3478 -126 -43 246 15 184 -121 130 54 213 -188 133 19 -5 -26 40 -17 221 315 -260 47 168 181 383 -141
3501 -141 119 31 -6 237 -60 37 84 169 179 -95 -312 -93 77 240 -38 253 -91 -162 -61 -315 170 254 -61
3524f1J02M38l28k21K36j25K30l95j85J39LK50K29N9m07J0p2o6M21R6m26L7P6
3547D0o3Q4j31%J77J96l16l5P6l45M98j86%N8OL75l10j13K07n55M29O7l68K54
3571D5M9M4j44K44l95K62J03j71k44J58M7J71j78J08l03J1J77l08O1K0M41k01
3593ck75L88k97K52kk57K72j25PK95l23M29r8j40k04K34k40J85k56K04k46M64
3615B64j43m9N6j65j54L06k14J46K8l89K81pk85J23L30l52KM02l67K88q7J85O7
3638B66m6k96k56N42k65L37k42K35l89R2M04j55k42R1m3J74k15l6o2J89J7j23
3660b3K05j68k51kK98J75k22l5R5J0k51J34JK0o7K02j53l39J86K85k43K58j77
3683f2J06k21Q6N8Pj35L19k99L13l0R7l43r4K76m32K20K4k3J30o9Q3l16K13J90
$$ plain form
3524 -61 41 479 151 -70 166 41 271 -124 -309 -170 -167 83 312 371 -36 -26 -98 -164 257 353 -73 -36 40
3547 40 -23 61 -70 -70 107 303 -13 -48 28 -317 181 -5 -5 53 59 434 124 11 218 -337 92 159 -209 45
3571 45 94 138 -6 238 -157 105 208 37 -207 -49 -2 169 -9 99 -204 -193 -16 -324 -263 -243 198 -3
3593 -3 -278 110 -187 65 63 -194 78 -47 -40 255 -68 361 263 123 -81 153 -87 98 -158 46 -200 264
3615 264 121 72 128 -37 -191 115 -99 47 75 -314 -33 -40 -325 -202 128 -224 -222 180 -187 101 14 199 266
3638 266 220 -76 -332 210 -55 282 40 275 -114 -22 382 227 -15 76 33 207 -8 -44 -106 83 100 -23
3660 -23 182 14 -237 -239 59 234 12 -23 72 82 -169 -35 -34 -14 -81 121 -32 -371 -185 100 -143 115 -62
3683 -62 44 -177 -91 -33 -26 -161 158 -141 172 142 239 -104 -198 78 -354 -134 -110 -133 -3 -72 11 -305 -92 98
3707I8k48K52l64J40J51k08K14m19O05j84L9K44m20nJ90P1n35L93k91M39k19J51
3729I4l75L71j70Q5J1J47Rj64J51R0m7k40l9J51l31K8M77j21l29J49L59n29J14
3752a09P5j15j39K59P7M4k72K60m6P9k14j82J80K77k09j8nJ24n8K15j83K45k61
3775B4q0O2q1J62J28l93J49K29m55J58q7k0J20mJ50k8J44l30j00L30l05J06L41
3798B20k74K41l95J77l55N30j48k49J22K30l70N9L91j5r7K9l25J32J15K00l8k52
3820g2O8n2K91k17j56M59p6j82k83L73K77m55J77l71M46k93K01j85P7R4l05K24
3842D0J23j96J43k46K02k07P1q8J09P5o2L14m20K42j47p9k6K29k15R6j10J84N5
3865H7j61J17p5pj40Q9lL5J66k76J4kK61m4J04k25m1j06L43P7m52K37k57nM54
$$ plain form
3707 98 -150 102 -262 -122 29 -179 35 -384 221 37 76 320 -100 -105 85 156 -379 14 -277 162 -57 94
3729 94 -281 90 -80 5 16 163 172 8 159 249 202 -38 -77 74 -257 -229 248 127 -202 -53 306 -223 -109
3752 -109 -34 -149 -288 -29 48 92 -180 80 34 113 -101 -283 -103 174 -35 -53 -58 66 8 223 40 285 24
3775 24 -56 6 -75 87 215 -178 -29 200 -255 -97 -184 -204 -84 -88 62 34 178 -152 -252 78 -227 -121 220
3798 220 -54 187 -208 -31 -386 144 -4 -253 -131 99 -271 -212 179 164 67 96 -229 -97 18 218 180 -72
3820 -72 -4 -56 235 18 -138 321 245 63 -220 153 430 -25 152 -219 227 -66 135 -50 27 121 -184 40
3842 40 163 -33 110 -136 66 -141 -70 -158 -49 26 -36 278 -142 100 -47 -126 -152 77 -138 -42 -152 32 87
3865 87 -74 43 -32 -39 -179 -90 -93 -58 108 -168 -154 -156 105 61 165 -60 -101 -207 136 213 -239 -2 -259 -264 190
3890A90j86k88M22k64L59p0k29j76O9j62K29r5Q9L20j80P0m70M49p8j07K96k6
3912A62J04m64L03j88J26K8j30j86j16J69k4J77J43k23k27K33J99j93J4J49K97
3933C53m90j5q2J53L08j87k22no9L09j66J05q0j65L22k06p2m4k5L35l24M56r4
3956I5l09R0J28J41k54q0K60k11m4K15O2K72l74mj18mJ44k8J54j26q0p9K8j37
3980b59L59o6j59J6J45l33L58k79P3j8M77k00J1l41J44J59j78j50M9q2J13o5L40
4003A14M3n01L51J65j70L6j96L52J20nl53K62l91K16J23k78j7J32Kk65K85M20
4025D45l48O8k45K79l1k07j56O1K52k25p9J40R7o5k08K88k40J99m1N6O0L9k17
4048g8J93o9k5K03n0l11k4K38l12K14j99K03r7J70k78j53J81J82J1l70L39J35
$$ plain form
3890 190 4 -284 138 -126 233 163 -66 -242 -173 -335 -106 -201 -112 208 28 98 -372 77 -1 -108 188 162
3912 162 266 -198 105 -83 43 71 -59 -245 -361 -192 -216 -39 104 -119 -346 -113 86 -107 -93 56 353
3933 353 -137 -152 -234 -81 227 40 -182 -187 -256 53 -113 -8 -88 -253 69 -137 -209 -253 -278 57 -267 189 95
3956 95 -214 -124 4 145 -109 -189 71 -140 -184 31 93 365 -9 -13 -131 -135 9 -19 135 9 -71 -150 -122 -259
3980 -259 100 34 -125 -109 36 -297 61 -218 -145 -163 314 114 125 -216 -72 87 -91 -241 -192 -274 -161 -226 114
4003 114 157 -344 7 172 2 38 -158 194 314 309 -44 218 -173 43 166 -112 -129 3 5 -260 25 445
4025 445 97 165 -80 199 168 -39 -195 -134 118 -107 -186 -46 51 -14 -222 66 -174 25 -16 40 100 139 -78
4048 -78 115 46 21 224 174 -137 -161 77 -235 -21 -220 -17 -114 56 -222 -375 -194 -12 -1 -371 -32 103
4070A03k9K7j12j58L14k08J21p4j2J31k6O7l02L92j06K57j13l96P6j6o3J9J72
4093F4k8n3L38l13j54j02K23J80j98N48p25J26K63l26P9J76j47j42N8l9O2M53
4115C43l11l09N84l61j28K18j95J2J93j86K29K3k81M6K07nl70N91n77M48J68j70
4137A69j09p4K43k03j37J59Q4j27Rk10L62m40L73j54J45q5p9j07lL44j11p5L81
4160C55l48l0J32J0k79L92l43K33m5O7k25j22L62k07K86l28m8L54l01J77j19m5
4182g2m2NJ53l23K97K83l46l2J76r0j4m93L51k6J73J7Q9j75k74L70n6P8O4k71
4206a58K91r6k07j59P9L44l75K9k9J98K64l93J31J35J55j76k79L99k92l6L03k21
4228i3J67q4k0j69L15k28R4mP7r7J10k1k38J14j7J40R2j16m4KK07n1k16j11J21
$$ plain form
4070 103 74 101 -11 -169 145 -63 58 -16 -28 103 77 144 -158 234 128 385 272 -124 -48 -64 -127 -108 64
4093 64 36 -17 321 8 -146 -248 -25 155 -43 505 -220 -94 169 -157 -78 98 -49 -191 -133 -172 -110 343
4115 343 32 -277 307 -54 -182 36 -159 -147 46 -140 89 112 -169 -123 84 79 -291 300 -277 171 339 169
4137 169 60 -14 229 26 -111 48 132 5 14 -196 166 -274 99 -55 90 5 -74 -181 -184 160 49 -26 355
4160 355 7 -23 109 119 -160 232 -111 122 77 144 -81 -203 159 -48 238 -90 -138 216 -85 92 -27 -72
4182 -72 -114 -109 44 -279 18 301 -45 -77 99 9 -5 -498 -147 -173 0 17 106 -69 -343 27 -29 49 113 -158
4206 -158 133 37 -170 -329 -250 94 -281 -252 -281 -83 181 -212 -81 54 209 33 -246 153 -139 -175 128 -93
4228 -93 74 -10 -30 -199 116 -112 -18 -22 55 -42 68 47 -191 -77 -94 46 138 22 -22 -20 187 136 -80 -191 -70
4253g0Q5r7M0K22k49j53K51J09j33K93j03l16J98k9j19j77L33j10m3n2K23j13
4275a0R1j04k25L70j08Q6j00j50J06k69M45m44N49k91J31l91M87m66M77k50P7
4296A1k07R0K39l10K48p8j40J18k82K73p2K0J50l39M51k57M23n3k54K51m00n1
4318a69J37kk7k4J28J92l09J30p9L5J22L09l5n23J57k8K70k47p5J56j02j3m2P8
4342C9O2j35j87K80Q7N3J84k99l49K78L02k41j14j27J37J83k73K70Q5o4l76L44
4364A39m03L00j74j81L89k9J44j70K4j09K37j45J23k04j7J69K3n2r0J60j34J6
4386A6J06q8j71Q9LK47L2j62k8j49k8K57j00j80L01Pj72j54K14j29J10j12J58
4409F7K16k07k5r1j07J34J3j41j32m4J11n8R2R7M1N4l98M72L5K26k43N9j20j96
$$ plain form
4253 -70 15 -82 -42 180 -69 -222 29 138 5 298 195 -121 77 48 -71 -248 85 -25 -68 -120 103 -10
4275 -10 81 -23 -248 122 14 100 0 -150 -44 -313 132 -312 237 -54 77 -314 173 -293 184 -66 11
4296 11 -196 -106 133 -177 71 -7 -147 -29 -311 -38 -110 -90 60 -279 172 -85 338 285 31 282 -118 -169
4318 -169 -32 -34 -61 -85 43 235 -74 56 -23 12 134 443 408 -115 42 14 284 37 -38 118 16 3 -39 39
4342 39 101 -34 -221 59 146 199 383 84 -265 13 315 74 -40 -167 -30 153 -120 150 235 171 -205 139
4364 139 -264 36 -138 -319 70 41 185 15 39 -70 167 22 145 -59 -76 93 116 64 -26 134 0 16
4386 16 122 34 -137 -48 -45 202 234 72 44 -105 -133 124 24 -156 145 152 -20 -174 40 -89 21 -91 67
4409 67 283 76 51 -40 -147 -13 0 -141 -273 -317 -206 -264 -172 -75 -34 20 -378 94 129 355 112 171 51 -145
4433a45J61J6L00m20q7J11K21k61M6J97k55J20J2o9k0M3M1l2n5K84p1m6K53j62
4457A82M7m22K11q4J14k49M3J25L07n96M84l65L64n13N44j13p3k39K55qML69k94
4480I3M6j01k77R2L59j81M9l0j79k01L65Q1k39n7k50L24Q1J43j20K22j05l4n1
4503C0K29m51K1J84L3J62K3O3K1j19k20M53l00j0o0j49J31J04J56j87%l10m0K67
4527C1J9j75J08J04j48J05m3Rj75J80op9J09j62K40j94K36l19Q8K36N4N7j38Q9
4551B26n49L48L5J38n25K96K04j30k10M7MMj9L24l05k7L83l15l76P52n02n6M74
4574B21m27K69M0j88K81k10j40M45m52L88l26K01l21N36l05r5r8M9lK59j16J47
4596A55m24K65j59L38j92nj03J78K87m48J79nmk02L97k24j64L15j03j18K59q1
$$ plain form
4433 -145 16 32 332 -88 -175 -64 157 -104 -58 139 -116 4 16 -53 -73 -30 11 -21 -76 208 137 91 344 182
4457 182 229 -193 18 -66 48 -201 -158 -33 274 -322 162 -203 161 -352 192 79 6 -233 22 14 18 387 93
4480 93 139 38 -239 -147 212 31 80 50 -129 -330 35 116 -123 -180 -430 -106 -25 118 -2 220 115 81 30
4503 30 259 -192 -171 13 46 208 231 294 315 196 -24 429 129 119 59 -90 41 145 301 114 114 -196 -236 31
4527 31 50 -125 -17 87 -61 44 1 10 -165 15 9 -70 39 -123 117 -77 159 -160 -72 164 218 275 137 226
4551 226 -323 25 60 198 -327 -31 173 43 -167 -120 -116 -112 -131 193 -112 -139 244 -71 -447 305 -197 -253 221
4574 221 -206 63 103 -85 196 -14 -154 291 -161 227 -99 102 -219 317 12 -83 -181 -132 -135 124 8 155
4596 155 -269 -4 -163 175 -17 -22 -125 53 340 -108 71 66 62 -140 257 33 -131 184 81 -37 222 141
4618A41l35J67m5K25k1j09r1k8n7O6J33j92K66J10k19j19N19l51lP0k29P0k80
4641c12L17n3M9o0K02k13j88K35j7J5K08Mk27n8J51Q6k01K72k31p6K11J40m37
4664a83L23n5l87M58n7J04l58M82o44K14K85j92j26k83M03rj8n25P65l44K57k95
4686a85K74l85Q2K86j65l9K22j57L0N8j2k06L84m41O9M4r6J65M1J11J56l64R7
4709c1q0L14k42j9l18M06j25L17m60J35L2L08L0j10J1J59n70K92J6o2p8L91k47
4732F9j0l30J73J90k4k60m6J84N2j49j27M63l12P7J18M7J65l00j34l0M98j44k55
4755h5j5L4j47L34n8k82L78l80K21J46j08q7M1J87j98p4J88j51J60j78J15J47
4777A88k53K03p7K7n1qo7J37K6r9k11L4K37J22j50m4j54J76r4K89k04j06L6j08
$$ plain form
4618 141 -194 -27 -72 153 132 23 -68 -96 -153 -87 46 -146 120 230 11 -108 411 60 57 127 -102 -32 -312
4641 -312 5 -48 1 -59 143 -70 -258 -23 -40 -25 183 187 -40 -98 53 139 -62 210 -21 -97 114 254 -183
4664 -183 140 85 -302 156 99 203 -155 327 -317 -103 182 -10 -136 -419 -16 -25 -43 -568 197 -147 110 -185
4686 -185 89 -296 -214 72 -93 -132 90 -67 -37 21 9 -197 187 -254 -185 -141 -237 -72 -31 80 236 -128 -31
4709 -31 -111 203 -39 -58 -376 30 -95 222 -238 -103 -71 237 267 157 168 327 -243 49 65 3 -75 316 69
4732 69 59 -271 -98 92 68 -192 -238 -54 -2 -151 -278 185 -127 -50 68 115 280 -20 -154 -184 314 170 -85
4755 -85 -100 -66 -213 121 63 -219 159 -221 0 146 38 -49 -8 179 -19 -93 95 -56 104 -74 41 188
4777 188 -65 138 61 88 37 29 -38 99 125 26 -185 -151 86 208 58 14 -140 36 -58 231 27 -79 -43 -151
4801a51K99J14k80rq4L31J67l67L68m46J79m45R4K93j53J77p5j55j07J20J93N6
4823A19R3R8J7l01r2J09j79J3L2o5R1k68K11r5Q7J31N5k12J06m3P4j90l4L97j84
4848c0j79m4l6M0K56q0K91k95L83l06Q1n09M15J68j9m35J84K15j58J8J43k29J0
4871a16L37l34K92j09oJ17j58j06J97p8p9Q4j21L58m13K53k03J07J63m77L53k7
4893C4J00o0nk58M38j75j73J41j15N1l00O6L09j57K04O6k46J23k79J96j5J76P2
4916A93j36l3j68K65l39L07k19J02J76k54M20m87N41j79j88l5J52k7r0J9j33L70
4938B57l73J93j74J12o8kM6p5jm8k1J76K73k84q0M0K00M0k56k76P5K10k15K19
4962c2J68j43K40j82p1J91j50k32K94J7l05J55N0K03J00k73p4J55n0m4o1L78k63
$$ plain form
4801 -151 148 262 -18 -27 -111 220 387 20 388 -58 121 -324 -230 63 -90 87 12 -143 -250 -130 63 119
4823 119 212 310 327 26 -66 43 -136 -123 -91 -156 -65 -333 -122 -217 -130 1 56 -156 -50 -93 -19 -209 -243 154 -30
4848 -30 -209 -253 -289 -249 7 -73 218 -77 306 0 81 -428 -13 155 136 -299 -115 100 -58 -40 103 -126 -116
4871 -116 221 -113 179 70 64 181 23 -83 114 36 -43 41 -80 278 -135 118 -85 22 185 -292 61 34
4893 34 134 74 69 -189 249 74 -99 42 -73 -22 -322 -256 53 -104 100 166 -80 43 -236 -40 -55 121 193
4916 193 57 24 -144 121 -218 89 -130 -28 148 -106 314 -173 368 189 1 -34 118 91 1 20 -113 257
4938 257 -116 77 -97 15 -53 -55 -9 -84 -85 -133 -154 22 295 11 -69 -29 171 211 -45 -321 -246 -36 -251 -32
4962 -32 136 -7 233 51 -20 171 21 -211 83 100 -205 -50 0 203 303 30 -44 111 61 17 -44 334 71
4985G1k41J17J32p7OjJ47oo7j3r0J50k07J14L5p3J66m3j2j06j85K01Q8m6J36n92
5011c96J54O7J31m1K86l12L50l39J70l8n1j7P7k15k28K96j1M32M8k72K04j90k17
5034a12K35k38K07L6k2j91J90k46L39k1M6q9M4k84J47J58j2Pr6l18N14j03n2l56
5058b17J38j40J80m5p1K09L15l91j86K64n6nn7J70k68j64K80J8R5nq6L63l18J94
5082B17m45J03K40o8rl48K84KL3K19k12R1k91J56J24k65K18Q4l4k4J73m82J58
5105g6k26J08J43k11N49m2m88N40k58Kp1J27k23K84j08j39J19q3J05Q9l06K22
5127E7j32K74l15J75O2M7k80J45o2j28L92m03K60j54K61k11L2LJ97J5p09M99J16
5150A41k85j45M87k36J25K16k48j66K57j57j4J50l11L48l96J76k1M6k0J03Q0l86
$$ plain form
4985 71 -170 -53 79 2 8 7 154 148 81 68 -22 128 -79 35 70 -3 163 120 108 2 -183 18 106 60 196 -396
5011 -396 -242 -175 -44 -85 201 -111 239 -100 70 32 -19 -36 41 -174 -402 -106 -117 315 363 91 295 105 -112
5034 -112 123 -115 92 128 106 -85 105 -141 198 177 223 134 178 -106 41 199 187 194 98 -220 294 191 139 -217
5058 -217 -79 -219 -39 -84 -155 54 369 -22 -208 56 0 -5 -62 108 -160 -324 -44 -26 69 64 -22 341 23 217
5082 217 -228 -125 115 47 38 -310 -26 -24 9 228 16 107 -184 -28 96 -169 49 133 99 75 248 -234 -76
5105 -76 -302 -194 -51 -262 287 245 -243 297 39 41 -30 97 -126 158 50 -89 30 -53 52 141 -165 57
5127 57 -75 199 -116 59 121 168 -112 33 -29 -157 235 -168 92 -62 199 -12 20 23 220 235 -474 25 141
5150 141 -144 -289 198 -38 87 303 55 -111 146 -11 -25 125 -186 162 -234 -58 -79 -33 -53 50 130 -256
5172b56N1L54J22Om54M42j1j36k08J32J04k30K18Q1J19j02j17o7l99L56j46m7
5194a88K24j6J6L21k54k97K83L8l6l31K42P2L02n79J82J35o3K39k33j33j01M35
5216B58n98P0J00j62N05j75q4J2J82l89K75N9k95L37k65J78M08k69m28L87j53
5237d7pj00J19J7j4N7j18K90j51K31k94k50N89l41J22lmj78J29N1P0m88N41l7
5261A84n3n4l19J03L5j38L74L4j31j22J33L6k35L01l0j08K97k67L3j53o1J65m8
5284b4k4J62L9j27L1m00K68oK32j38J10K12m41J34M6k06L48k16n6k69R1K88Mk79
5308b21J17P1n4M3J73k15L40k76lM6J27J5j35j25R4k86K88R2J47m55J49m5J65
5331E2k72K76p7K11m1J55j27m70J83j54O5K90j37o7J13m0o8K6P2J48J1j62j44
$$ plain form
5172 -256 -205 149 271 277 -177 265 254 118 -90 42 146 -84 134 215 334 232 115 48 -351 5 -141 -188
5194 -188 36 20 36 357 103 -194 89 127 91 -240 2 74 376 -203 -21 114 51 290 57 -76 -177 258
5216 258 -340 -270 -170 -332 173 -2 -86 -74 108 -281 -6 53 -242 95 -170 8 416 147 -281 106 -47
5237 -47 -54 -154 -35 -18 -32 25 -93 197 46 277 -17 -267 322 -19 103 100 96 -82 47 98 168 -320 221 184
5261 184 131 77 -242 -139 -104 -242 132 166 35 -87 46 82 -153 148 118 10 307 40 73 -80 -141 24 -24
5284 -24 -48 114 153 26 57 -343 -75 -81 151 13 123 335 -106 28 74 -132 216 0 -56 -325 -234 54 58 -221
5308 -221 -104 -33 -87 -44 129 -86 254 -22 -25 21 148 163 28 -97 -3 -289 -1 91 238 -217 -68 -113 52
5331 52 -220 56 -21 190 149 304 177 -293 -110 -264 -199 91 -46 -113 0 -40 -108 -82 -10 138 149 -13 -157
5354a57K04p9j2J72n13K80L55j69N4k99l8M43l50L99j17k60j51M01k87q1j10K11
5376a04q5J94l60J44L2j85K99J97Kk14k44L13j06J07j03Q3J1n6L81m00J47M8j79
5399g8K00J03k15M9m3j46K02n0J66m38j10N62l56K07j28J22J52k8j30O4K50n6
5421B99k11k06K43J07m12J8Q5K42j84p0R8k10J74L6m6j44j35M19k26O7K77N5l54
5444g8J03J94M6P1m05K0j63K44RJ56k71L90l27J36O7K41k89k45j57L09j79p7J93
5467a2J21j47k42K79J1k19K21j85K87J5j4K13k35q7l9J35l09L94n36L47k4R5k07
5490a38L69l64J75l5L6O2n1o4p6l0N7N6k4j1R7j64N4n3J7q0J93k65K22L9j57J29
5516fJ0j83K94lk32K0O2Q8k88K3L52K30o39j32M98l9p9J44L85m84N7O1j12L54
$$ plain form
5354 -157 47 -32 -44 128 -385 -105 250 81 135 -164 -202 241 -109 290 173 -87 -238 163 -124 -205 -315 -104
5376 -104 -189 5 -355 -211 -179 -364 -65 132 134 -80 -324 -11 -117 -10 -113 -30 -19 -75 306 -94 53 101 -78
5399 -78 122 225 10 59 16 -130 72 22 188 -250 -360 202 -154 53 -75 47 199 171 41 105 355 299
5421 299 88 -118 125 232 -180 -162 -77 165 -19 -89 9 -201 -27 9 -37 -181 -316 103 -123 -56 221 276 -78
5444 -78 25 219 265 336 -69 -49 -212 32 41 197 -74 316 -11 125 192 433 144 -101 -258 51 -128 -205 -12
5467 -12 109 -38 -280 -1 10 -209 12 -173 114 129 115 328 93 6 -33 102 -207 187 -349 -2 -26 69 -138
5490 -138 231 -133 42 7 43 105 54 -10 -86 -116 -59 -3 -27 -38 59 -105 -51 -104 -87 -167 26 -239 -17 22 -135 -6
5516 -6 4 -179 115 112 -120 -100 -38 50 -238 -215 137 367 -272 -404 94 55 -24 120 505 21 78 139 27 381
5540C81m35K11m05K00QqJO0k31M88o3j73j40K6p0N3J85j42K99j36M4j53k12j1
5564b23L98k9k02J86j04J67j13k72M31r0L3l13J19p2J37j01j89K74P2j7j56mJ73
5587A05J13k11m19J78L16m9K24k40K8j67Q2k25K43k6p0j29J76L50k09J8K74j90
5609A72O0k48P2N8k94P5K94m19L50K97l45k92K48J77k92J38j73J36k41P7M9k42
5631c43L39j73L95J16j49j27pr1QL61m05L67k00J19k26K19k54K5j39O8K53l95
5653b39J33K24J75m63j20K76R5K0j33L83l85K28j88k8J51J87m03K62l37L96j78
5674E6L2p2J13j83J58K5k47N7Jj07l2j58M5M50l98K57j42L00j88j36J87j6K72
5697B74l03j08R1K53o3j7r8Rj26R3O1j56M5O9K59l17j3O2k22P5J08l1l5l7J18
$$ plain form
5540 381 -54 157 -248 -48 -40 -48 -47 13 -218 270 207 34 -106 -80 -150 -97 88 -54 245 109 153 0 -212 -223
5564 -223 175 146 -56 130 26 193 80 -192 239 149 182 -131 -12 -84 53 -48 -237 37 109 92 -64 -68 105
5587 105 218 7 -412 -234 82 33 257 17 45 -122 -40 -265 -22 -48 -118 -247 -71 279 70 88 362 172
5609 172 232 -16 56 114 -180 -105 189 -230 120 417 72 -220 28 205 -87 51 -122 14 -227 -150 -101 -343
5631 -343 -4 -177 218 334 185 58 51 -40 -32 329 -76 291 91 210 -16 203 -51 -26 -165 -97 156 -239
5653 -239 -106 118 293 -170 -290 -14 81 101 -32 351 -34 194 6 -22 129 316 -87 175 -162 234 56
5674 56 88 16 129 -54 104 129 -118 -61 -60 -167 -199 -357 -312 138 -260 -3 -145 155 -33 -169 18 2 274
5697 274 -29 -137 -46 207 144 127 29 38 -88 5 66 -90 -45 24 283 -34 -47 15 -207 -132 -24 -55 -90 -127 -9
5722iN1K45l48J92k26J56K30k36p6k38j67K54L3K45Q2j15J1l39K34J23N7n9J91
5745B91j46j79k6j29J98j41J43R4k34l17M18l19L29N6k03K54k28K44O6l69J01
5766i7P5nL2J48nj52jN2p5l55L58K23L9m9m7m28M07k38J02L37l76J67m45L04Q
5791b1J02m0j02K28j69J39k01K03k62j58L93m49L03p8K25l70L18k33M58k26J36
5812A96k6l24J78K38l37j68N16k67l92J55L62m75L50K41k44j03J68j35L18k72
5832b1L9M6j33J12Q8k66K64J40j31J38l00K38j41o4n4j17q3K03J48L3pm2K9K00
5856C19l68J30j10l1N9K16j50j65l7m5j5K00N1k04q5Q9K74l68K11j65J57j81Q9
5879a29J13j7J88j04K5m2J24j14k10K66L6n7m27P36K3n78N44l40J27j83M9K0j82
$$ plain form
5722 -9 42 287 -61 131 -95 61 291 55 -21 -259 -426 -172 -139 106 188 73 84 -255 -21 102 159 100 291
5745 291 145 -34 -60 -189 9 -132 11 105 -129 -446 -28 -347 -18 38 -165 89 -139 105 171 -198 -97
5766 -97 -22 -27 5 153 148 -4 -5 47 -28 -383 -25 198 237 188 141 -287 120 -118 -16 321 -55 112 -333 -29 -21
5791 -21 81 41 -61 167 -2 137 -64 139 -123 -281 112 -337 -34 -112 113 -257 61 -172 286 60 196
5812 196 170 -154 24 262 -75 -243 273 6 -386 -231 131 -344 6 247 3 -100 68 -67 251 -21
5832 -21 18 64 -69 43 131 -135 129 269 138 276 -24 214 73 9 -45 -162 -245 -42 106 139 132 90 119 319
5856 319 -49 81 -29 -60 -1 215 65 -100 -137 -182 -197 3 54 -150 -235 -146 128 -240 -29 -194 -37 -218 -129
5879 -129 -16 -33 155 51 76 34 158 44 -166 100 136 79 -348 388 411 -167 377 37 164 -19 30 50 -132
5902a32J66npP2j37k4K41r1j66K38J20rk61J8r4J77m9mj05J95k28J86O0J7l53
5927a75L72k32K08l15J76l4M0J6j07Nj06N5K07J3j04m5m88P18m25Q7L54l10K10
5950A20l92K77j8M45p54M69j62j22J39j58J64M2J84l5m65L58R9j48m4O2N7l36
5972b18K85q8L8K30k92l3J82l06M58n31M53k24j02j9K54l71p3K81K41l0k62M43
5994C16o72J97K10n1j38L78m27J4J32j52P4K20j45J67nk2J83ql96p3J93J13j59
6017e1K46R5l94N2J63k8k82J17M14l9k79R8j6l2j41k11K92j05J83Jl1k1j06j69
6041b44L49j98N7k86L08j80K42j53L66r7l56L67r8k73K53K41n32N50j17m19k6
6062b46K89P2l34l9N39k86K00k08J67rk02K2Q4p4J36P8l02J1j65J21M13j11J26
$$ plain form
5902 -132 34 29 22 94 -43 -67 174 83 -83 155 275 266 5 23 -71 106 57 53 -52 143 -85 101 161 178 -175
5927 -175 197 -35 173 -142 34 0 40 56 -51 -46 -152 -97 110 123 19 -26 -514 204 -221 -134 220 -90 120
5950 120 -272 5 -13 432 -322 147 -15 -137 2 -156 8 50 234 199 -266 92 191 43 -1 61 118 -218
5972 -218 67 -21 17 247 -45 -78 104 -202 256 -275 178 -46 -148 -167 87 -284 -357 -76 165 135 -127 316
5994 316 -356 -159 51 0 -138 240 -187 -173 -41 -193 -119 101 -44 123 118 96 279 271 -125 -198 -5 108 -51
6017 -51 195 290 -104 -52 111 83 -199 -82 332 293 14 112 96 64 -77 -288 4 -101 82 83 52 31 -75 -244
6041 -244 105 -93 -36 -322 -14 -194 48 -105 261 164 -192 175 77 -196 57 298 -234 316 199 -220 -246
6062 -246 43 115 -219 -258 281 -5 195 -13 154 145 -57 -35 49 -25 111 189 -113 -102 -267 -146 267 156 282
6085B82o5j80K10n35K24K28j46L1m6k55L13k54L25m5p1o4J55j24K68l89M3K95
6107B00Kk73L0r2J94p4L64l34j02K3K48m27M02j24J6nl19L47j33r8J2N9J27l9
6131Dj21j98N13j04k70M21j18J35l65J32q3J0O8j69o9Q9L76k80%j26L79j74r6
6154d6k69K83p0J38l8K55l19k9J53n2j19N94o72K88o3P5j26l19L79K89m12K50
6176A70j16J47j14N4l04J9j0Q0j9J85R0k42K14j30Q4J76o74L42m83O02J8j85K99
6199B03k11k35M49m46K67K1l06M32k3q9j19jj12J83K78J01l09l4j2k19L96j63
6221E1J42k45N1J84k9o5N1K8j0m9q6n6p5L28j06k08q6J18j01K82K60Jk65r3l29
6246c07K56n7L4k2M37m22mK65j11j06Q2N1k56K4L1J9J47k67K02J81j37N8MJ01
$$ plain form
6085 282 217 37 247 -288 -64 164 18 49 3 -252 61 -193 132 87 16 -48 107 -17 251 -138 -95 200
6107 200 202 -71 -41 -133 61 -13 351 17 -85 -62 186 -241 161 37 53 48 -271 76 -57 -155 -143 -84 43 4
6131 4 -117 -315 198 94 -176 245 127 262 -103 29 -54 -44 24 -145 -214 -125 251 -29 -29 -155 224 50 -46
6154 -46 -315 -32 -102 36 -2 253 -66 -95 58 6 -113 481 -191 97 34 109 -17 -336 43 332 -80 170
6176 170 54 201 87 141 -163 -144 -154 -74 -93 92 182 -60 154 24 108 284 -390 -48 -531 71 89 -96 203
6199 203 -8 -243 206 -240 27 48 -258 174 151 62 -57 -58 -170 13 291 392 83 49 37 -182 214 51
6221 51 193 -52 -1 183 154 89 140 168 158 109 23 -33 -108 220 114 -94 -180 -62 -163 119 379 380 115 22 -307
6246 -307 -51 -108 -74 -96 341 -81 -85 180 69 -37 45 96 -160 -136 -105 -86 61 -206 -4 177 40 98 102 203
6270B03k68J62P0l61RL30l18K78j53j74M87k07o5R2l63j45K62L29k73nN7J25j80
6293a08L84k71j25K35k42J15J21j83o1o8K76n2n8Q0j16Q4K02m15L00N2o39M84
6315eJ59m2l59L88J39m69L09k03k14L91j85J52j27j7L8J64n5M5r3q0k18K97J94
6338B09j32n81L29R3n3L92k46P9R4j62j24k49L89n0K44j25J67m16J13L52k42O0
6360A41j16J56k60K87l60J53P6o1k82K56M4J93o8k40J34j96J25P4J12k03j8R0
6382C7Pk71K73j51M7L07l20L1J33J6K87m57J15R2l28K65j52J06K50l16j40J02
6404f7LJ03N8j14L20k01q2j15L60l07k54J63L15l33K01p5J86m99N86j80k72J99
6426eQ5J58j97m4O4jK2j22N7m1Q2Pj27K65J40k15J5o7O8j20j76l7J47K56r7N4
$$ plain form
6270 203 -65 97 167 -194 -185 145 -173 105 -48 -222 265 58 -7 85 -278 -423 -161 168 -105 -110 -53 72 -108
6293 -108 276 5 -120 115 -127 -12 109 -74 -135 -203 73 21 -37 43 -73 11 213 -202 98 150 -489 -5
6315 -5 154 112 -247 141 280 -189 120 -83 -297 94 -91 61 -66 -83 -45 119 64 109 16 -64 -282 15 209
6338 209 77 -504 -175 -82 -135 257 11 90 184 22 -102 -351 38 -12 232 107 274 -142 -29 323 81 141
6360 141 25 181 -79 208 -152 1 77 16 -266 -10 34 227 159 -81 53 -143 -18 56 168 -35 -53 37
6382 37 44 -227 46 -105 -58 249 -71 -40 93 109 396 -61 54 146 -182 83 -69 37 287 -29 -169 -67
6404 -67 -64 39 97 -17 303 102 20 -95 265 -42 -296 -133 182 -151 50 -25 161 -338 248 68 -204 -5
6426 -5 80 238 41 -3 61 60 82 -40 17 -24 58 65 -62 203 343 128 143 76 144 24 -152 -189 -42 214 117 171
6452A71j02p9L66k87L3J6J7j06P2j57o9P1K76l31Km9J30J29j5j29L9N26m67O4
6476A21n2J21k53K32l50L88r8m23L56m9L0o3J50J6m19M70l12M87n47K78k26K22
6498G9j66J18J49J8r4j2j33Q9K08Jj6k50L3L5n3j5R3L0o1p2Q4k30K35j41R2N5
6524G6k51K80l1j02l3J4j9J0N2J81M0l05J15J78n78N01l06p9o5L78m04K4K37k42
6548c29L75M2o3j75m0K59k2k26K19l83M06l72K86m43M41m1P0K59l23J33l2k37
6570a96N43o07K86k04j05K54K99j35l16R9k72K67LN5rK0N2r0r9J2K45J38k87J44
6594I7K54m20K38j90K10kq4K8j12l1J16k2j67K30M6%l81K01k8n1mO2K54o11N04
6619A37k66L20j94J74j44J14l6l4j29m9p6K03j23k6J60l4J16j27Q0j68O9M7j27
$$ plain form
6452 171 69 -10 356 69 102 118 135 29 101 -56 -125 -54 222 -109 -107 -156 -26 103 88 -41 -2 524 57 121
6476 121 69 190 -63 169 -181 207 109 -314 42 -7 23 -40 110 126 -293 177 -135 352 -195 83 -143 79
6498 79 -87 31 180 198 104 92 -41 48 256 257 241 -9 24 59 6 -9 84 114 53 -19 65 -165 70 -71 21 76
6524 76 -175 105 74 -28 -61 -47 -66 -56 -4 177 217 -88 27 205 -373 128 -178 -257 -322 56 -348 -324 -87 -329
6548 -329 46 88 25 -150 -190 69 47 -179 40 -343 63 -309 -23 -466 -25 -66 4 263 -60 73 41 -196
6570 -196 347 -260 26 -178 -283 -29 270 135 -181 -82 -354 -87 -84 -29 -38 -18 34 -56 -155 -143 102 240 -47 97
6594 97 351 -69 169 -21 189 187 103 131 19 -12 104 82 -85 145 191 191 -190 11 -17 -68 -72 -10 244 -367 137
6619 137 -129 191 -3 171 27 141 105 71 -58 -107 -183 20 -103 -129 31 -3 113 -14 66 -102 -33 14 -113
6642a13J82K6L18l03K60l62k58K22k59L56O7k13QK42q2J43j53j39k46L02o8J30
6664F0L04j2k72L0j01j99M89k38R5q0R6j90J40n55M38J1J7K07j87M48o96J93p6
6687g8m4N8J62j32PP1j90L49j07j11N3M0k27P6J64L1l07j98K73L06k38j00J13
6710b9J6m17K28K17k01k0Q5J99J60M4l98K2Q0q1K07oL04n35J99n9O5k31J29j00
6734a22j16K54p6m0j5P4J24j18j58L04j65J19j45R6K31m38L44j29m3j14j90L31
6756Hl14J93J66k25J05K51l9k44R8K00K4l07o7MM43k81O4o0l0m11L86n5R8m5j06
6781a44J12J09j19n4J5Q8j69J27J16k7o7J62l26K07l6K9J22k34K86l06L9J68m4
6804E4k32l9K12o4J47P2j82R3j41j02J7M38n87M71j25k01K34M2m51M11l38L21
$$ plain form
6642 -113 69 95 413 110 370 8 -250 -28 -287 69 136 -77 -69 173 91 234 81 -58 -304 -2 -70 60
6664 60 364 352 80 110 9 -190 299 61 156 76 172 -18 122 -433 5 16 33 240 53 501 -195 -2 -78
6687 -78 -122 -64 98 -34 -27 44 -146 203 96 -15 38 78 -149 -73 91 122 -185 -383 -110 196 -42 -142 -29
6710 -29 -13 -430 -202 15 -186 -206 -121 78 238 282 -116 -94 -14 -95 112 106 410 -125 74 15 80 -151 -22 -122
6734 -122 -238 16 -60 -100 -115 -41 83 -35 -193 111 -54 65 -80 16 247 -191 153 24 -19 -133 -323 8
6756 8 -306 -113 53 -172 -67 184 145 -99 -1 199 223 -84 -151 -147 296 15 79 19 -11 -422 -36 -91 7 -38 -144
6781 -144 -32 77 -42 -96 -81 7 -162 -35 81 54 -13 149 -177 30 -6 23 145 -89 197 -109 -70 98 54
6804 54 -178 -217 -5 -69 78 150 -32 61 -80 -182 -165 273 -314 157 32 -169 65 107 -344 67 -271 50
6826E0j21m29L05K11L23l28R1J09j25j14J44l31J40k63L71m05M60j27j39M7L01
6847A70J33j72M5J06m23K37j15nm27M39o7n3J48J93j99n9j69l9K26J51m19K43
6869e6J73k17K4k78K30K18l07K26j88k4L51O0l19J06j0k8R6o7J10l10R8L05l5
6892A58j33J42k58j3L63k91J12k9L7N1J3l6j11J68pj53k0l02O2M73k15o0J83k94
6916a60l0K1O3L50k53P9K1kj15J38o0k19O8j8J1K04M1n3j43O8J89k83J16j80N4
6941i3q6L03j67K51j86j54M38k54j03Q2m1r8J90k37J79N6j99k38M70J8r1rj42
6964a11J31J80k0j30j7j44M4k18L20J75j45j37J7k5j19L13o8m13K57QJ8O9O1j00
6988e4k10L31n7r9K50j63J28k8l14L04j70J45l6k16K28l09L26rM7j56M1J10j64
$$ plain form
6826 50 -71 -500 -195 16 339 11 102 211 86 -28 116 -215 -75 -338 33 -372 88 -39 -178 -131 170
6847 170 303 131 176 282 -141 96 -19 -24 -451 -12 -79 -132 16 209 10 -49 -218 -257 -31 120 -299 -56
6869 -56 117 -100 -76 -354 -124 94 -213 13 -175 -199 152 212 -107 -1 -11 -39 57 -10 100 -210 -112 193 158
6892 158 25 167 -91 -104 259 -32 80 51 88 139 152 116 5 173 166 13 -7 -309 -247 226 11 -49 134 -160
6916 -160 -190 -169 -106 244 -9 70 91 89 -26 112 52 -167 -99 -117 -106 98 139 86 -57 11 200 -83 33 -147 -93
6941 -93 -179 124 -43 208 22 -132 306 52 -51 31 -10 -108 82 -155 24 80 -119 -357 113 131 40 31 -111
6964 -111 20 200 180 50 33 -111 -67 -285 35 210 65 -72 -55 -80 -199 114 46 -367 -110 -102 -84 -15 46 -54
6988 -54 -264 67 10 -89 161 -2 126 98 -216 88 -82 63 27 -189 39 -270 56 47 94 -62 -21 89 -75
7011g5KK30l12lJ08QJ63k99K16K27k28Kk13K51R1j78J01k39K92k51j8K03k27J75
7035B6K23n06K18j40O4K61j02O7m3J62m81J50J46l24M80k24P5Ln8J8p3J79j2m92
7059c83K22L5J14k9J42k10L93n85L90j30j5j35J5L81M5j8m17L0K54M0j00o6O1
7082C4J73p9P7k86K9k54L43K41k49%j34j7J70l10J30J61j54j9O3j38K61o0L5R4
7106A11k10J99j91K23m5k94J75J92j79K49k03j21J21N7K17J31m56K3P1J17m23
7127b36L12q8j6M2l6J23j44n9P6J53l10k7L30p1p9m7m0J47L7K39k88o9q5L78l45
7152a03L83l56J11o0J35j30k90J42k0J60l54J99L32q2K29j88j31j44k8J12nr4
7174a82O3J97j36P5k78J74j08J98N6j61J79j3j39R7N2j39K36p4k33M31k18m20
$$ plain form
7011 -75 -73 157 -155 -158 -50 -42 121 -178 38 265 37 39 -174 77 168 -10 91 -148 144 -107 -125 78 -149 26
7035 26 249 -257 -39 -179 -115 146 44 111 68 230 -251 -101 45 -279 201 -23 52 55 -3 15 -58 121 109 -383
7059 -383 -161 -126 -12 -41 101 -109 284 -301 89 -41 -56 -191 -176 205 250 232 -185 -155 99 139 39 -27 34
7082 34 207 128 205 -81 -52 -306 37 278 29 29 -105 -122 48 -262 -132 29 -125 -144 -81 -219 42 -18 17 111
7106 111 -99 100 -91 132 87 -207 -32 160 -19 230 27 -94 27 84 301 432 -24 -1 70 187 -236
7127 -236 76 -12 -28 14 -22 101 -43 -102 -26 127 -183 -210 120 49 -30 -77 -117 30 67 306 18 -51 -136 242 -103
7152 -103 280 -76 35 -25 110 -20 -310 -168 -188 -28 -382 -183 149 67 296 108 -23 -167 -195 -83 -88 -182
7174 -182 -119 78 -58 17 -261 -87 -195 3 59 -102 77 64 -75 22 74 -65 171 97 -136 295 77 -343
7196c43J42N0L43j71k5J6k17J48K53j43j0k3n9L67n36j40Q1L26m63N25l00Q6J07
7219A4Q8j87m6J16o9L19l22M17k67l35L91q8k73M0N3Q7l3L45l38j70K97K36k30
7242D5r9K50kr3m3j69Qj0K99k56QP2J92k38l06K02K94r9J43n2jk82K44J45m12
7267a60M4L70k23r2o3q7K63q7k5M9J31m02J86K27k3l77K48j3K3K81j20k60M59
7290C49l68j38L26k10M5K64m28j47N6O7K66M8l05J92o6k09M00J8j9n6L05k49l23
7313a82J24kl5Nj5O5l9j74N20k22l0j28K3K00l0l45K48K6o0K68q1j17k06K1M94
7338C28k70l3M8J5l76M73j48l12M67lJ07m31R2J32K46m14K41j00j54J08J71rO6
7361B44l06K33k86J12j85J88K59j11K4l53J85N2J14m34J62K5j44J31J03J27m40
$$ plain form
7196 -343 -201 -151 192 21 -4 12 -205 -57 196 53 43 20 -39 328 -208 -348 -267 59 -404 121 -179 -93 14
7219 14 102 -85 -131 -15 -84 235 -87 330 63 -272 119 31 -242 -202 -149 -62 -95 250 -88 -258 39 275 45
7242 45 -54 196 194 101 58 -111 -103 -113 186 -70 -62 10 202 -36 -342 -140 154 55 198 146 145 -137 107 252 -160
7267 -160 -116 254 31 -61 -124 -211 52 -35 -60 -11 120 -282 -96 131 108 -269 -21 -34 -11 270 150 -110 349
7290 349 -19 -157 169 -41 4 268 -160 -307 -251 -184 82 130 -175 17 -49 -258 142 160 141 85 390 141 -182
7313 -182 -58 -60 -95 -90 -105 -40 -79 -253 267 45 15 -113 -90 110 80 -265 -17 9 -51 217 136 19 -187 -166 328
7338 328 58 25 73 88 -288 185 37 -275 192 189 296 -135 -43 89 335 -79 162 62 -92 16 187 178 244
7361 244 -62 171 -115 -3 -188 0 259 148 172 -181 4 56 170 -264 -102 -77 -221 -90 13 140 -300
7382c00R0l9J01k80N04j33L10j20j79j71K19K33J13l42Q0K5J76j66q9M5K24l64
7404f3k94L16K00m10Q0J03L57l1k55J02qM7m93L93K4l52N42n32K55l40L90p0K04
7427A65J03nm25J46l51K19n2K64N7k91O26k58k89J80m56M32j59J67j71R8J10k36
7449a26K83kk5k65K91j64R7j79J0O2l0p7K0R0l2J03k46J22j2J17K46l66K46j65
7473bj13j57J17k3K73k09O7L49m24K50J10j33l45J60K75m66J87K43J16o8j74q5
7495e2Q8J06J32k46p2K9J90l5k74R9M2L98k14l07J06K07l12N02l12Q7j16J7O3
7518A26j32J68l36j04K01J72j72K46j40l40N92l62J89l22J89M6j6J04j22m13O48
7539B22j21p7O2j79o0J91j63p4L36P7l88K12j40J73k60K8J48K24j82R8l51M69
$$ plain form
7382 -300 -210 -249 -148 -428 76 -57 253 133 -46 -217 2 235 348 6 86 111 287 121 32 77 301 -63
7404 -63 -357 -41 159 -251 -171 -68 289 258 3 105 97 144 -349 44 68 -284 258 -274 -19 -359 31 -39 165
7427 165 268 263 -162 -16 -367 -148 -200 64 121 -170 456 198 -91 89 -367 65 -94 73 -98 0 110 -126
7449 -126 157 155 130 -135 156 -8 89 -90 -80 -18 -48 -125 -105 -15 -47 56 -190 -68 -80 37 283 -83 163 -2
7473 -2 -115 -272 -155 -178 95 -114 -47 302 -122 128 238 105 -240 -80 195 -271 -84 159 275 207 33 -52
7495 -52 36 142 274 28 -44 -15 175 140 -134 -35 7 405 191 -116 -10 197 -115 387 75 162 46 63 126
7518 126 -6 162 -174 -278 -77 95 -77 169 29 -311 281 -81 108 -214 -25 21 5 109 -13 -426 222
7539 222 101 24 86 -93 -153 38 -125 -199 137 214 -174 38 -102 71 -189 -161 -13 211 29 127 -224 245
7561B45j31j02J36k58n7J73J41j82J09k98L00j1j40J55k3r5j42J5K30L73m92Q0
7583B6q1o3J15J50l61P6P1PP6K8r6M9K65l70J01J41Q9n81K32q0K9K71K19j76r0
7608D7j07J22P6k69L06j30j34J47L7n5k02K31n7k45L46q2j65L27j06J33j01J08
7630B27m33j7L32l52R9J68%l6Qpk42L59n4M65o97K56j21l3K15j7j20Mj3L46l34
7655CJ51j19j03k68J63L01R2n1J48l57K38J17m08N9k89n6J64K8J17j2K91k35J1
7678a5O0r1M7lK80m99M98l10j10J11j12K32K0k23J39K6k9j46J97j55P3R8l01J08
7702a05L24l80M56l82J71P3j05Q9J17j26m96L65j40j2K26j78J56K3q8j88K91q4
7724Gj19k8K46k1l13L02l4j18L18l55j13M37l55Q5k59J00J61k29L29nj43O8J13
$$ plain form
7561 245 114 12 148 -110 -167 6 147 -35 74 -224 76 65 -75 80 57 -38 -180 -165 65 438 -54 26
7583 26 -55 -118 -3 147 -214 -138 -67 -60 16 44 -52 -3 262 -108 -7 134 223 -358 -126 -206 -177 94 313 137 47
7608 47 -60 62 138 -131 175 45 -89 58 95 40 -162 69 12 -233 113 31 -134 193 87 220 119 227
7630 227 -206 -223 109 -243 -144 24 24 -12 -4 -11 -253 106 52 517 -180 76 -45 -78 137 120 0 4 -9 337 3
7655 3 154 35 -68 -336 -173 128 220 169 317 -40 198 315 -93 -34 -323 -379 -215 -187 -70 -82 209 -26 -15
7678 -15 45 -46 1 -2 278 -221 277 -33 -143 -32 -144 88 108 -115 24 50 21 -125 72 -83 -10 88 -213 -105
7702 -105 219 -161 295 -87 84 157 52 141 258 132 -364 1 -139 -151 75 -103 53 76 -12 -200 91 7
7724 7 -112 -140 106 85 -228 74 40 -78 240 -115 -228 209 -146 -61 -320 -220 -59 -288 41 36 -107 -39 74
7747G4J1l3o3j41o7M8K42l1p3M6O3k02km1J32J08j73K92l71k8L38R7m73N37k94
7772dJ99j37M0l40L67p5J92q1qL6k39j54P7J50L27l58M69l13Ok28j91M05r6q9
7796d5K8l00L95k29O5m7K21l23J85M61n57K34rj5J96j67l64M55K59o60L67o2k82
7819a94p4P02n42R4j69K04J26k99R0J29L03m13J50j43KJ93j51j0j36%K99j52K88
7842B97l04j50L83j20k65j45L46L3M9p2m5P3j84k1q6J96J50l08J93q6R3k42J11
7865a04J86j34OJ14q7J35k46K84n1J13n28L31q3M7P5j46Q1o3l34L50R1K78l66
7888e1j93K99k84J59L60j91j72r9K97p5j03K33m60K31J06n9K7J06j92j64j2M71
7910B34m06R7j49K19P1j24j20M1O9K17J2m96N89j19r8j03j43M46m29J07j39L44
$$ plain form
7747 74 85 52 -11 -152 -219 -171 71 40 -33 13 76 -126 -128 -169 -37 71 -102 190 -181 -209 129 226 -247 290 -4
7772 -4 195 58 98 -242 125 50 242 161 153 189 -50 -204 -127 23 350 -8 461 148 154 -74 -265 140 44 -45
7796 -45 -17 -317 78 -151 -86 -133 88 -235 -50 411 -146 88 79 64 260 93 -271 184 443 -217 150 88 -194
7819 -194 -268 434 -108 -14 -183 21 147 -152 -62 67 370 -43 107 -36 -34 159 8 -2 -138 -138 161 9 297
7842 297 -7 -157 226 106 -159 -304 42 75 124 52 7 80 -104 -125 -211 -15 135 -173 20 -66 27 -215 -104
7865 -104 82 -52 -46 68 -19 116 -130 154 103 216 -312 19 -64 -17 58 -88 -7 -70 -404 -54 37 315 -51
7888 -51 -244 55 -229 -70 290 99 -73 -172 125 50 -53 180 -280 -49 57 -2 25 131 -61 -225 -237 234
7910 234 -172 -75 -224 -5 66 -58 -178 -137 -68 149 161 -335 254 135 37 -66 -209 237 -192 -85 -224 120
7932A20J3k66j05L37m62M33j67LN5p2K25q8J68k70k26L12l52M36p7L22m46q0k4
7955b11L6L8M30l74j57K06lj3N7J89j76M9N4j10j62o5N02k96q3K62k47M33l47
7978A2K0j53L13jj70J4k32J85o3r8L89j03l41L59M7M8m24N6J80p0J97q2j59K94
8002B18p19L95m5K4K17J30j78J56r6M2J02n9l29k2J04j96L64r2K3O1r1j55K97
8025A51J1k55L49m64L56j96Jj79K04q0J39J6o5j55K39L9p1K47m53M7K65j81J22
8048H7L46k89k05J14k63N02j55m19J61M25l23Q5j15k41K85j32J27j2J4O2j05J61
8070A10L8O3m34J54Q9m3pN7m5j03Jk07K82K27j91q0NJ19p7K60n45K75J59J39l41
8095i5N43l21J6J68k90k4M1j05K98Q3l56k3L33q1l03J04j45o1L14P1j56n1n7R5
$$ plain form
7932 120 133 -133 -238 99 -363 70 -97 -94 -39 -111 114 26 194 -76 -302 10 -342 94 17 339 -107 -187 -211
7955 -211 -175 -137 293 -81 -238 -32 -35 -48 9 198 22 71 125 15 -147 -212 290 -6 -89 173 -74 359 12
7978 12 32 -121 192 191 21 35 -197 -12 -75 -173 216 113 -228 131 178 226 -198 -142 38 -32 165 83 -76 218
8002 218 -501 -106 -151 -127 90 220 42 198 102 144 246 187 -142 -164 -60 -256 108 16 39 100 9 -146 151
8025 151 162 -93 256 -208 148 -48 -47 -226 -22 -102 37 53 -12 -167 72 111 40 287 -166 -119 146 -35 87
8048 87 433 144 -61 53 -210 292 137 -282 -121 304 -19 66 -49 -290 -5 -137 -10 -22 -8 54 -51 110
8070 110 148 211 -223 -69 20 -23 -30 27 -18 -121 -120 -327 -45 182 -9 -89 -84 35 -42 218 -327 -52 107 246 -95
8095 -95 448 127 143 311 21 -3 38 -67 231 314 -42 -65 268 187 -116 -12 -157 -218 96 167 11 -40 -97 -2
8119b%r5K38n6k7j04l18M89J20p4n33L54L24l92J69l4o3j48O9k73M19J94k34j83
8143a60L06N8l03K79k57lK27r6l24K80k07M41k43j42J54mqj77K8l6M66m71K40
8166D8k48m1K74R9n1l7ml0j55K40l53K08J51J73m97L53j86k1J62K8j88R2L57k58
8190A16J51
$$ plain form
8119 -2 -2 -97 141 85 58 -46 -364 125 245 171 -362 -8 316 -76 93 59 -4 -152 -83 -356 63 257 23 -160
8143 -160 146 204 -99 180 -77 -80 147 51 -273 7 -200 241 -2 -144 10 6 -2 -179 -151 -187 279 -192 48
8166 48 -200 -241 33 132 81 44 40 10 -145 95 -258 -50 101 274 -223 130 -56 -77 85 113 -75 17 374 116
8190 116 267
8191B67
$$ Imaginary data points
##PAGE= N=2
##DATA TABLE= (X++(I..I)), XYDATA
0@%%%%%%Pj4J4j4K1k8L5m7N4o3P7r2J13j33J53j80K08k41K79l20L65m14M68n30
30b82N99o70P49q40R37j042J159j288J429j582J751j937K143k373K626k908L227
47A698l589M001m478N039n707O517p519Q801j0505J2878j6433K2391l4758R4952
61G3288o8114o2619J35678j63007J31201o6029K7138N03l4068P6004r6424P6783
73C0334l5742k5982O1288m9301M5393m2197L0742k7327j756M6690n4708K9246
85F680r649O948r780J0567J1932m5517N0110l4637K461L5777l3509K149J3462
98F994L458l1193L3785j3825k8300O2998l8021k686K0807k8249J1090k78J2443
111I023j2785Q897M792l0641L4783j4801j5400K8319j3037J750K454m540M81n383
$$ plain form
0 0 0 0 0 0 0 0 7 -7 7 -7 14 -14 21 -26 28 -35 42 -50 63 -70 83 -97 111 -130 149 -171 194 -220 248 -282
30 -282 317 -353 396 -444 493 -549 610 -678 751 -831 920 -1017 1126 -1247 1379 -1529 1698
47 1698 -1891 2110 -2368 2671 -3036 3481 -4038 4763 -5742 7136 -9297 13094 -21664 73288
61 73288 5174 -57445 78233 -84774 46427 -19602 7536 8039 -26029 49975 -46449 30334
73 30334 -5408 -31390 29898 -19403 25990 -16207 14535 -12792 -14548 32142 -22566 6680
85 6680 -2969 3979 -5801 4766 16698 -28819 21291 -13346 -10885 24892 -8617 -6468 6994
98 6994 10452 -20741 13044 -781 -29081 33917 -4104 -6790 14017 -14232 -3142 -3420 9023
111 9023 -3762 5135 9927 -20714 14069 -732 -16132 12187 -850 900 3354 -1186 -705 -6088
125f088Q137J011q531J3601l375k2674K9925j0766j3185L0936l2477Q693J8091
138A3298j8484K09J4102o769j9499L3210k0483m289K4844k9376J6355M901j1742
151c723k018P606k773o85J4624k1327J0395o168K099P135j1963K1970k6984J1756
165e6O917j2922J0838j2844J3652j1223J7377j3611j0624K6211k7287K0644j633
178E439r846L158J145K227j0085K3526k5567N934J4337j9366J6377j0301O33J336
192a053P512q245k929J1009j6115J6952q520M160k719o789J2610j3344J7488j3588
206c571K080K877m235J0381j8347J9304j3689M555J0802k1935J7772p788m65L470
220A211L221m913o095J5098j9171J6726j098j4799J8134j1171K756p3n31o7J490
$$ plain form
125 -6088 2049 3060 -5471 8130 4755 -17919 12006 1240 -11945 18991 -13486 -4793 13298
138 13298 -5186 -4977 9125 2356 -17143 16067 -4416 -8705 16139 -13237 3118 8019 -3723
151 -3723 -5741 1865 -908 -1593 13031 -8296 2099 -4069 -1970 5165 -6798 15172 -11812 -56
165 -56 6861 -6061 4777 -8067 5585 -5638 11739 -1872 -12496 13715 -13572 7072 5439
178 5439 -4407 -1249 -104 2123 -7962 15564 -10003 -4069 10268 -9098 7279 -3022 -2389 -1053
192 -1053 6459 -1786 -4715 6294 -9821 7131 -1389 2771 52 -6737 5873 -7471 10017 -3571
206 -3571 -1491 1386 -2849 7532 -10815 8489 -5200 -645 10157 -11778 5994 -1794 -2259 1211
220 1211 4432 -481 -6576 8522 -10649 6077 4979 -9820 8314 -2857 -101 -174 -705 -772 718
235G18L483r388R165o007m31N133m697O726p194J611K570m503N858m506K33L303
251B074j785j225j567O896r077O955J004j0488J4416j0908J356O869o519L515
265A516m540O228p425O919J0j0541J6789j4668N364K534o016Q801p768O581p002
280c218M894k026l100P940p605P817p809L594M99n133Q385p507N800j751j351
295e71n54N41M104r050J0416o470j40O761r506M656J105j145j839N529n568j67
311a898N963q413P356j888l838K367J883j463M5J273m145N226l639J426l37j211
327a293M303n190M474k808l14p26J607L001n032P017r873M115M204p808P588m200
343i35J362j265L637n215J146N195j0516J2128n850j45J128l832N866n244P019
$$ plain form
235 718 4201 -5187 3978 -2029 -2460 2673 -2024 4702 -2492 -881 1689 -2814 3044 -1462 -1229 2074
251 2074 289 -936 -2503 4393 -4684 2271 3275 -7213 7203 -3705 -2349 4520 -1999 1516
265 1516 -3024 3204 -4221 2698 2708 -7833 8956 -5712 -348 2186 -3830 4971 -2797 3784 -3218
280 -3218 1676 -350 -3450 4490 -3115 4702 -3107 487 986 -4147 4238 -3269 2531 780 -571
295 -571 -1125 -584 3520 -5530 4886 -1584 -1724 5037 -4469 187 1292 147 -1692 3837 -1731 -1898
311 -1898 4065 -4348 3008 1120 -2718 -351 1532 69 114 1387 -2758 2468 -1171 255 -82 -1293
327 -1293 3010 -2180 2294 -514 -828 -1554 53 3054 -1978 5039 -4834 -719 3485 -4323 3265 -935
343 -935 427 -838 2799 -2416 -1270 3925 -6591 5537 -313 -458 670 -3162 2704 -2540 4479
358D479p726K575L703o963Q613p809M452j379j970M607m890N429n071K155N69
373G74l20j85l630O562n686M523k49n234M681j608j119K980O7m420M186o98k622
390a998L755k126j423L088N30l009K291k026p66M075k553Q8J140k341O19J790
406A134j527J076r53j842M951m872L200j46m709P369n104J604n96J74m5P78J884
423B376n650O404n152J211M125n000K916k632K897k988K558r16k885O823o584
438b497M007j360j749L011l344M625m566L128k329m35L449m180M737m887L582
453A192m77k757L872m043K944J70q64k31K23K96k023L611k249n33K596l241J178
470c36K254l503J736Q40k111J725r62R5M0J234j028r13K781m269L894k289P42
$$ plain form
358 4479 -3247 -672 3031 -3932 4681 -3128 1324 -55 -2025 2582 -2308 3121 -1950 205 774
373 774 454 269 -3361 3201 -2485 2038 1789 -3445 1236 -372 -1491 1489 1556 -2864 1322 624 -1998
390 -1998 1757 -369 -1792 1296 1826 -1183 1108 -918 -1684 2391 -162 -74 1066 -1275 -656 1134
406 1134 -393 683 -270 -2112 2839 -2033 1167 1021 -3688 3681 -1423 181 -415 -241 -286 492 2376
423 2376 -3274 3130 -2022 -811 3314 -1686 1230 -1402 1495 -1493 1065 149 -2736 4087 -2497
438 -2497 1510 150 -1599 1412 -1932 2693 -1873 1255 -1074 -1509 1940 -2240 2497 -2390 1192
453 1192 715 -2042 1830 -2213 731 901 37 -194 29 325 -1698 1913 -336 -869 1727 -1514 -336
470 -336 1918 -1585 151 991 -1120 605 -357 -262 -222 1012 -16 -929 1852 -2417 1477 -812 -70
487g0J470l802M660m704L805j242p04K220l090L949n668N619l494k81M675p511
503d168P308m627J462J34j000L074m859N791n972L758j06l251O048o408N224m392
519a984K590M92l114N503p179O226l927J158J699m209N552m640L525k227l24J405
535E46k242M000l813L037l249J234K352l997M196l622J686J96j39N69j898K318
551A174k744L585j620j146J171k345L523j284O76j347m99J285p11J562k005N86
567a39L32l43J348j628k22L26J12J504j134r21J49K36J006L90p16j629J288K57
585B16J07N13k177R54M98J00P35k005P44p46K363q85p34J307k534K524n76Q6n89
604i9j056J607j118K777l379J955j221j95K401l339L780l720J641M43j634K857
$$ plain form
487 -70 1400 -2402 2258 -2446 1359 117 -587 1633 -1457 2492 -3176 2443 -1051 -1332 3343 -4168
503 -4168 3140 -1487 -25 109 -891 2183 -2676 3115 -2857 901 795 -2456 3592 -2816 2408 -1984
519 -1984 606 1098 -2016 3487 -3692 2534 -1393 -235 1464 -2745 2807 -1833 1692 -535 -859 546
535 546 -1696 2304 -1509 1528 -1721 -487 1865 -2132 2064 -1558 128 324 185 754 -1144 1174
551 1174 -1570 2015 395 -751 420 -1925 1598 314 990 -357 -856 429 -282 1280 -725 -139
567 -139 193 -150 1198 -430 -652 -326 -214 1290 156 -765 -616 -380 626 1016 300 -1329 -41 216
585 216 323 836 -1341 -387 111 211 946 -1059 -315 -1061 1302 417 -317 990 -1544 980 404 490 -99
604 -99 -1155 452 -666 2111 -1268 687 -534 -729 1672 -1667 2113 -1607 34 477 -1157 1700
620A700m015L358k397K834q08k253M010n650N579l136O29J422l191M154m569N010
636B677m164J466J273l840O042n975M299k736K92K524m054N223n889M289j924
651d97j18L039n109N398n978N029j022k061L994o372N961l593K934j402k277M730
667B656n741O179m306M21J768l442N811m311K377k810P06J882k518M028m633K194
683B61j78p27K700l410K049k116K136k39j263J693k668K977j447P9N56k408K716
700G11r91R49l66j508J220n49J889j761L98J21j733L267k271P29l7j287K492j613
718c40J133j582P21J06m87K172l308K464j226n2J897k764K260k562K113k19r73
735f47J932k948L062k384J697m68j165K746l519L024j692M35J78r75J570j846
$$ plain form
620 1700 -2315 1043 -1354 1480 672 -1581 2429 -3221 2358 -778 -149 1273 -1918 2236 -2333 2677
636 2677 -1487 -21 1252 -2588 3454 -2521 1778 -958 -666 1858 -2196 3027 -2862 1427 -497
651 -497 -615 2424 -2685 2713 -3265 1764 742 -1319 2675 -3697 2264 -1329 1605 203 -2074 2656
667 2656 -3085 3094 -1212 -791 977 -2465 3346 -965 1412 -1398 -692 1190 -1328 2700 -1933 261
683 261 83 -644 2056 -1354 695 -1421 715 476 -787 906 -1762 1215 -232 -153 403 -2005 711
700 711 -280 669 303 -1205 15 -534 1355 -406 -8 113 -1620 1647 -624 105 68 -1219 1273 -340
718 -340 793 -789 -68 38 -449 1723 -1585 879 -347 -399 1498 -1266 994 -1568 545 326 -647
735 -647 1285 -1663 1399 -985 712 244 -921 1825 -1694 1330 -362 73 251 -724 846 -1000
751a000K544k542J439k04j123K089j946J798k337J812n17m52K041l559L468k148
767f37J095J72k054K542k654L195k737J563m47j328K900l110L166k716J142j69
783g7r18K339k563K231j814J495n13j011K130l218L633k328J090J59j899K466
799A202k850L670k888J232j37k373M399l748K416j271p2J447j922K444l441K822
815I30j211j1J611k691K678k640K090r69m48J795k771K989k081P57K2k70J493
832A273k761K728k315O24R14j669K324j795J072q36N1J438k420K600j703L69P84
849F78k084K520j843J031o10L83Q04k404K993k244R88L72j698K041k146K429j810
866f00N23R47k655K967k590J947k59o40J367k292L092l336J433O64j838K996l112
$$ plain form
751 -1000 1544 -998 441 237 -886 1203 -743 1055 -1282 530 13 -439 1602 -1957 1511 -637
767 -637 458 630 -1424 1118 -1536 1659 -1078 485 38 -1290 1610 -1500 1666 -1050 92 -77
783 -77 -995 1344 -1219 1012 -802 693 180 -831 1299 -1919 1714 -614 476 635 -1264 1202
799 1202 -1648 2022 -866 366 229 -2144 2255 -1493 923 -348 -420 1027 -895 1549 -1892 930
815 930 -281 -292 1319 -1372 1306 -1334 756 -213 -661 1134 -1637 1352 -729 28 50 -220 1273
832 1273 -1488 1240 -1075 -451 463 -1206 1118 -677 395 -441 -390 1048 -1372 1228 -475 -106 678
849 678 -1406 1114 -729 302 -308 75 879 -1525 1468 -776 212 584 -1114 927 -1219 1210 -600
866 -600 -77 870 -1785 1182 -1408 539 280 -360 1007 -1285 1807 -1529 -96 568 -1270 1726 -1386
883a386K348j870J043J56j585L277l862L125j487k08J018k001K995k804K642j773
899c72p0J276k388K685k129J449r74K74J144k577L394l242J858k37p72J748k239
916a172K855l194K362q46j172K430k691K491j338R17p58q86J913k612K983j715
932d33N69L58j022R93k207L093k277J245O88k111K052j977J554r92J003J18j551
949h97K307k915J737q0j77O76r62J100j527J146n57o36J840j954P96K34J1j12
967C0k78Q18j327R59m26l80J253q13O32n05K73o37M7J191j491J355k90p10M51
986A52o12N43p00J140l51p34J667k477J705o65K03M77o09J288j996J939j518K05
1004c43J405k216J941j253R42o95K39Q97k446K658k003P67L31o99J161j597K087
$$ plain form
883 -1386 962 -908 135 291 -1294 1983 -1879 1246 -241 -449 569 -1432 1563 -1241 1401 -372
899 -372 -442 834 -1554 1131 -998 451 -523 -249 895 -1682 1712 -1530 328 91 -681 1067 -1172
916 -1172 1683 -1511 851 5 -1167 1263 -1428 1063 -275 642 -116 -1002 911 -1701 1282 -433
932 -433 136 494 -528 465 -1742 1351 -926 319 1007 -1104 948 -1029 525 -467 536 654 -897
949 -897 1410 -1505 232 152 -25 651 -311 789 -738 408 -149 -785 1055 -899 -103 131 142 30
967 30 -248 570 -757 202 -224 -604 649 -164 468 -37 236 -401 -354 837 -654 701 411 -299 152
986 152 -460 83 -617 523 172 -562 1105 -1372 333 -332 -129 348 -261 1027 -969 970 -548 -343
1004 -343 1062 -1154 787 -466 476 -219 20 917 -1529 1129 -874 -107 224 -475 686 -911 1176
1021A176k434J729q1j427K623k265J131p49L68j44q42K578k592K059j467l01J179
1038E41r68J301j686J983j298l04J570k567K370j052Jm8N3N61j660K212j486R22
1056D45K81j122P81j066J225j005P97k7j271J246p51M41J83J09l62l65Q27j302
1074i36J215j80l86P74q77J36J55L82q28P54J67p20O0N37o92L27K88k77M72n61
1094a90K11l90Q08n16k4O90j136N08K53k88J77k22K28o43R98j042n5R44p90P61
1114B82k36K13r29P64K14q66J223n48n77O61m71O84o07Q77j346J255j99r23P36
1133B07q4k02k45Q53j083P30k9o67R08k29k73m47R53o54j19J205j335P43L2n35
1153b71L8N14N3q50J250j333K45R54p24K25P6J48o85Q42o72j40P74l30n5Q9J64
$$ plain form
1021 1176 -1258 471 390 -1037 1586 -679 452 -297 71 -73 -915 1663 -929 1130 -337 -638 541
1038 541 -427 874 -812 1171 -127 -431 1139 -1428 942 -110 -109 -157 -104 457 -1203 1009 -477 445
1056 445 726 -396 385 -681 544 -461 336 309 -962 284 -467 -26 157 266 -96 -461 366 -936
1074 -936 279 99 -287 487 -390 -254 -99 283 -545 209 376 -344 -284 253 -439 -112 176 -101 371 -190
1094 -190 21 -369 439 -77 -101 589 -547 -39 214 -74 103 -119 109 -534 464 -578 -633 311 -479 282
1114 282 46 259 -670 94 308 -558 665 117 -460 201 -270 414 -193 684 -662 593 394 -529 207
1133 207 123 -79 -324 529 -554 176 147 -520 388 159 -114 -561 392 -262 -381 824 -511 232 264 -271
1153 -271 -233 281 334 -516 734 -599 -354 600 -124 101 177 325 -360 482 -190 -330 444 114 59 148 312
1174C12q55R48k54m47Q05n53k91N31k9m14M24M33j126P67m9o13P23n54O02n93
1194b33M24p23P0J069o40N67n41K51n07L75k61J7O42q33O26n12r4r6R15k67m36
1215a87M95p47J41N64l77j53L30J79q71Q11l17k44Q68p24J03M2P7k10L25K11n20
1236b04N95o80K18Q3L21o60J13R90j401Q06k10k73M02l07N46l23M70p04K2N17
1256C21n44O11o94K03j56J51K97o11J103j448Q86rq5J86k70N14j015R21k50o79
1276e68Q66m31K40j96L35m03QJ78k93N03l07j33M04k75j1Q4K47m14j63M34o52
1297e47M00M46m36N70n67p9k26N04JJ61L49r63K45J35p2K23R0k71jO47o89k35
1319c15Q04q00M62J28k84j22L61j21o79P83j13k15K99p18Q51m34N17m80j16O54
$$ plain form
1174 312 -543 405 151 -296 509 -44 -335 196 167 -247 177 610 -516 251 202 -411 312 -242 360 -233
1194 -233 191 -532 -462 607 -33 534 -7 244 -263 112 -149 -132 510 -323 303 -209 -303 -399 516 249 -187
1215 -187 308 -439 -298 266 -111 -264 66 245 -626 185 -132 -376 492 -232 -129 -87 -10 -220 105 316 -204
1236 -204 391 -289 -71 12 333 -327 -214 776 -625 181 -29 -302 100 -207 339 16 486 -218 -196 321
1256 321 -223 388 -306 -103 -259 -108 189 -422 681 -767 119 110 25 211 -59 455 -560 361 111 -568
1276 -568 298 -133 107 -89 246 -157 -149 29 -264 239 -68 -201 203 -72 -83 1 248 -166 -329 105 -547
1297 -547 -147 299 -137 433 -134 -213 -439 65 66 227 576 -387 -142 -7 -79 144 234 -37 -38 609 -80 -315
1319 -315 489 -311 151 279 -5 -127 234 113 -566 217 104 -111 188 -530 321 -113 404 -76 -192 462
1339D62j256J398j044O62o3J19j97o53R67r59J012m83l53R63p06K97m61K53l5
1358g7j41Q41j318R76l95k61N44l60M15p71J359j205K58O39q74M59m76O42m14
1377a59K20K13q38J059o96J42K47l14J14k64P24j050O06j19j53N39n38P50n20
1396c7O11r14J98N86o55O39m21j8m5R0Q5n04N70p08O23K1l13M30m41J63j02K31
1418H9l89P0M64m31M21j74J48j07J15L2o53M50J36k65K83n07L08l1O6L19n67O96
1440D73n06J45j54l41O58l77J47m90N27j51k80O71p99N25q1k51N81p73O95m16
1460a97M58n60q0P60q59J122p92J64K77n15L11k81P13r60M76N31j098R51j137
1479g16J011l52P4L97p13Q65j262J026l42n10R81j059Q64n53O57k27k45M17p14
$$ plain form
1339 462 -794 604 -440 222 159 278 81 -572 395 -564 448 -35 -388 575 -131 166 -295 -42 -77
1358 -77 -218 623 -695 281 -114 -375 169 -191 224 -547 812 -393 -135 504 -370 89 -387 255 -159
1377 -159 61 274 -564 495 -201 -59 188 -126 -12 -276 448 -602 4 -115 -268 271 -267 483 -37
1396 -37 574 -340 -142 444 -211 428 7 -11 -56 34 119 -385 185 -523 100 121 -192 238 -203 -40 -142 89
1418 89 -300 -230 234 -197 224 50 198 91 206 238 -415 35 171 -94 189 -318 -10 -41 25 344 -223 473
1440 473 -33 112 -42 -383 275 -102 45 -445 82 -69 -349 322 -477 48 -33 -284 297 -476 219 -197
1460 -197 261 -299 -379 381 -478 644 -148 16 293 -222 89 -192 521 -439 37 568 -530 421 -716
1479 -716 295 -57 17 414 -299 566 -696 330 -12 -522 459 -600 264 -289 368 141 -104 313 -401
1498d01P57n71K84j74k2L04o92J100r69M59P8m00Q78j100Q26p02K80K59n51N95
1518B38k72L10n99J65N01l60K19l64K20j35j15M00p7K96m00J90k79LJ04o28Q68
1539B85k19K06k60k06K25l05N12n11n1M88k92K4J22j94K88k81M61p53O16j3k5
1560A17Jp0M5k41J53j91L16J34k81K51l44k0M08m83J82Q4J14k99J21R6m50O45
1582B88l03J42l05L10J00k85N98p40N85m34J56k6l26M25n42L38Q7k31N81p13L89
1603I4l07J69j3K26r7q9O23o72j23O86o39J22j71N44n18L95j88l51O81q24O83
1624B31l45J90L12o99J008j131R34n22j45M03l95L01m47O34l72n8J24m14N19k41
1644a13L99j36k97N00l75R8j60L4J37k0n1j36L05j83M53n17m3M16m41M2J21J77
$$ plain form
1498 -401 356 -215 69 -105 -127 177 -515 585 -384 75 153 -247 631 -469 357 -345 -65 194 -357 238
1518 238 -34 276 -323 -158 343 -17 202 -162 58 -77 -192 208 131 427 27 217 -62 -59 45 -583 285
1539 285 66 272 12 -194 31 -274 238 -273 -324 164 -128 -104 18 -176 112 -169 292 -461 155 142 117
1560 117 118 48 93 -148 5 -186 130 264 -17 234 -110 -130 278 -205 -23 61 175 -124 -3 93 -357 288
1582 288 -15 127 -178 132 232 -53 545 -195 390 -44 112 86 -240 185 -357 -19 68 -163 418 -295 94
1603 94 -213 -44 -57 169 72 -17 606 -66 -189 497 -142 -20 -191 353 -165 230 42 -309 372 -452 231
1624 231 -114 76 388 -311 697 -434 500 -22 -167 236 -159 142 -305 329 -43 -101 23 -391 128 -113
1644 -113 286 150 -147 353 -22 76 -84 -50 87 67 16 -120 185 2 455 -62 -105 311 -130 -88 33 210
1666B10n38K35mj41N93j82l42J21J90j38J23k47K71l15n6r0M51j94J51l9Mj85
1688a22j22K66o5J73J14k55j50L48k49K43m86J89m1J57jj57L05l37K53k28K1M06
1710B62n16N1J53P3J3N4l16L65K19k92J34j9k1m04J25L14j66n9N3K6M21m62K4
1733C2j69K65n1j55K12l7K9q6Q1K2P5l8l64M71m95K54q5k3K5k14L59l59pL27q9
1758b0J86l41J54r1L00j18j98L04q1J53l82M87n18N6o3J23L88r1m03L18o0m0j53
1781i0p1K45p0m1j39J70j01m21O01k14j68K67L30o63N70k8l37j63J93J19j42L02
1803A49j68J62n44J00P12o04J10J68k36L95m02K04J54j61j39L14k21k09O0K4J49
1824A7j90K13k63J35J04R9q0k63L03j3J82k64k16J74K63k64J38K08m93L84j19
$$ plain form
1666 210 -328 -93 -97 -238 355 173 -169 -48 142 4 127 -120 151 -164 -220 -310 141 -53 98 59 63 -122
1688 -122 -244 22 -43 130 244 -11 -161 187 -62 181 -305 -116 -157 0 -1 -158 147 -190 63 -165 -144 262
1710 262 -254 -203 -50 23 36 90 -226 139 358 66 200 181 160 -244 -119 195 29 -30 23 49 470 8 32
1733 32 -137 128 77 -78 134 97 126 40 121 143 218 180 -184 287 -208 46 -39 -62 -37 -251 108 -251 -258 69 -20
1758 -20 166 -175 -21 -112 188 70 -128 176 95 248 -134 353 -165 -109 -172 -49 339 248 -155 163 103 63 -90
1781 -90 -161 84 14 -27 -166 4 -97 -518 83 -131 -299 -32 298 -365 205 177 -160 -323 -130 -11 -153 149
1803 149 -19 143 -401 -301 411 -193 -83 85 -151 244 -158 46 200 39 -100 214 -7 -216 -156 -132 17
1824 17 -173 40 -223 -88 16 115 35 -228 75 62 244 -20 -236 -62 201 -63 75 283 -210 174 55
1845E5q5K42l21L72j60J79m49N2N3l8j39j29K81l9O5K73m14l4k00L74J20o2K29
1868B25k17k19j06P58m02l1n8L83m57J29m9P6qK36l91N8K81j39k19J10o4K31j29
1891bj4L13l92L09l07K78l19K43k10k73K78J30J18j52k90K93K13o4o05K95P5j9
1913a02K78j51j07j8K39k32M84m84j76L82K65k35j0p0M6j1k08j13L65J63m25J90
1935G0j37o0j08M75J82o84L54k40J82K1k02L81j40R1n0k51Q5K31k32J03j66qk92
1958c95L38O9k9K40l6m23J69N4J24m2l10L91k48J98j48J28Kp2J0p6j7L0J32k37
1982a48J80R4k30J37l2l3q5K00J86j96M9l40L35j0Q0k75R3O4j4j42K39m0l17M55
2006B50L8j60k88L31j37K81j39K40p3m97k02L30j24j7J91K48j5m14K35k67K91
$$ plain form
1845 55 -30 212 -109 263 103 282 -167 -115 -62 -100 -239 -368 -87 -126 -61 212 -202 -236 -436 -62 58 -4 225
1868 225 8 -211 -317 441 39 8 -50 333 -124 5 -44 32 24 260 -131 -73 208 69 -150 -40 -104 127 -2
1891 -2 -16 297 -95 214 -93 185 -134 109 -101 -374 -96 34 152 0 -290 3 216 152 -453 -158 -83 -102
1913 -102 176 25 -82 -100 139 -93 391 -93 -269 113 378 143 133 63 109 98 -110 -223 142 305 -120 70
1935 70 -67 -127 -235 240 422 -262 92 -148 34 55 -147 234 94 185 135 -116 -31 200 -32 71 -95 -103 -395
1958 -395 -57 12 -17 223 187 -236 -67 -13 111 69 -241 150 -98 100 -48 80 82 10 20 -56 -73 -43 89 -148
1982 -148 32 126 -104 33 1 -32 -117 83 269 73 122 -218 117 107 187 -88 5 69 55 -87 152 112 -205 250
2006 250 288 128 -160 171 34 315 176 416 343 -154 -356 -26 -150 -167 24 272 257 -157 78 -189 102
2027A02k25J02rL0Q8j46J18n1J0j93N9j05K95K5J4j32P1J12j89P0K24n13N48j79
2051A26l5K39k69J81j71j85j1k07K93o2L36j03j51L1j15J22j05J93j21j06K57
2072A37j58M49o06J46J06n9L3k03J23p6K40k93K23J40l32R8j0L40p1k73j8n4L23
2095B05k70o8K06Rp1j28M41l75o8o7J57R9J5K5j83K35K4k8K2r5Lpj32n5j5J53
2121C2k07O5j47K28r1N5J63j38k0j55J42j69K67Q4Q1j41p6k27K27k11K21K12k53
2144e8P3Jm1J29J38q2q7n7L1j12j60K45j4j60J76K57m83J00J71O0q7k11K21L3
2168H3j16k12K09M03m84k8j00J85l36L53J05j28K45j59N2J63l00m0J43j69L6J87
2190I2j07r1j41J76L1pK61k47L18j02l57L97q2m8j87j31L11Q1k58K76J07l15k73
$$ plain form
2027 102 -123 -21 -30 0 88 -58 60 9 19 -174 -115 -220 75 100 114 -18 53 165 -24 46 270 -243 305 126
2051 126 91 330 61 242 71 -114 -125 -332 -39 -101 235 132 -19 12 -103 19 -86 107 -14 -120 137
2072 137 -21 428 -178 -32 74 15 48 -155 -32 -108 132 -161 62 202 -130 -32 -42 298 227 -46 -64 -118 205
2095 205 -65 -133 73 82 11 -117 324 -51 -119 -186 -29 70 85 110 -73 162 186 158 180 85 88 81 -51 -106 -121 32
2121 32 -175 -110 -257 -29 -120 -65 98 -40 -60 -215 -73 -242 25 109 190 49 -27 -254 -27 -238 -17 195 -58
2144 -58 15 16 -25 104 242 160 73 16 47 -65 -225 20 6 -154 22 279 -204 -104 67 127 40 -171 50 83
2168 83 -33 -245 -36 367 -117 -145 -245 -60 -396 -43 62 -66 179 20 72 235 -65 -105 38 -131 -95 92
2190 92 -15 -106 -247 -71 -40 -47 214 -33 285 183 -174 223 141 93 -94 -225 86 167 -91 185 292 -23 -296
2213b96L49O7l67L97l46L32j43J70j98j2K35n06L37j3l8L1k32J90k32K72L18l30
2235a5r4K78l23j3K68M3o8j28j20K49p2j4m8j24P3J25P6k8K06q2m46M92J78n96
2259a83L21j38kj85L2O4L77l69M79m72K44m84L74l3j42o5k5M49k67K14k22R4k19
2282a58L22o2k54L85k48oN3J02n0k65j11J60K26k55M1J44p9K90K55p37J72m4k14
2305c33K82L08m58M39L4k27O8l63J20J7nJ1J83j22Q5k57K77J67n3j36L32k71N6
2328A54l20K28K47k80k27lM98m57oL25J43km28j0L27l80M11j04j24K27m41L68
2350A46j52m1O9m17L21M3J58j93J91j39J03J29k94J51n3j64J0K2N09m89J5n5J19
2373a1P3q2J16k47k00J53K22j3k10M10j40N1q0k42L08k09M90m43K5K4K9p3k11
$$ plain form
2213 -296 53 120 -247 150 -196 136 -7 163 -35 -47 188 -318 19 6 -32 -1 -233 -43 -275 -3 315 -15
2235 -15 -109 169 -154 -167 101 144 76 -52 -172 77 5 -9 -57 -181 -108 17 93 65 271 189 -257 235 413 -183
2259 -183 138 0 -2 -187 -155 -91 286 -83 396 -76 168 -316 58 25 -117 -182 -207 242 -25 189 -33 61 -158
2282 -158 164 102 -152 233 -15 -21 32 134 84 -181 -292 -132 94 -161 -120 24 -55 235 490 -247 -75 -119 -333
2305 -333 -51 257 -201 238 272 45 113 -250 -130 -113 -118 -107 76 -46 39 -218 59 226 173 37 369 98 154
2328 154 -166 62 309 29 -198 -201 297 -160 -166 159 302 300 -128 -138 189 -191 220 116 -8 219 -222 146
2350 146 -6 -47 22 -395 -74 -31 127 -66 125 -14 89 218 -76 75 22 -142 -132 -110 399 -90 -75 -130 -11
2373 -11 62 -20 96 -151 -351 -198 24 11 -199 211 71 122 42 -200 108 -101 389 -54 -29 -5 24 -49 -260
2396b60J91O9k63M21q3l32K28J86J58m01m8l5L42m74O4M22k31OJ71j89J43k53
2418a68O8L2k1q1k03O11j66k91L33l20P5J84J72j36J8J21j11p3j92L1K21m08L05
2441Al6J83J42k53M9j83P0j02K13n3P6l6J51r2k19P7J19J01j5j43K3J89m19L68
2465B11j40m4R9j00j72k3k29P5J91J29R7k64q0K34N2K08j66Q4m21M34N6j91j57
2488a17Q1J91m6j08J12l72M24m65l7K08K36j64p2P6j7k97M28j2k29N45l82O1n5
2511a1m8k1J05k01K74n5J68n0j68p7Q4j1J40j46J30k03K31n82M56l7J16j62r1
2534a59n5J22K35l66L99k55j7n6L04n82N77j25J89k55k0J23k87O28n68N40m96
2555a24o9M54j92o5J13m34J78J64o3J07k52J62k54K25M31k78j47n6j25K53J85
$$ plain form
2396 -260 -69 0 -263 158 75 -257 -29 157 315 -86 -134 -169 173 -301 -237 185 -46 -40 131 -58 85 -168
2418 -168 -100 -68 -89 -170 -373 238 72 -219 114 -206 -131 53 225 89 107 228 117 44 -148 -117 104 -304 1
2441 1 -35 148 290 37 86 -97 -27 -129 84 31 107 71 222 130 -89 -12 107 208 193 50 73 262 -157 211
2465 211 71 27 126 26 -146 -169 -398 -323 -132 -3 94 -170 -250 -16 36 244 78 162 -259 175 231 40 -117
2488 -117 -36 155 109 1 113 -259 165 -300 -337 -129 107 -57 -129 -53 -70 -367 61 49 -180 365 -17 44 -11
2511 -11 -59 -80 25 -176 98 43 211 161 -7 -84 0 -11 129 -17 113 -90 141 -441 15 -22 94 -68 -159
2534 -159 -214 -92 143 -223 176 -79 -96 -152 152 -430 147 22 211 -44 -64 59 -228 400 -168 372 -124
2555 -124 -193 261 69 4 117 -317 -139 25 -38 69 -183 -21 -275 -50 381 103 -44 -100 -225 28 213
2576B13k79J15l10K19j21K35r5J18O4j69L46l21l9J70q0k40j27K53N47o58K78
2597A19j67R5K02m01j25J90K81j25j75k65L26o9K1K86k88J01j04j91L72l00L38
2618A21O4j75JJ89q6p4k3p8n0Q5O9k65K19n9J78j72R7K9k03K9L25l47j12L41k6
2643G7K60j41n67N67j58J1KJ73r9q7J47k58Q7J65m12K76j95J66j21K20l20L42
2665A35j29m2J29j37M64l48k6m0K18l69P7j11K77K00l91J2m2K83m7k28j1J06K97
2688B77m34RJ10J02p4L2J10l04J63M4m1k55K60K15k26K48J07l06J7l00K74K80
2710C08j7j73j31K67l59R0Rj0J79k63Q2K92k63k21L49r9m0K33l85m9L10Q0J9m06
2734a98K80o0n8J51j43j3k6p7Q5M87q24J01M94j40n4R0n5J50j47L3J62R1l53K73
$$ plain form
2576 213 -66 49 -261 -42 -163 72 -23 95 159 -10 336 15 -24 146 66 -174 -301 -48 499 -159 119
2597 119 -48 47 249 -152 -277 -87 194 69 -106 -371 -45 -114 -93 193 -95 6 -98 -289 83 -217 121
2618 121 185 10 11 200 114 40 17 -61 -111 -26 43 -222 -3 -62 116 -56 41 70 -133 -104 221 -126 -238 103 77
2643 77 337 196 -371 196 38 49 51 224 125 38 185 -73 14 179 -233 43 -152 14 -107 113 -207 135
2665 135 6 -36 93 -44 420 72 46 6 224 -145 -68 -179 98 298 -93 -81 -123 160 113 -115 -126 -20 277
2688 277 -157 -148 -38 64 -10 22 132 -172 -9 35 -6 -261 -1 214 -12 236 343 37 54 -246 28 308
2710 308 291 118 -13 254 -105 -15 -6 -16 163 -100 -18 274 11 -210 139 40 0 233 -152 -201 109 189 208 -198
2734 -198 82 22 -36 115 -28 -41 -67 -144 -59 428 -396 -295 199 59 5 95 40 190 43 76 238 329 -24 249
2758B49r6k48J07J06m29L16k18J2R7p2K63M6r2J09q8l70K82M0J1L5Q8j69O0J04
2782A43O6m05oK9K5M0Q5Ql1J52R2k60J56k83M0J50p3N2K18k50N2L8N4k31J9J75
2808E5k75j7J22R5K45m96M57l06M21o03J04K55K39l12L3N5j71qM0k25K15p4K23
2831G2n3j44K17J04o4l15M32j00n1k38K58Q0k92L26k82J49K20L31p48L29k07k01
2853a77j77L49k95M07l54J62K04k96P5k6L73m75L24o0J2r6J52j36k11M7o2M74
2875B14j97J99R2l82k17M21q9k70M90j48k1j51K44j0j89J49k74j39K45J45o4l9
2897Ik00R7J03L19m04j6Q6K92k19n16K51J30k4J89m1J75kl53K13j70K48l2k98
2920a63M1N14l75L4j45l4r2K52j24Lk36L32K7k33K20j3j30l4N70m9k17K3l39O06
$$ plain form
2758 249 153 -95 12 118 -311 5 -213 -201 -104 -176 87 133 41 150 62 -308 -26 14 25 60 148 -21 39 143
2782 143 209 -196 -202 -173 -148 -108 -23 -15 -46 106 198 -62 94 -189 -149 1 -72 -20 198 -52 0 38 92 -139 -120 55
2808 55 -220 -237 -115 -20 225 -271 186 -120 301 -302 -198 57 296 -16 17 72 -99 -107 -67 -292 -77 -151 72
2831 72 19 -125 92 196 132 -183 249 149 98 -140 118 198 -94 232 -50 99 319 650 -98 231 24 -177
2853 -177 -354 -5 -300 107 -247 -85 119 -177 -102 -128 245 -230 94 34 46 -50 102 -34 -245 -198 -260 214
2875 214 17 216 308 -74 -291 130 41 -229 261 113 92 -59 185 175 -14 135 -139 -278 -33 112 48 9
2897 9 -191 -94 9 328 -76 -92 -6 286 67 -449 -198 -68 -92 97 56 231 229 -124 89 -81 167 135 -163
2920 -163 -122 392 17 51 -94 -128 -220 32 -92 -89 -325 7 34 -199 21 8 -122 -156 414 365 148 171 -168 438
2944D38m33J73p0j19J16k52J78J34j68J43j22O6l04Q4L00k06K9J17j20K87k17
2965E4J83j62O9j50j53j29K14J61R7n56L80m0R3j65j08Q5J46P6k09L11l20J92
2987F9K0l6k82L46P1k22L7j23L85k46l7j70J3L2L66lm60L67j7j68K06j67M3k48
3011b24J06L33o4J27m97L53r4L0l44L12R6l75J22o1J04j35M96l16j59K27J25j56
3033FR0k4j19J05J54m46J93p0j29K45n8M1N2p1J15j77j14K64j32l83M60j27K53
3056A28j22J94k62K7k56J1M50k56K35k37K89l6m07k5M86k24J3m86M52L93m74O3
3078d4K53m06M7J79p4n6J75m6k53M59m1j40R9j08J44l74K8J26NJ1J97r5K44l27
3102CJ9k01N25l47k83M40pj67J56k30N6K4j22M18l17K08l80K4M1L11k11n8J82
$$ plain form
2944 438 5 178 108 -11 105 -147 31 165 -3 140 18 84 -220 -136 164 -42 -13 104 -16 271 54
2965 54 237 75 144 -6 -159 -288 -74 87 184 -372 8 -32 61 -104 -212 -127 19 95 -114 197 -123 69
2987 69 89 53 -229 117 188 -34 3 -120 265 19 -18 -188 -175 -143 223 220 -240 127 110 -58 148 -19 24 -224
3011 -224 -118 215 151 278 -219 134 40 70 -274 38 134 -241 -119 -180 -76 -211 285 -31 -190 37 162 6
3033 6 96 72 -47 58 212 -234 -41 -111 -240 5 -53 -12 40 -31 84 -93 -207 57 -75 -458 2 -125 128
3056 128 6 200 -62 -35 -291 -280 170 -86 149 -88 201 165 -242 -267 219 -5 8 -478 -26 367 -107 -44
3078 -44 209 -197 -150 29 -45 -101 74 28 -225 234 193 53 152 44 188 -186 -158 -32 -27 -16 181 86 330 3
3102 3 22 -179 346 -1 -284 156 149 -18 138 -92 -36 -12 -134 284 -33 175 -205 -181 -140 171 -40 -98 84
3125H4k02J99k19J50K23n76L51j54J42k82M57J97n54K75m2j09k01L16Pk14K30
3146G8k23K09k36L19Nk4p6K8J12K0l23j22K16RO00m24j79m7J75k10j05M25j62
3169F5J05j59k18M07m87K39q8M25k22j9k5j98K7J84k95J50j75M69k60j42j27N05
3191A61j2q6j43M71l73l44K98J89k54K71m03J11O5Kj34K86q4M1J27k03M06j64
3213B28j90l5m5K17R1m71L44K3j67J16j77J6O8m3k27K96m8K05m50J61j56L51Q5
3236A92o90N88l31L24j36j0Q9L13p4m7k75j30L39j75k8J40N5K80n40K67m52L72
3258G1J37p8j84K9l23M59l31N47r8l33K53r9j19L83l98L60m08J02l57J42K32J66
3280A53r8o4L26M2k06j15j80J20P8j27L20k72l3L11k74l6n6J55J38l04J40K79
$$ plain form
3125 84 -118 81 -138 12 235 -341 10 -144 -2 -284 173 370 -184 91 49 -60 -261 55 62 -152 78
3146 78 -145 64 -172 147 152 128 52 80 192 212 -111 -233 -17 -8 592 168 -11 -58 117 -93 -198 227 65
3169 65 170 11 -207 200 -287 -48 -136 289 67 48 23 -175 -148 36 -259 -109 -284 185 -75 -217 -344 161
3191 161 149 63 -80 391 18 -326 -28 161 -93 178 -225 -114 -49 -47 -181 105 21 62 189 -14 392 228
3213 228 38 3 -42 175 266 -205 139 162 -5 111 -66 -50 18 -25 -252 44 -4 201 -249 -88 -244 107 192
3236 192 -498 90 -241 83 -53 -63 26 339 265 218 -57 -187 152 -23 -51 89 144 424 -116 151 -301 71
3258 71 208 130 -54 -25 -348 111 -220 327 229 -104 149 50 -69 314 -84 276 -132 -30 -387 -245 -13 153
3280 153 55 -9 317 359 153 38 -142 -22 56 -71 249 -23 -56 255 -19 -55 -111 44 182 -122 18 297
3302B97k67K71m24L43j60k28K88J14j36l54L08j08m8j26K51k43L8l7L33l09K89
3323I2K5K43n45M73o40K73j28M62k31M2k0k6j3L9j98J40j35R9L2LJ14j59M28n98
3347b28K56l31J69L15j66l43L24k26L84n7P2k12j45M00j70Pl0q3R3k27O0q1J73
3370d6L7l06L29p7r8j73M37o6Q1J20j62k28L83k22J71r6j81J54j47o5M32j01n4
3393A22L86n30l5L5K01k2k81K96k70n8jj48J09J22P5R2l41L45n7J3n9L32n22L33
3417A37m01L72p3j15J65j9j43J34K9j39J65L1k7l15L11k08k4Q1J74P3k36J41n1
3440F2l4Oj25Q1j28K69q2O6q7J38ll43L68k32Q4L6kmk53J75O1m85O12j40j89O2
3466h7M3j33J68pL40k95k00R8j24K18J9J95l42m6j67R5J68RQ7L78m39J30K8Mj9
$$ plain form
3302 297 30 301 -123 220 60 -168 120 234 98 -256 52 -56 -104 -230 21 -222 -184 -221 112 -197 92
3323 92 117 360 -185 288 -352 -79 -207 255 24 66 46 20 7 46 -152 -12 -147 -48 -16 -13 101 -58 370 -228
3347 -228 28 -303 -134 181 15 -328 -4 -230 154 97 169 -43 -188 212 42 49 19 -64 29 -198 -138 -219 -46
3370 -46 -9 -315 14 -63 -161 -334 103 37 118 238 76 -152 231 9 180 84 -97 57 -90 -155 277 176 122
3393 122 508 -22 -57 -22 179 157 -124 172 -98 -156 -157 -305 -196 -74 1 93 -248 97 40 53 -6 326 -196 137
3417 137 -264 108 35 -80 85 66 -77 57 86 -53 112 143 116 -199 112 -96 -120 -39 135 208 -28 113 62
3440 62 28 34 -91 -10 -138 131 49 115 28 166 163 -180 188 -44 40 76 74 70 -183 -8 53 -432 180 40 -149 -87
3466 -87 -44 -177 -9 -16 324 29 -171 -73 -197 21 40 235 -107 -153 -320 -225 -57 -48 39 417 -22 108 136 140 121
3491A21l15l0P01l27l26J14J32Rj72J81N0q0j84L29K77k10l48j67M96m42L53J7
3513A79r9k5N3J97n76K89N9K9m09M75l23J35jJ65P0k32L4KJ80k73J4QJ29j60Q0
3538@P6j93J37JK86l51q4r3K09K97j64K30m19K36k63n5k20P40k96j27L02k7k91
3561f9L77l80k21J18J80J41po8j64p8k22L40M2j81J21P7j17M69k33q0k14K26Q7
3584A44n25K1M81K65n25J39j98M57j78o2l9m2R1o5P6j11j59J67j88J60J85j31
3606c7Q7k46L5J41L1o6M54J6n57r8L19p9J47j25J91k45j02J74j20J81k98K21j65
3629a41L79j82L5Lj41N7K06l01k0J37k80L18p7k2K7k43K40K1J60p8Q5j35j40r5
3653a87P1R2J96l33K69k79L55j71nJ00j31J9J20P0j56k68K59q9J49J22r5j29L40
$$ plain form
3491 121 -194 -224 477 150 -176 -62 70 79 -93 88 138 58 -126 203 480 270 -78 -245 251 -191 162 179
3513 179 80 55 108 305 -271 18 77 106 -303 172 -151 -16 -17 148 218 -14 20 22 202 -71 -57 -49 80 -80 0
3538 0 76 -117 20 21 307 -44 -128 -221 -12 285 121 351 -68 168 -95 -150 -370 370 74 -53 249 222 -69
3561 -69 308 -72 -293 -175 5 146 139 71 -93 -171 -393 -53 -11 -192 -71 6 -111 358 125 45 -169 57 144
3584 144 -381 -360 121 386 -139 0 -198 259 81 19 -20 -62 29 -36 40 -71 -230 -63 -251 -91 94 -37
3606 -37 50 -196 -161 -20 11 -55 399 415 -142 -240 79 0 147 22 213 -32 -134 40 -80 101 -197 24 -141
3629 -141 238 56 91 94 -47 10 216 -85 -105 32 -248 70 -7 -29 -2 -245 -5 16 176 98 183 48 -92 -187
3653 -187 -116 -24 172 -161 108 -171 184 13 8 108 -23 -4 116 186 30 -238 21 -68 81 203 108 -21 319
3676C19n49L50O6j54K30m32K22L07j85m59J87K84k34J69l54K16O8o5J07j43L22
3697B72l76K12lrk29K84r6k71J61J43j75j60J63r9R2K18K10r9m33N3k41L58l6
3720f1J91k63K59on4k93K98l47K6L72j7p3J30l82L36m02K57J07l52K57K06j00
3742H9o0K95k58k31J77J1N1j88J21K11l52K81k34L44j91k69J82r9K11l8K60k04
3764A09r5K1R0J99n46M07m67J88N4J25l34n8K59r5K32j11p3N3p1L49k8r3l57N71
3788C29n79L66K2m9J4rj78q4L56l05J29R1k04J64N7m06N36n43M18J58k31o1P5
3811F6j73J90k2j64L99l61J27q9K9J05J7j77K1J07l2o9j85M51j39k61L92j94k07
3834a69K65J18j69j21O0L4k6M26l35J13j18k46Q9J04l6k48K61n3mo4J1N4J42m0
$$ plain form
3676 319 -230 120 186 32 262 -170 52 359 174 -285 -98 186 -48 121 -233 -17 51 -14 93 -50 272
3697 272 -104 108 105 96 -133 151 55 -216 -55 88 -87 -247 -84 -183 -91 127 337 238 -195 -142 -383 -25 -61
3720 -61 130 -133 126 120 66 -227 71 -276 -250 122 105 32 162 -220 116 -286 -29 78 -274 -17 189 89
3742 89 29 324 66 -165 12 23 74 -114 7 218 -134 147 -87 257 66 -203 -21 -120 91 53 313 109
3764 109 14 35 125 324 -222 185 -282 -94 -40 85 -249 -307 -48 -143 89 -22 -95 -42 -113 236 208 115 -242 329
3788 329 -250 116 138 89 103 94 -84 -168 188 -117 12 103 -101 63 120 -286 250 -293 125 283 52 -9 66
3811 66 -107 83 61 -103 296 -65 62 -27 2 107 124 -53 -32 75 43 -26 -211 240 101 -160 232 38 -169
3834 -169 96 214 45 -76 -16 18 -8 418 83 196 78 -168 -79 25 -11 -259 2 -51 -55 -119 -108 -54 88 48
3858D8K05l76J20M2k12K7k6O61n60L0j7m0j52N5K18J4J31n53N27j32L07n20J60
3881d3J56k57Q5J94l01L78k81M4Q5m7rO4m6k46K89J11r2j19k5K86l75K60j0J41
3905B42o2k94l8L7J73J40k62J75k29J10O6K18m09J03M3K36k82j10M18l04J4R0
3927G5L9k52m3K09Jo7K05J94k48k48M85m76o7K20oJ93m0N6N5l28O4M2j50P8kJ52
3953A41j83Pj00j36K27o2K39l6m09L86J68n93L05J59k89K29j30J7j16K45m07M17
3975G9N3l39J55K30l55L52j59k34K23J79l0%k64K95j18k39L15k21J72k00k4J81
3997E1j05L45m9l32K89l48M87k61o5j25J67q5p8L75k73L9k20K33p7q2J90p6K03
4020B03l53K33J20k07J40k57k24N15j46K14l00LL59l49J20n3J46j80o2L22m01
$$ plain form
3858 48 253 -123 -3 39 -173 -146 -172 489 -71 -41 -58 -98 -250 -195 23 37 168 -385 142 10 317 -203 -43
3881 -43 113 -144 -59 135 -166 212 -69 -25 60 13 4 68 22 -224 65 176 84 -35 -60 226 -149 111 101 242
3905 242 180 -114 -152 -115 58 198 -64 111 -118 -8 58 276 -133 -30 13 249 -33 -143 275 -29 -15 75
3927 75 114 -138 -181 28 29 -38 167 361 113 -135 350 -126 -193 27 21 214 174 230 285 -43 21 63 -87 -9 -11 141
3953 141 -42 -35 -135 -271 -44 -106 133 97 -312 74 242 -351 -46 113 -176 53 -77 -60 -176 69 -338 79
3975 79 132 -207 -52 178 -177 175 16 -218 5 184 154 154 -110 185 67 -172 143 -78 94 -106 -130 51
3997 51 -54 291 242 -90 199 -149 338 77 12 -113 54 -31 -109 266 -7 32 -188 45 -32 -114 76 0 203
4020 203 -150 83 203 -4 136 -121 -345 170 24 238 -62 -59 300 -49 71 18 164 -16 -78 244 -157
4041a57p3O8O5Q1k5r6R7l97M28J69k33K1l6j45K61j56J41k3j17M8J83q0jQ0k52
4066a49N9K60l32K03l8Q6k67L03j84J48nM6l40L53L02l54P1j0l55K09o1M5J83
4089A73j37l8J20k93J43K4Q4r7K01jk74K52j58j1j63K08l6l01K69J6O0j37P0j07
4113a33L97l02J29n7L31k90m18J52J61k6K14M8Qj27k63K39q2QR3n1K29k61p7K71
4137A93k52l7O1J68n5p5r9j20M04k79J64k59J20J85l2N6j11r6r3J37j8J71k31
4160i8n3K93R2n52L87k04M61k68l17j17P54j24o04n1K50K39j32kk50n7L48l9l30
4183c74N43K86q7J8n90P49n99j86L87m65J06K77j28L28n90K15K87j60j29q1o2
4204b55O6K92j00K6k06K72K63j18m67L57J2l10K77j33J24r4k66JJ98K44j25K47
$$ plain form
4041 -157 -230 -162 -97 -16 -41 -137 -40 -437 -9 160 -73 -52 -88 -233 28 -128 13 -10 -127 -79 104 24 23 103 -149
4066 -149 -90 170 -162 41 3 89 -178 125 -59 89 84 130 -210 143 445 91 162 152 -203 6 -55 -10 173
4089 173 36 -2 118 -175 -32 -8 76 -21 180 179 -95 157 -1 -12 -175 33 -3 -304 -35 -19 41 -96 -26 -133
4113 -133 264 -38 91 34 365 75 -343 -191 -30 -56 158 206 214 87 -176 63 -19 -11 82 31 260 -1 -78 193
4137 193 -59 -96 -35 133 78 3 -96 -216 188 -91 73 -186 -66 119 87 143 32 -64 -157 -20 -38 133 -98
4160 -98 -151 142 234 -318 69 -135 326 58 -259 -376 378 254 -350 -401 -151 88 -44 -46 -296 -353 -5 -44 -374
4183 -374 169 455 368 386 -204 545 -54 -240 147 -318 -212 65 -63 265 -325 -110 177 17 -112 -193 -255
4204 -255 -189 103 3 29 -177 95 358 240 -227 130 142 -168 109 -24 100 6 -260 -259 -61 183 58 305
4226C05j62m4o0j55m8J55L53l66j99J44N00l54j5l8q2J52oj02j27j8K03M6o0Q5
4250A07o1k42L69j07p7j73l3L5l6l5N29j3j06N2l69P0L73k41J45k28j67j40K10
4273a38K88J36r9K8k70O3j05J26J7J97l44M55k17j16R0l91J90q9K79K84q3m29
4295a28J0K02K42k51k77L7J64p7J82pMr5k82L38P6j07m8L54k74J63j47K6k69P2
4319i2K03k46L37p67N30J54j25j77M6L62k18k87L19J18p1J19J09k60j11r8L0J50
4341B5M13p03M56j6j11k07K08J62k9l81j04K83Q3M5j21K00l15L02k68K72k58j38
4363b02L36j40J14M3l70L80k8j61p7J9P4k90K29j5Q4p1K44q8K4Q8k82J68j29q8
4387a38J76j65rK13P8K69n50J32l34L09L24j95n9r8r5J31J13j43M1n0J2K45P3
$$ plain form
4226 305 143 99 39 -116 -164 -9 344 -22 -221 -77 423 69 54 16 -66 86 80 -22 -149 -167 36 82 22 107
4250 107 46 -196 173 66 -11 -184 -217 -182 -218 -253 276 263 157 209 -160 -90 283 42 187 -41 -208 -348 -138
4273 -138 150 286 187 215 -55 8 -97 29 46 243 -101 354 137 21 111 -280 -90 -179 100 384 301 -128
4295 -128 -118 84 326 75 -202 -165 -1 -78 104 97 101 6 -276 62 138 31 -17 337 63 226 79 105 -164 -92
4319 -92 111 -135 202 -565 -35 119 -6 -183 -137 225 7 -280 39 157 86 205 314 54 -57 -155 -125 25
4341 25 438 -265 191 175 64 -143 65 227 198 -183 -287 -4 79 124 3 203 -112 190 -78 194 -64 -202
4363 -202 134 -6 108 151 -219 161 133 -28 -105 -86 -12 -302 -73 -88 -4 -75 169 81 105 193 -89 79 -50 -138
4387 -138 38 -127 -136 77 155 424 -126 6 -328 -19 305 110 51 -47 -142 -11 102 -41 0 -50 -38 207 280
4410B80n10L95p8J10p60O43k19J2M6j00K43k79K96k48k2m5K77Ml6j93L11J89l83
4433f7j0n8Q2j67L22k33J78j66J65j28J74j48M0L4jj5Q2k72J08k9K48m8m91M92
4457I2k62J06kQ3n9L36l93p3M02ok40n1J77k47j7K48k5l4K24l52N4m5m5L41m40
4482b28K50j21J8O5M0K21j83N5k63K55K6m42L48q4K30k13K96k80k06L89j99l5
4504f1k37L25J78j14L7P0L1J26l37m5j42J87j89L0l9L72P1l47J69j58r8M45n1
4527B23m61O8O9K16n1P7l64L99l51K21j77M0o3P2J99p6K60p04M3J59L76p8M3J40
4551B80k07l02K68r3n4L69l27k3k70L76o5k11M45n25L91k09Q6O1p7J79k54J05
4573e7K07k26J66j12O8K44o1l75K45N4ok38K13J5p1k5j67M6K93k70j67L17k92
$$ plain form
4410 280 -230 165 87 197 -563 80 -139 -127 -81 -181 62 -217 79 -169 -191 -236 41 45 9 -184 127 316 -67
4433 -67 -77 -135 -53 -220 102 -131 47 -119 46 -82 92 -56 -16 18 17 2 84 -188 -80 -109 139 91 -400 92
4457 92 -170 -64 -66 17 -42 294 -99 -172 230 224 -16 -67 110 -137 -154 94 69 35 259 -93 -39 -84 -129 212 -228
4482 -228 22 -99 -81 -16 24 245 62 117 -146 109 135 -307 41 -43 187 -26 270 -10 -216 173 -26 -61
4504 -61 -298 27 205 91 128 198 229 355 18 -27 -169 18 -171 -141 -180 192 263 -84 85 -73 -171 274 223
4527 223 -238 -170 -101 115 64 141 -223 176 -175 46 -131 -91 -154 -82 117 41 301 -403 -360 -201 175 97 140 280
4551 280 73 -229 39 -54 -108 261 -66 -89 -359 17 -48 -259 186 -339 52 -157 -71 -10 -87 92 -162 -57
4573 -57 150 -76 90 -22 46 290 229 -146 99 153 147 -91 122 137 66 41 -126 -80 213 -57 -224 93 -199
4596a99k8M16k41J60m34M7K91J6k34K53j55J18J81m76L99r9P2l94L26k58M62r
4618B14rk28k17R1L47m62J17J51o9K01R4k79j70K1k2J86J95k03j97L10R4k90N5
4641g0n9j42M03o2J6j65M2j40J45R0j27k4M5Q5j63L79k78N0J43l22L03J05j88
4664F6j19j57M2j09L29R4j26l8k06L01L09l52kN8J4M4m88M51j46R7p8l0J81l00
4688a65K28j84M25j53j42j6k37L69kkj72J01O9l66K19p3Pj05o3J98R8j45k7L27
4712A89J43k30L8j37Q4P5k36K00k86J74J99K26m11j69O3j99L10j15k15L74J46
4733B23K19k55k49K45O6k19Qj50O2j1L71j88L2l3k0M1o2J29j16o7k5R6m21J87
4757a37R8P8M36m02R2k27k4K40l67PK54k94M3J39O5Jj16j86N67l99M01l03p4j03
$$ plain form
4596 -199 -227 189 -52 108 -326 -279 12 28 -206 47 -108 10 191 -285 114 15 87 -307 19 -239 223 214
4618 214 205 -23 -240 -149 198 -264 -147 4 -65 136 230 -49 -219 -198 -220 -34 161 -42 -239 71 165 -125 -70
4641 -70 -129 -271 132 70 86 -79 -37 -177 -32 58 -69 -93 -48 37 -126 253 -25 25 168 -154 149 254 66
4664 66 -53 -210 -168 -277 52 146 20 -18 -224 77 386 34 32 90 104 148 -340 111 -35 62 -16 -46 135 -165
4688 -165 63 -121 304 151 9 -7 -244 125 123 121 -51 50 119 -247 -28 -101 -94 -199 -262 -64 34 -111 -138 189
4712 189 332 102 140 3 87 162 -74 126 -160 14 213 439 28 -141 -78 -277 33 -82 -297 77 223
4733 223 442 187 -62 183 249 30 38 -112 -50 -61 310 122 154 121 101 142 80 209 93 26 1 97 -324 -137
4757 -137 -39 39 475 73 165 -62 -86 154 -213 -206 48 -246 -203 -64 1 2 -114 -300 267 -132 269 -34 -108 -211
4781b11K29J86k90L19k33J62N6j86n08J67L64J6k78J77J06o4J86m77K65j89Q0
4802a23KK76l05NK92j63K9k81M83j73jO1j46k5j3j29J50K42k54q0O8J33j8Q0k84
4827a74J99P4j16m4k4j44M44q7j43lN9j31M17l56O3l6n0J72j66J40k46j12K32
4850c2P9r9M05o72K74j17J47J24m51L77J91k51m20M28J08j49k32M26j76k56L02
4871Fm3j58J1K83N7j39j91L48p3m4j92K77J5K5o7o8k12K1K95k41K14K2k17j46
4895b17J31j53J60J71j26pK53o6O1k31m3L1K11j38Q1m54M9J51J26j7q4J30J67
4918A86k29k63K98j09K17j37Jl11J79J44K93n22M78j70L5j34k17M08m94K23M32
4939C08m22k0L01l54J40j25J17l6Q3n5K01m7k58m3J93J48o2L3q6J55k1j74l06
$$ plain form
4781 -211 18 204 -86 233 0 162 218 32 -476 -309 55 71 -207 -30 76 12 198 -279 -14 -203 -123
4802 -123 -121 155 -150 -145 147 -16 13 -268 215 42 41 102 -44 -69 -82 -211 -61 181 -73 -153 -85 48 30 110 -174
4827 -174 25 99 -17 -61 -85 -229 215 128 -15 -18 41 -90 327 -29 34 -2 -52 120 -46 94 -152 -264 -32
4850 -32 47 -52 353 -319 -45 -162 -15 109 -342 35 226 -25 -445 -17 91 -58 -290 136 -40 -296 6
4871 6 -37 -195 -184 99 156 17 -174 174 101 57 -135 142 157 182 115 47 -165 -144 151 -90 124 146 -71 -217
4895 -217 -86 -239 -79 92 -34 -41 212 146 207 -24 -67 -36 175 37 118 -336 -287 -136 -10 -27 -111 19 186
4918 186 -43 -306 -8 -117 100 -37 -36 -347 -168 -24 269 -253 225 55 90 -44 -261 147 -347 -124 308
4939 308 -114 -134 167 -187 -47 -172 -55 -91 -8 -63 138 91 -167 -210 -17 131 69 102 16 171 150 -24 -330
4962c30L45MJ55j8j36qj13l21L44k53L68M9M0k11Jj16K63L8k38M01k27m6j25M43
4986C09m40k8n4M52k60j05L36j42J14k27K98l00J99J10j49l52L48k38R0L97m74
5007a16J86k9J90k61PL60Q0k35m3k50J38j45J52k24J59j13j0K37M2k71M12k71
5029ej58K49k78R4R3j16j71J99J19q1j62K35J15m11q3M48l5j26j25K81Q3k04K06
5052A67l03K33p1J70j90o8p8K43j36j59J19nN6O8q1j57J07L52k45O8k48J66j29
5075a21J9K19qk30j13L76K1k7n02P5N41m84p8L84k73p2K92N6j5l16K07j14J35
5098b8J68k43J99M3J41l06j91J55j69K83l61J02J93J02J04j86J28k96Q3n7q7K86
5120F3n1OK6l08K64R4Q3p0q2Jj27O1j56pJ80m1j61K94n7J80p6n4J66j71k00K65
$$ plain form
4962 -330 15 19 174 156 20 12 -101 -422 -78 -331 37 86 126 -85 -84 -200 63 101 -137 264 37 -9 -134 309
4986 309 -131 -159 -213 239 -21 -126 210 68 182 -45 253 -47 152 262 113 -239 109 -129 -39 358 -116
5007 -116 70 41 231 -30 -23 337 417 182 139 -111 27 -118 34 -190 -31 -144 -154 83 125 -146 266 -5
5029 -5 -163 86 -192 -98 -5 -121 -292 -93 26 -55 -217 18 133 -278 -361 87 52 -74 -199 82 165 -39 167
5052 167 -136 97 26 196 6 -62 -140 103 -33 -192 -73 -78 -22 46 -35 -192 -85 267 22 90 -158 8 -121
5075 -121 -102 117 109 -121 -234 142 163 136 -366 -291 250 -234 -312 72 -201 -273 19 75 60 -256 -49 -163 -28
5098 -28 140 -103 96 139 280 -26 -217 -62 -231 52 -309 -207 -14 88 192 6 134 -162 -79 -136 -223 63
5120 63 12 18 44 -264 0 94 177 107 25 26 -101 -40 -196 -203 -23 -64 -225 69 12 192 116 62 228 57 -143 122
5146A22l68M09q3l11M33p2OJ11j39J23j14Q9l27O6o0K94P4k5j59jj31K55Jj09
5170H4l75L38K2J50j5m1l70j4Q8K81n7j50K85o3J94k2m19R3l3J06j68j73K43M7
5194C1K9Q2k88K26l08L40k16K32k33L66J7l74K47l58J33k8L7M0P3l46L96m20M22
5217A00N9k36J33k45M28k15J21M0l31L19k3P8n3k67J65j71J34JK2J70m18J79K20
5240B10k51J58o9P5K2k92J76J05k93M04j86M4j82r0J92M9J12m85L93k46M0L69
5262B55j71J35k35LL55j41j06l6j72r0M99l72N0k16N61k27j29P7o5J43N3j68o
5285co6L55k71j75K32k45N66j38l97j90K84m8r1L04j13K5qP3r7O4K87j13k7j69
5309C9M23o03K97j27n8Q1j22J64j79j03L08J91o9k73N5K85m31J79Q6K9N9j46l4
$$ plain form
5146 122 -246 163 80 -231 202 130 136 247 108 231 117 206 -121 -55 -115 179 253 228 69 68 -63 192 193 84
5170 84 -291 47 69 219 204 163 -207 -221 -133 148 91 -59 226 163 357 335 -84 9 -24 82 -86 -259 -16 31
5194 31 60 142 -146 80 -228 112 -104 128 -105 261 278 -96 151 -207 -74 -102 -65 -25 48 -298 98 -322 100
5217 100 159 -77 56 -189 239 24 145 185 -146 173 150 228 175 -92 73 -98 36 37 59 229 -189 -10 210
5240 210 -41 117 48 123 145 -147 29 134 -159 245 59 103 -79 -169 23 72 184 -301 92 -154 -114 255
5262 255 84 219 -16 -13 342 201 95 59 -113 -203 296 -76 -26 -242 319 92 -37 40 -25 118 171 3 -3
5285 -3 -69 286 15 -160 72 -173 393 255 -142 -332 -48 -96 -187 117 4 29 21 94 -3 61 348 235 208 39
5309 39 462 -141 156 29 -29 52 -70 94 -85 -188 120 311 242 -31 24 309 -122 57 143 172 231 85 51
5332E1p2j20K64J71Q9l54Q9j59J84p1j24j03L26m51M50l67J66L5M1J60j31o4K
5355A2j03K34J34j33j28Q6j94K03L3j66j42J06j17J17K9j42j54O17J07q03L23
5376h1K31K86n8n58L2K58J95m61O70m70J12j47k17J96J51k98K37M1m6j7j26K22
5398A52k95L71n05M76j66m1j69K7l8R5K0M0j69K03k13J01K61k93J70J54k52N4
5420a7j22j61N17k91l5j06k1L15j15j53K15p8K80k68q0M0K93K19n57J23oj1Q3
5443F4n0r8J74j07j97M48l22J70k91J36K05n28M89J6j56Rj10M28j64k60k4K65
5465I7Nk37K61kQ4k11ok73N06Pl35M8R1P9j78O0j18J77k24L01n3P0pl57R0K4J31
5492C0K09k86Q7q2M5j33p2J05J94k26p9r3L29K62k83O2j19K20j58l26L71k5k24
$$ plain form
5332 51 -21 -141 123 294 383 29 118 -41 143 72 -52 -155 171 -280 170 -197 -31 4 45 205 74 10 12
5355 12 -91 143 277 144 16 102 -92 111 144 -22 -164 -58 -175 -58 -29 -171 -325 292 399 -404 -81
5376 -81 150 436 378 -180 -148 110 305 -156 514 44 156 9 -208 -12 139 -159 78 119 73 56 -70 152
5398 152 -143 228 -277 199 33 -8 -177 -150 -188 -93 -73 -33 -202 1 -212 -111 150 -143 27 181 -71 -17
5420 -17 -139 -300 217 -74 -109 -215 -236 79 -36 -189 26 -52 228 -40 -120 -80 213 432 -125 -2 -8 -19 64
5443 64 14 -84 90 -17 -214 234 -88 82 -209 -73 132 -396 93 109 -47 -38 -148 280 116 -144 -168 97
5465 97 102 -135 126 124 208 -3 -9 -282 224 231 -104 -56 35 114 -64 -4 -122 55 -169 132 79 149 142 -215 -125 -101 30
5492 30 239 -47 40 -42 3 -130 -202 -97 97 -129 -208 -301 28 290 7 69 -50 170 12 -314 57 32 -192
5515a92M16j19j53J13j83k95N37j62J50j59M5J80k18Q0J66j33L0k78K50l72J62
5536a35J95n5O1l57K45k76J42m0M5J33L0l04N75k41J30k37J93k4pm1N9P5j87J9
5560bK87j91j46o1K28J80l26j0o8O21o95K01k23K04j25PJ20J12k24K13k74J34
5582c8k7mO2L11l75M9k49L00R3k2j65m8L11l06J1J75M7l01J07J0P3J75l34L69
5606B24l15k17m2M82k40L00j45M6k07JL55k79m1M82j23k25m99L52j77M13j84M3
5628Dk9R4j32K3R3n63M44L32k72j77L41j46m17N38o2L5j64n6J08K23j19L9m4p4
5652A9n1j4J30n5j51j25J96J61l28J30K69J61j51j90j34J47m2p9L32J08m20J02
5674A5J30l61K51O4k04Lj05J58j09K3L16l29L24k50R4J95j11k43J81N7l27K62
$$ plain form
5515 -192 224 105 -48 65 -118 -413 124 -38 112 -47 -2 178 -40 40 206 73 103 -175 75 -297 -135
5536 -135 60 5 66 -291 -46 -322 -180 -220 -175 -42 -12 -316 259 18 148 -89 104 80 73 32 91 166 -21 -2
5560 -2 285 94 -52 -113 115 295 -31 -41 -109 512 -183 18 -205 -1 -126 -119 1 113 -111 102 -172 -38
5582 -38 -65 -69 -7 304 -71 -22 -271 29 122 100 -65 -113 198 -108 -97 78 125 -176 -69 -59 14 189 -145 224
5606 224 -91 -308 -350 132 -108 192 47 93 -114 -113 242 -37 -78 404 281 56 -443 -91 -268 145 -39 4
5628 4 -25 69 -63 -40 53 -510 -66 266 -6 -183 158 12 -405 133 71 106 -58 -114 -6 217 98 137 93 19
5652 19 -32 -46 84 29 -122 -247 -51 110 -218 -88 181 342 191 1 -133 14 -28 -107 225 333 -87 15
5674 15 145 -216 35 99 -105 -102 -207 -49 -158 -135 181 -148 176 -74 20 215 104 -139 42 99 -228 34
5696C4k2Rj70K76j05J54j70j87Q7N0j84J82L13l21rK91m39K89K99n86J50M0J79
5719A60j24j72j5J00r3K48j65k52K45O3N0j01K20j06n1P5N5J42n53L43j70O1O5
5742B5j15j7Q7j24K82P3j0Jl5k67j8L09M0k7k88J42J65l03j67J24L39o5k64L1
5766h2K02m67J42o5J73P2kR1j68j53Q35p26Q4L52l16N7M21o32K20Q0j55K3K36
5789B22j44l40L15j94K80L9O3j03k95L37j17OJ70r3j89p7j5L20j37k5o9l67N62
5812A49j99P7P8O9l35K36j12J4m0j7M9qN6L54l19M0j63O5j06K80j68j70J11J43
5836H4m3j50J10k14N21l86j91L42k38K21J12J09l87J14J29r1N6j00J05l7n9N22
5858E29m37N3j87L08l94M1K68l3q0j47K16j07k65j25N16L9m04M34k96j95J03J89
$$ plain form
5696 34 12 21 -149 127 22 176 6 -181 -94 -44 -228 -46 267 -54 -63 228 -211 78 377 -209 -59 -19 160
5719 160 36 -136 -151 -51 -144 104 -61 -313 -68 -5 45 -56 164 58 7 82 137 279 -274 69 -101 -40 25
5742 25 -90 -107 -20 -144 138 211 201 202 167 -100 -118 191 231 204 -84 58 223 -80 -247 -123 216 151 -113 -82
5766 -82 120 -347 -205 -270 -97 -25 -27 64 -104 -257 578 -148 -64 288 -28 29 450 -182 38 118 -37 -14 222
5789 222 78 -262 53 -141 139 178 241 138 -157 180 63 69 239 146 -43 -120 -135 185 48 23 -46 -413 149
5812 149 -50 27 105 174 -161 75 -37 -23 -63 -80 -31 -39 17 371 52 92 -71 -6 -112 168 0 -170 -59 84
5836 84 41 -109 1 -213 308 -78 -269 73 -165 56 168 277 -110 4 133 42 98 -2 103 66 7 529
5858 529 92 145 -42 266 -128 -87 181 148 68 -79 137 30 -235 -360 156 195 -209 225 -71 -266 -163 26
5880B6J25l28J42K10K28n53K03P6j33j02J82J0l88K50K73m2l50K58q7RK5K98j13
5903B19m72L17l72N03l17R6j4Q2Q7l00J20O0K68l47k86L78jQj29k6j54L49K0m7
5927D2k05K68m59M3K39K91j72P9k94l7J90k8k9K98j03k29n7J03m5K98j16l79N43
5950B41%l17J24j61N1p9j34L0J82j4P1j36K19o8l32N64l55J1j05L56k91J3K53
5973A23j7n7j74L38l88J12J03P0m32N18j75k01L4o8J59L8LP2o9M9M9r0J7l4K67
5998B47q3j67l9k81K21L03N3M4k80j43N4m7J49J67m40J50L68l47P12m88j55L4
6020C2Po8j68K31L4j26O8Q4O8q2j03n2L43k3r20O67P3K9j60k7L44k95K53l70M82
$$ plain form
5880 26 151 -177 -35 175 403 -150 53 129 -4 -106 76 86 -302 -52 221 179 -171 87 0 9 34 332 219
5903 219 -253 64 -308 195 -122 -26 -40 42 129 -171 -51 9 277 -70 -356 22 21 29 -100 -126 -280 69 89 42
5927 42 -163 105 -354 -311 -72 219 47 126 -168 -205 -15 -43 -72 226 123 -106 -163 -60 -105 193 77 -302 241
5950 241 241 -76 48 -113 -62 -141 -275 -245 -63 -77 -6 -142 77 9 -323 241 -114 -103 -208 148 -143 -130 123
5973 123 106 49 -125 213 -175 -63 40 110 -322 196 21 -180 -146 -214 -55 -17 -14 58 -11 38 87 -3 14 -20 247
5998 247 164 -3 -42 -323 -102 201 254 298 18 -125 -71 -118 31 198 -242 -92 276 -71 641 153 -2 32
6020 32 39 -29 -197 34 68 -58 10 94 162 80 -23 -75 268 245 -675 -8 65 94 -66 -93 251 -44 209 -161 321
$$ [...]
8191B17
##END NTUPLES=NMR FID
##END=
