##TITLE=1H_Ser DOTAP
 CDCl3
 8 sc, 
 31.05.2022
##JCAMPDX= 6.0         $$ Bruker NMR JCAMP-DX V2.0
##DATA TYPE= NMR FID
##DATA CLASS= NTUPLES
##ORIGIN= UXNMR, Bruker Analytische Messtechnik GmbH
##OWNER= root
$$ XWIN-NMR		Version 3.5
$$ Tue May 31 16:06:07 2022 Russian Standard Time (UT+4h)  she@DPX200
##.OBSERVE FREQUENCY= 200.1313499996
##.OBSERVE NUCLEUS= ^1H
##.DELAY= (6, 6)
##.ACQUISITION MODE= SIMULTANEOUS
##.ACQUISITION SCHEME= undefined
##.AVERAGES= 8
##.DIGITISER RES= 18
##SPECTROMETER/DATA SYSTEM= spect
##.PULSE SEQUENCE= zg30
##.SOLVENT NAME= CDCl3
##.SHIFT REFERENCE= (INTERNAL, CDCl3, 0, 15.7039)
##AUDIT TRAIL= $$ (NUMBER, WHEN, WHO, WHERE, WHAT)
$$ ##TITLE= Audit trail, XWIN-NMR		Version 3.5
$$ ##JCAMPDX= 5.01
$$ ##ORIGIN= Bruker BioSpin GmbH
$$ ##OWNER= she
$$ F:/spectra/data/she/nmr/H-F/1/audita.txt
$$ ##AUDIT TRAIL=  $$ (NUMBER, WHEN, WHO, WHERE, WHAT)
(   1,<2022-05-31 16:05:05.62 +0400>,<she>,<DPX200>,
      <created by zg, POWCHK disabled, PULCHK disabled
       configuration hash MD5:
       00 E9 B6 7A A2 85 ED C7 34 08 36 98 17 FE 4E 26
       data hash MD5: 16K
       07 51 40 7C 40 BF 7B 82 E2 AF 6E E3 65 9E FA 27>)
$$ ##END=
$$ 
$$ hash MD5
$$ 00 5D 07 4F 0C AB 84 E7 F6 7D 36 6D C7 01 72 D3
##$RELAX= 
##$RELAX= 
##$RELAX= 
##$RELAX= 
##$RELAX= 
##$RELAX= 
$$ Bruker specific parameters
$$ --------------------------
##$DU= <F:/spectra>
##$EXPNO= 1
##$NAME= <H-F>
##$PROCNO= 1
##$TYPE= <nmr>
##$USER= <she>
##$AMP= (0..31)
100 100 100 100 100 100 100 100 100 100 100 100 100 100 100 100 100 100 
100 100 100 100 100 100 100 100 100 100 100 100 100 100 
##$AQSEQ= 0
##$AQ_mod= 1
##$AUNM= <au_zg>
##$AUTOPOS= <>
##$BF1= 200.13
##$BF2= 200.13
##$BF3= 200.13
##$BF4= 200.13
##$BF5= 200.13
##$BF6= 200.13
##$BF7= 200.13
##$BF8= 200.13
##$BYTORDA= 1
##$CFDGTYP= 0
##$CFRGTYP= 5
##$CHEMSTR= <none>
##$CNST= (0..31)
1 1 145 1 1 1 1 1 1 1 1 1 1 1 1 1 1 1 1 1 1 1 1 1 1 1 1 1 1 1 1 1 
##$CPDPRG= <>
##$CPDPRG1= <>
##$CPDPRG2= <>
##$CPDPRG3= <>
##$CPDPRG4= <mlev>
##$CPDPRG5= <mlev>
##$CPDPRG6= <mlev>
##$CPDPRG7= <mlev>
##$CPDPRG8= <mlev>
##$CPDPRGB= <>
##$CPDPRGT= <>
##$D= (0..31)
0 1.2 0 0 0 0 0 0 0 0.06 0 0.03 0 0 0 0 0.0002 0 0 0 0 0 0 0 0 0 0 0 0 
0 0 0 
##$DATE= 1653998704
##$DBL= (0..7)
120 120 120 120 120 120 120 120 
##$DBP= (0..7)
150 150 150 150 150 150 150 150 
##$DBP07= 0
##$DBPNAM0= <>
##$DBPNAM1= <>
##$DBPNAM2= <>
##$DBPNAM3= <>
##$DBPNAM4= <>
##$DBPNAM5= <>
##$DBPNAM6= <>
##$DBPNAM7= <>
##$DBPOAL= (0..7)
0.5 0.5 0.5 0.5 0.5 0.5 0.5 0.5 
##$DBPOFFS= (0..7)
0 0 0 0 0 0 0 0 
##$DE= 6
##$DECBNUC= <off>
##$DECIM= 32
##$DECNUC= <off>
##$DECSTAT= 4
##$DIGMOD= 1
##$DIGTYP= 9
##$DL= (0..7)
0 120 120 120 120 120 120 120 
##$DP= (0..7)
150 150 150 150 150 150 150 150 
##$DP07= 0
##$DPNAME0= <>
##$DPNAME1= <>
##$DPNAME2= <>
##$DPNAME3= <>
##$DPNAME4= <>
##$DPNAME5= <>
##$DPNAME6= <>
##$DPNAME7= <>
##$DPOAL= (0..7)
0.5 0.5 0.5 0.5 0.5 0.5 0.5 0.5 
##$DPOFFS= (0..7)
0 0 0 0 0 0 0 0 
##$DQDMODE= 0
##$DR= 18
##$DS= 0
##$DSLIST= <SSSSSSSSSSSSSSS>
$$ [...]
##$SUBNAM2= <"">
##$SUBNAM3= <"">
##$SUBNAM4= <"">
##$SUBNAM5= <"">
##$SUBNAM6= <"">
##$SUBNAM7= <"">
##$SUBNAM8= <"">
##$SUBNAM9= <"">
##$SW= 18.0517283424761
##$SWIBOX= (0..15)
0 0 2 0 0 0 0 0 0 0 0 0 0 0 0 0 
##$SW_h= 3612.71676300578
##$TD= 16384
##$TD0= 1
##$TE= 0
##$TE2= 300
##$TE3= 300
##$TEG= 300
##$TL= (0..7)
0 120 120 120 120 120 120 120 
##$TP= (0..7)
150 150 150 150 150 150 150 150 
##$TP07= 0
##$TPNAME0= <>
##$TPNAME1= <>
##$TPNAME2= <>
##$TPNAME3= <>
##$TPNAME4= <>
##$TPNAME5= <>
##$TPNAME6= <>
##$TPNAME7= <>
##$TPOAL= (0..7)
0.5 0.5 0.5 0.5 0.5 0.5 0.5 0.5 
##$TPOFFS= (0..7)
0 0 0 0 0 0 0 0 
##$TUNHIN= 0
##$TUNHOUT= 0
##$TUNXOUT= 0
##$USERA1= <user>
##$USERA2= <user>
##$USERA3= <user>
##$USERA4= <user>
##$USERA5= <user>
##$V9= 5
##$VALIST= <valist>
##$VCLIST= <CCCCCCCCCCCCCCC>
##$VD= 0
##$VDLIST= <DDDDDDDDDDDDDDD>
##$VPLIST= <PPPPPPPPPPPPPPP>
##$VTLIST= <TTTTTTTTTTTTTTT>
##$WBST= 1024
##$WBSW= 4
##$XGAIN= (0..3)
0 0 0 0 
##$XL= 0
##$YL= 0
##$YMAX_a= 221713
##$YMIN_a= -262144
##$ZGOPTNS= <>
##$ZL1= 120
##$ZL2= 120
##$ZL3= 120
##$ZL4= 120
##$ABSF1= 10
##$ABSF2= 0
##$ABSG= 5
##$ABSL= 3
##$ALPHA= 0
##$AQORDER= 0
##$ASSFAC= 0
##$ASSFACI= 0
##$ASSFACX= 0
##$ASSWID= 0
##$AUNMP= <proc_1d>
##$AZFE= 0.1
##$AZFW= 0.1
##$BCFW= 1
##$BC_mod= 2
##$BYTORDP= 1
##$COROFFS= 0
##$CY= 11.3945322036743
##$DATMOD= 1
##$DC= 2
##$DFILT= <>
##$DTYPP= 0
##$F1P= 2.36226072786647
##$F2P= -0.459571619588291
##$FCOR= 0.5
##$FTSIZE= 0
##$FT_mod= 4
##$GAMMA= 1
##$GB= 0.15
##$INTBC= 1
##$INTSCL= 1
##$ISEN= 128
##$LB= 0.24
##$LEV0= 0
##$LPBIN= 0
##$MAXI= 10000
##$MC2= 0
##$MEAN= 0
##$ME_mod= 0
##$MI= 1.114404
##$NCOEF= 0
##$NC_proc= 0
##$NLEV= 6
##$NOISF1= 3.799351
##$NOISF2= 2.8
##$NSP= 1
##$NTH_PI= 0
##$NZP= 0
##$OFFSET= 15.70392
##$PC= 1
##$PHC0= -18033.81
##$PHC1= 11.00074
##$PH_mod= 1
##$PKNL= yes
##$PPARMOD= 0
##$PSCAL= 0
##$PSIGN= 0
##$REVERSE= no
##$SF= 200.130013532006
##$SI= 16384
##$SIGF1= 3
##$SIGF2= 2
##$SINO= 400
##$SIOLD= 16384
##$SREGLST= <1H.CDCl3>
##$SSB= 0
##$STSI= 0
##$STSR= 0
##$SW_p= 3612.71676300578
##$SYMM= 0
##$S_DEV= 0
##$TDeff= 0
##$TDoff= 0
##$TI= <>
##$TILT= no
##$TM1= 0
##$TM2= 0
##$TOPLEV= 0
##$USERP1= <user>
##$USERP2= <user>
##$USERP3= <user>
##$USERP4= <user>
##$USERP5= <user>
##$WDW= 1
##$XDIM= 8192
##$YMAX_p= 0
##$YMIN_p= 0
$$ End of Bruker specific parameters
$$ ---------------------------------
##NTUPLES= NMR FID
##VAR_NAME=  TIME,          FID/REAL,        FID/IMAG
##SYMBOL=    X,             R,               I
##VAR_TYPE=  INDEPENDENT,   DEPENDENT,       DEPENDENT
##VAR_FORM=  AFFN,          ASDF,            ASDF
##VAR_DIM=   8192,          8192,            8192
##UNITS=     SECONDS,       ARBITRARY UNITS, ARBITRARY UNITS
##FACTOR=    0.0002768,     1,               1
##FIRST=     0,             0,               0
##LAST=      2.2672688,     0,               0
##MIN=       0,             -262144,         0
##MAX=       2.2672688,     221713,          0
$$ Real data points
##PAGE= N=1
##DATA TABLE= (X++(R..R)), XYDATA
0@%%%%%%%%%%%Qj6J6j6K4l2L9m7N6o6P4q9J12j35J53j77K08k40K76l17L62m13
33b20M68n29N97o71P54q46R47j056J173j302J443j596J763j947K151k374K615
50A370k879L172l495L854m255M702n208N789o458P236q159R275j0655J2410j4731
65h032J7965k2809L0950m8019J47256k17009j04798M26209j88275k47527K44974
76C0885R7109k41798R8743J11467j53746L8237J56666j77148o3325K09090o5728
87D0452k15042J64558J40099j96506l1083K10530o2705j45684J31645N0616j65446
98g8566N2961J14186j50120k6603J90961q4240j43100J87027N0450k10006P8852
109a8198J46852j78865l4291J77249j11720r5678K01887l5967j91065J75626J03221
$$ y = [0, 0, 0, 0, 0, 0, 0, 0, 0, 0, 0, 0, 8, -8, 8, -8, 16, -16, 23, -24, 32, -34, 40, -49, 63, -72, 81, -96, 112, -128, 148, -169, 193, -220, 248, -281, 316, -355, 399, -447, 500, -556, 617, -685, 758, -838, 925, -1022, 1129, -1245, 1370, -1509, 1663, -1832, 2022, -2233, 2469, -2739, 3050, -3408, 3828, -4331, 4944, -5711, 6699, -8032, 9933, -12876, 18074, -29945, 117311, -99698, -204496, 221713, 33438, -214089, 30885, 127994, -113804, -15061, 96406, -57340, -19103, 137563, -39585, -102910, 106180, 40452, -174590, -10032, 130067, -66439, -97522, 113008, 50303, -95381, 36264, 86880, -78566, -25605, 88581, -61539, -88142, 102819, 18579, -124521, 62506, 112956, -97050, -18198, 128654, -50211, -84502, 92747, -18973, -114651, 87236, 51269, -139796, 35830, 139051]
120A39051k48803L3122K40232j54598j61733K07256L6902k02747O3750J44263
130I6695j04463m7345J06541l0736o3920P8528k935r0237O9503N5673j32967j679
142f7342J55169o6362j24979J38306O9248j68744R255J44283q6361q1856J13436
153C4053j1059q9631Q2692J9120r6584P4962O5909j28665J0213J30195r3472q7089
165h9356J30165N662j22361O7269P3022r4417N784Q8114o5342m5705R2767j5601
177C0001r6866N8225O3993q9591k1298R8718j3400p2091M8682L6091o1584L734
189a5386M1067m6067o458O2828m3683m7515R1626J1482j03376M7681Q6657r0686
201a1830m5479R5549j4117p4198M9407K7541n1409K5145K6985n0874K0318M8212
$$ y = [139051, -109752, -76630, 163602, 9004, -152729, 54527, 91429, -111318, -47568, 96695, -7768, -55113, 51428, 20692, -43228, 35300, 32365, -57872, 11631, 67304, -65663, -67342, 87827, 21465, -103514, 34792, 104040, -64704, -55449, 88834, 2473, -79383, 34053, 22994, -66637, 16055, 35175, -61409, 13553, 79462, -49203, -38990, 91205, -2267, -89356, 40809, 46471, -75890, -8621, 64401, -30016, -24232, 63882, -1460, -47165, 45602, 30001, -66865, -8640, 55353, -34238, -55536, 43182, 29782, -42309, 6373, 42464, -19120, -15386, 25681, -20386, -26844, 35984, -7699, -55214, 36412, 47894, -55482, -7801, 78856, -11830, -57309, 38240, 24123, -50075, -668, 26873, -24536, 609, 27594, -23280, -2962, 45250]
213D5250o1759k1998P5203k2544p0187N3080M3716o3568n231O0932j9925l7548
225b4579L5523Q558l5686J3735J8858l2994J537L7426k3066k4457M6052N868n1710
238b4935K0046L9190m3485j7280M6321j4355l4951L4627P821l5800K5773K3010
250B5982m3115O042M2190l6709k6677M9584j053m5746K4050K8772l1371l123K7863
263A6689j2592q699J8653j3835j5257K5824j906l3237J8931L0662k9730j7896
275b2393L7017N715l5921N233K5629j4410j4028J1924j32m300R333o269p334K3523
289A3587K501l1981Q972K9488k3974k1778L1024Q128k7853N215J6417r236l06
302B04O754r087L153J1273j9302j0904K5869R06k5939J1497K1462j6576j1929
$$ y = [45250, -16509, -38507, 36696, 14152, -56035, -2955, 40761, -22807, -28038, 32894, 12969, -24579, 10944, 19502, -16184, -2449, 16409, -16585, -15048, 22378, -688, -25145, 20907, 26775, -24935, -4889, 34301, -9184, -26464, 19857, 5502, -29449, 5178, 12999, -22801, 2972, 25982, -17133, -11091, 31099, -5610, -32287, 17297, 16244, -29502, -5452, 23320, -8051, -11174, 16689, 4097, -4602, 14051, 216, -15041, 10783, 8877, -24360, -5429, 25233, -4497, -22393, 14624, 20339, -15582, -10349, 15280, 870, -13158, -1234, -1366, -5666, 3667, -2602, -9936, 13587, 16088, -15893, -6921, 22567, -1407, -23185, 7839, 15967, -11886, -6671, 9746, 510, 204, 6958, -2129, 1024, 12297, -7005, -17909, 7960, 8866, -17073, -5576, 15886, -690, -12619]
315a2619J5258M412q576M87L49k088N022l159r180J1014J2254j3870p294J6781
329H791K228j8066K04J5374l625j1600L791N625j852k065k494K661R479n163j3626
344a0338Q387J0887j4007q189J7293M530j4635P70R450j822k515q02m37P604j42
359F034j4149L142J5093q048j2528J3302Q887j3528m715R045Q36m391j372l3M782
374B357J536j0134j611J3053j87j2756M157J2716p668j1203Q187P377o459k676
388c311N025P84o71j485m389M548Q665q376q907J3401L898j8635K413J8013p679
403C294j1800J0289K350q837K830K282m259P163R63j3511N545J3936j3287q653
417a1695J9192K231j8119L046J3878o739p222O983J919l127J867l024k933R187
$$ y = [-12619, 2639, 7051, -1525, -1038, -689, -2777, 2245, -914, -10094, 920, 13174, -696, -7990, 8791, 11019, -7047, -6843, 8531, 4906, -6694, -2903, 2722, 870, -1195, -3689, -1028, 8451, 3288, -10338, -1951, 8936, -5071, -13260, 4033, 8563, -6072, -5302, 4148, 2326, -189, -991, -1428, 6176, 6034, -8115, -4973, 10120, 2072, -10456, 2846, 11733, -1795, -6510, 2535, 3371, -1020, -2392, -2425, 2357, 3893, -6241, -7852, 5201, 5014, -7742, -3585, 9131, 1463, -9740, -1553, 5824, -635, -3311, 1714, 2498, 1827, 342, -4047, 501, 9166, 790, -8117, 5284, 9182, -9453, -7040, 10973, 3294, -8506, 1783, 4133, -4704, -1874, 408, -3851, 3312, 4275, -9236, -3691, 10245, -3042, -11695, 7497, 9728, -8391, -5345, 8533, 1794, -5428, 1555, 3474, 347, 2214, -810, -3743, 5444]
431E444J94j3986M626J6205j1633j5134J6794R321j9846j887J8006m846j0331
444g073P361km163Q502m437r746J5447N789k3461K694K5076j2030j8563J8647
458D041Q838j7638j151J0377k971j073J844o676K697R796j0609r531J7299O674
472A1917k0636k064K0496m357j8078Q920J3311j0411n621Q281j527p94O506q345
486b402m095J7028m167k1562J4825J8069k3264q062K5394l114j9369J1023P223
499G527j1384L346L187j0406P419R178j6526k369K1232n601j9225J2025J4491
512A2894j4864q410J3071L590r876l62N946L59R4q60n704N593R085j2865q980
527a1289J9316L229k4517N323K2993j3546j4739J7197L677j3320N005J994p081
$$ y = [5444, 5638, -8348, -3722, 12483, 850, -14284, 2510, 11831, -8015, -9902, 8104, 3258, -7073, 288, 286, -3877, 4625, 188, -9558, 5889, 11678, -11783, -9089, 15987, 3957, -14606, 4041, 12879, -4759, -5910, 4467, 1496, 423, 2267, -4409, -1712, 8084, -2525, -12056, 5243, 11917, -8719, -10783, 9713, 5356, -12722, -3802, 9509, -902, -6523, 1758, 231, -563, 5943, -2402, -6497, 10531, 6364, -15198, -373, 17696, -5568, -13630, 11764, 8650, -10719, 304, 7527, -3857, -511, 2676, -7730, -311, 8867, -7659, -10028, 11204, 5603, -13622, -1597, 12894, -1970, -10380, 2691, 6281, -3595, -3957, 1989, 2348, 2442, 1582, -4122, 1471, 10556, -2309, -11289, 8027, 11256, -13261, -7938, 15055, 1509, -13230, 3967, 7644, -5676, -671, 1323, -5758]
540e758R946K01j7826J1054J7518k0754r468K6165M80k2938O765J5609r564p008
554e578O585R43j184J418n201o86J0153l98j3196K508J5200p595j6404J1542J3613
569A1720j4729q006J4417J094r015M194R93k569Q415n252j4042J4869J1831k3196
583i276k036K5437p445j9514J3643J0170j1653r55L204m271M510J164j1599N633
597b988J4153j1952j1543J5914P403j6428l199J4327q24j3275K617J0147k930
610A422m660L742J52r05M531l815n070J0077J241j6854N322J5880j1623q719J6414
625G135k50j3458O929M447q645M800L160j2147M239J0838j1696l857J6429k482
639E442j3772P247P736q417j802N497j249j996O46j123J613N099j612o021L828
$$ y = [-5758, 4188, 4389, -13437, -2383, 15135, -5619, -15087, 11078, 11558, -11380, -4615, 10994, 1430, -5578, 1007, 1950, 766, 2184, -3017, -3703, 6450, 6052, -7144, -4636, 10564, 2969, -13435, -1893, 11720, -3009, -11015, 3402, 4496, -4519, -325, 668, -1901, 6514, 1262, -12780, 2089, 13920, -9276, -11312, 14125, 6680, -12834, 809, 10979, -674, -1629, 1575, -2696, 1814, 2978, -8621, -2988, 11165, -787, -12330, 3584, 10987, -5441, -8640, 5687, 4863, -8412, -5795, 4352, 1422, -3238, 504, 656, -249, 4282, 467, -4603, 5474, 6715, -10139, -4817, 11063, -560, -9279, 7135, 6885, -6573, 356, 4803, -3842, 958, 4118, -8029, -3790, 7048, -4648, -8505, 7924, 5442, -8330, -1083, 6653, -1764, -3566, 1931, 682, -1314, -668, -1791, -178, 4921, 3309, -2712, 1116]
654A116N727p242o717J0122M479j4038j235J3894l620r656R049M287q673J731
668g76J766n600N398L112j1629L009J2739r720p310J6334J772j4371L846P796
682F366p692j738M695k341j89L113m155n69P693p19p067J920M919n086n299M744
698a405L873m641j929N053M34k453K806O65l621K937n06p467M487P459q838k558
714e704J1744j774r174O855N418p845l97K882m763R71L453n507J716P473n759
729d11n056R115J813q655P30N642l853m697K965L418p07j143R31J817K28j176
745I61n62O59J354k458m538L271M787m938j893P799j40o854K405M035m516j882
761b510K637l265P10L426m090L51P469k868n643N692K868o724o23L894j713j628
$$ y = [1116, 6843, -399, -7116, 3006, 7485, -6553, -7788, 6106, 2486, -7170, 1879, 6166, -2507, -776, 990, -4610, 788, 3900, -7729, -4720, 8019, -1701, -9011, 7323, 9095, -5276, -1430, 6366, -1326, -3064, 1631, -710, -899, 2214, -1941, -2510, 5183, 4464, -2603, -683, 4236, -850, -6149, -1405, 2468, -2173, -4102, 951, 1385, -1068, 1738, 2403, -1218, 1719, 1213, -6254, -1767, 5692, -3146, -5704, 6040, 4266, -4908, 1947, 7365, -480, -877, 2005, -2758, -1787, 1666, -3841, -2125, 5348, -411, -5467, 3648, 5461, -3194, -2464, 3178, -675, -5372, -2407, 1011, 304, -839, 92, 1909, 2137, 961, 399, 1058, 2412, -46, -4584, -1313, 3474, -1464, -3357, 4442, 4302, -2552, -147, 3888, -628, -2510, 127, -3138, -2428, 998, -3092, -2741, 4728, 1860, -3783, 1909, 4777, -1947, -2570, 1324, -389, -2017]
777b017J159m3J982K624l227q35L846r94m510M34L419j781l993J317M178n31l067
794b039J947K969j788k639J03J075M86j567k194K919L400l737j959P095O11o460
810a778J367M007l471k286J446k6J451Mk605K067M144l764l002M475N99n533o8
827b973L113p21j638Q08J186J391l72j812J135K160k125k270J459J746j541j468
843a922J626K984j072k339K126J474k499j137Q76j65j99j157q81K271J822l089
859a281m36M359j408m223K409K135l116p56J869Q5O56K36j689K169K403l463j465
876a516M145o34m558J170L257j606j238J076J414K39j784j203J712N36k433q36
892b259J898J027k286j077L189K022l069p51L006J32l592L69K310j018l64P30
$$ y = [-2017, -858, -901, 1081, 3705, 478, -357, 3489, 2495, -2015, -1581, 1838, 57, -3936, -2619, 1559, 1028, -2039, -92, 2877, 1089, -1550, -1447, -372, 114, -1453, -3647, -728, 2672, -1065, -3024, 4071, 4682, -1778, -411, 3596, 125, -2161, -715, -741, 710, 714, -1891, 176, 4320, 556, -2446, 2029, 2628, -2905, -2973, 140, -581, -2219, -1411, -225, 1166, 794, -1018, 117, 2277, 152, -2118, -659, 1087, -454, -1922, -296, 2688, 1616, -723, 1403, 2877, 378, -759, 117, -48, -247, -1404, -2285, -14, 1808, -1281, -1717, 2642, 1234, -2989, -580, 1555, -1561, -2317, -448, -363, 293, 529, -1160, 1009, 3412, -51, -1516, 2629, 1995, -2563, -1393, 1864, 258, -980, 96, 1510, 1749, -35, -1238, 474, 1010, -1423, -2259, -361, 666, -1620, -2697, 492, 2514, -555, -1306, 1700, 1832, -1760, -1391, 919, -99, -463, 267]
908B67q40J928O71l198J316L720l149l577L556Q64l843L12L054r02l65N2q20J124
926A70J210l138O0L400j502l268J754K912j524j743K257K232j569k242P07J517
942A233l74j784M22J443J41j301j817L004J979l848j379M767j085m930J823K979
958A273k007j164J990j16N67J92k778J687L800l810k872M751J164m905K51L991
974B014k90j979P14Q79R8r73k294J261K094j266k724J689K175j421k397J801L752
991C133k758l381K805J492k840o08K332O96j95o29j637K261K410l975j068N243
1007C281j212n623K466L758k538j385J810J75N0p11k072J791K392k920k735M238
1023G65J211m093j64L601J25k349n96K548P75k641r50K403P09j035j023Q03J951
$$ y = [267, -573, 1355, 2026, -1172, 144, 3864, 715, -2862, 694, 1558, -2285, -1973, 1081, 179, -186, -134, -954, 170, 1380, -1758, -1698, 1702, 200, -3068, -1314, 1598, 74, -1669, 588, 2820, 1251, -991, -284, 1233, 859, -925, -503, 940, 1081, -220, -2037, 967, 2946, -902, -2281, 2486, 1401, -3529, -1706, 1273, -734, -1898, 92, -24, 543, 735, -2043, -356, 3444, -366, -3238, 1513, 2677, -2228, -1977, 2014, 1724, -255, 459, 1338, 1436, 463, -1831, -570, 1524, 258, -2466, -777, 1398, -23, -2420, -619, 3133, 375, -3006, -201, 1291, -1549, -2157, 175, 871, 676, 47, -1590, 671, 3081, -894, -1962, 3281, 2069, -3554, -1088, 2670, 132, -1253, 557, 732, 782, 71, -2001, -210, 2182, -738, -3473, 765, 1976, -2117, -2281, 1320, 1445, -904, -1500, 1048, 1823, -818, -1768, 635, 1344, 309, -714, 89, 2040]
1040B040p43l042J030M075k536l799L470K355m721l25L189p15l74j0j689J656
1056a39J922l440q34N060p52m913K037K884j830j279K033N91k46j032j092J756
1072G26J156k407p03K135K47j849j037K319J531k511j652K940L57l409L34K734
1088I11j077j075Q89l70J324Q51k662J11M033k273l811L599K138l578l89L047
1104A668l52p84L19j034J074M53k762l01L132j175k377J402J964j063j274M31
1120f79J791l25k330J45K102q43j291J611M93j82O1r62N91K191j928k206L391
1137A630O0l379R44K624j802o32J108k83n45R11j524n9K149j323k322K600Q38
1154I95k376P48J280j59n12j24l7J167n39j164J170N44j150m52Q24M50M03p47
$$ y = [2040, 1297, -1745, -715, 3360, 824, -2975, 495, 2850, -1871, -2196, 993, 278, -96, -106, -1795, -139, 1783, -1657, -2491, 2569, 1817, -3096, -1059, 1825, -5, -1284, 749, 1340, 1094, 62, -1030, 726, 1882, -525, -1228, 907, 1154, -695, -1732, 587, 2118, -393, -2045, 895, 1252, -2157, -1823, 911, -166, -1241, -352, -722, 602, 1453, -1209, -1098, 2935, 662, -3149, 450, 2588, -990, -1379, 1668, 1316, 532, 851, -183, 891, 1344, -1418, -1719, 1413, 238, -2139, -737, 1227, 164, -1110, -679, 1112, 787, -1543, -1398, 704, -139, -1430, 181, 674, 492, 553, -409, 182, 2373, 445, -1761, 1630, 1690, -1689, -745, 1879, 77, -555, 553, 270, -275, 636, -888, -947, 1202, -121, -2443, 157, 995, -1381, -633, 647, 488, -24, -148, -185, 982, 443, -721, 449, 993, -157, -609, 215, 665, 1068, 321]
1172C21p54J651j79k729J259K155k145j208J646J10j131R77l08M70O45j116j463
1189a799K204K15k509J477J844j821l85J652l40K83l98n03M15M94j413k71J498
1206F43o25r17J064P58m88j48p11K06N79j884j80K263o27j431J610L16q29J040
1224F39J3m26P21o73k137J297J574j575L93K040q56j250M23J47L32K47j342l89
1242h22J295j023j335J949J132j227l17M04j14k34n00k54J916m90j877R78J559
1259A040j136k08J338mj85o73p42P94P17j964p6K241o11j471J236Q33j331j46
1277c48J53L22L32r32j105J405j16r37Q17J562o17o81K03P8R7kp22O64R44j879
1297g62O0J437Rm85M27J15o84j37p48j32J562r24j126J205Q13j396K99J235m64
$$ y = [321, -433, 1218, 1039, -1690, -431, 1724, -421, -1629, 17, 127, -1004, -27, -335, 135, 780, -336, -1799, 405, 620, -1889, -412, 1432, -389, -774, 878, 538, 821, 423, -80, 335, 829, -584, -855, 643, 18, -899, 165, 923, 435, 287, -424, -218, 361, -1523, -1703, 560, -67, -1498, 112, 428, -401, 639, 652, 226, 947, 274, -1863, -566, 1008, -567, -174, 1866, 1010, -240, 183, 330, 662, 909, -433, -822, 473, -550, -1885, 64, 1196, -31, -348, 56, -58, -292, -792, -1046, 870, 380, -1497, -519, 1040, -96, -304, 1034, 1030, 845, 172, -570, 224, 941, -1023, -1099, 1142, 531, -940, 296, 1129, -202, -348, -195, 127, 459, -473, -1578, -173, -289, -1226, -409, 1153, 536, -145, 58, 136, 233, 231, -491, 173, 1117, -762, -702, 735, 744, 259, 686, 801, 117, -20, -768, -900, 662, -262, -1388, -183, 630, -766, -467, 768, 304]
1316C04n18K24r62R45L3j235N60J761q04o90J437L13p29p34M79P0j32j100J39
1335f39J106l54r47J162P65n87m32j8n63K21n73o05J335N44j243L02J427n67q49
1354e15J441k7r05j4o57J8J099l93k66J350K84j303L5O50j64j005J09j72M06n65
1374e94p48J293M81o43P2P87p17m9m32MN67Lr68N27J348p41m53J265J1j129L91
1395B75J06l23n4k13n77J201K05j210P58R92j173n22P08J74q73m12Q3M27L77m85
1415e36J81J101j84p77J98K98j11m43Q4K99M4q05N73Q73k6o92K93O51j313j99
1435d91J47j17J66K46r71P83J117j332J4J258n3j532L63O19p37L87j67NQ17j95
1455C27n90N77J003r67n17Q29k04n28p35M27P84l50n24M38J074j155m42N87l5
$$ y = [304, -214, 10, -952, -7, 26, -1209, -649, 1112, 308, -382, 1055, 1368, 639, -95, 384, 454, 322, -778, -639, 467, 113, -834, 328, 1093, 506, 74, 56, -507, -286, -859, -1464, -129, 415, -828, -526, 901, 334, -515, 926, 899, -6, -20, -677, -659, 440, 47, -219, 1131, 1415, 112, 147, 797, 633, -372, -263, -435, -29, -594, -1342, -49, 432, -211, -139, 648, -69, -118, -550, -546, 21, 24, -944, -417, 931, 190, -263, 1002, 1013, -116, 275, 381, 58, 4, -209, -786, 415, 620, -590, 168, 1160, -13, -535, 173, 347, -526, -938, -855, -428, -51, -536, -355, 746, 562, -215, -17, 281, 170, -273, -189, 110, 154, -651, -78, 795, 769, 77, 370, 1021, -292, -491, -344, -461, -295, -49, -1020, -237, 880, -452, -438, 820, 767, -765, -402, 217, -520, -133, -300, -295, 522, 327, -263, 314, 1317, 350, -167, 662, 458, -70, -805, -378, 406, 56, -468, -30, 1044, -111, -553, 34, -1]
1474al95l18MM08O37j164J91J727n44j231R48L96q98J8M31k0L24m96l66R00M66
1495A017j341j68J522m47j186L44N28k85o40K75M33M58q73j83O72K91p87j23O95
1514B02l58l8m15M87J108m81r44J274K29j050L5N17k60k57p3l82O07L32j227J78
1534e16J495o34j143J020M7r20J23K10p4N91k43n60R73Pr07L35J046k30o46l4
1554f0L4K09m32K51O44J42r88k83J137n91o72R64n30L7N1p21L15J148o02q66J375
1575E62O0j146J07P10m04J07K56o66R88Mq32L14J012r60m74Q09l38k20J22lM16
1596D24K8n74k66R14m32o17L58J92l32L40l38p0P13n64m67J073K84r73M27Q17
1616I37j045j56O70l26K47J71p37K35O57o58k76P37N7j238N48l7j70m4L68j47
$$ y = [-1, -396, -714, -710, -302, 335, -829, -638, 1089, 545, -686, 262, 658, -240, -222, 209, 189, 513, 17, -349, 551, 1017, -324, -492, 1030, 583, -603, -259, 269, -16, -656, -381, 52, 510, -363, -546, 126, 417, -370, -493, 202, -156, -194, -609, -122, 986, 505, -439, 835, 1064, 14, 49, 566, 306, 49, -24, -406, 201, 533, -694, -516, 979, 345, -798, 222, 269, -651, -528, -318, -392, 199, -44, -604, 369, 376, -531, -196, 850, 620, -26, -60, -26, 183, -249, 2, 646, 788, -200, -483, 654, 63, -609, 355, -175, -138, -87, -808, -493, 655, 53, -813, 562, 622, -524, -417, 293, -111, -4, 252, -414, 574, 578, -254, 60, 1072, 112, -362, 447, 109, -111, 11, 8, 424, 452, -122, -388, 526, 94, -523, -165, 27, -305, 35, -303, -373, 340, -224, -691, 382, 666, -307, 120, 937, -108, -264, 406, 80, 327, 498, -239, -4, 653, -5, -281, 456, 513, -725, -177, -214, -384, -428, -60, -207]
1636b07M48m71m71P73M06p48J2L74l63Q8J92j53O66l4p10O08M07o72o34R37k15
1657B33m74J37p6K24K49k06m79P15k67p13N58K68o12j85N15m62M93L4j26L61L79
1678E66p23L8O45n06l74N93j69l05N74k96J0O72p92k27L67J95n85K27M78q39k
1699d53N06l63K44J08o32N69L97o98O2R08p12k95P25k56R0M40o15L37K87n44l97
1720b92P20k01o51N49J98n52L96l1n33M90O2n91J09L91n74j46O25j31M6K20j93
1741h9L98K35q07J05P28m20n39M99J27n07J79J20j50P06k98o09Q61m04p46K41
1761c70M94m19J03K77j98L65o5l00M3K13m95q7N76r9l60L26J87l6J63Qj11O76
1783H91o81n09L65m2k28k11L77j41J59J39j5K53j17n81q2N86o71QN78j48k56N60
$$ y = [-207, 241, -230, -701, 72, 478, -270, -258, 116, -247, -159, 33, -120, 546, 512, -198, 410, 817, 145, -489, 448, 233, -241, -104, -180, 44, 293, 87, -392, 323, 56, -657, -99, 169, -443, -628, -113, -575, -82, -48, -174, 187, 566, -157, -119, 526, 20, -354, 239, 70, -235, 339, 43, 53, 725, -67, -294, 73, 268, -317, -90, 388, -451, -453, 53, -310, -66, 42, -590, -21, 376, -322, -260, 648, -64, -359, 366, 110, 200, 640, 25, 362, 649, 105, -292, 428, 227, -424, 125, 323, -229, 167, 136, -397, 93, 155, -436, -327, 64, -510, -656, -31, -162, -116, 104, -89, 309, 544, -263, -158, 570, 150, -389, 110, 237, -270, -91, 29, -121, 585, 287, -322, 539, 135, -611, -370, 124, -295, -192, 85, -113, 252, 187, -113, -70, 143, -352, -439, 137, 38, -322, 4, 191, 155, 318, 326, 215, 891, 210, -299, 66, 24, -204, -415, -38, -179, -20, 119, 104, 357, 240, -341, -423, 163, -508, -500, 78, -70, -326, 234]
1805B34O2l86N96l55k19K88k2n85N69n5j60m2L5P1N67k94l95M28k43p97Q7O41
1827B5j90l19M76M3r5K50p1JJ16m83q3L15j88l34M60N06j69j18J74m74Q59l70
1849C31m35L99k45o04L78L68l18J39J11k23J43P3n30Q1M45o01l18O33O7k76L82
1870@K57k25M59l54j41L92j93o37K66L2K48k10M67q3j0J72l45q9K25m13j31J23
1892a90l82J39K12L14O7J12l98K76J8l47m8M29j17m83K55M42M1M7O5k08L04m51
1914I7k76KJ57l35K3M42k91j60M28J95k96L05n69j82M96m38k97M45m0J51K18o4
1936A1R2jJ7l5J12l32k30O29l0l19O3L85k74K69K51o05k57P0j42j80M54l72P6
1959c48M29rk42K54J29m88M58l22j24J49L1j76M45Q5j46J68J29L4n2j26m36k02
$$ y = [234, 296, -90, 506, 151, -68, 220, 198, -387, 182, 127, -33, -75, -40, 31, 598, 304, -91, 337, 94, -703, -616, 25, -165, -484, -8, 35, -60, 190, 119, 120, 236, -247, -330, -15, -203, -537, -77, 429, 260, 142, 316, -158, 701, 331, -104, 295, 50, -554, -176, 192, -126, 13, 124, -99, 44, 117, -413, -332, 113, -488, -806, -173, -106, -382, 0, 257, 32, 491, 137, -4, 388, 195, -442, -176, -144, 104, -106, 361, 278, 268, 440, 95, 6, 231, -182, -313, -190, -572, -433, -221, 93, 160, 272, -126, 150, 168, -179, -227, 202, 85, -398, -143, 299, 340, 387, 452, 244, 548, 97, -179, -177, -20, -355, -332, 110, -181, -341, 87, 282, -14, 291, -278, -460, 36, -402, -699, -254, -294, -143, 75, 11, 103, 102, 119, 84, 196, -136, -366, 263, 233, -86, -23, 362, 88, 357, 608, 3, -254, -184, -326, -506, -52, -424, -348, 81, 72, -170, 84, 213, -275, 183, -139, -263, -114, -83, -259, 186, 271, 125, 293, 422, 456, 404, 278, -158, -360]
1981c60M58l08k76N69j02k76O23P2l95j11j22k34K32J3l76N58K7J12J05J76J38
2002E23j48j81j66J82j08m45p5K71J23j24O48k46k14K42j31j07r6k95k66J91K29
2023a93l69O89M0k22O8M96l56j96l8j61j23L02k76K43L93K11l6l5j43p9Mn28K72
2046c7L8l12NL32L35m63K50K1r6j72K42n46p1K49k50K29J55J49l24P03j46l53
2068f2J31l6p6J85k27o4K40r8o0K85M3l36M14l87o0j57n9p5K89j40k54L91K98
2091A85l2j66L38k82k4k81O9j26K78RJ9N08o8k82M91k35l65K40n03o4R0J62m06
2114d45L78K97n65M88P7k60o5k9j28J13k0J2k18N28j29j92M64P3l21K12k95J40
2136A15k55k6Q2N66l53m7K01M8j8m11J87l83J33j28l51L68O7q7J57L58j82l25
$$ y = [-360, 98, -210, -486, 83, -19, -295, 328, 400, 5, -106, -228, -462, -230, -217, -593, -35, -8, 104, 209, 385, 523, 375, 194, 28, 210, 102, -343, -418, -147, -24, -148, 500, 254, 40, 282, 151, 44, -52, -347, -613, -422, -193, -562, 127, 167, -55, 13, 509, 153, -43, -81, -242, -365, -63, -339, -96, 297, 508, 472, 437, 294, 215, 219, -309, -37, 1, -311, -306, 26, 361, -102, 148, 169, 73, -99, 143, -403, -474, -225, -475, -246, -91, 58, -266, 437, 291, -62, 69, 33, -43, 142, -85, -149, 91, -7, -67, 218, 261, -75, 339, -48, -108, -265, -324, -399, -110, -250, -504, -113, 185, 153, -13, 325, 43, 19, -262, -193, -319, -41, -32, -13, 495, 427, 145, 636, 401, 36, 276, -227, -291, -201, -39, -445, -67, 230, -335, 153, 230, -30, -95, -124, -252, -139, -159, -147, -365, 163, 34, -158, 306, 379, 58, 270, -25, 115, -140, -166, -84, 482, 129, 82, 283, 331, 313, -98, 89, -294, -161, -289, -640, -272, -205, -292, -135, 223, 41, -284]
2158b84L07k47J00K02k37L1K05k6K8L91j32j04J26j1k08k00j7k61M08j64k05L07
2180Ij33K16k6o4j30q1j20n9K81K58k20j00K58o0k77O84l2o87M49n4j74K43j11
2203G0l42L40J04k29j46M50l87l8J94n9j62J89l19m3M96k99k56P08j91k5K1Q4
2225A60m5m47L21p4J68J2J3J01P8o8m9o0k11J49Q1k50O3Pj58J82J39%j78J93j45
2250a8k55K43j87k18K06o7L9L00J07j80P8M88o20J65q8l01K71L09o14L87j2j14
2272h1L42l0k10nK55k80l7J0j77j14K65l09K48L39l22l76N90qk24K02O6j88L76
2295C32o7j60K12q1j3k52K46n2q7Q6k27J5K92l63l8j79J11K69M8j41n9M3J97k85
2319a53lk7R2O7j20N2Q6K90j61O4M3j2L8j40k67K12J55l78L1L53n2l26J10%k87
$$ y = [-284, 23, -224, -124, 78, -159, -128, 77, 51, 79, 470, 338, 234, 360, 349, 141, -59, -76, -337, 71, -93, -298, 9, -124, 92, 66, 2, -128, -209, -329, -388, -107, 151, -69, -169, 89, 29, -248, 436, 404, -283, 166, 112, -62, 181, 70, -272, 68, 172, -57, -203, 247, -140, -178, 16, -43, -205, -16, -335, -378, 118, -181, -437, 271, 80, 55, 76, 160, 115, -332, -11, -85, 83, 95, 108, 209, 287, 219, 170, 110, -101, 48, 129, -121, -58, -51, -209, -27, 112, 112, -66, 127, -18, -273, -30, -217, -435, -229, -296, -257, 43, 150, -30, 48, 536, -84, 81, -7, -308, -37, 272, -342, 45, 33, -81, 261, 231, 21, 16, 271, -9, -46, -36, -213, -327, -62, -371, -123, 216, -106, -482, 108, 100, -124, 78, 144, -44, 332, 265, 105, 317, 236, 223, -29, 217, 165, 78, 164, -63, -48, 244, -119, -157, -336, -225, 44, 92, -49, -108, -65, 132, -153, -156, -183, -91, -24, -144, -92, -6, 284, 123, 187, 230, 218, 256, 116, -151, 61, 216, -162, -131, 222, 170, -156, -46, -46, -333]
2344c33L77Nj66J69j15L7L3k25L17Pm5j46Q5J80j38J6j41L86k35K57l64J99j9
2367A41K18n10J40K7Q3o2k99L45L5jj71J20Jk59K9M07l83K9j03J64r2K16n4p3
2391e2J99Qn7q6P2k03K36j79J8k64R7M52k28Mm05L41j15o7J07M43n13J29Mj00
2415a59J53j08Mj17K77m47K78J79j61J91L23j39k55K5J00j13Q1P1j06k7j39N0
2437c9J92K5n99M43o2N0j86L71n70J16L11n2j0N0j42k14J65J93j9JQ0q1j79M11
2461B55l85K63o8o1J30J3Q5j78j58RP5K63l61O3k4J19k98K46l11K19J59P4j67
2484c8J71l90J09L16k27L7K74q0k8K44l34p6K00j49k59M96l25L2k65J7J18NL51
2507A99k58Q6q9l9k9J08J10k00K12J73k76J90k9O9j59n7j47L97q8j36J57k52r3
$$ y = [-333, 44, 49, -117, 52, -63, -26, 7, -218, 99, 106, 61, -85, 0, 180, 42, 58, -83, 303, 68, 325, -39, 160, 141, 359, -151, -11, 16, 99, 37, -262, 83, 118, 117, -54, 66, 67, -192, -163, 244, -139, -110, -213, -49, -141, 75, 21, -52, 147, 155, 98, 12, 84, -119, 117, -62, -44, -308, -211, 241, 13, 17, -388, -47, -162, -229, -122, 321, -192, -63, -59, -159, -6, -114, -110, -227, 50, -397, -119, 60, -101, 90, 413, 274, 19, 44, 144, 31, 112, 183, 77, 50, -89, -39, 153, 178, -421, 22, -40, 10, -176, 195, -375, -259, 52, 0, -10, 40, -102, -316, -151, 42, 23, 24, 104, 23, -156, 255, -130, 133, 65, 4, 134, 147, 232, 54, -104, -95, -20, 243, -118, -55, -79, 40, -258, -12, -323, -104, 55, 129, -38, 133, -257, -148, 168, -59, -22, 252, 172, 144, 388, 54, -22, 178, 29, -230, 266, -59, -27, -292, -275, -157, -152, 199, -59, 27, -62, -101, -130, -22, 88, -112, 100, 273, -3, 187, 158, 227, 68, 11, -136, 261, 173, 37, 194, -58, -151]
2530a51O0J71j72J02k31L11rk00K17l65K01J28j94J31j83K27n8J75l0n5j24j76
2552b25L79J69k62j74L35k2r1j10j28L72m10J15r4J25k00J02K05p4N9j72J4L05
2574B18k23j87K37k23L14l15O5K65j69j8R2j82K91j4j46K48j27j10k4O6p3J92
2596A77O7jk13K06j52K1k02j33q7L66k46O0K18k46J72N26m17m3pL7l33J74L71
2619C15j46J5q6q2m2j5J33k63J58r9K9M1lp5J99o0k55J42l8J04J23J2k49J51l88
2644c79L43j62J87J80j43Q3l1J02K6Rj63o8N2k86N68m53Q9Q0M1m2L59l85j08p5
2668a76J15j62J72J79j71O7j36j56J81P6P4O4p6j57L41j27j94j64L89j07j37M50
2690C45m73J85Q3k29L85l21J02J0k63L37o6k26M56l72j82L12Pl56M21k04R6R0
$$ y = [-151, -91, 80, -92, 10, -221, 90, 81, -119, 98, -267, -66, 62, -132, -1, -184, 43, -15, 160, 130, 75, -49, -225, 154, 323, 61, -113, 222, 200, 109, -1, -129, 243, -167, -52, -146, -21, -221, -119, 86, 12, 71, -101, -87, 218, -5, -192, 45, -178, 136, -179, -114, 151, -18, -36, 56, -126, 165, 151, 5, 253, 126, 16, -8, 58, -15, 177, 244, 243, 30, 236, 84, 105, -97, -230, -317, 49, -197, -137, 81, -165, 7, 533, 116, 73, 66, 103, -230, -56, 315, 169, 184, 98, 16, -26, -41, 92, -171, -13, -112, -83, -42, -45, -120, 79, 19, -236, -94, -132, -28, 95, 107, -142, 9, -379, -36, -198, -11, 169, 26, 109, 78, 180, 206, 215, 52, -16, 36, -250, 318, -135, -46, 34, 75, 33, 392, 7, -101, -176, -61, -223, -51, 128, -43, 24, -112, -268, -87, -11, 63, 127, 51, -106, 235, 108, -86, -250, 139, 32, -105, 345, -128, 57, 140, -89, 296, -25, 77, 87, -176, 161, 95, -131, 325, -47, -229, 83, 90, -266, 155, -49, 47, 137]
2712A37j32L13j57J17j33j07J66j90K81r6k41J09M3l4mN9n8j13J1j52L40j42j78
2735a61K11k2j1J5k3q7J43r5J15N6j27q5K2N2k69L30Qk6j98L42k40l4oJ29j96
2760a57k7lo3K99O7j02J80q4j93L8q0r3j28k3M36k5J18J61j64L72n43j58K18j33
2784h7L91j89k52J99n2l3L1J45j62p8K58n7l33J76j3k92K04J43k39K09k2M5p4
2807h2K19j73K5J95j11K30m13L16J19j38N6q4rk5L1p3m0Nj32J2kj28K72k16J14
2832c2K1j0j47jJ07J45p2J26k68L15l6L5j5q7k46L72q3j86J59m2l4J50j27j89
2856a45J72j44j19K60j60M53m72j1p0R1L21j11k92K06rq5L92k53k28K37m0J4P0
2879G7L8q9p0Q2J43n2m9k05J32J22k98L02k46R9J97k59K43k09MJ09j69Q6R7m3
$$ y = [137, 5, 318, 161, 278, 145, 38, 204, 14, 295, 199, -42, 67, 110, 76, 72, 131, 73, -40, -29, -181, 159, 17, -161, 50, 28, 17, 32, 9, -78, 65, -30, 85, 141, 14, -71, -49, 3, -266, 64, 72, 46, -152, 190, -50, -84, -90, 39, -157, -184, -187, -250, 49, 116, 14, 194, 110, -83, -45, -125, -218, -346, -369, 67, 42, 160, 321, 157, 529, -14, -172, 46, -87, 304, 115, -137, 62, 10, -23, 8, 153, -9, -87, 171, 114, -219, -43, -56, -348, -144, -1, -240, -31, -53, -8, -82, 137, -36, -11, 184, 73, 303, -110, 206, 325, 187, 243, 159, 150, 125, 156, 83, 43, 48, -84, -72, -74, -202, 70, -146, -32, -11, -21, -168, -169, -62, 83, 11, 137, -131, 184, 148, 183, 168, 81, -165, 207, 124, -62, 97, 55, 21, 171, 44, -145, 27, -117, -236, 24, -136, 317, -155, -166, -236, -145, 176, 65, -227, -21, -30, -115, 277, 24, -204, 33, -7, 7, 77, 115, 26, -44, 38, 181, 129, 80, -125, 7, 129, -169, 133, -113, -14, 183, -76, 167, -42, -38, 71, -98, -12, 85, 42]
2903D2j13P8J31o7j04J06l2k2K2K69k20j05j00K7K15L2r4l1K8J33k05j45K58r8
2927Er3q2J25l00L29J85l13N4K11k51K03J22l07Q0J7k2J12nm27M93j37j21Q1J90
2951A49k09%OP9j01j67K92J15j37j49K60K8j41k91L15l6l64K56L74l38L32k98
2973b5j23M24l22L09k09l4J18j53r7K11n6K29k90k6l0K5nj04J45L6O7l45Q0J17
2997e8l7kJ0L33n71M81l25L44l6j09j01O5j95J65J31J16j55R1m8o3N9k51J66l
3021GL9j88O1J87l24J27K98k77J80J83l56l39L53R9k69J76R7k07K33n2J92j43
3043G7m3j53j1J89J34l21J7j70K21N7j99J53JN6k85L03j3O4j15J16j07Jk2J43
3067I3j11J05j41K42N8k66J8N8K08n8n3l26K26K9q8J85k53J41k30J19J97jj60
$$ y = [42, -71, 7, 138, 71, -33, 73, 41, 19, 41, 310, 90, -15, -115, -88, 127, 159, 65, 34, 62, 195, -10, -155, 103, 5, -88, -170, -45, -345, -16, 169, -144, -90, 121, -130, 73, 195, -112, -32, -15, -37, 75, 70, -357, 136, -1, -122, -41, 149, -60, -60, -54, 25, -76, -243, 49, 164, 27, -122, 138, 166, 25, -266, 49, 13, -351, -95, 279, -59, 273, -25, -148, 276, -46, 263, 54, 20, 138, -15, -112, 99, 43, 272, -18, -44, -74, -49, -54, -158, -13, 23, 90, -255, -175, -58, -95, -97, -87, 246, -325, 156, -169, 175, 139, 30, -71, -6, -201, -36, 95, 211, 56, 147, 99, 36, 95, -156, 10, 7, 46, -142, -81, 106, -218, -91, 207, -70, 110, 293, -63, -402, -49, 50, -219, -43, 54, -153, 80, 28, 220, 77, 34, -119, -130, 59, 193, -128, -111, -281, -60, -3, -202, -49, -48, 8, -277, 26, 13, 77, -38, 78, -29, -28, -50, 93, -18, 87, -54, 188, 246, -20, -2, 56, 264, 206, 153, -173, 53, 82, -6, 179, -74, 67, -163, -44, 153, 152, -8]
3090hJ04j83l8J28j66L74%l37K69p1K9j50m1Ml2J00j09K18o1L4l8j82K47n3j54
3115a16J54l83L22j86J10l1J50j57J32J4l8J43L7p8M9j73J26K39k43o2P8k14j1
3138a38LL40j22n6P2K26n03K60j42J3l5Q3j20K71j35q8Q9j18J31j9l79J00J46
3161a21n1J89l4n6K17O7k81l4m2L9L67l42L11m67K29K25j9l7j19j11K07l61J2
3184b12N64n50K37p0k81K83j79K10J92nr5J85l42J41j4k7r2p4L60l32N6j5j54
3207b14K22K6J31j41J02k6j12J23j83L2j2Q7o7J90j50K37n01K25k6J79j55j73
3229b06M77q9l5j20J98k59J55k64K60n0j5J6k95K10Q8j02o6p3L35N8k42j48J29
3252c8k38K00O0j05l3l1o1J94j30K15j51J19PkNj67J02L28j90k4J2n5J42j99j48
$$ y = [-8, 96, -87, -125, 3, -163, 211, 211, -126, 143, 72, 101, -49, -90, -86, -118, -18, -127, 91, 30, 64, 26, -156, 91, 38, -116, 38, -345, -23, -209, -99, -130, 20, -137, -5, 9, -29, 114, 151, 73, 122, -51, 75, 314, 71, 9, 87, -127, -138, -135, 205, 83, 27, 99, 325, -178, 82, -60, -47, -82, 1, -119, 152, 17, -71, 18, -100, 31, 12, -367, -267, -121, -172, 17, -17, -73, 144, 211, -70, -104, -146, -107, 260, -82, 229, -238, -9, 216, 197, 160, 41, -70, 137, -224, -212, 352, -198, 39, -31, -312, -29, -208, 2, 194, 189, 94, 279, -63, 78, 64, 37, -55, -129, 231, -101, -45, -60, -214, 8, 34, 165, 24, 126, 100, -12, 111, -72, -40, -52, 35, -32, 158, 8, 245, -256, -31, -57, 122, -33, -206, 271, 182, 147, 27, 225, -34, 121, -143, 117, 67, 52, 68, -227, -17, 71, -31, -97, -170, 165, 223, -19, -167, -38, -276, -76, -16, -121, -154, -185, -246, -52, -182, 33, -118, 1, 8, 6, 11, -156, -54, 274, 84, 60, 72, 17, 159, -40, -188]
3277a88J41M7O5p2M4j01M4R0j64j20J3R7L00k76P0j19j4J98J4OJ35j18k2J25k19
3302b4J14J11j03j01n8Q3j65J14n5J0K32m83M19k52J95r6k6J82k47K26O0j14j45
3325a23K42J6k51L47k42l0K2j9K6kK7j5K22j11j1p1p3jm0K30l51J06M9Q0r6k49
3351c18L98l37L66k8k12L1J2j9k8R0o1M84k53j33m3Q3j04N2J47Q1k35O7k62K32
3375A0k24K37j54J46l88L67k65l7K59j72K20m4M16l47M4j17K45j62n4J02m9J5
3397D8k0J96l07J75j26J67j31r4L4L2j79Q3O5P1o2n7j3K71k63J23J27j01O7l15
3421b09K36N5jk24J02M3K10J01l63K4l1L7k0J37M2l79O6J23m2K08o4j56P6J50
3445A21j03K41m58L11p5l01M18j05jO3o5J55m76J65K05k13L59l8k78J10L14l43
$$ y = [-188, -47, 0, 65, -7, 37, -64, -20, 70, -94, -214, -201, -104, 196, -80, -10, -129, -143, 55, 69, 75, 210, 92, 70, 195, -24, 90, 201, 98, -3, -61, 22, -143, -29, -84, -74, 158, -325, 94, -158, 37, -59, -85, 97, -150, 76, 136, 22, -123, 119, 135, -116, 231, -11, -41, -19, -38, -12, -14, 13, -2, 220, 109, 98, 27, -46, -47, -87, 143, -208, -102, -53, 27, -69, -318, 80, -257, 109, 81, -131, -100, -88, -107, -135, -45, -106, 378, 125, -8, -51, 32, -72, -20, 127, 208, -27, 40, -222, 10, -214, 23, -131, 15, -373, -6, -271, -308, -49, -221, -1, -45, 371, 24, 68, -49, 196, 34, -20, 82, 33, 48, 28, 224, -83, 92, -34, 133, 2, -92, -58, -26, -205, -122, -57, 14, -48, -105, -118, 153, -110, 13, 140, 39, 106, -209, 27, 82, 81, -143, -41, 2, 212, 313, -50, -26, -57, -20, -40, 97, 139, -240, -174, -51, -93, 115, 51, -105, -29, 121, 18, 259, -199, 112, 37, -264, 154, 49, 48, 111, 46, 201, -275, -110, 95, -118, 241, 203, -75, 35, 349, 6]
3467FRl4k4k7m1J01m3J07O2nr5j61j1J27L47n43K58j8j55J93J3J0m2l9K38l58
3493a25L49k70K2q1M4n3K35p8k9J21l12KJ68K54l51r4M3J45n2J26P9P4k05j0J01
3518A03n7k8M2M6q4L8p9q3R3Nj95K11k1R5q2N8O0J20k54j70K69o3K47l87m1L36
3544A79l36M05j20k31K92k57r6M20Nj58N1j66j7j05K6L94j68j02K2k34K51J15
3566A70l8k08K12j75J38m9k25O6J64k25J0R7J63j89J99K54o27N16m23K45Rj09
3588b5K6j73K15j08O7K02l06l5K89k69ol4P3J71j05N0k13M5O7L25n32M76l05L1
3612g4Q7q6J85m7J90k11J09J04j85p0J61l09K33j43J11J42r8j4j78J54m4k09Q0
3635a12j51M80l43J78r3j61J42Q2P5j39K41o4j96J99p8l00j44L12J34j0l6l0J97
$$ y = [6, 15, -19, -43, -70, -111, -10, -53, 54, 116, 111, 16, -145, -156, -29, 318, -225, 33, 15, -140, 53, 66, 76, 34, -5, 233, -125, 224, -46, -24, -105, -61, -114, 121, 43, 14, 135, -177, -175, -7, 247, -104, -198, -155, -10, -62, 64, 143, 217, 12, 2, 103, 46, 18, 60, 106, 22, 60, -19, -102, -9, -4, -199, 12, -9, 86, 4, 62, 122, 242, -12, -182, 87, 24, 271, -116, -157, 179, -157, 248, 128, -103, 189, -68, -164, 256, 261, 103, 154, -12, -29, -134, -108, 286, 118, 16, 38, -196, 55, 170, 132, -76, 136, -39, 99, 50, -175, -109, 55, -170, -160, -63, 100, -89, 110, 364, -263, 253, -170, 75, 84, -25, 1, -172, 43, -65, 2, 204, -102, -137, 152, -117, -123, -157, -84, 87, -18, 32, -181, -136, -69, 256, -276, 200, -105, -74, 13, -73, 112, 65, 255, 44, 153, 257, 72, 2, 163, -146, 87, -56, 55, 197, 99, 85, -93, 61, 17, -192, -112, -263, 217, -126, 52, -41, -202, -60, 22, 97, -42, 199, 135, -61, 138, 60, -240, -384, -72, 62, 52, 16, -14, 183]
3658A83m1j45l9J40k28J07J15j12r0J76j12p9P7Oo1j64K36O0J4j43M24n68K34
3681a0J71JJ61l92K0L5R9P6M0M4r5l68K91j05j5n7L1M3L5J70r2J97j09k63k19
3706c11N12k76K26k19J67q1J0k88O6J40J02k3j54J49k9R2m1j3Pl17K57j41K94
3729A29n58K59L54j04o3K2L8j24J68J7K4m12N35j42Q1l4l13j99K67K13k20J55
3751I3l02O3K41lq4J17k84J60J29m8J73j79L87n06n6j4K72l21K91j6k37L45k81
3774f0j2J34%l11L01M9l19K25n1M9P7j47L58j03k95K23l69L83n4rk0k39L85l88
3798a93M49j4m42o4M90k14k5P4J95l94J36j35J66l23K24l8m1K96l98L23Ro5j17
3821a01J5L9l57O8L02J77l57L61j60R3R2j93K7Q7j59j2k19J71K07j24Pj37P6N7
$$ y = [183, 142, -3, -42, 98, -130, -23, 92, -20, -110, 66, -46, -125, -48, -42, -103, -267, -31, 29, 43, -100, 324, -244, -10, 161, 162, 323, -69, -49, -14, 85, 161, 201, 245, 150, -218, 73, -32, -47, -104, -73, -30, 5, 175, 83, 280, 171, -92, -311, 201, -75, 151, -68, 99, 18, 28, -260, -194, -54, 48, 25, -129, 20, -9, 83, 42, 29, 36, -281, -24, -165, 129, -429, -170, 184, 80, 17, 39, 77, -47, 121, 138, 162, -250, 285, 143, 224, 190, -123, -322, -55, 158, -62, 93, -209, -146, 95, 92, 8, 125, -159, 1, 130, 82, 255, 76, 463, -43, -99, -113, 159, -162, 129, 113, -124, 221, -60, -72, 62, 62, -249, 52, 101, -218, 7, -44, 5, 82, -65, 293, 190, -105, 118, -251, 132, 78, 69, 49, -190, 195, -193, 256, 242, -200, -264, 226, 12, -13, 61, 256, -138, -2, -137, 29, -294, -70, -108, -149, 147, -251, 72, 81, 16, -101, -86, -47, -404, -336, -34, 143, -214, 147, -13, 80, 172, -21, 6, 93, -66, -78, -297, -126, 81, -43, -36, -173, -97, -40]
3845d0J53J46k19k28J77J11r6J67j33J39j97om2K84Ll42L15j80K54k59J26j5o8
3868E0mn2J70k83N6M34k02j5n0k01J55J5L0J1k26J84l34O00k93O6o5j08L8j50
3892a74K02o0j57L23l14N2O2L3j07J29j78J8K35l17M08j33o7J32j41J23j94K32
3914A07k1J72l08m5k1L81j91k5j70K21KJ37r8m86L35J34p5K3p8Q0k50RJ73l09
3938c03L15L2R4l75K88j32NR0Q4j60j36J58J27J61l59K61k28l9R2K35l15k03K64
3961d4l4K13q9l88K93o6J66r9K20k02r7L4rK03k55N1J11j00n8J58M5j51q6OJ9
3986a59L67k03J03j2j38n3J41r4J16j83K25k45K8L39j66j36L52m12J19r9L8KK24
4009A54k67p4K35k7r7l6J51n2R7m5m8j59k9K8k1j25J64n1J40K16Kk20K18j57J9
$$ y = [-40, 113, 259, 40, -188, -11, 100, 4, 171, 38, 177, -20, -26, -68, 216, 219, -123, 192, 12, 266, 7, 133, 118, 50, 46, -6, 164, -119, -63, 371, 169, 154, 104, -97, 58, 73, 103, 114, -112, 72, -262, 338, 45, 111, 46, -62, -24, -174, 28, -32, -189, 134, -180, -128, -66, -33, -140, -11, -189, -171, 64, -253, 155, 22, -45, 87, -54, 69, -125, 107, 86, 258, -50, -95, -116, 265, 74, 49, -121, 100, 102, 239, 141, -345, -10, 124, 49, 72, -6, 74, -176, -167, 6, -303, 12, 44, 138, -237, 51, -81, -76, 14, 98, -62, -198, -40, 87, 248, -111, 150, -78, -117, -25, 210, -105, -308, -44, -78, 135, 46, -342, -49, -115, 51, -48, 172, -30, -127, -93, -102, 101, -154, -103, 8, -92, -150, 8, 53, -98, -184, -178, -159, 208, 5, 108, 96, -42, -95, 46, -48, 68, -115, 110, -135, -107, 232, 66, -70, 282, -130, -11, -110, -72, -70, 154, -113, -187, 48, 21, -76, -112, 39, -13, 84, 39, -9, -168, -197, -169, -190, -315, -151, -202, -62, 154, 156, -64, 154, -3, 16]
4034A6r1J97okj72K3J41k42k2K41o3j7O1q9k38J12K83j05J29j98J31k27K52j68
4058e4P6n4L13j94o9J31nj43L8j34K72k16r5J13K10k58J76P6k08L12j70m84K42
4081a25L3J73m8q0J22k30J16j68M5R3J53j1L7j51j65M50l64J7L46k25n6L6L26
4104C24l80O1nj00o5J36j17mN7K90k49K33j81K3J14q6m7j17j40J54q7m8L16k59
4128a77J35J14k42J28l7j0p4K65j71J6J16L9j61j36M16l79j29K80M41k62J0k36
4150e4M1j34L6K13j07K51M8j67p6l83M92j83J9m9JK49j63j03J05J23m4l25L03
4173I3Q7%r4j28O6J38L2k52k57R7k1J52p4l0J31j3K52j45r4M2L85k13l13J01p7
4198a35R6O9k7L0J50j92J4l4m8j11L49k60J34K93l63n4N7P4j10j61L37j18r1J87
$$ y = [16, -75, 122, 116, 114, -58, -35, 106, -136, -158, 83, 20, 3, 64, -25, -263, -151, 132, 27, 156, -42, 89, -138, 114, -54, 22, -32, 281, 87, 18, 149, 144, 1, 39, -95, 177, -39, -134, -21, 189, -69, 107, 183, -25, 287, 117, -367, -125, -92, 81, 33, -47, 75, -155, -39, -207, -162, -69, 84, 73, 110, -41, -206, 244, -120, -103, 243, 18, -38, -2, 324, -56, 5, 0, -100, -165, -29, -146, -150, -93, 197, -52, 181, 0, 23, 137, 51, 4, -113, -253, -99, -186, -234, 82, -177, -42, 72, -170, -42, -79, -89, -163, 102, -69, -53, 63, 102, -59, -195, 221, -158, -287, -7, 434, 172, 182, -54, -13, -147, -111, 102, -5, 246, 294, 127, 51, -332, 160, -23, -4, -53, -52, 197, 34, -69, 36, 159, 115, -210, 93, 180, 180, 86, -42, 24, 162, 194, -58, -315, -218, -239, -87, -161, -191, -60, -73, 179, 34, -60, -18, 367, 154, -159, -58, -135, -39, 30, 3, 33, 183, -9, 5, -29, -77, -188, 161, -99, 35, 328, -35, -89, -32, 42, -68, -229, 108, -10, -101, 86]
4222H6l51J72J97kj23K97m13kj19J10L5K83j02k86L70r5q4j7L22n81N27p5k32
4245h3K34j72P7j92J03R4j60J09Q6j79OJ28j50M45l30L0j45J77j42J18j47j21
4267b14L34j53R3j2K48l37K15j10N8k83Q2k0L1L7l4n1J35K04j65J7J33k0j76j12
4291a00M65j75P1j78j16K13p2j41p4R6J11l5n0k0j6Pj26L02k27k2L28l19J32k80
4315b26K66L59l69j80J38j34K6L6j50M62p0o3n2r9q6K98m4j92K02j86n7k7Q0N4
4339a4m3P2J30l28K09n7J39r3Nl88P08o76M61L7m03J54J7M2K64k86k0O5j22K9
4363i8J43M2o8O0k42K24j21j20J39L5L8O0j44L81l82RK3p1l5K19o6J47j22RNj32
4389f7P1j85M26l54N8jo4k87K74K31j28ll3L05k33Ok70J55J50o5O2r7J53p9PK0
$$ y = [86, -265, -93, 104, 102, -21, 276, -137, -139, -258, -148, -113, 170, 68, -218, 152, 57, -27, -44, 278, -303, 224, 149, -83, 151, -21, 56, -136, -33, 61, -99, 10, 96, -83, -77, 51, -99, 346, 16, 46, -99, 78, -64, 54, -93, -214, 120, -33, 60, 48, 296, -41, 174, 64, 122, -161, -79, -99, -68, -31, -65, -116, 19, 223, 58, 75, 208, 188, 12, -100, 365, 190, 261, 83, -33, 180, 108, -33, -107, -11, 100, 65, 15, -5, -21, -14, -140, 162, -65, -87, 241, -78, 54, -226, 40, 399, 30, -150, -12, -146, -120, -84, -234, 228, 158, 95, 43, -56, -142, 156, 112, -80, 122, -64, -121, -148, -68, -14, -57, 15, 145, -183, 26, -31, 108, 15, 20, -368, 340, -336, 125, 162, -241, -87, -70, -28, 236, -50, -70, -5, -127, -98, 45, 87, 19, 79, -163, 61, -60, -180, -41, -6, 32, 92, -52, 329, -53, -44, -21, -92, -127, 92, 26, 173, 51, 60, 65, -67, 4, -181, 245, -109, -51, -52, -116, -403, -129, 102, -26, -29, -62, 243, 10, 16, -254, -99, 51, -14, 48, -49, 104, 25, 32, 52]
4415E2k8k04P3K8J83m4k2o2R4j27QK44k81J9j2K8K31l18L8p2K69j04L9j89R4j3
4441g6J75k37J2J61N9q2q3K48k7j53k34K82J20j98L1j59l9K53K35m19J57k84J36
4464a22M7J43o2R5Q9l43J20o6J07o0j01K71l6J2J34l33M4kk5L5Q1j37j88M72j07
4489F8r8j4J28k58k31N99j02j40k74J39K00K36m60J83R0j57J43O6k94J53J56k54
4511a21K78k1n0l3j49K06k18OJ72r8R5p7L24j21l32K51j95M38j27k11L9j07O4
4534A3j05J86QJ08L2k38L3M5k79K71k63J19j68K76r0J38K7j18K3j57n6J34Q6m2
4558a7r8L21j39j83L16k59m3R9N8k86J17K02j6Q8Jk68N8j77K14m2j2K95j70L4
4582I3Ok43K37l1m4k5k2o6J65q3o0J59j54P4r4J54j25j44J78J9O6j75J0J1K7M6
$$ y = [52, 24, -180, -107, -79, 104, 60, 38, -24, 70, -57, -49, 195, -86, -67, -79, -51, 180, -138, -100, -172, 97, -7, 32, -157, -63, -76, 99, -138, -126, 35, 94, 12, -71, 177, 150, -3, -237, 45, 165, -33, -2, -161, -200, 53, 288, -131, 26, -258, -122, -75, 68, 6, 101, 190, -153, -33, -99, 8, -52, -153, 118, 82, 94, 228, -105, -61, -63, -88, -53, 28, -109, -297, 175, 68, -30, -44, 84, -174, -405, 194, 92, -48, -322, -183, 17, 253, -207, -24, 66, -91, 52, 118, -176, -23, 133, -121, 157, 136, 86, 53, -96, 110, -108, -102, 70, -28, 67, -10, 314, 193, -139, 112, -83, 355, 228, 17, 56, -51, 13, -92, 94, 102, 210, 242, 4, 37, 82, -197, 74, -189, -70, -238, 38, -52, 86, 113, -5, 18, -139, -195, -61, 25, -17, -115, 206, 67, -116, 200, -59, -102, -3, 55, -231, -114, 88, 72, 160, 161, -107, -49, -226, -12, -54, -66, 229, 59, 93, 99, -144, 93, 62, 18, -7, -29, -95, 70, -13, -73, 86, -68, 6, -88, 66, -59, -203, -25, -6, 60, -115, -105, -94, -67, -21]
4608b1K78q0r8Ql4p5J04Jom1j5n0J79k37J00k22J30m5K33l23j56L30k2j87L4L28
4634A13K01r7m47K06P2lL8j13k4J45p4j36K28m3j03k4R0p6K21k16r8J37Rl8L53
4659C21m69P5L04k02Q1M4J7k80J84j36k3oK17k03K71j42J08k89J68j64K09j39
4681e4J63k85J04K1K4k1k8J07n8j34K07n9j36q1K7K97k00N7k4J70o6q9K58Pj38
4706F9l17K52J7Kj62J99k58K96l1k17M5m5J26j22O8L41l2j29k95O1K20k99M2R1
4730g8j37J44J72k26M9N5j38J53r3l6M19j03j50p3J94k54R4J68m53K84j2j95L09
4753I3k45K45k2j08q4J23n7J40k44L5K88j79J57n2j20n9K73k15R7J3M0J65l64
4776h0R0J58j03J42k7k70J32N5j28J26r6k5K93j73l35J81K62o9j93n0K2k7O9J11
$$ y = [-21, 257, 177, 79, 87, 53, -22, 82, 83, 77, 36, 21, -29, 150, -87, 13, -209, -79, -124, 109, -214, -370, -40, -62, -249, -215, 113, 314, 217, -230, -24, 48, 45, 83, -30, -54, 91, 17, -119, 109, 66, -37, -61, 29, -47, 174, -42, -140, -3, 6, -32, 321, -148, -73, 231, 29, 110, 154, 171, -109, 75, -61, -84, -90, 127, -76, 195, 53, 161, -128, 40, -124, 85, -54, 109, -176, -72, -51, -27, -48, -76, 31, -27, -161, 46, -13, -149, -230, -203, 94, -106, -49, -73, 97, 31, -58, 200, 207, 69, -248, 4, 21, 23, -139, 60, -198, 98, 67, -150, -105, -150, -24, -146, -78, 263, 231, 102, -193, -132, 88, -211, -169, -78, -215, -71, 101, -125, -76, -21, -159, -6, -99, -135, 284, 181, 31, -42, 152, -102, -8, 160, -293, -9, -21, -216, 93, -152, 93, 71, -37, -121, 2, -55, 85, -159, -124, 164, -15, 142, 90, -30, -89, 184, -31, 66, 79, 119, 284, -80, 10, 168, 65, 207, 180, -90, 42, 97, -31, 95, -1, -26, 267, 94, -241, -60, 202, 133, -60, -110, -88, -115, -46, 65]
4800F5k32L34j49o9Rj68J81K82k74J2J46j3l32r7L36P0K9j59J87j70j64J28L09
4823B61l83J44P4j52K20k32p3M97l48J02q1K51j00l9j0j49J65r8jj10K59r8j30
4846c1o3K80j19Lk74L39j63K14j50j15J66k42L52j68P0L6J85j80K3l31o4N23l02
4869a1P6M9J8m4l34j38L78n0RJ29o7l6k7p1l01N11j88j93J47J56l4O7J9q7N9J01
4895A38j12J48k11J02j30J13n3r4J97R4k37J64l87K09J23q9K0M61l16m54K53J28
4917F7r1l84N18M9j19L2J08j45j96pK27j88J12k1m4L7P7O1o9l35L25o4j89J78
4941f1j30K96j26Oj84K96j6j33r9j08M23k73J23r4K1L68j27j45k4r5j1n9J21l3
4965f4L9J17m8J15j43j9o2K36j57k99J23K21K17j89k01K83K2M0j58p0M3L2k49
$$ y = [65, -167, 167, 18, -51, -42, -210, -29, 253, -21, -9, 137, 124, -208, -305, 31, 101, 130, -29, 158, -12, -176, -48, 261, -122, 22, 96, -56, 164, -68, -141, 356, 8, 110, 29, 280, 180, 141, 131, -18, 147, 49, 48, -62, 197, 99, -31, -94, 186, 67, 70, -204, 135, -28, 186, 36, -79, 87, -155, 197, 29, 99, 135, 320, 140, 163, -168, -232, 291, -11, 65, 114, 132, 88, -246, -384, -6, -56, -47, 82, 15, -21, -48, -119, -420, 91, -97, -290, -143, 13, -21, 46, 65, -22, 37, 138, 26, 174, -37, 65, -65, 48, -5, -99, 98, 192, -45, 119, -268, -59, 64, -25, -5, 456, 140, -314, -61, 67, -24, -408, 110, 159, 40, 72, 180, 35, -161, -168, 59, -129, -17, -38, -82, -45, 32, 93, 24, -311, 14, -50, -239, -61, -191, 105, -21, -15, -199, 97, 81, -52, -151, -259, 164, -109, 14, -80, -59, 309, 182, 37, 13, -82, -93, -152, -31, -64, -25, 92, 44, 159, 16, -3, -65, 171, 14, -285, -162, 59, 276, 87, -114, 169, 191, 231, 73, 3, 46, 78, -171]
4988a71K42rm0q2K18l8p2j03P0O3k0Q1N8Q4n17K75J28k26J01MM4M0j16k38J90
5013c4k0j65K46n0k08K97o3R2j41P2r7K14Q9n3j90R9q4o0P7L8j63K19j72N8L6
5038C7K26n12L47Q4j59j59l8j94K62K76p5j78J42m02L41j9j19J25R7J14j95q9
5060h8j4J21R3j02J49k92J44O1J7k96K56J07k29Mm6K29l55Q5M03k76j5j05j51
5083c00L34K7J67k17J84l14J81j07o2J79j89L27Rj04l6J5J27k77k18K88N5j58
5105h9K90j44l08l1R7r0N36k32o9k7j52L23k19j23J38J30p1J29j82L08n77K65
5127i8J07M9j19O9L2O5M1k09J96k01K38j39N8j28j32J30J30j35j01r3L88R6l73
5150a29M7j93R2K29q1RJ01r4L86m64J18j0K44j76j94J67l78M98k95K52j14R8q3
$$ y = [-171, 71, 62, 22, -60, 158, 120, 48, -55, 15, 78, 58, 139, 197, 281, -236, 39, 167, -59, 42, 46, 90, 130, 14, -224, -34, -54, -219, 27, -23, -231, 66, 3, 95, -46, 26, -71, 143, 232, 179, -11, 88, 4, -56, 21, 59, -104, 115, -57, 1, 37, 263, -249, 98, 182, 23, -136, -174, -368, -106, 170, 95, -83, 59, -343, -2, -21, -140, -15, 82, 196, 1, -88, -102, 19, 112, 10, 159, -133, 11, 72, 89, -207, 49, 156, -73, -69, -115, 114, -241, -156, 247, -29, -44, -149, -300, 34, 61, 228, 11, 195, -119, 62, -45, -107, 72, -117, 210, 219, 115, 79, 94, 221, -56, -274, 14, 69, -89, 201, 57, -251, -282, -185, -275, 261, 29, -40, -67, -219, 104, -115, -238, -100, 30, -41, 88, -94, 214, -363, -98, 9, 58, -61, 8, 40, 105, 146, -63, 133, -68, 170, 31, 89, -39, -171, -41, 89, -46, -147, -240, 148, 244, -129, -82, -275, -183, 46, -35, -26, 75, -19, 367, -97, 21, 11, 255, 79, -115, 52, -326, 172, -123, 129, 15, 113, 30]
5173C0j01j29K94J5p6J21l42J61P7ok15K21O4l48J93mP3o1j29K50p7j51J82J11
5197A53jj02l4Jj13m2R7j52Q8q5k5R0J56J90j79J08j63NJ58k11R6k13M55l19J54
5222A12k17P4J31p6J91k57M8KJ64k44K8J17j76J76Q1l78R0k4j97K53K17j7L7k00
5246f5j28L95j79j82R2L35j7j02L6n74M53jJ04o4l44R9J52J61k26M67m12N8L9
5269I7Rj42L5lOp7K25j77n4J61m9P9J5j80j85J25P0O1j61Q4Q4k32L68r3j40J52
5295G8l03l7M59k48M7M8K27n11L15n5J7r3L02l61M0K76l14J34j33R2Mo7j48K33
5319BN3k19J72J0j19K86k65J08J49K1j14k91M15m12J94L5M1l23L30q8J39o0j22
5342e8N1j24O9J44J1l9P2K7k23J84R3j52Q9p6Q8j60L36k40j75L8M9j91L27q6K7
$$ y = [30, -71, -200, 94, 109, 33, 154, -188, -27, 50, 44, -171, 50, 114, -234, -41, -45, 28, -33, -162, 88, 11, -140, 42, 153, 152, 50, 16, 17, -96, -138, -41, -193, -105, -190, -215, -125, 31, 221, 42, 150, -13, -8, 150, -61, 35, -178, 277, -42, 112, -105, -31, 100, 24, 215, -42, 6, 8, 172, -72, -44, 73, -103, 73, 154, -224, -134, -158, -355, -102, 115, 98, 135, -65, -193, 202, 23, -159, -67, 268, 251, 149, 185, -389, 64, 63, 167, 103, -241, -142, 10, 171, -55, 412, 0, 58, 97, 106, -36, -1, -4, 2, -75, 150, -27, -81, 80, 31, 110, 125, -55, -240, -115, -45, 16, -145, -61, 23, -209, 159, 66, -74, 78, -225, -262, 197, -51, -4, 44, 271, -240, 75, 20, 37, -56, 246, -115, -75, 201, -113, 21, -112, -20, -16, -83, -231, 2, 55, -164, 8, 18, -101, 185, -80, 28, 177, 198, 84, -207, 208, -204, -10, 25, 66, -257, 73, -15, 124, 64, -58, -7, -131, -62, 82, 93, 54, 126, 153, -70, 114, 207, 55, 144, 68, 156, -4, 332, 92, -83, -45, 4, -187, 140, 54, 81]
5367H1j76P8m6MJ84L5k22m9J63L7O3j12k2J16nk8j97p4O9K36j61j37K9K59j28
5392cl5j32Q8P1P9n8k7mq4J25j32K34J0Ll44K63K42j00j18o0L68n69J07K54O8
5417B46j65q7J95l12m7K26k2K77l68O3o3j37K92l20M14m18L55j60K60m66J68J96
5439A27k72j5O6K05j25R9j10O9J66Jk44J72j24l1j54M2l1L39j97K7n0k75K3m7
5463c39L57N8l17K84o2J04J8r4K07l91L7J3k5K78l63K94k33L67K8j27j92J75j47
5486g0n6K82j92n7J94l22K97j82n0j1L5J41J37j71j5j72K65k27L32J42l68R6o1
5509c3J39J8o3J34m17J02K60Qj23p6k7J57k99K79o8J18l7n0J1m0l9j65L33m09
5533b87L36j75K36k49M05j30j95L4Q3k51J84k6j82J06J03J59k84N18j98j52J09
$$ y = [81, -95, -17, -63, -59, 125, 160, -62, -111, 52, 89, 152, 40, 18, 134, 129, 101, -96, -170, -101, 135, -26, -163, -134, 125, -3, -38, -170, -82, -11, 68, 10, -17, -21, -105, 20, -112, 122, 132, 135, -209, 54, 296, 196, 78, 18, 386, -183, -76, 178, 246, 81, -6, 189, -123, -170, 56, 34, 311, -57, 6, -57, -194, 98, -222, 192, -226, 129, -31, 229, -237, -69, 127, -145, -160, -94, 111, -14, 85, -25, 44, 210, 211, -33, 139, 15, -16, -170, -128, -159, 180, -17, 10, -40, -315, -292, -339, 18, 76, -241, 43, -19, 85, 103, 9, 216, -175, -138, -125, -150, 128, -235, 59, -174, 193, 221, 94, -98, 77, -70, -126, 156, -36, -93, 101, -221, 76, -106, -156, -167, -132, 9, 146, -25, -40, -212, 53, -174, 158, 300, -68, 28, -33, 106, 124, 61, 195, -222, -120, 140, 148, 25, -51, -78, 79, -220, 59, -9, 109, 72, 22, 33, -7, -46, -211, 122, -287, 49, -126, 110, -139, 266, 136, -59, -25, 58, -193, -9, -35, -217, -111, -8, 151, -133, 385, 187, 35, 144]
5554A44QJ8m5o4k95J06R1k11L10k07K87m20K79r7J59L7j85R1j7ro6J19J92m52
5578b27J92k8R4J02j52j75K50j4K2J64j18R7M2j90l09K34k69K03Q7K04j53j29
5600g3J43J13k18J94R0j52L1j04j11K4J40l1J3R2k11M53n53L2M06k85r8J9QL51
5624B73l32r9J74j03j4J2N7K29k28j7K12k22j3k74L51m5q0J61k58R8K41K59m19
5647c7P7j79J57n1J06m1k2j6jJ07l62K80R9k0p5O0q9j17k2O1K53q7l84J70J35
5672BlJ01p2K52k36j37K15q4J65l35k4K18M4r4N3p1q1j53J36M7k02O9M8J73j63
5697a32N4j8L00j30M3L0k61K44k57R8L7j17K05p5k08N11l54J52j93k5K63l67P1
5720a29M9m0K48K1k16J22l2p3J59kk11k9J72o0N5P6k39l2N03j99r9j36J79l40
$$ y = [144, 152, 170, 125, 61, -234, -128, -37, -248, 62, -145, 142, -278, 1, -96, 63, 100, -85, 6, -11, -20, -86, 33, 225, -227, -35, -63, 31, 133, -19, -194, 56, 42, 64, 228, 110, 207, 249, 59, -250, -16, -285, -82, 5, 209, 56, -73, 70, 183, -35, 159, 249, 97, 128, 24, -87, -63, 77, 46, 59, 151, -60, 393, -160, -128, 278, -7, -105, -86, -78, 273, -59, -158, 16, -87, -101, -89, -32, 197, -31, -48, 164, -58, -71, -345, 6, -39, -119, 42, -216, -118, 123, 382, -37, 40, -139, 18, -33, 73, 32, 10, -6, -7, 100, -262, 18, 117, 97, 22, 82, -7, -124, -146, -85, 168, 81, -303, -133, 2, -1, 100, 28, 280, 44, -93, 122, 38, 203, -132, -156, 62, 106, 12, 65, -6, -87, -240, -104, -57, -259, -190, -142, 31, -132, -78, -96, 204, 74, 117, 147, -114, 130, -127, -29, 8, -109, 96, 21, -187, 324, -30, 122, -71, -96, 167, -200, -129, -80, -120, 128, 149, -67, 55, 23, -50, 109, 107, -104, -133, 39, -21, 34, 110, -129, -161, 342, 143, 44, -92, 87, -253]
5744b53J78K23j41k5J75o8m3R8M9j04N9j46j4J50k89L32k39q3O9r7J34k24M94
5767B35j76Ln4J04j03J5j0j12K29j25J68j90J36j28J48j57K25l31N8K36k15m8
5789i2J23L6j5k58J7J1n9M71k7j13J11k92m8K14R2O4k25j58qJ30j2j02N7n9J76
5814C4J30j20j43P0M1k6L8K7N3l0k63K69k26L21l13L55k08Kj60J78j13J6k30J80
5838a18K11m0Q6j8r4k68R0K24k71L25N3r9j58n1o6pL23k22j5q0K36K5K16k81M8
5863D9N2m1l1N9r3J76p3j67N5r5O3q1M8nkJ34J5K58l44J57j95J3M1o7M82m18J54
5890A44ol07p8K84N9k58K81nN4r5pL6O4j41J62k18K71Jk88L4j59J6J45j46J5J45
5916Cj09O4j9M8OK43j33j27J85l45L86k55J73j62K09Q1l28Q4K05m63J65L8o6J40
$$ y = [-253, -75, 148, 7, -18, 157, 89, 46, 144, 193, 89, 148, 2, -12, 138, -151, 181, -58, -141, -72, -169, -35, -259, 235, 59, 62, 8, 112, 9, 24, 14, -98, 131, 6, 174, -16, 120, -8, 140, -17, 208, -123, -65, 171, -44, -92, 31, 67, 52, -206, -189, -178, -237, 234, 207, 94, 205, -87, -135, 79, 171, 235, 10, -148, -156, -26, -38, -140, -83, -142, 34, 164, 44, -99, -29, 12, -14, 24, 51, 104, 74, -189, 80, -146, 175, -138, 217, 9, 11, -149, 29, -84, -68, -298, -118, 93, 53, 139, 121, 27, -241, -151, 73, -198, 127, 180, 81, -77, -128, -194, -201, 122, -100, -115, -195, 41, 66, 282, 1, 49, 101, 60, 29, 88, -5, 171, 98, -69, -14, -109, -46, -127, -79, -84, -86, 48, 63, 321, -23, 134, -61, -48, -7, -74, 408, -10, 144, 138, -169, -247, 37, 96, -162, 119, 114, 168, 73, 66, 102, 166, 25, 187, -31, 240, 241, -47, -13, -172, -156, -11, -157, -142, 3, -106, -42, -61, -13, -7, 236, 103, -24, 161, -184, 202, -53, 120, -42, 167, 248, -80, 4, 209, -254, -89, -51, -117, 23]
5940B3J64j4k59J50k46K63J56j25p6o4K31l19L00l31J83K76j88l02N6Q9N9j65
5962a39k12L31j4j81K35L4M0j60KN6L0J54j68QR4J3k32J09j15j21J97j77Q1n7
5986a92K37j91J85r0r8K24k39K11J63j6p7Kj78j74K89j25J06m3J01m9oJ8j05J44
6010I7j32o0q2R1l3J00K13k75Q2O6j56M8L2J63k67N3J02j96R8j14L59j50r0K71
6034B20l84K36j78K11j50K03k30J0K78J1k69R7J47r6k75K63J82l99Q3K84l73J95
6056F6J63k70j47Q6K63k03K16p2J8k06J02oj2j14M02m54P9M08l33j70K99M1qo8
6080H0n3q8J96j69k2K49j35K9J37k88K25p0n5M3k41MRK95m9j0j30K45j26n8J13
6105A31k11k0J7k31J67K15k02K30O3l41K97j35j45K41k53J12N5M0m5K08j97k46
$$ y = [23, 187, 173, -86, 64, -182, 81, 237, 112, 36, -28, 203, -116, 184, -147, 36, 312, 124, -178, -122, -33, 26, -139, -351, -20, -34, -215, 20, 54, 94, -66, -64, -8, 22, 176, 8, 16, 110, 123, -109, 0, -115, -236, -39, -216, -135, -192, 45, -146, 39, -51, -149, 75, -164, 47, 210, 194, 117, 119, -59, -233, 56, -69, 37, -6, 95, 46, 40, 58, -47, 97, -35, -95, -177, -86, -119, -19, 194, -81, 1, 67, -89, -41, -9, 154, -113, -60, 42, -154, -56, -170, 189, 39, -51, 220, -164, 72, -106, 105, -45, 158, -72, -62, 216, 227, -42, 55, 202, 106, -169, 94, 276, -123, -40, 244, -129, 66, 229, -41, -188, -102, 161, -42, 174, 102, 120, -86, 16, 10, -2, -116, 286, -168, -89, 319, -14, -184, 115, 156, 148, 80, 27, -61, 135, -34, -56, 193, 58, 87, 224, -64, 161, 91, 36, 79, -162, -158, -149, 146, 97, 87, -43, 202, 76, 18, 131, -80, -100, -83, -314, -147, 68, -134, 96, 159, -182, 115, -20, -165, 76, -177, -65, -10, 30, -15, 193, -4, -250]
6127b50L37l7k6p6K5K7P2n2j37J35k43K91l12L88k36K3l3o1K45p0j87K70k91K67
6151F9j34L53k37j19M3j60O0l6J75N7p4lj76M23l45L8q8L63j55p6k59J34J52j34
6175a29J63K6P3k56O4K88o5j6j69oj07Q0J40j12k5o5q5M54k14m1R9O1j38k14K86
6200I2j39K08k00N4P9r9J0J43j37L0q4P8k6j18J5k46J49L22m23L82j20Ro8R2K21
6225B24k17j46%K29j5Q9k83K96r3j64J88k02j72R2K61kJ09j61j64j69K41L54n32
6248b37K00K56k42J72j02K26k53r0R5P1J48o9q8o1j88N08l43j5J4j56K04j05L4
6271b1J8m1J61m5k4K19j31l35J21Q0k35L31O7q6J01l16J38O2L5j31n9N9P6P2l0
6296H6On4l21L27m1k57J4M69l71p7M25k08J08l9k2K4j57K73r8o6J79p1j63p0J34
$$ y = [-250, 87, 50, 24, -52, -27, 0, 72, 20, -117, 18, -225, 66, -246, 142, -94, -71, -104, -165, 80, 10, -177, 93, -198, 69, -65, 288, 51, -68, -25, -185, -125, -161, 14, 71, -3, -6, -182, 241, -104, -66, -154, 209, 54, -22, -281, -147, 5, -129, 34, 60, 133, -123, -59, 229, 164, 148, -21, -27, -134, -54, 86, -26, -51, -116, -201, 253, 39, -2, 97, 158, 20, -194, 92, -47, 161, -39, 15, 94, -5, 5, 148, 11, 41, -43, 35, 9, -109, -94, -340, -191, 131, -292, 90, -30, -21, -89, 3, 224, 7, -139, -139, 90, 75, 164, -119, 177, 84, -80, 108, -94, -266, -174, 87, 85, 194, 33, -131, -300, -59, 295, -237, -37, 219, -23, 149, 47, 273, 20, -70, 25, 96, 244, 175, 87, 26, -162, 346, 3, -12, 2, -154, 50, -55, -21, -3, -44, 117, 72, 48, 267, 136, -199, -78, 2, -233, 98, 165, 79, 180, -136, 2, 64, 99, -32, -91, -32, 44, 116, 86, 92, 38, -283, 44, 3, -254, -240, 229, -142, -219, 206, -2, 106, 67, 45, 69, -88, 185, 87, 21, 200, 129, -34, -104, 30]
6321C0k01J70P5N2k01J22J4L0pm6l6j51J72k4J95j40j00l4K1l0L2J50m43N01m8
6346A03p1j98M11q9k87k8rK09O5l7P7k6j70P3n1L1j2j6M5r0jJ02j72R9n3l7K68
6373A36K3j65J8R7K14j68k86L52q5l44K30J66m32L65Mk29J26Q8n02L15rm6P9J32
6397G9jj40M9J88l8jj14j04N9K07j75j35J06o0L12l45K47k27j25L83j64J2j6k80
6421b83M39k90M40o00L84o9q8p3Q4N4j07j38K47L2k48N3J42J1rj31J15j88N04
6444B81k89P0o6L8j3k71L24j07J67m41N05k42P7k82L57k74k3J35K67k23j61l3
6466b04M6o2M31m49K93l5nPk13L26m29M11P4l3m57J42K83j35r9K70j46o7J44j01
6490hK8m5J62k86M6M2r2M0J08K02K5l13J53l7J21l26K74p9m8j10J7J5L10j06K2
$$ y = [30, -171, -1, 74, 126, -75, 47, 61, 91, 84, 38, 2, -149, 23, -1, 194, 54, -46, -80, -59, -89, -57, 93, -350, 151, 103, 32, -166, 245, 156, -131, -159, -168, 41, 106, 69, 146, 120, -50, 23, -28, 3, -9, -25, 20, -70, -71, 31, -141, -42, -95, -132, 136, 159, -6, 12, 109, 323, 155, -131, 221, 136, -208, 22, 188, -244, 121, 125, -104, 22, 110, -392, -77, -86, -132, -53, 79, 78, -62, -13, 175, 137, 136, 22, -82, -23, 184, 9, -126, -20, -80, 232, -113, 134, -93, -218, 165, 1, 13, -3, -283, 156, -134, 306, -294, 90, 21, -67, -140, -56, -2, -109, -247, 0, 32, -216, -163, -21, -10, -19, -150, -35, -223, 281, -8, 62, -4, 34, 21, -250, 74, -33, 134, -307, 198, -44, 33, -249, 108, -166, -189, -54, 213, -10, -171, -204, -158, -220, 211, -238, 55, 20, 15, 22, -191, 135, -294, 117, 191, 158, -299, -157, 126, -9, -108, 162, 16, -51, 93, -8, 20, -25, 137, -149, -103, -61, -153, -113, -5, 197, 222, -91, 62, 25, 146, -180, 94, 15, -33, -143, -126, -111, 199, 93, 115]
6515A15L8p4j86J00j96J66K35k94K24k5J46j34j33K9M2k0J97k32M4j1J6r9R6j0
6539C4J32l41j18K56R1k71K20N3ok7L02j32r2o6R8r5k39K84k0N8l41K86L0j22
6563b6O7k03K79l5k22K35m2j04j69J74J63j53M2j6j0J01j32N1j32J5m4R7lJ60
6587I3k57J93l6J91j68J19Jk86J86q6Qj47k6L94k39J62j22O3M8Kq7J5p2K58j65
6612D2j94M43l05M7l00L21M7k61K29k08j69J75k3J87N0m6j61J0o6J79j42L1J22
6635Hk44J81R4K42j74J48j37j44O9j68O8k8P4j8j0M8J08j9j43K05l1j85k0j15
6659a91m9K95j50K00P4j53j22M1Nk55L94o6J63k31J19m02M10p6K10l91J69K02
6681A96k9J31l65K0k47L62j65P9n0j2N8Lk67J08J1N5jK97j36J32j10r4K25l48
$$ y = [115, 153, 79, -107, -7, -203, -37, 198, -96, 128, 103, 249, 115, -18, 11, 53, 33, 230, -2, 42, 31, 47, -52, 44, 34, 166, -175, -293, -37, 54, -217, 3, 56, 50, 23, 325, 193, 101, 35, 133, 38, -201, 83, 63, 121, -220, 66, 96, -26, 41, -162, 117, 82, -140, 95, 53, -51, -220, -46, 117, -36, 6, -10, -20, 81, -51, 0, -132, -117, -161, -64, -67, 93, -164, 29, -7, 184, 16, 135, 136, -150, 36, -50, -42, -189, -215, 179, -60, 102, -20, 43, 91, 93, 6, 21, -51, 207, 42, -152, 291, -14, 33, -267, 54, 101, -160, 69, -139, -308, -133, -156, 31, 81, 35, -126, -116, -182, -3, -145, -114, 8, -236, -55, 39, 281, 107, 255, 118, -26, 43, -125, -57, -85, -11, -29, -39, 9, 117, 98, -45, 160, 129, -56, -76, -191, -240, 55, -95, 105, 179, 26, -96, -55, -50, -305, 89, 23, 186, -45, 74, -328, 82, 6, 216, -175, -6, 196, 167, 298, -67, -47, -294, 68, -97, -18, -68, -80, -22, -19, -286, -178, -167, -112, -113, 184, 48, 180, 70, -24, 201, -147]
6705a47J23k30K28L06k48O7J7l83M81k47o9J22O9K61m49L1k53J42L92k6j29r7
6727c9J38q7J52j46j96l7K93j15Qk2Q2J08k15J62p4j08K2J27j13J24J75j98j23
6750h2K13k81J85o3L7o2j3Q2p8K38o9j30l0L26l48J45K0l79J88m12L06L36k21
6773i2J12J41j96n2j37K51j5m3J41j32R3L3k6m15M73m5m13L53k98L42k67J85%
6796gn9N9k22K06j51J40N8k27L01j0k27J55l1k20L88p4j28N5OJ64j69Rj08J15
6820B3j05k69M03j39Ok16J91P0R4l0j37J60j19L48k99Q7j1J32m63L02J56j61q8
6843f5K61j04l2N0l2o9k41J96j00M4p3K63p5J35k55J03j85K00k5k0J33j12oJ17
6867A08j4l51K77Q9J16k61j83J89K70j62j03j52K04K2J42JM1k75Q2p9M01n85K17
$$ y = [-147, -24, -254, -26, 280, 32, 99, 116, -267, 214, -33, -102, 20, 89, 350, -99, -68, -321, -179, 213, 187, 58, -39, 99, 12, 164, 18, -178, -215, 78, -37, -29, -51, 31, 139, -76, 86, 12, -96, -74, 53, -60, 64, 239, 41, -82, 131, -150, 35, -28, 9, -53, -66, 16, -62, 176, 107, -23, -53, 273, -75, 70, 90, -289, -101, -513, -207, 129, -92, 20, 161, -35, -87, -224, 27, 12, -31, 110, -22, 71, 104, 78, -337, 136, 91, -322, 31, -267, 75, -192, -7, -7, -66, -7, -229, -23, -174, -34, 24, -203, 98, 88, -139, 16, -15, -235, 153, 79, -49, 6, 12, 176, 7, 16, -92, 23, -82, -351, 52, -87, -81, -297, -106, -36, 58, 28, -109, 51, -68, 280, -19, 68, 57, 189, -274, 28, 184, 23, -65, 196, 92, 60, 110, 78, 9, -232, -36, -136, -92, -165, 98, 23, 158, -97, 6, -179, 21, -4, -24, 109, -3, -9, 108, 94, -257, 20, 109, 225, -36, -219, -30, 240, 78, -25, -177, 27, 49, 191, 192, 233, -42, 40, -39, 362, -223, -6]
6890fk24L65j11k34J72M0j7PM6N6j16k50K84m2K21j83r4K54R8k59N9k66P0K60
6914A30l34K29O9p1j00K63j7NKm08K69k79M38J6k83O0j05P0O6K79o58N76j35J43
6938B25j65j22J16J4j12l8L17j77J27r5n0k75OJ90P2n0M1K0j17j58K66j71J19
6961a7m4M3M6K7k29J57J4Q5n53N69K02j52n2k5k47K55lj53J02K2P2m51L70j5r6
6986g3p9R1r1R1J21J53k46J32j85K84j42j26%K5j50J72P8p6P0L4r3J6J8m7N8k22
7012a87K75j9j61J28r7k2j46K09J10l5K2j51Q7K54k74%L4j32P4k21K78N5k89J75
7036c3j3L1J40k02r3K15Q5K9k93n6L30j01J2O9r8j46L01kk70J78q7J94p6J51k01
7061F4j83K03l7l54L40k27K92k29K56r8J06k03L39j37j63O7L5L6j78L93l31KJ9
$$ y = [-6, -230, 135, 24, -210, -38, 2, -15, -8, 38, 94, -22, -272, 12, -30, 191, 8, -86, 168, 266, 7, 66, -200, -130, 130, -204, 25, 94, 23, -77, 186, 169, 174, 176, -232, 37, -242, 196, 212, -71, -11, -116, -46, 20, 299, -359, 217, 82, 225, 60, -62, 54, 68, -44, -82, 235, 58, 185, 90, 40, -235, -229, -39, 33, -17, 24, 44, -73, -231, 35, -136, -17, -61, -18, 28, 55, -174, -17, -3, 82, -471, 98, 300, 148, 96, 71, -176, 79, 76, -77, 25, 47, 119, -332, 38, 23, -73, -152, -61, -152, -61, 60, 213, -33, 99, -86, 198, 56, -70, -70, -45, -195, -23, 55, -21, 49, 83, -10, 6, 24, -23, 35, -187, 88, 69, -92, 36, -61, -83, -229, -20, 90, 55, 77, -74, 13, 267, -7, -7, 27, -105, -31, -252, 26, 81, -208, -33, -46, -15, 125, -77, -170, 45, 130, 159, -134, -190, 140, 39, 51, 120, 22, -124, 177, 175, -95, 83, -4, 190, 114, 265, 64, -119, 84, 47, -307, 33, -194, 98, -131, 125, 27, 133, -70, 269, 132, -31, 36, 71, 107, -71, 322, -9, -7, 12]
7084A2L7o0r2o1L2R3j37n3L09J54j95N7Q6j25P1k9j68j02J93j01K45k12J09J06
7108A69k40J35k16J02p8K93j02l0k28J62j3J46j64j23L71j87K08R1p9j99Q0j44
7130d6l2j2NL1J24q6j67J30J76l1l33%L87o2p6L4Q0l92J95p5LJ89k30K05K31j84
7156F4j72j6L19p0k59K98j51JO5N3M7m02K64K07k03j6K93l17j1K02j42j22j12
7179a80K0M38k88j7K2N0l1J14p4l8O0j36J27k08J56J5M9p5j21L07P3j42j40J44
7203A25j10L2j9Rj31J4J02q4J08n7J17j26K25j56p1K7j69J54n0L8J47J44k20o1
7227a2j86K04N3k02J66P4j55r4PJ15J57O0k62J63j91J22m2Q8k02J44m2j43J92
7250A4p4L12j07j81L70k87j54J72j08j57L61O4Qj45r9j81J90j77K77j15K6m3J10
$$ y = [12, 49, -11, -103, -164, -132, -39, -176, -229, 80, 234, 39, 96, 182, 57, 128, 99, -69, -171, 22, -79, 166, -46, 63, 169, -71, 64, -152, -50, -128, 165, 63, 33, -195, -33, -46, 100, -64, -187, 184, -3, 205, 296, 217, 18, 98, -46, -78, -90, -85, -54, 70, -16, -183, -53, 123, 92, -241, -241, 146, 84, 8, 42, 122, -270, -75, -150, -147, 42, -188, 17, 248, 64, -108, -124, 195, 125, -134, 164, 13, 14, 79, 132, 179, -223, 41, 248, 45, 29, 322, 5, -6, 196, 54, -68, -180, -160, 278, -10, -27, -5, 45, 14, 128, 54, 16, 76, -60, 67, -141, 15, 30, 79, 4, -117, 190, 263, 121, -19, 125, 15, 47, 28, 37, -94, -80, 22, -62, 46, -11, 106, -20, 205, 49, -22, 5, -164, -10, -60, -22, 125, 269, 49, -12, -198, 6, 59, -143, 23, 97, -58, -152, -145, -30, 127, 187, -75, 88, -103, 19, -23, 65, -137, 7, -35, -178, 14, -60, 252, 145, -36, 334, 47, -107, 65, -43, -200, 161, 225, 233, 88, -11, -192, -2, -179, 98, -17, 9, -34, 76]
7273G6k39M2J34M6j28OpL3q1J32k9K19q9n0k22L87n32J92P7j45P2lK3K1m6J68
7299E7K3j14J36r6r0P7N9j32q2J43k00J37Q4j32P0J05j06K4k72K87J77q6L4k10
7323a07L2R1L3j8L5l4JQ1p4j5K9j21J99k41K21k50j41K75n9N5l9Lp2O9l5j14K72
7350G6k80J94NQ4K0k14J0j31L01J05k48J32O5j69j90M01l10K69q0q7K60l15L10
7373B08m42K94j92o3J0J42J07J75k68L71l45j26J40J17k2k44K15o5Qp6K04m1o9
7396C8O0J0k4k93J72P0Kj35j7L1o1J69k00J71j26J04J58l58K06M4J38o1J01k35
7420c6L8J2J32l07J32j23J67j37J87l31L19o9k24K9J78mJ42o8r6K97k05qk58K84
7444E1l37L70j77Pj13J02N0K4m9P8O3N7j05Q5k24J64Lk02L69k94j19J59R3j09
$$ y = [76, -163, -121, 13, 59, -69, -63, -70, -37, -118, 14, -15, 204, 115, 65, -157, 230, -302, -110, -33, -178, -106, -109, -86, -65, -111, 57, 80, -34, 102, 6, -84, -7, 52, -80, -162, -19, -219, -82, 2, -130, -60, 45, -61, -37, -309, -22, 155, 69, 103, -107, -75, 16, 49, 31, 66, 32, 33, 114, 40, 25, 54, -67, 132, -109, 112, -138, -279, -4, -63, -8, -47, -44, -116, -47, -82, -196, 76, -204, -10, -5, 79, 99, -115, -105, -236, 65, 170, -78, 54, 119, -50, -240, 161, -149, 120, 40, -47, 213, -102, 208, -234, 60, -132, -195, -185, -43, 64, 239, -29, 342, -3, -129, 11, 128, 106, -138, 77, 12, 20, -56, 148, 107, 38, 98, 108, 84, -209, -37, 33, 35, -100, -117, -86, -147, 22, -178, -7, -133, -29, 129, -229, -23, 21, 159, 98, 199, -36, 2, 14, 146, -161, -29, -152, 15, -122, 65, -266, 53, -16, -240, -211, -33, -37, 105, 37, -59, 238, 33, 25, -233, 51, -286, 84, -93, -86, -199, -97, -47, -23, -72, 6, 69, 126, 21, 106, -118, 46, 49, -153, 216, -78, -197, -38, 55, -54]
7468e4j26J88k48K16l6q1J20J33j64m5n9J75l3K64p9k13o9m0M8M16j31j80j6J30
7492A16j42J40J02k20o1L38j19j50j0qM9K46o9k24J85k20J71op9k06L44j58j77
7515a58L05L1l51N9N6K78k77m9K07M1m1J72n13O3n3K76J6q0n5p7PK06r2R0J18
7540A79j58K03j88j18k9J74J38J1l89L24p2J20r1qQ1J0m87M26j4r6k0J26L4j12
7564D4k90N16m20o3J3Q4r7L33j77O5J56l05M58m75N2K11j66m4m4K03P0rj20K34
7588B29k89L4J17L9m7p2o4J38J75j38j06k03Q7K16k92N4J17j31r6K82J01Pk47
7611h9J04J2j82M7R0j65L75l6J56l65J50J05j80p4j22J05M2Q4J41j55O8k96L38
7634A53k7l58K39j61J78k9J11Q0k40p9J15O2r9K80j27m7J8k04q2K33j31J13L23
$$ y = [-54, -180, 8, -240, -24, -60, -141, -21, 112, -52, -97, -156, 19, -14, 250, 171, -42, -111, -151, -103, 313, 182, 2, -14, 116, -26, 114, 216, -4, -65, 273, 154, 4, -6, -14, 35, 281, 212, -12, 173, -47, 124, 118, 39, -167, 177, 19, -158, 147, 178, -173, -114, -58, 220, -57, -106, 101, 142, 101, 273, -240, -177, -230, 46, 62, -18, -73, -150, -143, 63, -29, 61, 179, 21, 224, 36, -82, -111, 63, 201, 212, -177, 147, 75, 195, 104, 96, 177, 187, -300, 126, 112, 16, -4, 122, 156, 44, -246, 270, -150, -213, -200, -116, -213, 120, -57, 8, 164, -141, 317, -158, -106, 105, -61, -105, -149, 54, 124, 115, -5, 229, -60, -26, 91, 130, 83, 11, -53, 85, 260, 122, 16, -187, -100, 116, -176, -122, -5, -136, -232, 50, 151, 158, -89, 15, 27, -155, -108, -18, -183, 192, 156, 312, -53, 97, 202, 22, -52, -174, -69, -27, 57, 198, 43, 111, -185, 153, 126, -232, 7, -154, 24, -5, 106, 186, -54, -133, -18, 44, -55, 225, 98, 51, 69, -135, -217, 16, -115, -2, 321]
7657C21k30j15J42j81L1j91J8K09P0l18J90MR3j0q8l5L47j09j54k6J13m19K05
7680a33K49j87K79j98Q9nl3p7J48P9k17K15l23O9Rk11L18J39Q0m28J30J18j85
7703g5J06j98L10J66l25K7j3K4k05K09L3l6j59K73j07K85l91K0J24k42J56j1M0
7726A1k12J35k42J99N1oJ4j2M1J77k55J14l6J7K55k38J62l46J23k35J71J48m4
7749hN5j50j63J62J55j52k8j09M6J92N4K24l20QJ56Q5j98n0J44%p9j09J94m5m8
7774A6J40k17j36J19P7p5M4k68K72n3L1M4p6J35o9K91k48r9O31l55j98j18m4K11
7798E5o6j19M99m09J62O5k02p6K03j78j86J94j0J60Q9l65L13j11j90P9R1J22m7
7821G3p3R8O5J5k17M8m7K15k51K4L9j90Q0L18m33K61k90L62k24Q6K2j68M34O8
$$ y = [321, 91, -24, 118, -63, -32, -223, -205, 4, 74, -244, -54, -50, 43, 33, -55, -90, 257, 148, -6, -32, 81, -338, -133, 116, -71, 208, 10, 99, 94, 61, -16, 132, 211, -6, 209, -114, -45, -36, -247, 71, 210, 290, -138, -8, 110, -75, 31, -167, 143, 309, -16, 11, -2, 22, -183, 26, 59, 23, -136, 137, 30, 315, -76, -56, 68, -174, -18, -29, 11, -201, -66, -308, -109, -58, -64, -50, -62, -21, 156, -99, 15, -21, -4, 251, 13, 175, -171, -48, -283, -112, 36, -8, 47, -103, -266, -104, 51, -101, -129, -238, -192, 0, 54, 278, -42, -34, 122, 207, 9, -41, 103, 103, 24, -85, 109, 64, 16, 156, -61, -197, -78, -1, -76, -32, -300, -28, -81, -50, -6, -82, 53, -16, 275, 27, -72, 559, 204, 6, -112, -156, 55, -11, -130, 369, -40, 122, 187, -15, -91, 112, -66, -252, -58, -68, 92, 181, -184, 129, 18, -172, -93, -2, 120, 73, 0, 98, 163, 178, -39, 9, -38, 177, -74, -50, -11, -201, -121, 197, -236, 25, -265, 97, -127, -41, -19, -187, 247, 315]
7845C15r9l28L15q9j33k7K2R0O9J7m71K90K81n39J93K05n4Q7j76L37m45NJ81j33
7869h7J53K6K22j59P9j02o4j17k37L54j46J20J03j27r6J43L25l85K91m95j34M05
7891G2k9k1n4l1j26J81n1L43m99K52k4q8K3J89j4J8k59K56j15L28j90k35J53q9
7915a0P7k10Q8J95Jl00L92k98J79k11K22l43j6M84j19m49K29K11j06L5j08L6k47
7938b68M09j75K50j70j08J25k29K44j26N9r4Q7pj70K56j8J6p0j67J2K13k20J31
7961b0q2q5K32P7j46l7J6p3J71MJ16k4l75K25J84j02j9j40j13j15M80o3j82L4
7985c7R3K45l65k3L17l10J14k9p9J94m28Q5L70l49M5nL48l4l55L81l4l08R0O6
8009hoj26L50l51J08o7Pp7K63n6p1R4k9j01k6K08j76J0J4L7j36L25j96J31k38
$$ y = [315, 216, -112, 203, 114, -19, -46, -24, 66, 135, 152, -319, -29, 252, -287, -94, 111, 57, 144, -32, 305, -140, -135, 46, -87, 66, 92, 314, 155, 234, 132, 68, -49, -286, 68, -78, 42, 145, 18, -78, 65, 390, 5, 296, -199, -333, 72, 43, 22, -32, -63, -189, -8, -59, 284, -215, 37, 13, -75, -52, 137, 123, 141, -118, 138, 23, 351, 161, -74, 79, -10, 67, -143, -55, 140, 141, -159, 233, -65, 114, -97, 125, -218, -234, 250, 131, -318, -89, 122, 16, 51, -57, -21, -268, 141, -34, 216, 46, -62, 63, -166, 78, -48, 11, -83, 4, -3, -173, 83, 65, 81, 11, -156, -144, 69, -151, -20, -102, -187, 45, 122, -24, -61, -45, -118, 53, 57, 173, 149, -226, -1, 183, 81, 62, -78, -191, -306, 174, 111, -71, -37, 56, 301, -64, -87, 230, -80, 34, 5, -74, 120, -308, -223, 147, -202, -157, -162, 186, 152, -203, 178, 144, -164, -74, -8, -14, -140, 210, -141, -33, -100, -93, -170, 93, 37, -34, 60, 31, -70, -96, 112, -64, -54, -40, -3, -139, 186, -10, 121, -117]
8034a17J76j03l5J77Pj78J27j27J67r5N5J27p7jj24K9M2L7mo7r2n4J38J00K2L6
8060A66j69J61k81K06J72l31l3j2K05k00Q0L00j11k44p1Q6O1K73o12J31O58r41
8082e06n7J040l16k09J17k51K52j44J81l43M72j00J42l13k1L10n15J14Q2OJ66
8103A07k57j84L7L66j29J04o4L37m87j34K63J11k37J75N7j86K52l11J29O0q1J16
8125D4j15J22K22j62M5k32K15l37J48oL9r1J73J03m7k19J11j63k8K34J57k37J
8148b3k12J58L3Q6J77l08J94m4j37J37l30L48q1r5J73ok88L00Q4p7j79R3O3N2
8172A18j35J25O7k54m4J93O2j06j08L7J9j97L6N9Q1J03j55m7J66
$$ y = [-117, 59, -44, -79, 98, 105, -73, 54, -73, 94, -1, 54, 181, 104, 103, -21, 8, 50, 87, 83, 16, -76, -130, 8, 108, 130, 166, -3, 158, -123, 83, 255, -76, -109, -121, 84, -116, -36, 264, 153, -91, -162, -76, -15, 258, -354, -223, 435, -506, -563, 477, 161, -48, 69, -182, 70, -74, 107, -236, 236, 136, 278, -35, -56, 254, -261, -147, -65, -59, 107, -150, -334, -297, 69, -60, 44, -20, 317, -170, -304, -41, 70, -167, 8, 65, -121, 131, -180, -51, 9, -72, 44, -71, 51, 273, 111, 156, -76, 139, -198, -50, -56, -17, -108, 65, 168, 121, -98, 13, -150, -178, 56, 213, -24, -23, -235, -77, -44, 42, 219, -89, 105, 61, -76, 61, -269, 79, -2, -97, 76, 70, -218, 82, 166, 89, -90, 3, 66, 118, -17, 108, 175, -79, -123, 70, 132, 26, -82, -45, -26, -223, -187, -128, -47, 56, -99, -146, 20]
8191B0
$$ Imaginary data points
##PAGE= N=2
##DATA TABLE= (X++(I..I)), XYDATA
0@%%%%%%%%%%%%%qJ6j6J6j6K4l2L2m0M8n6O4p2Q8j02J14j30J50j70J92k16K44
35A30k75L07l43L81m24M72n25N85o48P13p86Q67r55J051j156J275j407J552j712
54h98J893k099K335k606K922l300L758m324N046o004P331r296J2489j8488L3303
69B2062j30413j53793M35191p0156l29852K26258J86811k61317J5702J81526j36135
80a4116m2518J65635j21574j18528J98208P88k20081J25865J85744j82472q7594
91a10643K10689k1201j87005R7631R9761j58560J302J48000j03502p2685J83406
102H7193k5802j74749J41897J02266k11605J2357J86505j38742r6653J91173l9166
113C4674j43933J69060L4801k08537J09778J54074k23590l8517K52722j01228
$$ y = [0, 0, 0, 0, 0, 0, 0, 0, 0, 0, 0, 0, 0, 0, -8, 8, -8, 8, -8, 16, -16, 16, -24, 24, -32, 32, -40, 48, -54, 60, -70, 80, -90, 102, -114, 130, -145, 162, -181, 200, -224, 248, -277, 308, -340, 373, -413, 454, -501, 550, -606, 669, -738, 814, -898, 995, -1104, 1231, -1375, 1547, -1753, 2005, -2319, 2727, -3277, 4054, -5242, 7247, -11241, 22062, -108351, -262144, 173047, 102891, -226961, -703, 186108, -75209, -59507, 122019, -14116, -56634, 109001, -12573, -131101, 67107, 67895, -152186, -26321, 159423, -23049, -110643, 100046, 78845, -108160, -10529, 89232, -69328, -68026, 79974, -23528, -96213, 87193, 61391, -113358, 28539, 130805, -80800, -68443, 118062, -20680, -117333, 73840, 34674, -109259, 59801, 94602, -113935, -4157, 149917, -73673, -112190, 140532, 39304]
123C9304k09608J88979J01450k11663K1305J80871r0224r6627J10794M095r0320
134e1644N8472L1467r0241L6771P8067j02837k9281J51369k9334j44832J04052
145A2029R9893j61483l3048J61752n2286j18137J06832L6355j07229N2594N9681
156E6953r6045K8768Q6823j09444l2838J34732n4920j14260J18442M9952j30318
167f2155L6204J03509q5649l4017R5531l9960p1549Q1661J4722r8570L9048Q4395
179F3170p5191m1617R8205L793q9011L1219N3280o0078j8047N3669k6009k5530
191c2147N9110j6782n7583P1004L2717j01954J6906R8023p3578o9326R7550J5733
203C9673q7541L7100N4157n4199J183M2478m2205m953N2208m4791l8987P1545
$$ y = [39304, -170304, 18675, 120125, -91538, -70233, 110638, 20414, -76213, 34581, 38676, -51644, 6828, 38295, -51946, -15175, 62892, -39945, -69226, 82143, 52809, -92023, 12029, 111922, -49561, -82609, 79143, 26857, -91280, 15552, 51907, -55322, -2728, 56953, -39092, -10324, 76499, -32945, -65783, 68949, 14029, -100231, 18211, 68163, -62155, -25951, 77558, -8091, -42108, 53423, 13463, -58086, 23575, 38297, -60273, -21225, 63170, -12021, -53638, 44567, 48360, -40651, -9432, 43848, -16230, -34277, 19392, -6617, -32147, 26963, 10181, -47402, 23602, 56319, -45635, -28729, 69294, -4284, -73610, 23940, 39673, -47868, -10768, 43389, -10810, -9627, 32851, -9354, -14307, 37901, -6890, -45877, 25668]
215B5668k87p5218M1016N9440o0330k4170O4103r610n1515K8998K2417l8290L137
228a4641K9071k4094p983L8298j1337l2006L6090J6045n1523O369M6912l3603
240b402k9527M7594J235m2305K6886K3236l7279R245L0917l7411j0730M4371k3378
253D52l6758M5966J3360m9768J5152L9101k9194j5652L1167n861j9876J6708k890
266A907j8684K1528P775k9773J1571L3747k4779k4811L3853J1341l8274p68L0823
279A5456j0676k0638J4054P228q652O380n73r327J4492N045k9146K077L1592j6690
293F22k6627K9801J6088l0143m97K3456p640q250R037n850k977J0902j1836j1892
307a5806K4091O826k6482N713K3857j4902j7235J6050P177j2924j830M038j751
$$ y = [25668, 25381, -49837, -8821, 50619, -9711, -33881, 30222, 20612, -30903, -1905, 20512, -17778, -14641, 14430, -9664, -17647, 20651, 9314, -22692, 13398, 29443, -22080, -15711, 31201, -2402, -31929, 15665, 16900, -25405, 1481, 24717, -12562, -3317, 27600, -9811, -20541, 23830, 452, -36306, 9660, 23020, -26748, -11596, 27505, -1689, -17341, 13826, 7965, -11911, 4797, 1907, -16777, 4751, 12526, -17247, -5676, 28071, 3292, -21519, 12334, 23675, -14599, -15367, 15456, 4780, -15858, -1804, 5424, -3228, 3152, 2579, -6748, 7744, 12789, -16357, -14280, 17312, 622, -26005, 3796, 19884, -10259, -10756, 12700, 5060, -3190, 5847, -3, -2980, 7922, -3914, -15806, 8285, 15111, -11371, -5658, 18199, 3297, -13938, 2112, 9289, -3635, -5465, -1427, -3178]
320c178K509J60o636P644J1377j2502j0169J5193M811j7646j008J7290j614j3278
334g047L660R165k543l357j06J764N998m472j2135N731J2707j1244j0077J6488
348D532O261j6659k096J2133j545n949J099L64M147M48j1259J581J6053n175j3991
363a0056J1307J1153j4042p206J2198K463o779l80J703K456J404p624k167J1552
377E982J132j3325J608J2677o270j3053Q285R810p462m724N883J313k834p46j497
392c221L096O785n706r888J1088P162j6205m07J8946n053j5643R369O819r912
406b770K62O104m273K168K845j1318J882J4835j0262j1553J6607N391j9023K34
420h871J6599n273j0209P448M769n278M61j91k459O402J800j1295K486J5115p854
$$ y = [-3178, -669, -509, -7145, 499, 11876, -626, -10795, 4398, 9209, -8437, -9445, 7845, 6231, -7047, -3387, 5778, 3235, -122, -228, 1536, 7534, 3062, -9073, -3342, 9365, -1879, -11956, 4532, 10793, -5866, -7962, 4171, 2626, -3323, -2224, -1860, 2287, 2735, -8524, -6943, 9110, 3935, -10056, 1251, 12404, -1638, -8844, 3354, 5817, -962, -1342, 361, 2817, 4221, -3403, -5570, 5982, 7114, -6211, -4603, 8074, 1804, -11249, -2964, 6846, -616, -5340, 543, 1856, -978, -1724, -3221, -125, 6660, 954, -8934, 2154, 9316, -6889, -7296, 11650, 6597, -9046, 323, 7142, -2770, -2508, 3596, -677, 1491, 4336, -6982, -5100, 9735, -527, -12080, 4527, 9918, -9105, -8871, 7728, 2455, -7754, -306, 4463, -815, -354, -545, -3004, 3398, 5198, -6097, -3611, 11504, 3650]
435C650j6293J4140J2382j8952n570J9724k110j5111O784M769o649M911M27j0000
449g898R615Q587k0598j825K6045p785k2184J6497J3422j8978m445J4844j184
462D113n719L221l226O7Q771o326j0127J3981Q416j9780m807K0849j438j9736
476a1741O575J6116j0360r715J0436J400n510M847l441n972J3075L01j9899R983
490c905K0909j9369j3605K5931K330k3292Q104J3293j2179j625P742p934K589
503a011J0310j2213o482J9285j592k1069Q861J6907j4098j2022J4497N929j1708
516d406j271Q010J61k807J43l176K711Q056q956r974J6890O853k2529J164K4793
531A5662r655j9769J6136R312j6252O25P979p294M361M394j5009M838J8967j6030
$$ y = [3650, -12643, 1497, 13879, -5073, -10643, 9081, 6971, -8140, -1356, 3413, -3236, 1675, 2102, -7898, 1717, 10304, -10294, -12119, 13926, 6141, -16043, 454, 13876, -5102, -9547, 5297, 4113, -1606, 1615, -1611, -1544, 7227, 901, -9226, 4755, 13171, -6609, -11416, 9433, 7995, -11741, -5166, 10950, 590, -9125, 1311, 2711, -2799, 2048, -1393, -7365, 5710, 6011, -13888, -3905, 17004, -2365, -15970, 9961, 12291, -11001, -2897, 10396, -1783, -3408, 4334, -3600, -1011, 9299, -2914, -9396, 9889, 8297, -12772, -3911, 12996, -1102, -13124, 1373, 7302, -4406, -5677, 2333, 2494, -313, -170, -3346, -635, 7421, -1535, -11509, 5381, 12234, -10295, -9131, 15662, 6007, -13762, 2374, 11686, -4566, -3941, 4038, -3256, 1105, 5499, -9510, -4672, 14295, -1735]
545a735j4298K3988N253k5481L395J9554q935j0603Q733L460l779R47j947p97
559b245Q195K57j1910O32J4342m896j6254R841J5657j3884j1245J5200M424j2252
573d138J951M947m540L363o86j2215J0296J4153j9803o930K5385k645k3120J1390
587b592J5114j3634n246P960k260P15L688q050K081J3741r122j3189J4047R254
601A2507j6790n567J4986P45j3474J559J1952k648p575L823K085k796K320j409
615b82n545P263L947j3811K123J7357q221j2277J4765L965j5790M248Q947q638
629a949K52O317r132N67J2480q154q030J5015P6j6237N345J0411q669m484O695
644E03L68l749J681O40R62L631j712o116K748N691n259o302Q641N953j2119k737
$$ y = [-1735, -16033, 7955, 13208, -12273, -8878, 10676, 1741, -8862, -129, 3331, -448, 499, -1448, -2245, 5950, 6207, -5703, -5071, 9271, 4375, -11879, -2038, 13619, -265, -11510, 3690, 8114, -4138, -2187, 2760, -1780, 1583, 897, -11318, -1022, 13131, -6672, -13602, 11783, 9138, -13982, -2592, 12522, -1112, -6358, 1602, -658, 57, 3745, -4305, -2224, 11517, 2395, -10794, 3253, 12507, -4283, -9850, 5136, 5881, -7593, -6034, 5918, 3270, -4305, -482, 1603, -1193, 1127, -282, -5827, 1436, 5383, -8428, -6305, 11052, 2831, -9446, 5319, 9284, -6506, -2258, 6689, -1949, -1697, 4620, -4512, -3945, 8535, 381, -7649, 7366, 7442, -8795, -3450, 6961, -1708, -6192, 503, 871, -2878, -1197, -557, 405, 4036, 2324, -3792, -1044, 4647, -612, -6914, 1727, 7680, -4439, -7176]
660g176J4872r59j2470P093O394j0164j303N163m125J747M539q542l22J3184o467
675A464j0229J3506M225j6261J158J1187o575m198P245n66k292L798j813k129
689a480O276j74p694Q30N227l345m887N006M530l982l376N208J599m477P86J597
705A644l965L62J635n166K626Q406o622m943J1025M63j0758M983P256q519l039
720d612N825k308q82N146l466o22P069l907o676P068L601r937j040P232k817n013
736e339L999M483j813j890O45J200k67j930o46O21R53j287k650K753N787m035
752E84l043O771R77p844R48N841m749k903M023j086q66L824k192j735N942j592
768B900p281M004L859o709j516N299p95k539K619Q38M96J616k720j803L416l98
$$ y = [-7176, 7696, 6737, -5733, 1360, 7754, -2410, -3713, 1450, -2675, -928, 3611, -4931, -5253, 7931, 1464, -8765, 4741, 8966, -7295, -6137, 5050, -1525, -5723, 1522, 956, -1336, 2462, 649, -1480, 4796, 4622, -3072, -2242, 2985, -360, -5247, -241, 4289, 307, -3069, 2139, 3738, -739, 47, 1644, -2321, -1959, -324, -5490, -2864, 5542, -1080, -6023, 5002, 5465, -5293, -310, 6946, -1573, -4612, 1213, -1095, -1977, 3169, -297, -919, 6150, 2243, -4433, 2635, 6236, -3701, -4741, 2491, -326, -5339, -1340, 3143, 1330, -560, 85, 1285, 1018, -912, -1558, -937, 16, -1271, -3921, -1168, 4619, 584, -2459, 4312, 5289, -2555, -1607, 4234, -515, -3418, 605, -481, -1347, 2477, 285, -1450, 4492, 2900, -4381, -377, 3482, -3227, -4743, 556, -239, -2778, -159, 679, 1175, 2791, 71, -1732, 1684, 1286]
784A286m380Q52L912o80l566J573M765m30l852P31L029k664l438J177J527m18
800e76q75j228K707L266l373l186N602J392p321J35N457k561l130L020J485K32
816A046J84j213P64L350k922m349M006K131n749q8M519k71j972N83J271L79j106
833E63k004O55J811j860k429J856K400j295j381J767K764j681k577J942J537k538
849d70j319J742P32o58k01k80J950J680l013j119L637q88n221J745L360l018j068
866b409K564K59k95K34j084O86K043l098k440M457O72m888J387M391j192k088
882h01J748J019l54j581r08J335Q99j945j055K202J076k278j183K832J432k736
898b98j769K758O8l456K93L055o53r34Q59nP35R07k577J74L822k502l788L363
$$ y = [1286, -3094, -2242, 1670, 990, -2576, -1003, 3762, 3332, -520, 211, 3240, 576, -2862, -1685, -158, -576, -1451, -2679, 28, 3294, -79, -3265, 2337, 3729, -3592, -3457, 2000, -561, -3691, -671, 814, 1046, 1230, 17, 781, 4131, 1209, -3140, 866, 2997, -2752, -2840, 1679, 1408, -564, 19, 1290, 1669, 563, -1441, -786, 1025, -835, -3264, -1408, 992, -303, -1684, 83, 2847, 1166, -1411, 531, 2068, -470, -1789, -47, 685, 27, -174, -454, 1496, 3176, 163, -956, 2681, 1793, -3428, -1683, 1677, -1341, -2409, 155, 414, 119, 353, -731, -45, 1998, -1100, -3540, 917, 1589, -3299, -1912, 2479, 1287, -801, 947, 1966, 1612, 31, -877, 458, 1357, -588, -1643, 559, 1635, -643, -1826, 1006, 2438, -298, -2067, 691, 759, -2697, -2404, 651, -2, -936, -77, -82, 653, 1560, -1017, -843, 2979, 477, -3311, 52]
916E2K504l740k28L847p25j668N23n10J76R89k142r76L040m51m085J808L765j841
934C38k065J979J679k143k006J252J526n95j179O84J507Q2j156p04K279J869l675
951c28j899M348j05n155J784M082k229j787J911J74n83J58k050N63L383k667m150
968d550M852K283m939j85M908o60k667O38J187o5r75j043O98K908j238k896J549
985a95K560j705k352J892K902k489l940K436K549k612j176K717O35j267j007o27
1001a679J815K145l145k027M846J1n731K199N078k697k061K155M08r22j57j184
1017i46Q66K477k659k495L392K046m325o65M007o4l125m44K479P00k682j058K865
1034C69Q46j898l82J093J474n56k892Q55M057j435m564K984K904l482j480M136
$$ y = [52, 2556, -1184, -1412, 2435, 1710, 42, 565, 55, 231, 1220, -922, -1898, 1142, 691, -3394, -1586, 2179, 338, -1727, 252, 1931, -212, -2218, -966, 560, -35, -1214, -530, 977, 1059, -97, -801, 1478, 3347, -328, -2227, 2121, 2016, -3139, -1355, 2727, 498, -1289, 622, 796, 213, 371, -1679, -1116, 2267, -400, -4550, 302, 2585, -2354, -2539, 2369, 1709, -958, -320, 867, 802, -173, -1216, -518, 2390, 1152, -1744, -195, 2365, 660, -1692, 200, 3102, 613, -3327, -891, 1658, -954, -2130, 587, 1222, -45, -1052, -1679, 136, 2281, -864, -2891, 1955, 1966, -3765, -1566, 3512, 815, -1246, 909, 1317, 395, 238, -946, -80, 2397, -262, -2757, 635, 2681, -1644, -2309, 1698, 1634, -1491, -1935, 544, 1244, -1438, -2496, 369, 1215, -683, -1065, 28, 1502, 946, -1946, -1091, 2966, 1531, -3033, -49, 2855, -627, -2107, 2029]
1050B029j10j929K77j032P32J820k632j777M423l58m957J483M034k145j726K344
1066D76O42j049j045m05J579J200k183n64K281K87j445p18K249J125k369j918
1082a857K710J147l414l09L377j028j482J212q0l56J248k126j041L398p81m146
1098c528K778L311l861o80L741l95j747N92j83J95J055k308j55K934n87k583J440
1115A9K298j620j282K39J411o76j822J06K258o97j961J413J207q65k98k59O6J411
1133I48j243k150K996J350l638M40L649j569j753K247l44o55K59m80p40K002o12
1150G07k731K071J530k344j45K116q89j045K03n37J087j40j162P02J235j270m44
1167a056J310P54l15m04m69O62M15k021N56K430j518j495J907J93j256Q55J14
$$ y = [2029, 1919, -10, 267, -765, -33, 1787, -845, -2622, 1801, 1443, -3514, -2031, 2003, -142, -1868, 476, 1118, 69, -976, -1381, 198, 1398, -785, -1349, 932, 1219, -226, -944, 1305, 2430, 61, -1857, 853, 2000, -1414, -1723, 1654, 626, -856, 356, 276, -80, 1168, -958, -1999, 1399, 618, -3528, -750, 2561, -1300, -1980, 1761, 1366, -381, 211, 28, 223, 1278, -1030, -1185, 1749, 1162, -1421, 19, 2317, 697, -585, -346, 1065, 389, -1433, -1327, 931, 234, -1727, -314, 893, 28, -270, -529, -463, 948, -295, -2445, 551, 1901, -1737, -1297, 2352, 783, -970, 1277, 933, 278, 537, 57, -683, 1319, 707, -2024, 47, 1577, -767, -912, 1204, 315, -730, -527, -1064, 23, -117, -1279, -577, 658, -612, -1056, 254, 1008, 693, 289, -180, 482, 897, -1124, -568, 1862, 344, -1151, 756, 949, -307, 548, 662]
1184F62n43N62q37j938K177O17k416R29K358j790j074J861J4o01m1n47J06P80
1202B79r71nJ769j89j226J064P19o81j85n80k78O36j166k99K135n8k084R32J298
1221A110j316r7Q19q73l32K91j448P34K490j249n29J757n39j825Q96P42m58K89
1239D62n79m93J448k53j142J551R63j531q93N78l54j52l35j07J173j13j892J067
1257f02J764j374n37J051po14j02n29P84O24j026k75K345j53j847J147Q05j417
1275C7j24L01j13K61n77r53R68P51j065L34J324o74j397K76K04J7P3n34N65J030
1295G04j376m59K156K50j143L63l62j08j32l66K11R99K50j755P78J472j534l31
1313c83J412q70q65k7j07L38J38m18J27J741m31j303Q22L84q49l73L36J91J76
$$ y = [662, 119, 681, -156, -2094, 83, 700, -1716, -787, 1571, -219, -1293, 568, 582, -19, -60, -607, -501, 279, -692, -697, 1072, 883, -343, 721, 1440, 759, 574, -6, -284, 352, -814, -1113, 1022, 964, -1120, -188, 1110, -206, -303, 516, -357, -689, -398, -1846, -1112, 1378, 129, -400, 1357, 818, -1007, -111, 631, 173, 462, -117, -610, 838, 585, -557, 994, 1957, 426, -467, 111, -243, -395, -730, -837, 336, 223, -1669, -602, 1162, -212, -749, 302, 295, -319, -421, -950, -166, 458, -568, -843, 1502, 1349, -498, 649, 1454, 37, -87, 214, 101, 362, -215, -1168, -200, 551, -514, -180, 1144, 470, -927, -651, -447, -430, -357, -891, -326, 704, -672, -1131, 1025, 1275, 132, 495, 133, 25, -107, -473, -262, 737, 987, -768, 10, 1482, -52, -383, 1029, 159, -706, -733, -840, -502, -364, -782, -655, 1086, 655, -648, 174, 558, -291, -664, -328, -137, 39]
1332C9n38K56J196Kr95R14P08j253m55J46m62L82m67o2Q41N46j198k29J576l19
1352F28j663R95j37o97k40N32k63J194k38k43J163J00j532n4J328m83o83K68N3
1371B8K14l04j07J190J24o82m87M90m62p50QN2K27J94n00L29J426p27j028J377
1391F12P8j629N87K31m35K06M40r3R80K24j088J18J005r03q79O17M21j076QL81
1411a95L48J36J9m15P54m44j029L35L46l71k89N5P58J56l84P4J327j37j378L58
1431B4P55q07m80M45k5L54K78r27L41J306j043r71J360l6j387J61Q91n36l13L66
1451b44l1N37L9r77M83Q48p23q10P48M57m35l13L72J007j06j065N78O50o30p67
1471c82N46Q7l00j79P2J17M06p23k64J482o23j477Q20R50j093l51O09K63m4L65
$$ y = [39, -499, -243, 953, 955, -40, 874, 1582, 329, -126, 20, -442, -60, -527, -589, 252, 798, -400, -629, 947, 628, -1035, -40, -177, -874, -1114, -582, -845, 349, 111, -132, 1031, 1131, -401, -455, 873, 390, -293, -25, 28, 242, -62, -169, 1021, 1145, 463, -24, 466, 4, -746, -738, -686, -459, -265, -765, -436, 990, 263, -765, 612, 690, -939, -352, -121, -556, -350, 90, -3, 977, 1201, 113, 231, 1236, 333, -546, 71, 492, -584, -576, -195, 153, 289, 308, -107, 647, 203, -826, -491, -145, -516, -805, -750, 8, 164, -220, -146, 1181, 1044, -334, 24, 779, -28, -508, -63, -88, 266, 544, -383, -42, 1264, 221, -750, 610, 574, -813, -652, 239, -297, -610, -244, -275, 262, 301, -676, -193, 655, -68, -878, -130, 327, -108, -421, -49, 958, 852, -213, 365, 1015, 385, -382, 164, 251, -49, -228, -156, -39, 367, -356, -620, 862, 239, -1238, -418, 532, -561, -912, -303, -40, -84, 281]
1491B81m36M38P29j152j91J356m40j331M00O36q7j81O5K84L82p31l56M54N78j191
1511d93l1L73j51n1k91N61K98J15j207Q93Q62j763K60J168m99j20K2j15M40O83
1531I54r06k38J437p01j468O62P95q06m35J017k73R4j11k80N21j23r00j49J136
1550B26j43j060L63N78J82l80K40L60O06j482l1R73m2n55L25K81j61N0n82P9O92
1571E19l28p85R19J12j430Q3J235n31K4J98m28M04O5o10K90J079q24n93P56J36
1591B91o97O14J68M3J61n19j96P76k28j093O43N94o40N9K69k9l13j89q4N14M01
1612E45j232j3Q51j99q12J007K73l31q2J4j52Q86n69l99R83r1j069o4O89%l33
1633i8K82J69P1l44n22L30P93j014m25P96o17K41R3K23k04N36o79L00N61n21j31
$$ y = [281, -155, 283, 1012, -140, -331, 1025, 585, -746, -346, 290, 203, 22, 87, 371, 753, 22, -334, 120, 698, -493, -524, -151, -302, -353, -644, -83, 215, 330, -877, 16, 878, -885, -625, 543, 44, -76, -54, -169, 271, 954, 48, -190, 1247, 546, -922, -260, 535, -271, -706, 311, 38, 132, 21, -259, 262, 139, -761, -910, 226, 83, -977, -614, -36, 146, -234, 6, 366, 972, -510, -541, 432, 390, -165, 160, 441, 280, 330, -252, -173, 519, 191, -594, 325, 437, -993, -910, 325, -206, -182, 16, -412, -8, 57, -553, -263, 816, -8, -601, 155, 291, -406, 208, 376, 419, 580, 61, -135, 641, 413, -680, -37, 557, -83, -24, 245, 216, -97, -286, -370, 144, 545, -687, -700, 151, -48, -860, 147, 420, 89, 7, 21, -131, 755, 186, -213, 770, 679, -390, -454, 235, 235, -98, 184, 353, 424, 80, -442, -112, 681, -333, -758, 38, -579, -338, -245, -22, -226, 310, -369, -69, 492, -29, -160]
1654a60L31K77q12O16K94m66M99o9n87K78l8o53L45Q77j121K9K94j17P8L30n30
1675c05ML55o76j19J001q6p92P22k0k80L64R9k64M95k36m19M23J04l48k0M66l98
1697G0j25K51j95J05J42n99J74K83n45r5P67n14o5L70P8m78K81m6P4N19n03n41
1719e92O58M76q34M50L64m89J42J8k68L08J30n42M6L33m54k99N62K0m97L70pJ58
1741E3K85o44m14R68k99q39Q60M78l81O1J42j42L32l11k27L29K49q50L53M39k82
1762A60l67L49n7j7K89n59L6O69p73k26O33M7q00N01O3J71pR5k28J62j4q50O69
1785e4M70m06J67K04j51KK64k63J14j26o20J85J0K16m88R55m31m63N74j61Mr7
1807i5J58n80N85j95n86N38M84k94Q6R8k32K66J27l35qL27m78j37Q10k38o46Q31
$$ y = [-160, 171, 448, -364, 252, 546, 80, 579, 510, -77, 201, 163, -490, -145, 732, -389, -360, -66, -183, -105, 225, -305, -301, 54, -622, -741, 260, 174, -618, 104, 84, -196, 168, 267, 3, 498, 262, -157, 266, 370, 22, 2, 468, 70, -55, 196, 1, 106, 248, -351, -177, 106, -439, -534, 233, -281, -346, 24, 102, -376, -95, -141, -67, 452, -51, -592, 66, 542, -292, 158, 522, 33, 175, 193, -75, 233, 363, -179, -133, 200, -254, -553, 9, 29, -468, -98, -105, 53, 338, -306, -720, 248, -51, -890, -30, 448, 67, 128, 270, 128, 460, 149, -78, 251, 500, -350, 3, 442, 160, -207, 142, 85, 68, 357, -202, -166, 503, -270, -496, 137, 184, -616, -115, -52, 119, 112, 207, -21, 141, 127, -723, -54, 416, 10, 177, 381, 230, 232, 496, 233, 347, 221, -399, -214, -204, 12, -476, 479, 48, -415, 159, -2, 2, -95, 63, -517, 68, -127, -713, -175, 309, 15, 101, 199, -33, 233, 360, 25, 17, 344, -134, -271, 539, 301, -345, 486]
1829D86k42m34M20l56J61j57m40R2K19J54j9J49J79k42J45p2j52K00j78k50J56
1850a81M30n47L61N68l13J33J00j42m71j18j71q6M29pn37N66J97j95k70M93j17
1871A22j99l6k94R9K27n33K12P59j82j29P37k85n41R2K61m28M88m69j45K39j2
1892a7q8M25q7RM0l19j55l68L68k92K75L7l74L39M80J67n07K64k23jj42k41J47
1915b63P17n13n2P33m25Q6M6j78Ol3j61l80K42J39k44K63M28l21k52K63j05p9
1937h3l28L0J96Q2l92L85K15J30k09L83J46m06O5l8l21L43j74k29P76j75m11L35
1959C20P4m18L3L8j50o4j95J1p5M64k08R0L95j96J2j46J91m63J28l0o7M65k23
1982a4mK80J57m61J81J98j82j94j90j97M85k73j09K38N19m16M7M05m68j22J86
$$ y = [486, 244, -190, 230, -126, 35, -122, -562, -470, -251, -97, -116, 33, 212, -30, 115, 43, -109, 91, -87, -337, -181, 249, -298, 63, 631, 318, 451, 551, 409, -62, -180, -351, -437, -8, -15, -552, 14, 211, 16, -254, 239, 122, -77, -113, -407, -308, -81, -614, -402, 357, 175, 46, 783, 498, -43, 49, 310, -118, 370, -99, -244, -5, -17, -105, 320, 233, 242, 282, -37, -192, -560, -192, -484, -209, -172, -546, -207, 273, 440, -67, 197, -26, -27, -169, -410, -263, 454, -59, -111, 622, 197, 283, 329, 151, 157, 124, -37, -417, -175, -36, -280, -17, 411, 90, -162, 101, -4, -83, -411, -381, -185, -103, -495, -110, 105, 235, 26, 409, 555, 149, 214, 176, -145, 198, 24, -205, 571, 396, -15, 320, 394, -24, 9, 47, -103, -167, -362, -351, -426, 38, -170, -80, 315, 119, 131, -15, 176, -287, -159, -189, -256, 209, -14, -18, 262, 419, -42, 139, 337, 155, -39, -229, -426, 59, -214, -323, -85, 434, 18, 65, 470, 2, -120, 66]
2003F6m75J23N7j01J16M89J67n37O54M2o44K38j90l77M87k42j92M51J63m99L68
2024A64K25k61m19M47k93l97O1j53L02L03j29J80K92k88L9M3Pk50J65j10j65K33
2046dk9P1M16L65o00J73N5l20k68J37m54o3K20K45r5J85N6k29L93k4m44K53k62
2069b23j94L26k66K90J94L02k15J98j94j48r5J02Qk42J22Q8K21J09n61nP33o80
2091a30R6K30l79k85K93j43k38P19K3r1J72ll79L30J33n06K21K2j25k9P0J03P0
2114A74M70l71k80K69j17l53J42O8P1j17q9l9K99M4j65K46l74k28J17m2K95R1
2136A11j17j80M15N7k39K99J00n06o1J36j02k29K72l99L25L58j57J84j49J03n81
2157c60L20l9l65K16J49k60L55k93R5M61j49k02M6K78l79r4K38j6j38K53q3M4
$$ y = [66, -409, -286, -229, -330, -214, 275, 442, -95, 559, 601, -43, 195, 5, -372, 115, -127, -319, 132, 295, -204, 164, 389, 128, -291, 156, -137, -534, -473, -626, -324, -21, -150, 30, 322, 34, 73, 116, 123, -127, 38, -72, -237, -4, -33, 38, 454, 819, 219, 392, 447, 127, -141, -4, -458, -521, -301, -56, -151, 34, 90, -139, 254, 230, -214, 39, -223, -417, -91, -357, -67, 127, 429, 214, 412, 218, 70, -25, 77, 85, -157, -35, 53, 274, 383, -178, -183, 550, -130, -34, 196, -183, -468, -175, -318, -556, 163, 186, 95, 267, 264, -115, 215, 348, -158, 63, 85, -40, -69, 1, 104, 174, 644, 273, -7, 262, 145, -208, -66, 2, 73, -44, -133, -172, 127, 171, 6, 252, -122, -350, -233, -275, 20, 111, -6, -186, 229, 286, 47, 346, 446, -60, -121, 15, -87, -316, -44, -443, -118, 240, 83, 267, 118, 221, -360, -40, -79, -444, -228, -79, -339, 16, -277, -182, 279, 130, -72, -26, 252, -127, -221, 17, 1, -137, 116, 33, 77]
2179G7L36j78j01K96j64o16J43P3n7J91J88l16J86Nk02K90j64k72K29Q2M1l8J20
2202A49l90L15J01r0l7L74n22l01L95l9J48k6J77k24K19l41J45J93j58l1j45J
2224h7k78J9q0L83J77j7j51L02l9m09P1L17k14K6R2j02J11m2j82K23j2k29J01
2247b0M7j15j68K16j24k49K62j22J39K77j71l74N07k19K4J53k52J68k85M00k0
2268G4J87k8j38J95k45j94K32K78m53J38K22m47J32L50k11n2J64k67r7K87j39
2289a2j28RP9j12K06K7j26J50n1k46R6J04J2k56K99LJ69J07j78L7k51K0m6K85
2313A97m22R5P9J60l33K67k69L35p0j25M5j31L14k22J30k12k85M55J26j48O9o2
2335gJ56k52M34j89k40K99k43j74q0L95M3j27k69P2K12p4k39J84J70k01l5K89
$$ y = [77, 413, 235, 134, 430, 266, -350, -207, -134, -191, 0, 188, -128, 58, 63, -139, 151, -13, -285, -56, 26, 67, 29, 149, -241, 74, 175, 85, 48, 422, -100, -401, -6, -45, 103, 77, 254, 30, 249, -92, 53, 246, 88, 57, -88, -87, -365, -346, -426, -43, 134, 117, -34, 268, 229, -180, -109, 208, -6, 20, 112, 10, 121, 79, -103, 120, 108, -121, -20, 27, -88, -256, -40, -164, -413, -151, -273, -134, 143, -28, -402, 105, -114, -90, 63, -189, -21, -306, 94, 74, 261, 233, 95, 290, 45, -149, 83, 361, -92, 46, 268, -179, -47, 303, 92, 40, 204, -63, -160, 127, -12, -140, -131, -52, -164, 42, 69, -57, 93, 42, -204, -108, -4, 8, -248, 51, 54, 223, 330, 152, 189, -62, -42, -88, 197, -225, -130, -51, 109, -224, 43, -226, 109, 39, -86, -41, -172, 142, -80, 50, -162, -447, 8, 134, -14, 55, -7, 149, -103, 331, 142, -98, 201, -42, -216, -296, 99, 142, 15, -254, -182, 30, -44, -283, -99, 71, -130, -165, 124]
2357A24k57m0K61L9j27J1k11k39P60l28J21K37Rj55J48j59l4P5j22l29L26n9l13
2380b62M45j95J9k83L36j26L8J24l58R3J96m8l08K91J60j78L0M7k3L79j15j35
2402A27l07K94j38r1L04O6j83R8k91K45qk24J14P9r1k42K10m4l57M68k26R0j05
2425b12R7J88L5k86J3K31nk13M49j92jJ0j17l9J70J92k25k18N8j8k02L38l02K52
2449CR6k52p1K73J0J22l48K17j05j44J45M3o2Q4k5K54k09o5J77j20j04K37j44
2472A2J3J56m0j49k58L61j92p6K3k18M22N1m22L30j59K77kk97L02j35J31n5k60
2495a85K79j64q5r5L58j25J58j44n9PK3K27k70J18j32q0J95j44p8J41J3o3J5N7
2519c3j74J08n3j95M49R1k27J79j80l0J89j36J08R5n9j76j48K99j09l0K00j06
$$ y = [124, -133, -173, 88, 127, 0, 11, -200, -439, 321, -7, 114, 351, 360, 205, 353, 194, 160, 235, 113, -216, 110, 51, -262, 183, -12, 7, -276, 60, -66, -28, 96, -262, -169, 27, -21, -329, -38, 122, -56, -26, 21, -2, 377, 262, 127, -180, 114, -24, -115, 189, 255, 72, 170, -121, 124, 116, -108, 6, 85, -6, -248, -38, -82, -439, 29, -197, -107, -212, -115, 73, 108, -178, -165, 66, 61, -152, 297, 105, 104, 114, -3, -42, 128, 320, 95, -123, -65, -83, -285, 53, -249, 3, 99, -153, -224, 49, 59, 181, -167, 50, -55, -199, -54, -11, -73, 11, -14, 240, 31, -34, 143, 23, -81, 156, 12, 25, 181, 141, -8, -266, 95, -97, -173, -150, -368, 54, 105, -317, 13, -146, 131, 129, -168, 134, -1, 130, 75, -185, 94, -70, -155, -250, 108, -17, 141, -3, -62, -55, -32, 195, -75, 43, -89, -169, 26, -118, -196, -55, -42, -105, -90, -33, -207, -99, -152, -347, 102, 193, -34, 145, -35, -65, 124, -12, 96, 191, 132, -44, -192, 107, -2, -32, 168, 62]
2541F2j32J64j33j06K12j73J0K06j55j10K69j13k00O9M52j37mj3l84J13Q8J04
2563H9P9rJ15j97J67l93K49N1j23L7k08k31K1M13m3K2K21k79j18J9R1k14J24L34
2587B17k67P3J94l08L71k42M9J44l43K14Q8L6k47K7j79L23k97J50l06L53L5n5
2609C0j38Lj83J55L5R6k47K25q6j0K4J20m2j05L60j12k0O7k80K25j04l7j54N39
2633C61k62R8j33j11k20K96j31P4j48n6J32R7ml20L93J55l86J97J38l90J76p1
2655a15j46J69L16p9P3m42M42qj49J83j76o2j29p3L42l1j62k4L26l48Nk38J00
2678b26j1L12j86L2J06j10M8n8Pj37L51j19j13K08k27N2L67k16oR7k91N09j72
2701B17j70k12J20K3n3j07J60Pn7M1o3L6K49k14k0K49m90K60J30k64Q5M19j94
$$ y = [62, -70, 94, -39, -145, 67, -106, -96, 110, -45, -155, 114, 1, -199, -130, 322, 185, 181, 168, -216, -103, -15, 89, 168, 159, 274, 77, 244, -149, 100, 151, 28, 65, -143, -374, -353, 60, 17, 39, 260, -19, -137, -118, -27, -241, -117, 217, -50, 23, 217, -91, 280, 38, 87, 231, -112, 102, 190, 226, -21, 6, -173, 150, -147, 3, -303, 50, 85, 30, -108, -105, -288, -133, -98, -2, -249, -24, -110, -120, -96, 24, -18, -123, 237, 125, 105, 172, -108, 117, 13, -24, -178, 361, 99, 197, 64, -47, -267, 29, -102, -28, -176, -232, -100, -3, -7, -327, 66, 221, -165, 32, 170, -220, -44, -115, -261, -92, 224, 145, 218, -224, 218, 210, 61, 244, 68, 6, -123, -196, 146, 115, -47, -71, 255, -93, -88, -326, -226, -237, 75, -111, -79, 27, -83, -35, -93, -86, -223, 128, 9, -104, 104, -123, -71, 296, 80, 74, 171, -120, 389, 217, 47, -165, -45, -22, -75, -182, -22, -15, -72, -31, -94, -58, 191, -23, -43, 206, -284, -24, 106, -158, -73, 346, 152]
2724A52j95J10Q0j40L1q9j58K79J19n69K96J37J84l5Oj10j78k15J16j75K30K4
2746a00l0J66P9k29J73j58q8K76K90l80J08o3J28l3k33M40j58l6l80L8N04k32
2768H2l2L5k30J01j99kM7L33k19K12j24J6j48K96l73l6p4J80%J36K29M7N1ol67
2793d5%q9K27j46p7qJ17L49m73M9J10j82k3J66k39L75l04K00k61L31n9j20n1L14
2817A61k87K94l17N2k8K22J11j63r3NJ34j17N9N8M5k41R9r5j08K55p4m0q4K2O2
2842f8J11q7q4j32K74p6P2K32k10N7j89j6K81j19J94m33J17K62k46J27K43o19
2864c09M81j29j61J37k75M57j50M4j82K8k25M0L22k47j2L36k52%K86k94J36P1
2886A02R7p9J37l84J00J25k1j79jo1K82mn7J09j78k27K86j03k9J06k31K47O3j71
$$ y = [152, -43, 67, 147, 7, 38, -51, -209, 70, 189, -380, -84, 53, 237, 202, 208, 98, -80, -295, -179, -354, -124, -100, -130, 36, 115, -114, 59, -99, -187, 89, 379, -1, 107, 44, 172, 139, -94, 346, 188, 152, -228, -190, 314, 82, 50, 85, -145, -44, -243, -245, -198, 135, -84, 128, 4, 20, -128, 168, -205, -241, -315, -135, -135, 1, 230, 277, 328, 322, -45, -45, -134, 93, -53, -130, -138, -21, 328, -145, -96, 14, -168, -191, -25, -264, 111, -193, 7, -254, 77, 18, -102, -153, 161, -126, 168, -149, -97, -125, 97, 208, 45, -48, -43, 91, -26, 33, 91, 136, -105, -6, -101, -209, 46, -28, -68, -152, -130, -68, 43, -44, -128, -260, 14, -62, 10, 242, 32, 89, -100, -116, 165, 46, 240, -193, -76, 186, -60, 67, 310, -309, 172, 43, -118, 19, -256, 201, 51, 95, -87, -59, -284, -244, 78, -169, -181, 155, -97, -97, 189, -105, 31, 102, 199, 120, 257, -127, -27, 98, 77, -102, -103, -164, 118, 114, 57, 166, -12, -239, 47, -56, -85, 21, -210, 37, 100, -71]
2910g1J47k36J85j48J08K20m8l13L84m53J14K92o2j54l6K41l22M6m5L2L35j80
2932C6k02L15m92M09n9j63J47j51K17k07L4j26L22m7J13k13J4K39j63M8m9N4j85
2955a09K88J1n4J49j35Q5n55K13N7J13R0k41J62k01P2k20L07j49N9K15k19j3J02
2978B7M8qm6K42Q5j92r0N1q7J75l38L03rk79J65k00K98j01k6P8J2k82O0J83j98
3003a29J97lk3L5l36J99J52j02J28r1rJ85k67K47l01J53J9j28m3L57k90j48K80
3026H2j66J50k17K00J9m50L94J9l20L58K14j85j9j14J6k15L87j17j56N9K11o0
3048I0n0p7J38q6R4O8l45K03J7j17K78k99j0J44j61PR9m0K18k62P3O0j19J20k09
3073a66J63JK16n1j94J57J05j22K28l49n1M2J84k18J00J91j51l85M10qj17K8o
$$ y = [-71, 76, -160, 25, -123, -15, 205, 157, -156, 228, -225, -111, 181, 119, -35, -71, 170, -152, -106, -151, -119, 216, 36, -166, 149, -343, 66, 7, -156, -9, -160, 57, -150, -116, -242, 80, 33, 146, -67, -53, 186, 23, 71, 22, 76, -109, 179, 190, 136, 285, 150, 235, -320, -107, -50, 63, 153, -88, 74, -127, -55, -275, 32, -117, -58, 157, -62, -75, 27, 75, 67, 21, 263, 348, 156, 66, 117, 30, 205, -133, 170, 161, -118, 47, -153, 145, 44, 18, 96, 108, -174, -114, 69, -129, 68, 65, 42, 77, -259, -60, 92, -10, 118, 27, 18, 203, -64, 183, -118, 35, 54, -74, -117, 240, -50, -198, 82, -84, 66, -151, 49, 68, -382, 12, 31, -289, 69, 283, 98, 79, -35, -19, -234, 153, 36, -120, -61, 150, 90, 40, -37, 101, 15, 109, 177, -168, 35, 52, -65, 213, -86, -96, 48, -113, -106, -7, -47, 171, -91, -18, 42, -77, 43, -166, -3, -2, 214, 163, -31, 126, 231, 109, 337, -12, -63, -21, 163, -55, 45, 236, 85, -300, 110, 102, -15, 13, 7]
3096GJ99l61J16R8p2j21p3P2J98J2j50K42j53j31K26j46J72k0p0R4j93K21Qj81
3120fk56J60J67p7J18k65L09j52RJ13p6M2j97Jj32O4J66O2l3P8o1L33l72o3J1
3145e7M4L20j93K84n67J36L16k40J39k23k06M14j58k37n6M83j36l36M16m59L77
3166F1j28j41r2M78l5k80L73l30J54O2k06L72l25J00l06K26M0jj44J58l4k46J07
3189a37j6J67J3O8r7J9j96J41Q8j20OO2k26J48M9R1j98K50k01Q0J00k57J79R4
3213A07r1P7J85j22j1N8k7j1m74J96K37l71L42k11l4K90q1M0J39k78P3J63l32
3236a36L12k90k2K49M8j63Q2r3J28J67k24m9j27K11l35L07q4K24l00k7J78j95
3258a39L3R9j15K51m72K58M6R8k07J96j02n0K40k01J01l2j50k1J83pO1p0Q6J12
$$ y = [7, 206, -155, -39, 59, -13, -134, -207, -135, 63, 75, -75, 167, 14, -117, 109, -37, 135, 115, 45, 139, -54, 167, 175, -6, -262, -102, 65, -12, 106, -159, 150, -2, 7, 120, 44, 86, -111, -110, -242, -178, -12, 50, 17, 95, 34, 367, -5, -68, -57, -13, 307, 114, 398, -169, -33, 283, 43, 182, -41, -247, 167, 9, -228, -284, 199, 63, -273, 143, -316, 61, -67, -208, -300, 178, 143, -137, 236, -94, 60, 122, -84, 288, -37, 63, -243, -17, 23, 22, -122, 36, 2, -244, -137, -153, 14, 27, 95, -2, 17, -179, -38, 50, -70, -64, -2, -228, -80, -31, 60, -138, 112, -89, -9, 91, -166, 13, 107, 16, 93, 278, 156, 145, 203, 176, 165, -309, -113, 124, -247, 95, -116, -150, 140, 59, 99, 238, -40, 33, 196, -136, 176, -114, -136, 113, 161, -2, 80, -13, 115, 282, 58, 9, -118, 93, -242, 65, -19, 205, -95, -122, 56, -139, -106, -7, -122, 129, -343, -85, -39, 59, -148, 48, -54, -104, 136, -65, 36, 4, -146, -167, 16, 9, 70, 0, 86, 198]
3282A98j78j17J4L50m41J37L4J47m7m9p8J47j84J04P6P3J41l14J5l4K2J05n0l
3306F8k36L6J81jK4j40K09k10J05K8rm22M05l9N3J19j73J40M6j11j53O0j63K18
3330C5J3M2j05m5K8J02qJ18n2k72N3J77j28K44l66K13k09Mm0M94l24p7K91j71
3354A7r7Rk51L99n5Jj43K20J26k73J44j10j95m5K18J31m9j22J41j85P4K87j50
3377I2m7K5j38J72k70N7J34l8r6L57k20j13q7K07n3L8K9j62J68L2j88O1R0J9J9
3402H8j39Q3m2p3L1J57O6n1k15n0o1O5L5J04k04J29K38j72oJ19J39l73J86M0J06
3427B00j7j82m2q3K60k08N4p4J0L91l17p1L43j08j04mj5r4J46p2j0m7o5K13J4
3452A18Q9J5l13j2j2j21R9Q9j56M1K66L5l45L20j23Jk04L09Q5k15j31Q9P9l3l9
$$ y = [198, 20, -97, -83, 267, -174, -37, -3, 144, 97, 48, -30, 117, -67, 37, 113, 186, 327, 13, 28, -6, 16, 121, 71, 68, -168, -132, 49, 48, 72, -68, 141, -69, 36, 64, 55, -367, 38, -1, 52, 171, -2, 138, 184, 73, -80, -20, -183, 35, 48, 90, -15, -60, -32, 70, 62, 180, 128, -144, -91, 86, -42, 202, -164, 49, -160, -156, -196, 298, -26, -103, 188, 17, -80, -71, -322, 77, 22, 23, -120, 100, 226, -47, 97, -13, -208, -253, -35, 96, 47, -75, 66, -119, -45, 242, 92, 45, 70, -68, 104, -166, -109, 25, -13, -109, 248, 28, -85, -172, 35, -18, 20, 49, -113, 55, 87, -101, -40, 50, 69, 88, -51, 32, -10, -83, -52, 105, 171, 120, -95, -145, -206, -141, -106, -2, -206, -77, 161, -11, -17, 102, 241, -132, 54, 94, 200, 183, 1, -41, -124, 136, -72, -18, -92, -82, 309, -8, -79, 264, 156, 52, 48, 33, -61, 85, 13, 3, -44, -109, 104, 118, 207, 222, -91, -103, -115, -236, -137, -48, -204, -163, 103, 138, -207, 113, -10, -9, -213, 96, 181, -34, -165, -76, 3, -30, -69]
3477f9%J35N0o3l05L06k67M02l89L46j97J33n7K7j17J35O8k30L70m28J17J16k0
$$ y = [-69, -69, 66, 116, 53, -252, 54, -213, 189, -200, 146, -51, 82, 25, 52, -65, 70, 138, -92, 278, -150, -33, 83, 63]
$$ [...]
8191d9
##END NTUPLES=NMR FID
##END=
