##TITLE=1H_Ser DNG
 CDCl3
 8 sc, 
 13.4.2023
##JCAMPDX= 6.0         $$ Bruker NMR JCAMP-DX V2.0
##DATA TYPE= NMR FID
##DATA CLASS= NTUPLES
##ORIGIN= UXNMR, Bruker Analytische Messtechnik GmbH
##OWNER= root
$$ XWIN-NMR		Version 3.5
$$ Thu Apr 13 13:45:05 2023 Russian Standard Time (UT+4h)  she@DPX200
##.OBSERVE FREQUENCY= 200.13135
##.OBSERVE NUCLEUS= ^1H
##.DELAY= (6, 6)
##.ACQUISITION MODE= SIMULTANEOUS
##.ACQUISITION SCHEME= undefined
##.AVERAGES= 8
##.DIGITISER RES= 18
##SPECTROMETER/DATA SYSTEM= spect
##.PULSE SEQUENCE= zg30
##.SOLVENT NAME= DMSO
##.SHIFT REFERENCE= (INTERNAL, DMSO, 0, 15.7039)
##AUDIT TRAIL= $$ (NUMBER, WHEN, WHO, WHERE, WHAT)
$$ ##TITLE= Audit trail, XWIN-NMR		Version 3.5
$$ ##JCAMPDX= 5.01
$$ ##ORIGIN= Bruker BioSpin GmbH
$$ ##OWNER= she
$$ F:/spectra/data/she/nmr/H-F/1/audita.txt
$$ ##AUDIT TRAIL=  $$ (NUMBER, WHEN, WHO, WHERE, WHAT)
(   1,<2023-04-13 13:43:54.67 +0400>,<she>,<DPX200>,
      <created by zg, POWCHK disabled, PULCHK disabled
       configuration hash MD5:
       00 E9 B6 7A A2 85 ED C7 34 08 36 98 17 FE 4E 26
       data hash MD5: 16K
       9C E7 0A 4F 78 7A 7D 81 CB 8B 61 6F CB 58 DE 38>)
$$ ##END=
$$ 
$$ hash MD5
$$ 83 C1 D4 3E F4 9C 23 A8 5B F2 1F 4F 39 0C F7 E9
##$RELAX= 
##$RELAX= 
##$RELAX= 
##$RELAX= 
##$RELAX= 
##$RELAX= 
$$ Bruker specific parameters
$$ --------------------------
##$DU= <F:/spectra>
##$EXPNO= 1
##$NAME= <H-F>
##$PROCNO= 1
##$TYPE= <nmr>
##$USER= <she>
##$AMP= (0..31)
100 100 100 100 100 100 100 100 100 100 100 100 100 100 100 100 100 100 
100 100 100 100 100 100 100 100 100 100 100 100 100 100 
##$AQSEQ= 0
##$AQ_mod= 1
##$AUNM= <au_zg>
##$AUTOPOS= <>
##$BF1= 200.13
##$BF2= 200.13
##$BF3= 200.13
##$BF4= 200.13
##$BF5= 200.13
##$BF6= 200.13
##$BF7= 200.13
##$BF8= 200.13
##$BYTORDA= 1
##$CFDGTYP= 0
##$CFRGTYP= 5
##$CHEMSTR= <none>
##$CNST= (0..31)
1 1 145 1 1 1 1 1 1 1 1 1 1 1 1 1 1 1 1 1 1 1 1 1 1 1 1 1 1 1 1 1 
##$CPDPRG= <>
##$CPDPRG1= <>
##$CPDPRG2= <>
##$CPDPRG3= <>
##$CPDPRG4= <mlev>
##$CPDPRG5= <mlev>
##$CPDPRG6= <mlev>
##$CPDPRG7= <mlev>
##$CPDPRG8= <mlev>
##$CPDPRGB= <>
##$CPDPRGT= <>
##$D= (0..31)
0 1.2 0 0 0 0 0 0 0 0.06 0 0.03 0 0 0 0 0.0002 0 0 0 0 0 0 0 0 0 0 0 0 
0 0 0 
##$DATE= 1681379034
##$DBL= (0..7)
120 120 120 120 120 120 120 120 
##$DBP= (0..7)
150 150 150 150 150 150 150 150 
##$DBP07= 0
##$DBPNAM0= <>
##$DBPNAM1= <>
##$DBPNAM2= <>
##$DBPNAM3= <>
##$DBPNAM4= <>
##$DBPNAM5= <>
##$DBPNAM6= <>
##$DBPNAM7= <>
##$DBPOAL= (0..7)
0.5 0.5 0.5 0.5 0.5 0.5 0.5 0.5 
##$DBPOFFS= (0..7)
0 0 0 0 0 0 0 0 
##$DE= 6
##$DECBNUC= <off>
##$DECIM= 32
##$DECNUC= <off>
##$DECSTAT= 4
##$DIGMOD= 1
##$DIGTYP= 9
##$DL= (0..7)
0 120 120 120 120 120 120 120 
##$DP= (0..7)
150 150 150 150 150 150 150 150 
##$DP07= 0
##$DPNAME0= <>
##$DPNAME1= <>
##$DPNAME2= <>
##$DPNAME3= <>
##$DPNAME4= <>
##$DPNAME5= <>
##$DPNAME6= <>
##$DPNAME7= <>
##$DPOAL= (0..7)
0.5 0.5 0.5 0.5 0.5 0.5 0.5 0.5 
##$DPOFFS= (0..7)
0 0 0 0 0 0 0 0 
##$DQDMODE= 0
##$DR= 18
##$DS= 0
##$DSLIST= <SSSSSSSSSSSSSSS>
$$ [...]
##$SUBNAM2= <"">
##$SUBNAM3= <"">
##$SUBNAM4= <"">
##$SUBNAM5= <"">
##$SUBNAM6= <"">
##$SUBNAM7= <"">
##$SUBNAM8= <"">
##$SUBNAM9= <"">
##$SW= 18.05172834244
##$SWIBOX= (0..15)
0 0 2 0 0 0 0 0 0 0 0 0 0 0 0 0 
##$SW_h= 3612.71676300578
##$TD= 16384
##$TD0= 1
##$TE= 0
##$TE2= 300
##$TE3= 300
##$TEG= 300
##$TL= (0..7)
0 120 120 120 120 120 120 120 
##$TP= (0..7)
150 150 150 150 150 150 150 150 
##$TP07= 0
##$TPNAME0= <>
##$TPNAME1= <>
##$TPNAME2= <>
##$TPNAME3= <>
##$TPNAME4= <>
##$TPNAME5= <>
##$TPNAME6= <>
##$TPNAME7= <>
##$TPOAL= (0..7)
0.5 0.5 0.5 0.5 0.5 0.5 0.5 0.5 
##$TPOFFS= (0..7)
0 0 0 0 0 0 0 0 
##$TUNHIN= 0
##$TUNHOUT= 0
##$TUNXOUT= 0
##$USERA1= <user>
##$USERA2= <user>
##$USERA3= <user>
##$USERA4= <user>
##$USERA5= <user>
##$V9= 5
##$VALIST= <valist>
##$VCLIST= <CCCCCCCCCCCCCCC>
##$VD= 0
##$VDLIST= <DDDDDDDDDDDDDDD>
##$VPLIST= <PPPPPPPPPPPPPPP>
##$VTLIST= <TTTTTTTTTTTTTTT>
##$WBST= 1024
##$WBSW= 4
##$XGAIN= (0..3)
0 0 0 0 
##$XL= 0
##$YL= 0
##$YMAX_a= 105903
##$YMIN_a= -174278
##$ZGOPTNS= <>
##$ZL1= 120
##$ZL2= 120
##$ZL3= 120
##$ZL4= 120
##$ABSF1= 10
##$ABSF2= 0
##$ABSG= 5
##$ABSL= 3
##$ALPHA= 0
##$AQORDER= 0
##$ASSFAC= 0
##$ASSFACI= 0
##$ASSFACX= 0
##$ASSWID= 0
##$AUNMP= <proc_1d>
##$AZFE= 0.1
##$AZFW= 0.1
##$BCFW= 1
##$BC_mod= 2
##$BYTORDP= 1
##$COROFFS= 0
##$CY= 11.3945322036743
##$DATMOD= 1
##$DC= 2
##$DFILT= <>
##$DTYPP= 0
##$F1P= 2.36226072786647
##$F2P= -0.459571619588291
##$FCOR= 0.5
##$FTSIZE= 0
##$FT_mod= 4
##$GAMMA= 1
##$GB= 0.15
##$INTBC= 1
##$INTSCL= 1
##$ISEN= 128
##$LB= 0.24
##$LEV0= 0
##$LPBIN= 0
##$MAXI= 10000
##$MC2= 0
##$MEAN= 0
##$ME_mod= 0
##$MI= 1.114404
##$NCOEF= 0
##$NC_proc= 0
##$NLEV= 6
##$NOISF1= 3.799351
##$NOISF2= 2.8
##$NSP= 1
##$NTH_PI= 0
##$NZP= 0
##$OFFSET= 15.70392
##$PC= 1
##$PHC0= -19473.5
##$PHC1= 14.00081
##$PH_mod= 1
##$PKNL= yes
##$PPARMOD= 0
##$PSCAL= 0
##$PSIGN= 0
##$REVERSE= no
##$SF= 200.130013532006
##$SI= 16384
##$SIGF1= 3
##$SIGF2= 2
##$SINO= 400
##$SIOLD= 16384
##$SREGLST= <1H.CDCl3>
##$SSB= 0
##$STSI= 0
##$STSR= 0
##$SW_p= 3612.71676300578
##$SYMM= 0
##$S_DEV= 0
##$TDeff= 0
##$TDoff= 0
##$TI= <>
##$TILT= no
##$TM1= 0
##$TM2= 0
##$TOPLEV= 0
##$USERP1= <user>
##$USERP2= <user>
##$USERP3= <user>
##$USERP4= <user>
##$USERP5= <user>
##$WDW= 1
##$XDIM= 8192
##$YMAX_p= 0
##$YMIN_p= 0
$$ End of Bruker specific parameters
$$ ---------------------------------
##NTUPLES= NMR FID
##VAR_NAME=  TIME,          FID/REAL,        FID/IMAG
##SYMBOL=    X,             R,               I
##VAR_TYPE=  INDEPENDENT,   DEPENDENT,       DEPENDENT
##VAR_FORM=  AFFN,          ASDF,            ASDF
##VAR_DIM=   8192,          8192,            8192
##UNITS=     SECONDS,       ARBITRARY UNITS, ARBITRARY UNITS
##FACTOR=    0.0002768,     1,               1
##FIRST=     0,             0,               0
##LAST=      2.2672688,     0,               0
##MIN=       0,             -174278,         0
##MAX=       2.2672688,     105903,          0
$$ Real data points
##PAGE= N=1
##DATA TABLE= (X++(R..R)), XYDATA
0 0 0 0 0 0 0 0 0 0 0 0 0 0 -1 8 -8 8 -8 9 -16 16 -24 24 -32 33 -40 48 -56 64 -73 85 -97 110 -125 142 -160
35 -160 181 -202 227 -254 282 -314 351 -389 431 -477 526 -582 639 -705 777 -856 942 -1038
53 -1038 1147 -1267 1401 -1555 1732 -1938 2180 -2468 2824 -3270 3850 -4639 5782 -7596 10927
68 10927 -19110 86901 62626 -62294 -12148 -86877 -111697 -5020 56254 2233 25307 21815
80 21815 -58537 -59004 12341 -10356 -1304 76882 58361 -15606 12162 14925 -52029 -33317 30377
93 30377 -5503 -31290 9016 -10398 -54183 -11304 15344 -1010 40523 69170 11278 -3216
105 -3216 22202 -32441 -67245 6754 33051 -6548 25344 47355 -31027 -60598 -19642 -30982
117 -30982 -25959 49407 61756 17655 25880 12349 -57299 -51217 182 -13430 -3093 58462 36868
130 36868 -25431 -13984 -12213 -48936 -16986 41142 30350 19958 33002 -5102 -37850 -4364
142 -4364 5684 -13902 16579 30035 -21405 -33348 -1361 -12758 -16006 31203 36420 -1378 122
155 122 -2165 -40723 -30626 12505 11457 13703 41180 18994 -23615 -16602 -16221 -38583 -10892 29618
169 29618 17351 15932 38975 12504 -24567 -13418 -14387 -31219 -1778 26972 9828 7819 20117
182 20117 -10351 -33393 -6145 923 -12220 9915 21423 -6301 -9228 6783 -6152 -8144 18204
195 18204 13908 -9773 -2666 -2507 -22349 -9829 17675 14863 13713 22301 1733 -23125 -16954 -12337
209 -12337 -12840 11382 28686 12656 3735 2936 -21627 -32425 -9104 1904 1025 20191 25342 1490
223 1490 -8436 -6858 -18926 -15733 7387 10107 5045 17030 11871 -10902 -7124 2894 -8439 -7541
237 -7541 10499 7457 -3465 3556 5010 -5484 -1264 4633 -2387 -1935 644 -10679 -11970 1393
251 1393 1862 552 14628 16127 -4010 -11636 -8376 -16031 -14284 5904 17334 18540 18975 7411
265 7411 -9385 -14177 -15855 -17206 -543 19200 15971 9153 12620 843 -18779 -16233 -4696 -4194
279 -4194 -105 8828 8066 1701 -1158 -5389 -5247 1273 -693 -5620 1109 3913 -5570 -3712 9303
294 9303 8916 1578 3652 4107 -5250 -10742 -6578 -799 5417 9218 8327 7709 3312 -10303 -15367 -7784
310 -7784 -2780 -2538 6767 15530 8442 -4359 -7696 -8688 -10857 -8273 1101 10384 12043 5911 265
325 265 -96 -4446 -9686 -4852 4898 5833 2321 5566 7462 455 -4856 -3155 -385 -2391 -4974 -1102
341 -1102 3961 2317 -1063 2028 5164 -860 -7326 -6101 -3776 -5722 -3820 3777 9536 9407 4038
356 4038 777 -1347 -7645 -11547 -5036 3814 5328 6935 11868 9313 -987 -6127 -6248 -7821 -6349
371 -6349 -1544 3808 8634 8253 1391 -1676 -1592 -7644 -11858 -4569 2198 411 2793 8769 5106 -1155
387 -1155 -1217 -3138 -6128 -2562 605 744 4635 7211 2254 1492 3950 -1996 -6364 -498 2 -4676
403 -4676 425 6307 1854 28 2833 -1630 -6218 -3537 -4539 -5921 2015 5940 1575 3641 5467
418 5467 -3426 -7625 -2563 -3226 -3695 5966 9183 3572 4817 5087 -5745 -8899 -1366 -2134 -2035 7579
434 7579 8793 1695 1324 -159 -8907 -8050 -444 -2868 -2265 6429 4469 -1404 3109 2373 -7111 -5048
450 -5048 1451 -4196 -4856 5436 5376 539 6016 6341 -1286 -846 -1585 -9021 -5065 4476 1874 2288 12024
467 12024 7598 -5880 -4707 -3095 -10811 -7539 2945 2582 3697 9719 3555 -4963 -2362 -5286 -10916
482 -10916 -2039 6166 369 2918 11289 2277 -6071 2570 2379 -7328 -2643 4819 -184 455 5977
497 5977 917 -1184 4342 -1869 -8505 777 1841 -8398 -2185 9031 1768 -2623 4251 -195 -9406
512 -9406 -4035 -318 -3422 2945 8370 1904 2262 5154 -5303 -8000 2000 -345 -5016 8041 12801
527 12801 -1081 -3059 3293 -4833 -8536 755 1381 -1731 5349 3121 -3815 2554 4164 -9604 -8671
542 -8671 3496 -1866 -6154 7233 8611 -2985 369 5274 -3860 -4477 2043 -2683 -4581 4657 4359
557 4359 1306 8953 6136 -7533 -3753 1905 -9435 -8459 7411 6837 -263 5987 5772 -5774 -6836
572 -6836 -4790 -8949 -2020 7816 1012 -155 9321 1878 -8905 438 3241 -8311 -3533 8265
586 8265 1667 -1490 8331 3674 -5462 1100 2087 -5712 -419 3300 -6155 -1995 9609 1657 -4318
601 -4318 5822 798 -14010 -6104 4762 -2136 -139 9698 2463 -4251 1606 -1922 -7898 982
615 982 3712 -3751 3278 10709 -719 -3086 5361 -2387 -9769 1820 5160 -3030 2929 8877 -2015
630 -2015 -4274 1431 -6141 -8114 4498 3194 -4648 3986 4684 -8512 -3543 8151 -503 -4858 4280
645 4280 -1571 -11005 1147 8852 1145 6156 10734 -4561 -10132 -1513 -4731 -6552 8441 11587
659 11587 1100 4261 4857 -10618 -11538 -17 -3652 -3786 10633 8723 -3109 182 1064 -10010
673 -10010 -5882 4840 -893 -1919 7433 1687 -6268 3029 4334 -4302 1985 7732 -3855 -5856
687 -5856 4012 -1747 -5783 7429 9097 -3132 878 3892 -8789 -8342 1711 -1871 -2402 8992
701 8992 6120 -3303 1905 64 -13926 -8367 5032 723 2413 15140 7549 -8441 -5640 -4219
715 -4219 -10018 653 13146 7436 4014 4936 -7201 -13211 -769 2818 -1842 8121 10532 -5609
729 -5609 -8441 460 -4124 -5165 7440 7040 -3074 -1603 -1991 -9518 -2677 6999 2431 3578 9888
744 9888 -1096 -11882 -2659 195 -6752 3439 14781 5410 -307 3924 -4613 -12262 -3596 -315
758 -315 -1766 7582 10881 -263 -1381 1523 -9297 -12480 1985 3510 -2014 6143 9105 -3138
772 -3138 -6101 -554 -4162 -3344 5710 4704 -60 3229 -534 -8266 -686 7204 1170 1895 7838 -1557
788 -1557 -11026 -4252 329 -1684 5541 11106 2552 -3545 -3834 -10651 -9724 2249 4953 3566 9167
803 9167 5985 -7687 -8576 -1522 -4750 -3142 8838 8469 955 1450 29 -6274 -3545 1357 -497
818 -497 2248 7035 1100 -3709 1375 -671 -6666 -659 4196 -1549 -1863 3155 -619 -4651 -260 565
834 565 -1091 2043 2625 -2553 -1638 -3 -4776 -2019 6623 5415 1229 3739 1043 -7477 -6679 -521
850 -521 757 3828 8804 5541 -646 -2605 -6681 -8863 -2767 2858 2712 5156 6369 -1209 -6244 -3253
866 -3253 -2905 -4048 1587 5266 1693 -126 384 -1825 -1592 1914 1987 962 2469 32 -4223 -1782
882 -1782 1510 890 2224 5035 1985 -2079 -2422 -3958 -5191 -1570 2874 3354 3185 3175 -1034 -4835 -4735
899 -4735 -4307 -2261 2628 5171 4242 3076 698 -3380 -5188 -2511 82 2367 5355 5046 1391 -1330
915 -1330 -2420 -3340 -2160 827 2643 2722 1376 -918 -2383 -2257 -2029 -1109 1913 2829 -93 -2224 -2275
932 -2275 -1816 -1645 797 3839 4241 1209 -1564 -3061 -3303 -2210 1102 5184 5821 3762 1087 -2015
948 -2015 -5104 -5564 -2769 1260 4301 4339 3292 1568 -2198 -6126 -5694 -1521 661 799 3123 4335
964 4335 579 -2633 -2417 -1549 -1161 331 1356 2266 1580 -832 -1914 462 1905 385 1736 2446 -998
981 -998 -3686 -1395 117 -375 1573 3976 1872 -686 -2519 -3565 -3374 -1401 -741 1834 5524 3230
997 3230 -1906 -1975 -1475 -4033 -3360 2429 4430 2465 2206 1503 -1412 -1740 -1307 -1608 835 2844 954
1014 954 1066 2160 -1009 -4226 -962 1178 -1733 -534 2993 -248 -2742 -18 1032 -623 -267 182
1030 182 -1453 14 628 -1435 23 3780 1053 -1079 2356 1445 -2870 -1945 762 -401 533 3440
1046 3440 1934 -67 400 -2148 -3877 -1228 -404 -2104 1813 3970 89 -514 1533 -2042 -5636 -1236
1062 -1236 1454 -322 1716 3666 305 -651 1008 -1547 -1986 1261 289 -2189 1952 3830 -524 -165
1078 -165 2194 -1441 -3250 765 605 -2122 319 750 -1368 514 1794 -1250 -1522 940 -2047 -3199
1094 -3199 1723 1657 -1831 1691 3802 -1108 -1246 1611 -1877 -2832 1570 1910 478 3429 2521 -2642
1110 -2642 -1540 705 -3085 -1936 3427 1128 -1391 2511 1710 -3685 -1969 419 -2901 -1777 3514
1125 3514 1283 -1080 2316 60 -3596 -42 1817 -2179 -469 3324 -303 -1291 3666 1641 -2951
1140 -2951 1015 1522 -3213 -1108 2312 -1221 -1399 2934 803 -1851 1567 192 -4332 -1336 1018
1155 1018 -2572 -319 4244 355 -1165 2794 -311 -4965 -1025 1423 -2134 1450 6275 1635 -937
1170 -937 1592 -2049 -4654 1181 1870 -1623 1796 3788 -2148 -2079 2760 -1031 -4553 945 1272 -3134
1186 -3134 407 3158 -1509 -1468 1887 -822 -1971 2260 507 -2730 1440 1577 -2935 1102 5197 -741
1202 -741 -1925 2823 -904 -4567 694 2380 -664 2254 3397 -2477 -2993 566 -3398 -3294 3975 2202
1218 2202 -2772 2015 3019 -4495 -3159 2682 -1341 -2940 3505 3370 -1191 1641 1714 -3643 -1515 1833
1234 1833 -1572 439 5229 488 -3254 1949 1195 -4222 217 3875 -1944 -3133 1571 -1241 -2820
1249 -2820 2425 1966 -1667 1360 1127 -4909 -2023 2392 -1959 -1078 5887 2771 -2917 1064 1803 -4223
1265 -4223 -2371 2618 -20 465 4749 1904 -2048 770 -1391 -5169 196 3402 -1638 158 4273
1280 4273 -1309 -4645 942 921 -3063 1016 2931 -2222 -1553 1998 -1150 -1069 3985 906 -2590 1635
1296 1635 852 -4210 -28 4385 -189 -876 3989 498 -3705 -63 417 -3095 422 3116 -568 -188
1312 -188 2237 -2562 -4209 832 -133 -3084 2212 3713 -1928 -820 2224 -2280 -3043 2170 1061 -1758
1328 -1758 2445 2597 -2163 194 2327 -2181 -1561 2795 -580 -2943 2009 1394 -2536 625 2624 -2117
1344 -2117 -1379 1741 -1894 -3222 1322 829 -1840 2223 2901 -2095 -1032 679 -2760 -2266 2898 1915
1360 1915 -386 3405 2192 -2988 -1235 1445 -1579 -933 3094 365 -1795 1786 953 -2508 521
1375 521 1932 -2534 -1703 1314 -1525 -1777 2418 1553 -1642 1110 1243 -3108 -1717 1908 -288 -432
1391 -432 3162 1539 -1160 936 -56 -2549 -204 2282 -752 -155 3109 145 -1957 914 138 -2707
1407 -2707 -589 1351 -1430 -430 2098 76 -1522 737 -318 -2297 603 1043 -1378 601 2710
1422 2710 -1352 -1468 1970 731 -1684 902 1298 -1367 -239 1534 101 467 2110 -263 -1827 -87
1438 -87 -1040 -2361 889 2698 -103 -22 1619 -1534 -3196 -411 562 -762 996 2140 68 27 208
1455 208 -1285 -511 1418 -157 -908 1698 1263 -1417 46 2089 205 -1421 376 -146 -1812 -448
1471 -448 487 263 893 847 -791 -1056 -156 -1512 -1434 657 268 -962 1162 1785 -337 -1118 315 104
1489 104 -1517 127 1207 985 778 548 -151 -35 -299 -1267 -492 1154 503 -541 580 432 -1551 -1782
1507 -1782 160 161 -667 -149 418 -445 -610 73 63 393 475 -148 -508 290 16 -510 1146 1807 473 -71
1527 -71 775 -631 -1958 -975 932 689 851 1235 489 -1328 -1798 -1317 -884 92 631 278 642 780 -721
1546 -721 -1048 -94 -565 -1196 629 1779 565 -62 829 85 -929 416 900 -479 347 522 -935 -435
1564 -435 842 128 -422 1085 374 -1913 -696 -20 -1747 -854 1894 1244 75 959 -89 -2689 -1486
1581 -1486 66 -288 1131 2662 1002 -392 573 -785 -2169 96 1252 12 1048 2119 -464
1596 -464 -1707 -130 -630 -1896 961 2105 -496 -380 414 -1500 -1412 1197 291 -887 1336 815 -1670
1613 -1670 -523 857 -927 -341 2796 861 -760 747 -247 -2582 -241 1890 616 970 2257 -1103
1629 -1103 -2323 -446 -1186 -1954 1666 2381 -652 79 1595 -1623 -3074 -247 -63 -1154 1767 2452
1645 2452 -338 -363 634 -2035 -1173 1804 583 -636 1896 1332 -2112 269 1836 -1272 -545 2063
1661 2063 -219 -1929 172 -91 -1688 706 1518 -430 409 1220 -2372 -2447 660 274 -1324 2516 2492
1678 2492 -1186 -597 1021 -1856 -1986 1355 887 201 2097 1181 -1621 -1 863 -2017 -708 2630
1694 2630 170 -1629 1463 511 -2433 -119 1532 -1354 -892 1126 -545 -1160 1102 -419 -1561 1224
1710 1224 955 -1506 368 1683 -1513 -1249 2190 691 -978 1432 1434 -1570 -525 677 -1107 -84
1726 -84 1917 -13 -663 1399 -407 -3171 72 1013 -1615 44 2405 -661 -1899 761 194 -1749
1742 -1749 399 702 -809 728 1408 -487 139 2095 -734 -1756 1535 831 -1877 700 1935 -1169
1758 -1169 -635 1531 -214 -1317 558 -404 -1896 516 692 -1159 760 1908 -1145 -1132 1189 -750
1774 -750 -2001 1248 1386 -1098 850 1808 -1093 -746 984 -734 -1409 1240 647 -989 1224 1086 -1827
1791 -1827 -537 1130 -1387 -1234 1626 393 -1777 645 642 -1778 -168 1647 -1017 -932 843 -741
1807 -741 -1591 1909 1403 -911 844 1138 -2137 -805 1484 56 -352 2266 912 -1867 351 690
1823 690 -1456 -498 1367 -771 -598 1582 136 -1262 647 370 -2460 -53 1400 -1202 -290 1809
1839 1809 -249 -1587 1093 627 -1458 853 1474 -1043 -335 1512 -440 -290 1838 395 -1678 550
1855 550 386 -2262 -42 2228 -373 -779 1489 2 -2233 149 362 -1697 345 1582 -254 98
1871 98 1418 -970 -1542 925 345 -1298 1456 2074 -1175 -371 1574 -527 -1164 1416 554 -955 191
1888 191 24 -1339 -103 1350 -722 -571 1417 -1078 -2340 552 609 -1365 737 1869 -603 -832
1904 -832 728 -797 -1234 1115 495 -463 1350 907 -1368 -362 776 -1412 -1052 1828 631 -1049
1920 -1049 843 648 -1778 -892 784 -712 -465 1387 -462 -1063 794 -174 -1250 768 1303 -1035
1936 -1035 -469 1397 -549 -1273 1159 628 -402 845 769 -1064 -405 440 -567 -240 1606 455 -582
1953 -582 933 -109 -2103 -543 458 -1014 -291 1708 415 -1040 -54 -116 -1248 24 785 -372
1969 -372 805 1211 -562 -648 1030 6 -1003 801 1011 -947 -219 747 -407 -421 1015 216 -487 351
1987 351 -154 -1408 -25 545 -574 124 1110 -257 -1063 329 -203 -1390 256 1034 -22 320 929
2004 929 -339 -523 147 -621 -398 1040 1066 -676 270 732 -1275 -878 752 -107 -622 614 228 -712
2022 -712 -161 496 -778 -457 320 -305 -784 717 -346 -853 816 793 -352 265 1141 -464 -655 746
2040 746 408 -197 720 854 -339 405 366 -856 -643 124 -214 -109 1157 652 -600 -289 -287 -1236 -547 610
2060 610 -46 -255 759 245 -487 247 -83 -523 -103 760 138 180 463 20 -414 436 462 -507 90 337
2080 337 -744 -598 397 211 -381 368 93 -576 -98 6 -845 23 133 -189 234 763 124 -608 151 -34
2100 -34 -552 120 899 472 186 101 59 -266 -234 -46 -205 288 488 29 265 169 -632 -972 199 148 -31 312
2122 312 236 -315 -637 -156 121 66 -195 84 242 288 -349 -38 386 153 -10 114 585 2 -583 -105 424
2143 424 89 190 352 348 -481 -579 -287 170 -374 -241 281 248 109 -213 -146 67 -580 -414 268 581 524 24
2165 24 100 394 -51 -392 278 244 -206 134 656 166 -97 -128 -84 -273 -160 -171 -73 112 -259 -867 -85 517
2187 517 -209 -215 581 -71 -789 -283 84 267 67 351 211 -40 349 -411 -153 156 122 -225 404 893 -367
2208 -367 -580 143 -248 -852 302 419 -217 214 127 -380 -433 -232 -433 -263 440 108 -65 463 345 -802
2228 -802 -278 542 33 -75 735 362 -561 436 276 -265 74 521 -169 94 292 -581 -963 561 96 -586
2248 -586 395 421 -543 -706 251 -627 -459 672 417 -69 260 44 -933 -189 519 -659 -34 1227 557
2267 557 -5 738 18 -1225 -405 279 -91 268 1076 -230 -535 107 -469 -1057 296 456 -829 -127 706
2286 706 -704 -814 650 -26 -736 490 777 -489 -250 303 -657 -316 1105 151 -268 712 192 -1202
2304 -1202 -12 344 -569 352 1088 53 -658 328 -312 -1131 -77 935 -316 27 698 -600 -831 237
2322 237 -338 -564 867 687 -404 300 740 -1148 -864 998 130 -395 1067 711 -788 -396 279 -612
2340 -612 -350 1098 5 -504 270 -183 -1041 348 467 -571 126 906 -457 -1249 450 204 -933 687
2358 687 923 -246 235 539 -838 -379 665 -62 -102 1211 699 -731 199 375 -1146 -1031 1113 184
2376 184 -658 593 191 -1371 -298 425 -426 346 712 -672 -351 762 -245 -875 971 1068 -619 -24
2394 -24 814 -787 -606 816 248 -366 586 330 -716 -30 387 -1045 -310 1136 -153 -411 1003 76
2412 76 -1409 -154 471 -713 8 948 11 -500 363 -521 -692 471 216 -599 642 911 -595 -485
2430 -485 883 -296 -1044 749 551 -359 185 334 -882 -365 278 -163 -161 884 124 -875 -12 57 -1099
2449 -1099 51 1273 70 -341 597 -478 -1263 166 752 -138 527 1064 -250 -533 -36 -573 -452 1046
2467 1046 476 -568 266 383 -1036 -513 568 -365 -479 792 299 -730 422 287 -625 54 544 -179
2485 -179 43 797 -205 -877 404 541 -214 310 743 -320 -689 248 -409 -504 659 88 -205 681 354
2504 354 -726 -525 89 -522 -642 610 266 -216 233 147 -901 -410 454 -152 72 1068 19 -700 386
2523 386 106 -553 615 669 -91 104 504 -339 -734 532 219 -228 317 367 -807 -449 236 -298 -12 580
2543 580 153 -428 -59 -46 -733 -2 357 -49 20 1100 100 -348 413 -204 -531 270 748 -55 13 384
2563 384 -101 -451 154 -330 -571 184 292 -384 -52 446 -608 -517 327 240 -280 83 356 -554 -143 338
2583 338 -37 8 585 154 -504 38 -268 -555 275 643 -408 -54 319 49 -314 11 57 -263 254 197 79
2604 79 -120 -350 -576 -205 426 109 -156 279 188 -397 -51 426 -359 -115 466 382 -339 168 139 -182 -65
2625 -65 -44 -307 -38 314 -219 -143 204 80 -369 185 341 -198 -395 292 -57 -145 113 -32 -185 183 -92
2646 -92 -255 31 9 -53 -130 607 383 -37 207 56 -310 -227 -76 45 -83 95 -76 -53 162 -297 -254 201
2668 201 217 -196 -42 -100 -290 -197 -101 93 158 263 55 -46 -13 0 75 354 8 3 54 30 -112 9 61 199
2692 199 52 24 423 17 -139 -231 -48 -115 -19 74 17 -31 70 -20 -162 81 -50 19 123 -112 96 105 121 -26
2716 -26 -49 -146 359 325 -137 6 172 147 -4 172 107 -39 -14 -201 -279 115 -65 38 -1 140 -190 -116 243
2739 243 31 26 -187 -9 122 208 352 -50 -157 83 225 86 67 217 -42 250 76 -90 -90 22 -73 -256
2761 -256 126 214 15 -14 -106 -210 8 244 -18 -296 -79 143 -201 -282 164 28 116 337 -31 -276 193 -103
2783 -103 -283 253 415 -196 -38 -7 -294 -516 -211 263 -82 150 50 15 -167 8 -438 6 187 -93 -155
2804 -155 363 -81 -680 -4 183 -317 -209 343 108 -64 21 84 -385 120 -13 -228 39 250 -188 -276 238
2825 238 -111 -393 227 218 -211 -220 164 -63 -182 218 -13 -140 219 95 -346 82 86 -233 125 673 73 -41
2847 -41 198 131 -367 -82 -5 -199 -53 359 -193 -10 -49 -118 -265 123 -136 -630 202 323 -580 -170 436 247
2869 247 -317 68 168 -126 -63 179 -55 -35 475 -234 -68 312 -103 -305 49 152 -446 -140 472 -158 -329
2890 -329 36 -239 -149 213 67 41 368 143 -199 104 349 -439 -429 501 252 -374 195 327 -260 19 296
2911 296 39 -167 546 -30 -174 74 -240 -409 26 262 -390 -311 367 -146 -484 272 44 -445 -47 233
2931 233 -190 -66 161 -301 -275 281 289 -228 604 578 -482 251 434 -388 -274 456 22 50 180 209 -489 -101
2953 -101 183 -193 -88 258 -146 -321 -95 121 -575 49 215 -530 -9 299 -83 -378 643 69 -366 238
2973 238 234 -267 106 339 -198 -361 551 -21 -197 266 184 -407 153 69 -244 -241 640 51 -271 72 14 -453
2995 -453 -148 213 -150 -89 220 -97 -399 369 -196 -279 225 364 -346 19 269 -145 -176 227 -79 -309 332
3016 332 355 -236 124 428 -250 -232 232 -337 -242 279 86 -100 130 337 -349 -35 599 -42 -394 51 -42
3037 -42 -261 -51 473 -59 228 144 -381 -439 436 -90 -2 260 329 -72 45 342 -175 -369 -29 -52 -93 193
3059 193 -196 -411 -78 126 7 -23 321 -26 -192 348 148 -362 340 407 -15 -135 316 -49 -79 127 -90
3080 -90 -187 310 -19 -335 226 157 -470 -174 220 -77 79 323 283 -140 201 162 -336 -51 360 -30 55 208
3102 208 -159 -437 19 -3 -202 295 378 122 -53 68 -5 -355 33 351 17 208 91 -398 -115 196 -173
3123 -173 -132 148 329 -304 286 237 -74 157 222 0 214 190 59 -254 -144 272 -135 184 284 -207 100
3144 100 157 28 -100 26 179 -38 261 401 -114 -178 -273 -233 -207 119 -22 105 193 -72 -152 189 -34 207
3166 207 260 172 155 -193 44 66 -189 -69 286 75 -98 106 23 -73 -145 -111 -100 309 66 -136 -270 10 -125
3189 -125 -96 112 245 117 178 15 -25 -87 281 68 -112 127 -8 -76 64 -277 -304 -5 71 88 -91 49 -30
3212 -30 59 222 -127 -356 280 -77 -43 -83 -142 -50 -257 221 88 17 194 19 -78 -76 -184 -68 -2 230 169 -143
3236 -143 247 -234 -396 -162 123 113 433 96 -29 -243 -1 -641 -150 204 54 -118 -190 86 -148 -43 -10
3257 -10 159 247 165 82 315 69 -106 -81 183 -103 39 77 19 -170 -59 274 56 0 32 5 44 41 -53 -120 64
3282 64 -116 131 30 -53 -48 149 -107 -190 14 9 218 12 56 -15 113 319 -61 -75 55 178 127 56 44 37 -142
3307 -142 86 49 141 -148 15 175 -336 -5 -77 92 230 53 -1 -23 -7 -131 47 -2 231 121 -37 -80 -90
3330 -90 168 -55 -45 86 -23 54 117 -127 -43 -94 17 -89 -28 -88 57 83 -142 23 45 7 53 -13 -3 156 146
3355 146 -172 274 -178 -202 152 197 -21 217 94 -61 -79 92 -1 -9 140 -41 24 -161 -97 -19 -39 324 258 -228
3379 -228 -23 61 -282 -127 -47 -143 -93 50 107 -68 -222 -169 243 -74 220 165 -3 251 289 -208 328 168 15
3402 15 34 9 202 151 154 -79 -372 -107 -144 -121 -217 -13 -296 -340 117 212 312 338 330 68 -24 116 -149 142 -90
3427 -90 242 49 143 -80 -296 1 256 -96 124 136 63 95 -151 27 -79 218 153 -56 145 -47 -119 -56 -95
3450 -95 -158 -184 22 -3 8 -133 103 227 65 335 -51 -237 -3 -203 112 102 160 -22 45 130 -111 121 179
3473 179 136 -313 185 15 -79 -118 -161 -268 -161 180 35 103 47 20 10 14 61 -60 35 82 40 24 64 -156 -151 213
3499 213 -16 -86 43 336 -14 -54 232 -23 -149 186 79 13 80 -26 -75 -108 -50 102 -49 201 106 -355 115
3522 115 20 -239 -112 -15 -199 -133 59 54 -165 -79 176 -69 153 105 -185 11 52 -39 -123 412 -104 -130 -71 99
3546 99 76 -32 394 13 -153 115 213 -36 354 219 -115 51 244 188 212 212 -162 -95 -56 235 -117 -126 -3 -236
3570 -236 -251 27 -102 -139 110 65 -1 209 124 -118 -90 233 -40 -86 128 334 -60 144 129 -40 246 343 109
3593 109 -209 -146 -116 25 97 300 -415 148 -50 -102 -59 140 74 -252 176 253 7 -264 136 101 101 324 -73
3616 -73 -259 236 240 -384 247 256 25 -88 443 71 228 31 20 -98 234 87 -180 59 231 -271 -154 268
3638 268 -122 -108 95 -80 -234 259 -33 -33 28 221 -81 -12 122 25 -5 199 -86 -54 47 84 -373 -82 156
3661 156 197 -110 -18 139 0 159 148 10 -209 28 -14 51 132 -171 -228 -103 171 -75 -12 160 173 80 34 -70
3685 -70 -175 109 359 167 -159 326 89 -176 43 -81 -211 231 28 -55 -90 238 -255 -356 64 17 -51 35
3707 35 -122 -250 31 144 -39 2 141 28 -13 50 46 -111 302 -40 13 -68 352 40 -180 177 -316 -101 -65
3730 -65 19 -140 -172 43 -64 -114 -9 26 -286 -256 107 18 57 25 -237 128 10 156 -199 79 236 -138 144
3753 144 78 -193 86 96 143 22 172 -139 -64 215 32 -85 98 58 -141 -265 49 166 12 -126 -58 -117
3775 -117 -41 -171 -188 101 -54 166 -30 357 171 -98 -31 93 -207 15 96 -22 74 8 -120 -211 -54 -46 22
3798 22 -144 70 -106 -46 237 94 -126 -53 -28 -162 114 166 205 -273 65 178 -16 46 -88 -33 -14 -223 -331
3821 -331 111 -54 -30 171 329 -149 -330 -172 38 289 11 -143 40 -49 -246 -70 -132 1 134 -154 -113
3842 -113 351 40 -150 -44 113 47 57 251 -196 -92 63 3 -312 -167 15 -170 -3 123 -88 -137 68
3863 68 -40 -160 35 -135 127 1 22 -144 -135 156 -54 226 -13 56 -14 0 80 -54 -35 79 40 -41 201 -31
3887 -31 -29 70 -41 119 121 45 112 69 -55 34 17 176 -35 -194 120 -103 -92 -320 75 66 -93 179 48 -54 -46
3912 -46 -198 268 -104 -154 177 -53 133 123 -56 -343 65 -31 22 89 58 -31 -96 -189 54 217 -12 78 11 169
3936 169 121 -141 -45 -145 -116 -39 110 -221 -6 -68 148 137 -85 147 -28 -122 17 -158 -55 -153 116 196 361
3959 361 88 -207 119 116 -101 -121 101 -104 34 -116 124 -117 -21 -232 106 -5 -222 -66 -122 232 40 -73
3981 -73 -158 -25 -86 -172 8 -109 186 118 -204 30 5 13 -87 62 208 -35 -176 20 275 -195 131 140 69 -301
4005 -301 24 -55 -11 298 -15 13 57 67 208 110 19 180 159 276 -198 52 -101 -4 -28 -2 -26 -208 45 -114
4029 -114 -61 -55 -174 128 -120 213 144 -198 297 394 23 -280 328 37 -30 -298 -50 -227 67 191 -120 63
4051 63 -79 158 -175 267 36 -181 -77 95 -125 6 92 -22 -212 -25 274 -101 -42 -75 -129 87 109 -25
4073 -25 -337 112 123 -202 158 -7 -81 -69 32 -61 -269 97 74 -165 -110 -57 -7 17 162 -7 175 82 -78 84
4097 84 59 -115 -192 94 -69 136 123 33 -37 60 53 189 -60 149 -56 -212 -225 143 -46 34 -242 -50 -160 102
4121 102 -50 -203 -2 -40 2 30 35 -12 -81 -297 204 -255 135 209 -307 94 -40 -170 60 187 80 -1 -64
4144 -64 100 8 -21 -290 46 -230 85 191 -104 -149 -171 -406 32 -171 -194 -237 32 -10 20 61 7 237 199 212
4168 212 -147 -148 -92 -274 -165 58 -145 172 -119 2 -52 -148 65 21 13 67 -24 -71 9 202 11 -3 215 -59
4192 -59 -135 186 -105 -42 187 -127 -65 211 130 106 30 71 -31 -73 239 134 -62 71 219 123 98 144 -32 117
4216 117 -71 69 -6 20 92 130 -207 -14 277 -92 -47 -30 -164 47 115 -137 253 -93 -163 3 171 -216 -76
4239 -76 186 -123 -115 34 92 40 195 93 -295 187 -181 -54 -364 117 -227 59 74 52 -31 56 63 -187 -108 55
4263 55 156 -223 218 -34 56 143 114 13 -134 172 232 -246 -80 6 -43 -136 9 -87 -59 -129 37 -78 44 -82
4287 -82 -100 -275 185 164 -88 -180 -105 107 -82 -58 -14 40 54 135 72 70 -36 -80 -11 108 -48 61 -37 -154 -176 -39
4313 -39 9 -134 230 111 -192 -160 0 -89 -63 -110 -51 -72 -30 -117 -93 12 103 100 315 53 -115 -14 -119 -14 192
4338 192 194 -80 -50 -228 -61 -188 17 204 -39 -93 186 -79 -79 -129 -63 49 -188 195 -88 41 53 -128 105
4361 105 16 283 -129 259 129 90 67 -104 40 222 82 -213 75 38 64 -217 -211 -159 -42 121 -62 -116 -39
4384 -39 150 152 11 -135 -88 -129 -236 91 164 -188 185 229 2 -109 56 210 65 242 155 -132 -42 141 186
4407 186 -44 -44 19 97 -244 34 151 84 -183 -258 155 2 -132 158 50 -56 313 8 4 16 -67 44 -5 -155
4431 -155 85 74 -39 114 -208 266 -132 -266 -59 251 59 51 -224 134 -223 -99 -228 -229 -28 -9 75 -13 -78
4454 -78 -69 3 -156 187 -53 -10 266 -29 59 80 109 228 12 145 -100 69 -108 -3 183 -89 170 -15 183
4477 183 43 -160 -127 113 82 -232 -117 -69 87 -271 -20 112 -39 158 -59 -100 139 67 21 231 -202 81
4499 81 -40 -149 -131 -94 -25 65 -125 -76 -47 111 37 -52 56 -4 -167 -210 184 41 52 64 47 -73 -251 -56 157
4524 157 55 232 -83 72 131 -37 -147 11 278 -33 348 104 -150 -297 -61 -105 16 98 -142 -141 -86 -84 -1
4547 -1 64 -11 75 116 137 125 42 37 108 -42 68 -4 -52 135 -31 65 91 -52 -182 -160 -172 -13 117 -8 -57 32 28
4574 28 -108 -36 -3 85 -26 56 136 139 -163 209 -87 186 -78 153 -55 23 226 -76 -84 172 18 13 -52 -86 97
4599 97 157 -46 -51 -216 120 23 82 -66 72 -24 -181 90 93 200 31 49 2 -31 214 129 -217 -23 -67 74 34
4624 34 19 133 69 60 20 47 191 52 -169 2 -106 50 -272 83 -35 171 19 117 169 84 -187 213 -26
4647 -26 39 -9 -13 2 23 117 87 65 32 60 -127 216 -108 -106 49 99 201 -49 -311 -13 -72 -143 -104 -39 81 -199
4673 -199 -74 -161 -119 -46 -209 257 -77 173 6 66 -78 110 231 -73 -4 -162 -108 -97 -22 19 15 41 -94 -245
4697 -245 265 -17 83 135 -184 -131 -85 -77 209 -3 -112 102 189 48 201 -17 184 47 -61 252 -163 -127
4719 -127 -168 -269 -53 25 125 -142 -65 -58 32 90 65 83 -100 35 84 -52 181 -69 -76 -140 -66 135 3 -16 9
4744 9 -42 -157 -221 -215 -43 172 -55 -16 107 -19 1 -111 57 -78 -158 171 33 70 -39 -27 -104 288 217 132 87
4769 87 -164 86 105 37 -72 68 29 -136 -232 63 15 101 -68 -37 -110 85 157 30 -299 32 47 81 202 137
4793 137 -167 16 -166 10 -173 25 95 112 113 -160 -238 13 -15 -157 -211 -9 -49 3 -38 108 -66 159 92 -149
4817 -149 124 -173 86 203 77 -176 -168 -14 218 -54 -12 -43 -203 -55 3 150 -47 53 -132 99 -172 295
4839 295 -26 200 -74 12 20 373 -11 -306 152 -125 -19 29 -44 -109 -77 198 372 -293 -83 -268 -210 124 -233
4862 -233 83 89 46 99 45 -82 -22 56 53 56 -66 -184 -243 73 271 67 203 -62 -41 -72 70 -242 221 -228 37
4887 37 186 -104 -30 -66 157 39 177 -6 156 -101 7 210 121 303 -118 -53 30 166 -29 96 -54 205
4909 205 115 -35 89 27 87 -38 -158 36 -124 -92 125 -46 11 -65 132 -158 34 -91 -29 -40 207 79 176
4932 176 -63 20 -68 46 -60 17 36 -60 39 15 157 130 -31 -156 -95 78 56 74 -150 -316 164 91 -93 -127
4956 -127 -201 -42 66 -48 5 112 -18 -84 1 -81 -45 102 -78 37 -9 71 98 248 174 -285 23 204 6
4979 6 -80 125 67 -156 -128 -118 -71 -163 -96 -132 -30 -46 -158 -6 104 -3 -98 -98 181 -96 -20 34 -59 88 -173 -211
5005 -211 -152 -18 -29 -15 -126 -62 85 376 -149 29 -32 3 24 -59 282 -113 -235 -48 37 -101 -4 -106 24
5028 24 6 143 -220 -192 33 -179 41 51 178 53 -235 -117 -91 -153 7 21 -26 29 173 79 92 -133 45 162
5052 162 168 83 -88 41 107 -170 48 9 -178 117 -48 -148 60 -61 -95 -49 -68 -104 94 175 -27 -160 -1
5075 -1 -40 -164 95 133 -91 119 -93 -58 103 21 143 -7 -102 -19 -116 -53 78 -144 -198 -149 0 -254 -1 295
5099 295 -38 4 57 77 95 177 58 101 -76 269 -7 -253 311 -216 -144 18 4 257 6 -205 -168 112 -136
5122 -136 -112 -28 -156 41 22 47 109 22 88 39 76 -18 -96 115 1 176 -93 20 -95 -76 -24 61 -46 -144 267
5147 267 70 -68 -188 49 113 -59 -66 -35 -115 -27 -12 -123 -178 93 -18 -126 -181 -140 89 381 -74 91 -8 -232
5171 -232 -17 21 196 -119 17 -3 -132 38 43 -179 -18 -72 132 183 61 55 -167 190 318 179 -39 90 140
5194 140 7 -102 -10 -24 176 -82 -181 -120 106 -144 -203 258 58 184 83 -211 -325 -155 80 63 -10 15 -1
5217 -1 23 4 -80 -262 72 47 102 119 -105 307 207 53 91 132 -87 91 -27 43 -80 6 73 182 175 -69 -161
5242 -161 162 128 22 -185 -54 -240 6 103 -148 24 -122 1 -155 186 -21 -72 192 71 -55 116 50
5263 50 -122 45 120 121 -166 -26 -113 -7 12 2 -97 -233 -2 -212 -25 295 13 77 -72 24 -1 5 34 -87 -199
5288 -199 -38 64 65 278 73 102 -29 -39 260 19 1 8 44 96 -168 -69 29 78 -118 -139 -9 17 -6 103 -205
5313 -205 -119 54 -90 5 -73 14 328 -147 -146 44 28 -122 -90 -187 -416 29 88 -97 279 152 125 36 11 -83 63
5338 63 243 37 132 -1 -169 46 137 76 -154 -186 224 -115 -85 46 57 -283 -91 -258 165 155 -35 235 -38
5361 -38 -61 -2 -20 255 -143 -116 -4 162 -70 101 -84 -32 113 157 22 -4 70 -39 -64 269 53 -7 118 150
5385 150 -107 -103 -216 218 -108 -141 -1 64 138 55 -63 -52 44 -75 -19 37 238 -1 40 94 149 135 67 -38 31
5410 31 304 -100 2 18 -118 -19 107 255 38 -28 4 -68 -90 -28 43 -109 2 -105 333 185 72 -85 71
5433 71 195 58 124 105 41 60 -187 -39 58 -179 23 -191 155 12 -17 70 -122 -6 -37 58 56 -130 189 11
5457 11 152 -90 -132 -46 94 3 -77 260 -46 238 -135 9 253 -250 -243 -68 -60 -72 -56 -58 -265 45 42 32 -170
5482 -170 -101 184 116 94 -219 32 -27 50 -224 225 248 -1 -129 -134 -150 9 -138 69 -5 106 -8 -65 148 -71
5506 -71 -3 18 -316 -34 12 -85 91 113 -57 133 -68 118 -91 100 139 82 37 -9 -129 -101 -93 39 53 -161 -179
5531 -179 -248 -12 -10 81 149 200 -256 4 11 6 -111 11 -66 163 54 -96 54 -157 -140 138 32 -21 1 -184 -79
5556 -79 -82 -17 97 -78 82 -109 -7 -14 -33 132 -412 -172 80 194 -87 25 146 -118 75 -5 64 -126 -85
5579 -85 -77 -39 17 106 26 64 26 -342 46 112 156 -53 218 175 83 22 -75 360 -128 -6 54 -200 75 -21 -74 -194
5605 -194 64 -33 -3 35 43 151 162 16 -144 66 235 -2 43 7 -81 -30 -351 51 -86 -70 99 -2 39 63
5629 63 211 -89 180 88 138 197 211 -78 -18 25 -93 -4 -66 -194 -195 54 68 -312 -11 153 5 -84 -17 -275 -40
5654 -40 156 -40 -15 -102 -9 48 189 -70 6 145 -257 190 102 -55 -321 9 -277 -333 92 313 -76 48 60
5677 60 -14 -12 -16 -50 -62 62 -38 -23 -46 -18 20 -56 4 155 -7 148 -13 -61 -58 -91 125 -34 -251 122 231 -96
5703 -96 54 139 178 -24 256 -38 65 144 -27 -9 -144 245 14 -29 -40 -81 -21 -151 -137 128 18 -86 -31 89
5727 89 99 67 -220 246 58 -186 37 -143 -275 -143 56 29 -139 -125 -75 -222 -55 64 9 80 -33 78 -6
5750 -6 -4 -4 -18 -48 70 123 -3 160 -29 -254 215 -92 -134 -9 4 173 -159 -68 -141 9 -222 -116 67 -94
5774 -94 145 10 174 268 27 37 -321 -153 -121 -72 -3 318 -360 -141 170 99 256 41 86 202 -127 -213 -120
5797 -120 20 13 186 266 -8 -90 -227 -191 237 35 8 -48 -101 101 87 -55 4 -73 155 53 109 -142 76 9
5821 9 157 171 -227 -12 -58 263 38 203 -70 -43 -145 -42 16 8 -44 -166 114 -44 173 111 -17 -223 -48
5844 -48 15 122 57 -16 118 -35 172 120 96 -284 -5 -7 -13 -244 -9 -75 90 -24 -229 25 -133 -7 -202 -180
5868 -180 167 122 -27 66 -42 -186 127 -177 115 115 -55 -281 40 54 -180 -194 141 81 -38 224 -210 43
5890 43 103 -341 -147 88 -176 -227 159 53 104 -108 -99 -254 0 -1 88 136 -51 -86 -11 122 -9 -68 62 39 113
5915 113 -85 -228 168 6 13 13 74 -165 -225 -13 91 62 57 21 226 185 25 37 179 267 44 288 -41 54 -77
5940 -77 30 166 -37 111 158 -137 182 271 -134 3 -57 196 204 7 -22 -188 118 -91 15 -166 150 -87
5962 -87 -17 -159 52 66 -218 -138 -51 99 -38 137 241 68 -81 152 -183 111 37 21 44 99 106 -167 -60 31
5986 31 165 107 92 251 102 -69 -15 -39 -148 326 114 -183 91 -26 -128 273 -211 151 -220 -41 173 -49
6008 -49 89 85 -55 -31 -45 -283 15 -148 41 39 4 17 -109 9 134 -56 -50 -57 85 22 -43 241 -159 151 56
6033 56 -83 -86 -212 415 -88 41 -7 -93 47 -77 -37 112 -152 -23 -71 86 119 10 -40 -110 20 -13 -185 29
6057 29 -24 8 -52 -84 -73 299 -135 -127 61 -126 -127 -94 210 4 -161 -38 -40 -35 -95 11 76 112 161 -136 3 179
6083 179 65 50 60 -165 -98 -137 238 126 -5 -51 -50 -43 -24 -91 -31 131 167 16 143 235 -33 93 97 -127 -6
6108 -6 -70 143 -157 71 176 34 -57 120 -15 121 67 15 71 -41 24 24 -105 -12 49 -94 37 226 93 -95
6132 -95 -83 186 18 -95 30 -129 -4 42 130 -166 81 -27 234 78 116 -160 -84 -103 -95 197 106 -156 72
6155 72 224 105 0 132 32 -71 -56 -42 105 12 5 -116 147 85 -93 175 236 233 67 -76 -166 -151 -314 85
6179 85 2 -110 7 178 -159 -7 37 -126 141 278 -79 -167 -187 -30 -123 -79 -123 39 176 110 50 -227 79
6202 79 26 -62 94 104 -112 -183 -39 109 52 109 -176 75 74 90 336 161 8 125 125 -97 -239 64 -30 -35 -56
6227 -56 -187 219 71 -58 292 64 35 -51 -107 -89 -5 138 56 174 -142 63 44 107 -29 -142 -40 -16 -43 155
6251 155 41 134 2 256 -103 139 169 154 32 -28 -205 -226 -65 -14 12 -289 67 -80 -241 88 -79 -136 -67
6274 -67 -221 18 207 -93 246 -2 -86 -102 -269 -15 196 194 -23 227 -32 -207 -270 -140 294 -106 36 107
6296 107 -109 -64 -266 -120 93 -70 -87 -114 81 -76 -54 112 -5 128 -74 -157 -84 -12 -146 -55 86 184 -115
6319 -115 -41 48 82 -388 -171 -42 217 -114 -40 88 145 184 -284 -113 0 -196 122 -127 3 118 -4 -152
6341 -152 93 259 184 3 -95 -35 51 -39 -125 91 9 67 118 314 -289 -26 -39 -240 -128 -136 11 -38 153 -25
6365 -25 -36 -11 134 159 93 -138 55 28 -188 -38 -74 6 206 -2 -71 219 -36 49 -23 -21 58 -93 53 -147 123
6390 123 132 20 6 -4 -4 55 102 -91 -31 98 -77 -21 19 -57 -39 34 -39 -171 1 278 119 1 -140 -36 115
6415 115 38 12 226 11 -5 -83 -317 162 196 67 -90 -151 -161 -22 55 316 -185 26 70 48 169 -101 -30 60
6439 60 65 38 -73 32 -216 67 122 -56 -61 -146 173 46 118 84 12 -140 -64 17 -57 -152 215 4 -75 -183 -31
6464 -31 -209 -48 -78 185 73 -46 90 40 15 -58 172 14 20 -253 28 -155 -64 16 24 -336 -210 291 -250 13
6488 13 -142 -99 -3 -81 84 -38 -63 -162 325 -9 92 84 -49 -152 -268 -24 34 -82 -167 -122 214 152 -95 -87 55
6513 55 56 -83 32 -92 161 -182 251 -2 -72 -18 6 -195 99 98 62 226 30 -91 90 -23 128 -187 204
6536 204 -25 -48 -108 -10 -51 -53 36 2 -20 28 128 259 142 -53 -105 -24 -62 147 -99 50 66 -150 14 -41 26
6561 26 126 214 -47 198 -133 -79 76 -273 -11 114 -79 140 -2 -1 147 86 -7 14 -118 -43 265 -68 -106
6584 -106 76 -66 63 57 81 84 -8 -329 -90 131 -4 -104 -181 50 69 -19 -212 -16 324 264 -57 10 94 69
6608 69 -91 -89 213 -223 -93 53 41 26 -33 248 -271 44 -243 77 -314 -317 -14 300 -29 -50 13 89 148 184
6632 184 -251 -136 -129 53 -109 -3 7 -121 48 62 48 -11 24 -242 2 -384 -78 -52 -271 -244 -112 9 -95
6655 -95 -21 -39 -57 118 229 -27 -92 -99 155 45 113 52 -148 12 116 -73 -53 -70 38 30 323 28 -2 -150 -3
6680 -3 85 36 349 105 6 -159 129 -70 -73 -27 113 -11 169 -23 153 -210 -159 -121 135 96 -177 -174 9 42 -57
6705 -57 198 -70 167 13 -7 -21 -8 -73 -221 157 -50 249 76 33 4 59 -2 -122 165 -77 -50 -13 3 118
6729 118 161 58 28 45 76 129 -148 115 -53 96 32 110 21 -120 -23 127 -63 -103 62 84 245 245 -96 36
6753 36 -38 -47 90 -81 -13 149 166 199 -77 162 37 -243 51 -10 10 162 172 -194 70 64 384 -43 -33 22 -266
6778 -266 18 -11 -57 -70 -167 188 -213 -26 -68 -113 -13 -63 140 -106 84 -96 -7 -77 -298 -42 -206 -133 27
6801 27 8 148 -1 -15 -11 33 236 -89 32 243 88 -145 138 -219 -22 122 -314 96 5 104 -10 -185 -24
6824 -24 51 9 44 -98 -89 -82 70 66 -227 20 230 113 -77 -142 174 -184 290 22 43 174 -1 -45 -121 -91 25
6849 25 -187 -217 -162 -2 110 -38 288 204 -56 19 59 169 139 228 93 -178 -53 -155 -74 -120 165 -104 206
6872 206 122 -7 214 103 3 147 11 31 120 9 189 45 -51 -5 109 110 108 391 -69 -11 -142 -50 -21 -247
6896 -247 -100 54 -15 -30 109 87 -113 -167 -81 119 -70 -22 -129 31 50 37 -67 124 -108 -161 129 -29 -57
6919 -57 2 -12 -69 83 -103 53 -126 72 -64 144 -30 -145 -153 81 107 96 -10 149 100 -35 -106 157 129 12
6943 12 -223 29 -121 1 54 -37 -101 -83 -133 -184 193 -174 -182 104 -6 -91 -38 -14 92 155 3 -215 193 62
6967 62 134 -122 -36 87 226 10 55 182 -106 51 -160 -241 162 -1 37 -85 -34 6 -96 158 15 -48 197
6990 197 56 -144 -7 -325 -59 25 -95 2 188 5 -101 115 -31 -291 194 -37 95 -59 55 114 -284
7011 -284 7 14 55 215 -110 259 -178 48 -59 109 -137 -135 -79 53 -210 -145 11 138 -144 -66 -14 -143 74
7034 74 170 48 27 -176 76 -48 0 19 205 17 49 101 -99 -10 14 32 134 130 37 -65 24 -30 -153 4 132
7059 132 -36 206 -116 -8 -186 -190 51 213 100 -323 109 -4 17 186 240 125 138 1 -254 -81 47 -20
7081 -20 38 272 -171 160 -2 -293 9 34 -117 -117 -6 -205 204 154 -36 129 40 46 1 88 94 -186 323 -79
7105 -79 29 -98 77 54 -38 26 23 -176 -173 -30 -105 118 76 290 74 61 -21 -188 -71 -50 2 33 -62 -140 104 235
7131 235 -159 190 122 -71 102 220 30 87 -119 -14 -75 55 -62 -21 152 -333 139 -182 195 -58 -123 52
7153 52 -87 -125 79 -150 -28 131 199 -116 155 -117 -74 34 -386 -6 -151 -249 14 -136 -103 125 -85 -169
7175 -169 -1 63 50 -15 38 102 88 76 -132 -48 -199 169 -79 -17 25 104 132 -148 -131 -80 85 -76 -134 -152 193
7200 193 -22 40 44 213 23 -128 69 -204 -170 15 -259 23 -41 -112 132 -160 -173 -93 -42 -201 -148 -147 -38 67
7224 67 82 -69 140 12 -116 -125 -13 241 -252 -193 -76 11 48 -154 55 157 -51 53 62 90 167 -84 62 42
7248 42 -148 81 245 -75 -222 -208 -148 147 204 -111 13 -54 104 17 -123 -37 15 206 34 10 254 -65 -84
7271 -84 -179 150 11 -23 -151 -245 -291 357 134 142 159 84 168 63 -88 88 249 15 -223 -136 76 -360 159 52
7295 52 42 32 26 162 -6 -184 288 -78 124 -71 -133 -34 -107 -229 -195 -104 66 -74 255 -77 -120 -181 245 -155
7319 -155 108 -172 85 -9 -91 60 -210 -68 -128 222 -124 -2 176 44 52 -44 -141 -75 -148 21 16 -12 159 70
7343 70 -77 -42 185 -45 24 -117 50 -118 58 -41 -49 -268 -98 -118 -105 -208 -42 -138 191 147 69 -138 -184 70
7367 70 256 89 -29 -75 187 213 28 -34 -136 -209 19 53 -133 -179 -3 -51 -92 -247 30 -111 65 -21 15 -26
7391 -26 -146 113 -108 177 -162 -85 -92 57 136 -90 90 -14 99 -55 -161 -342 -14 107 2 -50 -24 221
7413 221 61 -123 -122 -31 -123 -88 -203 20 -14 101 40 -69 -73 17 134 -100 245 17 -83 56 58 -116 -183 -164 67
7438 67 68 26 13 -74 -6 42 63 -80 -217 -175 4 -48 81 203 -26 75 80 -231 -132 263 224 80 145 -108 22
7463 22 -8 -35 163 157 82 2 -191 -217 68 -8 28 25 65 199 221 -130 116 -86 -40 -35 234 119 -204 -141 166 -64
7489 -64 229 303 -204 135 109 52 -137 82 -23 244 45 127 -110 124 -9 -137 40 19 111 71 31 31 156 -342
7513 -342 56 -30 124 -185 -87 30 -33 23 -165 -42 129 207 -31 -29 -81 -174 -199 -111 59 -53 -164 -55 -41 -163
7537 -163 66 -129 -53 211 193 -154 60 -88 89 -89 -150 -53 21 -38 16 58 109 26 256 -158 -184 167 -205 -35
7561 -35 129 238 51 -66 -180 -26 8 -26 -146 119 91 142 -47 -156 9 52 -78 -306 147 194 -240 345
7583 345 186 -78 33 -139 -67 -122 219 43 -193 37 22 23 -97 -11 311 357 15 -102 24 7 -254 -131 -57
7606 -57 -254 -35 120 168 -107 92 -61 -35 10 47 47 -14 18 63 128 296 210 2 204 91 -157 -161 126 380 -4
7631 -4 48 53 -235 -215 151 -247 234 310 -287 35 312 -106 173 6 215 -135 -145 196 -106 -6 -22 -274 -58
7654 -58 389 186 -156 -17 -107 -34 -199 -39 187 -80 -106 -43 138 -37 173 -137 -9 -11 -159 100 46 142 177
7677 177 90 -145 -49 144 170 -106 265 33 184 -100 183 176 403 56 53 -110 39 98 145 84 50 305 40 34
7701 34 22 32 175 409 -54 41 104 60 5 76 -38 39 -209 133 144 156 -64 -81 -179 20 -1 9 -258 101 115
7726 115 -131 96 84 -174 186 104 -14 -57 250 162 -110 -76 -57 132 174 -55 -72 71 -55 -35 85 -87 -59
7749 -59 -3 -120 151 65 107 274 -128 114 -157 76 147 183 11 -108 -68 126 -19 -10 272 -116 17 -123 -65
7772 -65 -194 57 80 124 -286 160 -126 291 -154 -291 -115 -27 -7 -23 -124 -39 -9 -38 -43 -42 11 34 -46 -279 79
7797 79 54 -123 157 45 -237 30 -119 -207 -226 48 -158 -149 -104 -76 -7 61 -38 -86 -51 68 -23 192 -39 43 24
7822 24 -12 78 -138 -12 168 -254 -92 59 14 119 -62 176 263 180 -30 -177 -29 -287 -311 -159 -105 125 32
7845 32 -171 -22 54 82 -186 55 27 -106 -16 302 -49 70 -181 -111 151 -15 -175 241 297 -25 -40 168 -43
7868 -43 76 150 119 289 -101 -133 -148 198 25 -16 -173 9 18 -80 55 -3 325 253 182 -218 -132 196 76 -52
7892 -52 -61 103 -99 52 -53 21 58 -65 -258 17 -175 51 100 -11 -29 13 -82 43 -185 22 105 280 -96
7915 -96 -28 -223 154 130 -75 83 14 162 -31 232 223 51 -213 41 41 60 -56 -170 -134 -8 -167 -273 -47
7938 -47 -10 -155 21 36 104 -172 -102 233 23 21 -30 3 -210 169 85 185 -183 225 -96 -4 -106 95 159 -56
7962 -56 -231 -95 148 -15 -174 -78 -219 -128 95 -182 31 92 22 94 -129 -140 2 213 39 -53 -67 96 -18
7985 -18 -185 -160 -35 61 56 -76 20 -139 67 100 118 135 -224 66 -54 251 -166 2 22 117 -37 -234 61 -258
8009 -258 12 -264 343 103 -107 47 83 207 -23 81 -106 44 -135 -87 -43 164 -38 59 -103 88 62 -45
8031 -45 28 -138 20 161 69 128 13 -165 152 -93 26 -20 145 52 -101 48 -12 222 -29 44 -254 -238 -135
8054 -135 103 357 -35 0 84 27 9 40 -155 249 -53 250 249 -51 76 -62 -114 81 4 38 62 63 -45 23 -25
8079 -25 13 81 303 144 -2 -34 60 -76 104 -113 -104 4 139 5 -142 79 100 160 24 262 -147 53 137
8102 137 -62 32 43 -151 103 108 171 -175 -131 33 92 -247 152 -95 -81 -163 191 -54 -57 140 -36 -361 -118 37
8126 37 -20 116 -88 -172 -72 -97 18 85 85 27 66 27 113 111 -96 -106 -74 -28 -172 -191 315 -10 -64 12 -200 88
8152 88 -41 -233 150 63 -130 170 -34 5 89 158 -4 88 -16 129 -3 6 -50 131 -119 107 -192 117 -60
8175 -60 -18 97 -3 49 48 34 130 82 51 -65 72 86 -138 123 -192 -124
8191a24
$$ Imaginary data points
##PAGE= N=2
##DATA TABLE= (X++(I..I)), XYDATA
0 0 0 0 0 0 0 0 0 0 0 0 0 0 0 0 0 0 8 -8 8 -8 8 -8 15 -16 16 -18 24 -24 32 -33 40 -46 50 -57 65 -73 82 -90
38 -90 101 -114 126 -140 155 -172 190 -209 230 -254 279 -309 342 -375 415 -456 504 -561 623 -694
58 -694 781 -885 1008 -1163 1361 -1627 2002 -2567 3520 -5409 10591 -53681 -174278 -75368
72 -75368 -55357 -65492 44418 105903 18529 -3842 13215 -43394 -40367 49561 43725 14900
84 14900 62933 40116 -52376 -36004 -1109 -49668 -37723 35135 7365 -37643 2419 7307
96 7307 -33385 6682 48914 19722 25451 43923 -17487 -48602 -9007 -28148 -53630 21679 59823
109 59823 1469 421 26070 -36492 -63187 5811 24169 13149 61940 61464 -12259 -25760 -18180
122 -18180 -61495 -46762 25645 23369 5628 42824 19582 -51975 -37186 -1802 -20227 3758
134 3758 58691 35145 -5389 746 -18975 -44229 -3837 23593 -1548 9157 24160 -20960
146 -20960 -34479 11500 15809 346 31251 32377 -18538 -25942 -9358 -28424 -17197 31403 28211
159 28211 4817 15424 -4024 -45329 -30673 -4116 -12510 8702 46251 26247 184 12767
171 12767 -6379 -41761 -20992 1682 -7777 13343 39839 13664 -6838 4528 -13510 -32509
183 -32509 250 18763 -153 7861 19163 -9294 -18510 4229 -862 -9514 11123 8873 -18509
196 -18509 -13486 329 -10741 -913 26683 18837 1491 3928 -10195 -28960 -12657 7376 7950
209 7950 20565 29313 4044 -14688 -10113 -19283 -22122 7129 22555 11460 14512 13855 -13554 -24820
223 -24820 -11656 -10739 -6620 15476 16902 1355 4456 1878 -18403 -13344 5342 -795 -3693 13587
237 13587 11336 -4502 252 5937 -3914 -2351 6314 -241 -4106 1063 -4909 -6470 7647 10126
251 10126 1860 7235 5945 -15010 -21064 -8164 -5199 -2063 15835 21632 9848 498 -10263 -21934
265 -21934 -17931 -6328 -6 13595 27086 15880 -1735 -2322 -7388 -20040 -11122 8007 9450
278 9450 7058 10726 6220 -3543 -6497 -6441 -5214 783 1069 -4747 -376 4363 -3614 -3764 8400 6437
294 6437 -4481 -4322 -1663 -7552 -8856 607 8169 10331 9683 4238 -350 -4220 -11773 -11526 1732
309 1732 9563 7597 9282 11534 668 -13532 -13427 -6541 -4126 191 8170 11653 6755 -3431 -9139
324 -9139 -7054 -6306 -7273 -335 8847 8055 1206 1222 3096 -2920 -6737 -2217 2375 1603 -65 3249 7239
341 7239 4002 -1015 226 1929 -3217 -8821 -5006 684 241 1393 6634 8368 2574 -4554 -8355
356 -8355 -7311 -8024 -7186 1849 10587 9036 5008 5180 1163 -8561 -10590 -4827 -1257 2164 7269 9764
372 9764 9305 4665 -3564 -7054 -4538 -5673 -6775 1508 8790 4683 1755 4600 -198 -8044 -6654
387 -6654 -4622 -5045 -564 4185 3226 3923 4798 -523 -3297 101 -2595 -5632 1150 4602 63 3022
403 3022 8404 2529 -2181 389 -2177 -6091 -1853 712 -368 4596 7295 59 -2270 -91 -6721
418 -6721 -9829 -1546 1481 -122 6340 8146 -901 -3322 -813 -7781 -8635 2663 5399 3175 8536
433 8536 8479 -2028 -4083 -2097 -6638 -4601 5087 4199 961 6573 4291 -4860 -2303 -479 -8104 -6209
449 -6209 2652 -462 -3016 5776 6049 -2234 -32 1809 -5851 -5976 -1767 -4794 -929 9730 7172
464 7172 2119 7330 2920 -10380 -8359 -257 -3609 -865 10215 8432 2198 4245 -1364 -10636 -6819
479 -6819 -3055 -6151 1421 9829 2529 -1198 5297 -1839 -10999 -1478 2725 -5764 -2107 7607 3049
494 3049 -369 4819 1672 -3493 1695 -278 -6468 1644 6465 -3449 -430 10583 3216 -6388 -389
509 -389 -1005 -9509 -3700 4510 875 2249 6327 -1142 -4646 -253 -6360 -8827 3092 5021 -1839
524 -1839 6456 10882 -4559 -8804 1545 -1179 -5777 4700 7338 959 4097 3910 -4708 -1347 2898
539 2898 -7672 -8118 6462 4068 -4324 5505 7730 -6400 -6087 2377 -4480 -7053 2075 753 -2779
554 -2779 5185 6439 -209 3009 1974 -9814 -6441 4343 -2302 -3034 11743 10871 -1670 772 2468
569 2468 -8069 -8608 -718 -1223 2212 10303 2781 -3826 3208 -1040 -12249 -3142 4215 -5767 -3736
584 -3736 9332 3675 -4084 3961 2507 -7800 -1904 3795 -3522 -411 6217 -1187 -796 9932 3207
599 3207 -7129 1386 1407 -11452 -4046 10595 3176 -1223 6819 436 -9330 -2634 -842 -6620 834
614 834 6341 -1646 76 7738 -2609 -8407 2077 -87 -7889 3268 9609 -388 966 7397 -2650
629 -2650 -7528 1333 -1097 -4603 6969 7230 -3693 301 4226 -7450 -5249 7587 392 -8127
643 -8127 1093 338 -8793 1933 11474 1342 -1335 3751 -8158 -13064 1014 3788 -380 10568
657 10568 12701 -2230 -3993 487 -9419 -9668 5630 5891 717 10096 7727 -7561 -5795 -17 -7487
672 -7487 -4675 7538 3112 -3735 3952 1351 -7965 -125 5188 -4231 -1680 5842 -3953 -7371 4806
687 4806 3023 -3646 7034 9454 -4921 -4343 2826 -6081 -6540 6722 5850 -99 7456 5143 -7560
702 -7560 -4503 -747 -10609 -5373 10580 6231 211 7851 958 -15627 -10069 31 -1807 4688
716 4688 14874 5591 -4655 -2472 -7659 -10832 3622 10611 2353 5223 7362 -7429 -10680 2483
730 2483 2702 -1905 7071 7190 -6358 -6012 -996 -5264 -194 9498 3437 -2025 2253 -4832 -13991 -2572
746 -2572 6376 -357 4220 13541 1899 -8311 -2406 -4277 -9615 956 8636 4432 7330 8744
760 8744 -3738 -8161 -1377 -6147 -8085 6656 10023 -319 2351 5609 -6407 -10488 -494 -262
774 -262 -1826 5765 4609 -3583 -1803 -832 -6655 225 9334 2096 -2025 3434 -2500 -10858 -802
789 -802 7457 3851 5236 8342 -2080 -9300 -5512 -5305 -2938 8272 9967 2314 1963 -103 -11816
804 -11816 -10694 1706 1772 443 8701 7038 -4402 -5115 -2483 -5739 -2139 4676 3039 2099 5285
819 5285 119 -5655 104 1772 -3792 637 6855 543 -2541 2642 258 -4350 -304 2479 -502
834 -502 421 1123 -3636 -3400 322 -1704 -812 6634 4396 -3282 -2088 -1795 -7139 -4292 4712 6385 5066
851 5066 6283 1403 -5913 -6011 -4304 -3248 3579 8743 5276 2545 2159 -4721 -8659 -2881 956 -498
867 -498 2908 5278 -107 -3469 -1723 -1855 -1619 1944 1791 -779 -39 -741 -3382 -892 4143 2870 1664
884 1664 3333 38 -4503 -3438 -1131 -565 2690 6342 4060 940 -823 -3706 -5945 -3462 -550
899 -550 1879 4775 4830 929 -2172 -3673 -5464 -4341 334 3665 3965 3947 1787 -2219 -3973 -2815 -1509
916 -1509 946 3798 4340 2484 -361 -2049 -2371 -1065 328 1001 2654 2212 -1263 -3584 -2093 -714
932 -714 461 1534 2730 1429 -2736 -4460 -3454 -1877 648 3539 5208 3326 -570 -3196 -3994 -4281
948 -4281 -1920 2576 5764 5977 3704 -50 -2290 -4194 -5274 -2303 2927 4115 2432 2242 1849 -2520
964 -2520 -5208 -3026 -805 253 990 1508 1105 -318 -2035 -2316 271 1782 550 404 1037 -1466 -3455
981 -3455 387 3362 1738 2299 3238 531 -2951 -3060 -2419 -896 1427 2473 2793 3635 262 -5417 -4674
998 -4674 -1460 -1797 -1482 3797 4608 278 -1355 -1125 -2578 -2621 -164 411 2193 3450 1137 -382 610
1015 610 -1049 -3378 606 3409 343 -191 2814 284 -3240 -230 1476 -668 -891 -333 -1261 -707
1031 -707 737 -1139 -258 2294 49 -2912 52 760 -3326 -1483 2639 1551 1200 2906 1464 -1657
1047 -1657 -1170 -1230 -2422 817 2409 587 2353 4049 -723 -3216 -170 -1971 -4954 222 3979 819
1063 819 383 1928 -1090 -3289 -551 -1113 -2159 1531 1378 -1463 1828 3565 -1151 -1815 1385 -559
1079 -559 -2669 1539 2420 -1014 809 2428 -336 -137 1610 -1594 -2334 569 -924 -2466 1959 2336
1095 2336 -1741 67 2525 -2079 -3392 495 -859 -2664 2037 3278 240 1160 1491 -3447 -2583 1595
1111 1595 -419 -459 4374 2689 -1894 758 1437 -3439 -2417 1689 -483 -789 3692 1602 -2719 -80
1127 -80 -184 -4331 -1019 2340 -1476 -1363 2981 272 -2430 2017 1122 -3527 54 2521 -2041 -1091
1143 -1091 3581 605 -1141 2823 1700 -2506 7 528 -3464 -1118 2961 -356 -292 3804 161 -3249
1159 -3249 402 -506 -5295 -1265 3303 -282 606 4786 63 -4356 -892 -942 -3564 2310 4690 -544
1175 -544 726 3693 -1700 -3141 2522 727 -3641 1194 3380 -1901 -424 3436 -1042 -2832 1164
1190 1164 -418 -2473 1144 698 -2917 327 2102 -2352 -290 4165 -1011 -4065 1625 606 -3653
1205 -3653 1398 4951 67 533 2533 -2548 -3572 1439 101 -1550 4758 3341 -3339 -689 2206
1220 2206 -4242 -3953 3102 1096 -2735 2582 3144 -2660 -1493 592 -3549 -1894 2607 407 -120 3961
1236 3961 539 -4391 881 2535 -2949 53 4769 -1009 -3188 2041 1164 -1807 2142 2771 -2580
1251 -2580 -672 554 -3992 -2093 3782 26 -1952 3871 1693 -5364 -1724 1792 -3438 -2017 4337
1266 4337 2084 -422 3314 769 -3878 -561 295 -2807 1200 5442 62 -1185 3392 -1069 -5418
1281 -5418 861 2676 -2259 236 3098 -2038 -2895 2003 -144 -1662 2625 770 -4056 -241 1439
1296 1439 -2986 -333 5159 573 -2494 2397 615 -4402 -204 2561 -870 1027 3907 -250 -1583
1311 -1583 1533 -1546 -4114 1442 2217 -1681 1773 3274 -2624 -2983 1250 -1545 -3356 2378 2104 -1955
1327 -1955 686 2076 -2548 -1351 2504 -1212 -1878 2725 852 -2706 1880 2684 -2077 -170 3103
1342 3103 -1253 -2419 2050 -23 -2666 1700 2308 -1428 762 1924 -2725 -3172 572 -1236 -1677 3335
1358 3335 2569 -1618 608 1235 -3659 -1966 2461 198 -467 3324 1611 -2288 974 1581 -2113 -50
1374 -50 2482 -1480 -1595 2000 577 -1510 2075 1454 -2629 -890 662 -3411 -2098 2492 841 -1218
1390 -1218 2192 958 -2656 -466 605 -2082 -212 2732 271 -507 2574 454 -2771 546 1239
1405 1239 -1903 3 2299 -270 -913 2202 69 -2037 -100 44 -2032 270 1695 -1273 -608 1583
1421 1583 -1190 -2375 1088 881 -2208 -23 1723 -643 -542 1835 836 -250 1096 -571 -2115 393
1437 393 711 -618 1673 3277 -403 -1595 243 -1337 -3106 672 1860 -108 153 1297 -866 -1730
1453 -1730 -550 -929 -784 1058 321 -979 1030 1403 -1285 -452 2241 -74 -1912 350 791 -731
1469 -731 265 1788 995 373 334 -996 -1105 -210 -481 -772 1130 1159 -666 243 1093 -1122 -1900 -323 -61
1488 -61 -1271 128 1680 747 121 -111 -596 -593 134 -351 255 1947 1058 -287 345 267 -1122 -1343 1009
1507 1009 1043 -424 15 390 -262 -947 138 98 -70 -309 -674 -678 65 -250 -283 950 1279 -158 -732 122
1527 122 -312 -1353 111 2140 1997 798 542 -222 -1544 -1189 -346 487 959 963 432 206 -27 -859 -1762
1546 -1762 -229 35 -742 260 1422 -50 -1098 -157 -135 -1067 11 975 -365 -83 471 -266 4 1358
1564 1358 519 -202 770 459 -1540 -944 651 -437 -109 2213 1092 -1132 -695 -1139 -2526 -1272 1076
1581 1076 838 914 1660 -48 -2153 -817 -556 -1564 675 2286 483 456 1692 -720 -2424 329 806
1598 806 -323 1139 2579 -347 -1387 345 -747 -1143 1564 798 -932 438 322 -2157 -1082 1312
1614 1312 -286 -750 2027 351 -2169 -533 -123 -1702 418 2742 1377 -184 669 -1105 -2749 103
1630 103 754 -366 1984 2823 -722 -1060 672 -1617 -3057 806 1810 -107 1349 1841 -1808 -1764 -355
1647 -355 -1417 -1243 2401 1017 -1353 720 505 -2034 -447 2183 -342 -1166 1961 799 -1947 -108
1663 -108 1079 -660 978 2332 -466 -881 131 -1623 -2054 1505 1507 -1002 1078 1797 -2364 -2284 502
1680 502 -1055 -1563 1624 1875 -482 953 359 -2396 -995 1228 -743 -174 2874 754 -1847 1025
1696 1025 1320 -1979 -366 2180 -435 -1290 1321 -1 -1529 433 121 -1530 615 1182 -1589 -533
1712 -533 1634 -1147 -1559 1775 1326 -1674 193 1409 -1890 -859 1518 352 42 2044 274 -1317
1728 -1317 821 72 -2480 356 2452 -675 -384 2238 -397 -2572 -7 503 -1400 -3 1032 -738
1744 -738 -344 1186 -976 -1028 1263 -501 -1773 1047 1715 -1600 314 2245 -778 -1076 1704 581
1760 581 -1477 405 597 -1139 717 1639 -706 -5 1370 -1445 -2007 636 -43 -1846 1240 1872 -1583
1777 -1583 -470 1694 -1200 -1725 867 108 -1068 1540 1396 -1185 457 1000 -1672 -746 1744 49
1793 49 -1135 1725 923 -1916 38 1459 -1243 -266 1378 -737 -1825 567 -5 -1212 1423 1209
1809 1209 -1701 -686 683 -1729 -838 2125 563 -797 1489 834 -2004 -365 1527 -885 -323 1992
1825 1992 34 -901 1234 297 -1661 240 743 -1983 -136 1972 -678 -913 1320 -245 -2220 90
1841 90 938 -1760 -347 1694 -805 -1027 1289 89 -907 1279 318 -1711 313 1471 -1182 205
1857 205 2509 -1 -1274 955 255 -2076 -30 1173 -794 133 1737 -816 -1248 690 -842 -1874
1873 -1874 810 691 -1028 624 1681 -1379 -1453 1348 65 -1124 1181 1159 -1100 -32 794 -828
1889 -828 251 1949 -610 -973 1163 -338 -2075 491 1513 -1153 233 1634 -1079 -1721 301 -297
1905 -297 -1054 911 720 -682 257 709 -1605 -951 1215 -568 -892 1996 1258 -1331 259 1070 -1083
1922 -1083 -572 1134 226 -648 1402 107 -1367 309 68 -1316 69 1307 -1263 -1335 900 -399
1938 -399 -1401 888 1378 -700 -69 779 -1215 -783 848 152 43 1674 532 -972 126 439 -1800
1955 -1800 -233 1413 127 -291 1175 113 -1552 -725 45 -870 283 1222 -268 -35 571 -929 -1390
1972 -1390 692 181 -844 498 1202 -824 -503 1022 174 -341 950 536 -774 158 49 -948 157
1989 157 1140 3 98 1038 -502 -1586 -72 200 -1133 404 1350 -193 -398 511 -775 -1245 32
2006 32 105 -113 1331 1048 -768 -216 421 -800 -471 1356 681 -304 407 672 -638 -103 583 -498 -270
2025 -270 755 -194 -580 129 -454 -1007 278 565 -691 -301 298 -534 -742 740 543 -555 470 688
2043 688 -255 -325 265 -350 -259 939 240 268 1117 418 -658 -75 53 -928 -261 1142 253 -356 467 124
2063 124 -1240 -443 61 -331 -195 321 -99 -209 353 86 -421 468 532 -580 26 545 -172 -190 741 727
2083 727 13 155 75 -405 -320 41 -434 -272 194 216 -44 397 -344 -982 -190 309 -313 -125 845 155 -435
2104 -435 -30 -87 -266 -233 213 485 482 611 254 -226 176 -438 -231 536 444 -280 -32 117 -95 -636 -137 323
2126 323 -173 -344 -43 72 -171 -346 -55 261 -80 -39 29 299 -307 -409 309 669 458 341 205 209 -460
2147 -460 -626 98 539 59 82 202 483 68 -476 -292 -379 -285 -29 246 591 -87 -452 -223 133 -343 -585
2168 -585 -105 584 10 77 513 123 -349 -184 152 44 208 113 429 158 -58 -410 236 482 -28 -42 -97
2189 -97 -113 -962 -331 383 -71 170 231 -249 -398 -184 -555 -153 478 238 108 548 757 -474 -475 565 -94
2210 -94 -288 565 863 -79 -59 183 -445 -217 -52 -162 -40 632 101 -296 170 22 -771 -421 583 -258
2230 -258 -161 605 58 -591 147 300 -247 150 825 -66 -7 644 -81 -669 569 567 -328 263 833 -545 -732
2251 -732 226 -290 -149 549 529 -565 -126 95 -841 -270 450 -18 72 853 411 -780 -209 -72 -839 -3
2271 -3 1301 224 234 789 60 -861 254 206 -610 408 992 -201 -284 730 -675 -963 426 429 -791
2290 -791 281 450 -622 -542 417 -276 -601 884 299 -830 190 -161 -1136 -19 1010 104 209 1077
2308 1077 -299 -1093 205 -7 -921 389 1181 -183 -293 486 -516 -1108 405 145 -490 548 908
2325 908 -706 -673 606 -483 -972 754 570 -689 644 890 -815 -111 636 -388 -93 859 -8 -718
2343 -718 63 -5 -849 421 1088 -532 -312 802 -700 -1453 565 504 -625 383 676 -616 -293 279
2361 279 -572 -561 573 480 -405 837 648 -968 -491 598 -673 -612 1606 650 -537 336 187 -1014
2379 -1014 -499 603 -404 -66 592 -428 -680 700 -49 -1023 547 803 -1012 -620 905 -481 -1027
2396 -1027 916 551 -224 351 722 -682 -130 471 -445 -49 1392 88 -781 606 43 -1428 -134
2413 -134 773 -198 -302 1014 141 -889 -154 -43 -691 410 658 -342 -18 752 -588 -863 872 195
2431 195 -913 350 932 -541 -111 792 -112 -432 573 177 -361 642 217 -1055 -55 162 -623 130
2449 130 1253 185 -829 48 -246 -1097 183 942 120 219 572 -643 -881 321 -71 -71 1103 945 -455
2468 -455 113 603 -555 -323 644 27 -432 722 231 -729 -166 473 -488 -12 593 -209 -589 562 102
2487 102 -777 143 523 -673 127 818 -322 -667 151 61 -684 596 983 -491 350 503 -905 -439 420
2506 420 -64 -263 710 520 -522 -288 -87 -606 -351 816 86 -133 509 -297 -804 -335 28 -473 181
2525 181 865 11 -399 171 -198 -577 784 666 -187 93 753 -779 -731 382 18 -282 455 51 -704
2544 -704 -173 27 -506 -107 724 131 -312 450 -72 -777 6 248 -441 174 897 152 -352 432 -130 -439
2564 -439 210 208 -280 225 384 -491 -147 424 -318 -495 386 266 -495 19 157 -534 -407 502 38 -62 457
2585 457 -55 -537 269 165 -563 389 614 -33 -387 223 -75 -625 157 380 244 220 248 -375 -605 -107 -302
2606 -302 46 589 167 -650 22 -24 -622 -269 403 51 -423 158 14 -116 72 85 48 40 194 -28 -24 109
2628 109 -273 -141 383 376 -114 12 457 -417 -282 219 -4 -236 163 122 -100 -111 52 -128 -171 38 -289 149
2650 149 518 124 -160 -150 182 -185 -22 427 -35 108 328 92 -94 138 -194 -219 111 24 46 -183 -156 -185
2672 -185 -111 216 250 -224 -239 70 -12 -134 235 287 309 -1 -253 -215 85 -440 -241 -368 355 299 256 103 20
2695 20 -149 -71 138 -137 127 -81 100 31 -253 -45 -200 125 -221 -18 189 -190 -80 -436 -72 -22 -340
2716 -340 -159 332 80 -10 -169 -9 -44 21 250 117 86 120 38 -292 203 -12 55 44 162 -146 -6 -17 -290
2739 -290 -131 143 76 0 170 115 -308 -468 -20 -66 171 173 242 47 153 22 -219 -138 147 -27 140 269 310
2762 310 -326 97 -31 -21 69 403 217 -214 45 -48 -147 -205 -18 118 219 189 -195 -224 64 45 -10 265 204
2785 204 -27 -33 -84 -188 -243 447 392 -107 -47 137 -320 -15 -93 -35 -237 154 37 -119 98 -151 -444 -112 255
2808 255 -82 -129 245 -50 -328 182 13 47 19 35 -83 198 311 -61 -230 87 -219 -59 -14 574 -255 -440
2830 -440 227 -314 -156 224 47 -379 34 -81 -461 -44 -37 141 99 519 150 -294 290 143 -396 89 393
2851 393 57 -24 238 -17 -137 53 -54 -380 286 194 -382 -110 392 -392 -377 428 -140 -447 61 57 -495 15
2873 15 181 -115 -33 443 -72 -139 260 29 -278 324 606 -371 89 468 -37 -213 205 318 -131 112 103 -87
2895 -87 -226 74 -355 -296 398 -255 -442 367 350 -222 50 290 -174 -274 253 171 -196 278 163 -605 22
2916 22 65 -328 136 313 140 -155 839 -12 -540 165 354 -228 -102 418 -510 -347 387 -64 -350 150 91
2937 91 -387 -42 88 -424 -200 219 -256 -183 364 305 -102 137 122 -637 -255 232 -6 -81 480 49 -37 -8
2959 -8 101 -475 123 229 -97 -207 219 26 -543 462 396 -284 -69 329 -192 -179 265 -127 -32 294 243 -287
2981 -287 -82 256 -430 17 319 -229 -340 284 20 -522 92 185 -257 229 302 -75 -197 204 -393 -300 -137
3002 -137 96 -373 156 171 -273 -92 426 -146 -382 280 -60 -412 310 261 -167 269 284 -186 -73 360 67
3023 67 -298 311 62 -484 -162 395 -142 -151 308 57 -368 134 -30 -626 179 523 45 3 69 -95 -426 307
3045 307 301 5 404 154 -612 -230 411 -179 -159 329 154 -85 58 -76 -329 -195 -59 -319 -83 311 -46
3066 -46 -353 -131 -306 -317 -42 154 -94 -154 95 25 62 347 232 -67 152 170 -144 182 188 -209 -31 559 432
3089 432 -185 78 135 -251 -166 159 23 -9 183 -262 -415 165 -241 -271 -131 17 -327 160 510 -280 -397
3110 -397 -135 -254 -67 155 273 47 45 53 -371 -296 53 31 11 83 -13 -245 -92 150 -255 -504 155 27 -60
3133 -60 -145 -83 -212 88 -59 -84 270 240 -249 -159 -98 -226 -404 304 334 -175 16 204 -128 -61 -133 24 -135
3156 -135 162 145 -56 154 -51 -363 -91 79 -98 80 118 3 -282 -127 232 -50 150 355 -22 -220 28
3177 28 23 174 59 149 -11 441 131 -322 21 -153 -15 -2 192 -37 -127 -37 65 -180 -257 50 -166 39 276
3200 276 1 -229 3 107 -152 4 58 117 76 109 74 -313 -64 -101 86 93 25 88 88 264 -142 44 113 33 150
3225 150 68 -176 -153 49 -106 -212 -96 236 130 -201 -293 -50 6 -196 139 50 171 -242 3 -113 -143 -84
3247 -84 -28 -23 160 -164 9 -74 -7 -453 65 -116 -224 266 -175 253 -85 54 -113 232 66 -53 -123 104
3269 104 -177 30 -7 21 -10 259 -42 156 55 104 -88 32 -6 -113 178 -35 -68 -93 -83 145 -177 -66 -142
3292 -142 27 -84 -205 24 -62 -271 59 120 41 110 -205 255 -8 -153 -81 56 202 -22 163 -48 99 -251
3314 -251 -30 -1 112 -97 -346 346 -128 -77 -295 37 -85 -65 33 -67 -147 59 -109 95 -26 -55 -15 17 -91
3337 -91 -180 -86 56 97 -247 196 -4 -18 -94 95 27 -127 -86 122 -144 -26 -59 -225 -232 213 82 -45 -36 1 -153
3362 -153 25 32 38 32 -161 -1 183 -11 -70 81 119 96 -150 153 15 24 -159 28 -23 -250 167 72 22 -49 -175
3387 -175 -429 -212 138 -87 -21 -179 -59 -423 162 130 53 182 44 54 -333 140 111 -185 72 32 39 231 132
3410 132 -214 94 10 -160 -61 92 -145 -207 -20 198 15 42 141 -70 -65 207 -121 -245 -46 195 29 110 321
3433 321 -239 -61 155 -74 -184 366 39 -261 65 217 -87 -128 -173 138 -233 269 115 2 299 29 -161
3454 -161 179 228 -228 191 -129 41 137 182 294 -158 49 125 -284 71 2 -163 49 18 44 193 -17 165
3476 165 -208 -115 140 -50 -216 241 7 4 280 -59 -274 -248 -80 -77 66 130 18 -98 180 -254 -17 -175
3498 -175 -28 -197 -24 -87 108 -66 88 156 -378 226 12 -116 -108 253 -126 25 224 -189 -98 66 285 -229
3520 -229 -134 151 -226 -191 284 -15 -180 263 -14 58 152 246 -7 -151 274 -118 -105 98 -181 -244 99 272
3542 272 -50 -49 133 -53 -38 175 -36 -110 -94 72 -180 180 64 -317 199 100 -52 88 77 103 -132 213 306
3565 306 -152 132 69 91 -89 -80 16 -117 23 -18 -347 111 186 35 -162 213 -34 -5 142 111 -246 -45 -47 62
3589 62 250 170 -97 -151 163 -100 -180 230 132 -120 -229 -7 -152 -96 277 183 -160 121 62 -228 27 54 122
3612 122 49 113 167 -245 26 -90 -226 142 -201 -314 -107 97 16 -175 53 87 -110 162 -24 -171 -88 182
3634 182 -81 -76 145 160 -369 73 97 -157 -17 141 -95 -179 222 58 -270 -10 262 -194 -41 0 -361 -21
3656 -21 148 82 10 -87 20 12 98 -7 -162 -147 402 -5 -342 144 92 -81 30 -5 -24 -243 2 -157 8 19
3680 19 -61 -63 -218 57 -110 194 -86 -235 -156 22 79 -345 32 8 -304 148 46 -20 52 113 11 59 115 -21
3704 -21 -209 4 90 -25 164 262 38 18 165 -97 -138 193 213 -125 -19 136 -172 -227 138 62 42 288 64
3727 64 96 -161 -199 -87 -102 159 -195 231 73 -93 -2 23 -2 -49 -47 -79 -133 109 94 -137 139 202 261 -78 -55
3752 -55 63 21 -156 52 -13 -151 -62 61 69 45 302 155 -96 -34 -109 -265 168 93 -211 -173 26 -187 -23 55
3776 55 -58 -17 109 -273 3 -23 24 -80 86 246 -18 -34 29 -223 -120 5 113 -26 -16 140 155 68 -228
3799 -228 -60 -266 1 29 -92 -117 234 106 116 -198 1 0 -62 -47 -145 169 204 21 122 -122 -223 -93 -114
3822 -114 160 165 -87 -166 -175 -131 33 164 -174 -136 -44 -206 67 -117 88 10 -91 -68 112 -280 -137 -215 70 138
3846 138 -113 -54 50 178 -65 213 152 22 191 82 51 263 -113 -83 139 59 -209 67 -85 -18 27 -91
3868 -91 -132 -150 -57 -130 115 90 78 292 -116 244 25 -353 -107 -152 99 -171 140 -49 -65 18 184 104 -213 -36
3892 -36 -6 -72 82 -54 -61 80 54 -50 -76 -54 -127 -158 -130 -52 176 -40 175 -61 -21 99 56 3 -96 -168 -242 -299
3918 -299 -75 157 -51 -64 165 -102 37 173 32 -101 19 104 -29 -134 -37 -239 -196 66 -19 -66 -194 -85
3940 -85 -174 -64 41 -90 95 91 -89 -4 -48 -123 -10 326 194 -105 20 -169 -14 -173 79 51 -23 48 -62
3963 -62 -43 -25 38 -90 -173 -127 -14 -53 -43 -97 43 88 -64 -11 -54 267 -219 -160 101 50 -145 237 -74 -168 -113
3988 -113 65 -58 -35 -103 -95 61 198 104 16 -139 89 -116 22 190 168 -99 -236 -5 3 -23 197 234 -72 103
4012 103 -300 237 119 190 -49 258 178 -109 -75 56 137 -24 127 -78 -128 -130 4 206 92 261 7 87 3
4035 3 -321 113 83 15 332 163 16 119 52 44 -369 152 242 25 20 68 179 -157 120 210 11 209 -26 -28 -155
4060 -155 -30 37 -204 79 61 -96 -32 169 150 109 -8 316 -56 239 295 18 47 331 -94 19 104 -7 -75
4083 -75 7 -24 -65 46 27 191 -226 -109 -49 134 14 30 58 -199 -102 -429 37 -29 -242 135 -8 130 52 116
4107 116 206 -129 -92 96 -44 -142 56 -20 -121 -56 88 -117 79 33 192 -19 46 -60 -334 -6 48 -119 137
4130 137 -108 -112 -248 15 145 70 197 252 81 -105 110 127 76 -22 44 -79 172 -64 93 183 51 -269 230
4153 230 43 -181 -41 195 -18 -75 -49 -60 -105 127 -300 -149 49 269 -116 -58 228 56 -142 -231 -76 -11
4175 -11 84 285 146 -236 16 -256 -18 152 48 -130 157 261 93 -150 315 165 144 -27 -50 -94 194 309
4197 309 -38 -176 -51 -155 -93 179 -145 -140 95 132 26 -68 77 -125 21 40 -63 36 -33 -82 87 188 40
4220 40 110 212 -68 -188 25 -56 15 70 -110 121 -37 -41 187 -5 -2 158 207 -83 -50 152 -178 -78 -111 34
4244 34 32 28 46 -38 -142 -76 -135 25 187 -273 2 21 -332 30 143 44 -129 39 -104 -116 63 -110 -103 134 112
4269 112 231 -15 124 236 56 -104 -98 -177 132 49 102 156 -117 -95 28 -16 250 1 132 280 -137 -309 203
4292 203 -81 -21 84 -58 -150 90 -49 -174 234 23 107 -155 -122 -164 -38 11 -65 -17 106 256 -84 20 -38
4315 -38 67 -104 145 25 84 -147 -90 190 -142 -43 -62 -54 -46 -75 -272 -19 37 -102 -220 175 112 -197 -89 56
4339 56 -109 -67 131 120 -357 21 -68 79 -155 -111 -86 68 -83 -214 -154 213 199 133 -23 85 -109 36 37 120
4363 120 56 40 -274 25 116 -10 159 -165 43 131 165 -303 20 -17 -64 -130 -153 74 186 206 2 -107 -2
4386 -2 1 95 -151 -171 120 -35 -205 -45 -105 -248 76 110 189 194 72 1 -14 123 -16 -1 -270 -13 -19 -62 3 120
4412 120 1 64 -58 4 -133 127 -16 -58 -39 -80 18 40 -125 -24 -136 -92 -72 -150 82 37 269 -284 -221 -139
4436 -139 115 96 226 -65 -141 -29 45 -140 240 -40 -34 8 101 -131 -101 1 10 69 96 -249 -61 -96 -142 -111 1
4461 1 -186 22 99 -144 -136 -47 56 -61 93 21 78 -10 63 121 66 -151 -133 197 68 -82 -217 6 68 -230 -179
4486 -179 154 222 11 14 -44 30 -118 -18 3 2 -280 -60 -19 43 182 143 125 24 -217 -201 175 -91 -180 -251 -141
4511 -141 -39 95 79 -330 151 52 164 -121 381 -106 -204 73 -60 -135 -224 56 -66 -290 8 -109 -90 -13
4533 -13 59 84 -42 -119 54 -81 -100 -37 -70 -135 46 296 -111 343 23 -330 248 110 -91 40 -42 -7 -312
4556 -312 3 87 -68 30 112 -21 137 -123 88 169 30 -27 -51 67 -92 -6 -110 93 219 -45 33 -235 -79
4579 -79 -74 -31 -8 0 235 -19 -322 -17 -44 -121 27 19 -157 -9 138 -25 61 -27 116 -94 103 41 43 22 363 57
4605 57 187 111 194 93 -155 -55 -153 -127 78 200 146 227 222 -121 54 147 146 -12 175 -49 273 44 -178 -119
4629 -119 -21 76 163 73 121 -8 207 -129 -160 159 -19 -170 -61 -51 187 -100 -170 -44 -343 62 14 -13 207
4652 207 240 -109 -82 -272 90 -127 110 114 -300 -244 81 20 266 110 109 183 128 234 -72 128 0 -39 119 -124
4676 -124 -63 -156 31 -66 -214 -191 44 -142 -172 -171 -152 -9 -122 -79 -49 -99 -27 -98 -128 130 -7 15 -165 -176 -79 -68
4702 -68 -9 123 107 12 -90 129 40 2 157 38 -13 92 -199 -9 211 -159 222 139 -78 -112 -62 -83 133 -371
4726 -371 -188 -240 270 244 -219 51 -60 101 123 93 -16 54 -46 75 -13 -7 155 -207 62 174 48 92 -10
4749 -10 -153 -180 74 -115 -198 -161 120 -94 95 -261 117 -52 -163 78 -306 46 -12 -117 41 156 -13 -312
4771 -312 -174 6 -117 98 -109 27 -11 -31 -112 140 175 -251 -156 140 56 122 253 -13 -56 60 26 -37 -129 -191
4795 -191 88 -40 -61 233 208 210 156 -79 -213 291 79 -128 17 -257 6 12 105 -71 -87 12 192 -137 -417
4818 -417 113 226 -240 238 25 61 345 -53 -254 -91 149 -89 61 -124 -178 26 107 104 210 158 54 -59
4840 -59 221 -29 -118 -48 273 58 139 -7 -32 -86 -266 -87 -46 -127 -12 54 -43 93 -50 177 -37 48 -131 169
4864 169 -67 -136 227 -96 33 25 7 -21 -107 65 152 -159 11 0 -47 31 10 21 105 16 4 2 -24 151 -62 -114
4890 -114 -62 -136 -69 -118 -260 129 21 -31 -147 -35 79 -112 10 26 103 -139 -290 128 -214 18 32 -102 -69
4913 -69 23 256 235 155 -161 -49 -30 -224 -117 -20 -121 -156 45 34 4 -88 33 111 -167 -133 -91 -33 -70 -111 -122 51
4939 51 -12 197 -86 105 102 -65 -93 130 -6 18 87 -120 -72 -110 126 -84 212 30 68 33 -135 157 -124 135
4963 135 7 81 2 37 48 -74 19 163 55 37 148 -53 121 236 -218 55 118 -82 -138 21 102 -47 20
4986 20 70 -1 64 -194 -8 -1 -3 64 84 -109 60 -46 62 106 148 -56 31 182 52 -108 -183 26 -59 107 -61
5011 -61 152 109 -101 35 -140 43 -163 78 24 -64 -140 -117 -34 143 55 -115 113 93 109 88 -40 3 -352 -61
5035 -61 -59 42 -60 -60 170 18 11 -203 19 19 155 130 203 -140 -72 94 -77 -197 145 -85 18 -61 -36 372 279
5060 279 20 -49 50 -6 213 -5 -19 -5 68 42 49 18 -307 33 -129 -9 -69 -150 130 -76 -42 -39 -64 311 -41
5085 -41 -285 199 -156 -23 -22 283 -217 112 217 -29 -103 63 241 5 75 -141 -157 -24 63 -264 -183 -109 47
5108 47 16 42 -53 27 -175 85 25 -74 69 28 -20 -15 138 80 254 140 -196 -280 151 101 -44 49 81 4 42 -78
5134 -78 140 338 59 -140 -20 -95 -59 6 214 214 68 -10 -157 -88 9 23 84 -106 -69 -110 -179 -6 98 -140 -61
5159 -61 -49 165 77 -45 80 37 -71 -16 -83 -200 -60 66 171 106 55 -24 -184 -44 -102 -39 -2 80 8 30 36 70
5185 70 151 -157 -257 101 2 -9 -11 136 -214 -104 -66 142 64 -6 34 -276 116 100 -22 -236 -23 92 2 86
5209 86 -19 -195 164 53 -200 25 5 -43 -82 148 -14 -98 -195 128 -300 107 102 41 -35 -100 138 95 117 -143
5233 -143 126 26 100 -134 18 43 -63 -174 -241 -42 82 209 35 -271 28 -40 -37 -204 182 -87 -193 -145
5255 -145 50 -266 -52 -66 -3 7 41 -88 -102 94 -52 89 -96 59 143 -433 -127 -21 -224 -187 -100 -77 -4
5278 -4 -139 40 160 -22 15 -158 249 -159 -96 80 -126 132 -120 33 -145 79 66 -97 38 193 -30 -62
5300 -62 141 -203 2 182 183 110 79 334 -254 147 260 -77 -187 21 -282 -37 106 -69 -103 -31 88 -83
5322 -83 -3 -62 -35 265 -133 200 70 67 -143 27 -101 12 372 357 -28 226 44 -231 105 273 29 -173
5344 -173 -352 -201 -177 -275 12 134 127 -218 -178 59 -106 184 -8 -46 -67 -133 -51 -247 -252 73 -96 -66 -10 -105 -77
5369 -77 -15 103 -47 43 26 66 -147 -93 44 22 288 -107 -53 -8 -49 -8 67 -96 -127 -83 27 -58 -102 15 -36 -37
5395 -37 75 -41 32 68 11 153 -54 152 -142 -82 -154 -197 60 -24 11 -6 -116 166 152 -102 -9 166 -156 -52
5419 -52 -300 -83 229 83 -124 106 -27 184 272 17 92 -24 28 -100 273 72 -197 93 248 -109 -207 -24
5441 -24 -162 -54 -193 207 -3 71 -33 -113 148 -159 -243 142 198 33 -194 222 151 -47 189 -409 -82 -39
5463 -39 -73 -136 279 -22 24 221 31 -201 -71 54 -56 -119 142 167 106 87 299 -104 -82 -71 -127 -52 101 109 -35
5488 -35 -13 23 2 255 210 -80 -290 -110 43 19 21 -25 50 -184 164 111 121 -131 90 -102 -119 -138 -129 -142 18 89
5514 89 36 -93 -85 -247 -136 -126 -251 -74 -105 -43 -41 -148 90 -145 138 20 38 82 -64 -140 -5 -102 -215 -61
5538 -61 141 346 176 417 39 65 178 10 -208 46 -56 -52 15 129 70 28 -21 162 -129 -53 -20 17 -42 -59
5562 -59 209 207 -5 104 -92 -16 53 -29 -82 -255 73 58 -132 90 50 176 16 15 84 39 152 -202 -110 -6 -13
5587 -13 -44 -187 -209 21 17 -272 179 65 165 -224 -38 32 10 -73 -97 -176 251 78 241 -39 374 10 55 6
5611 6 128 190 78 -82 231 6 91 77 -71 -13 -68 196 -203 -47 -120 220 142 -190 -144 29 33 102 -77 -9 -4
5636 -4 134 92 -221 131 37 -14 311 47 112 -70 -25 -4 78 -22 -156 -5 -14 319 183 45 64 32 -8 -4 125
5661 125 140 141 -157 36 -124 -136 241 58 -27 143 35 -71 -88 108 -116 -79 22 -2 -45 -107 121 -241 -36
5684 -36 -5 -70 13 -111 -88 213 -4 184 162 -123 200 -80 -16 24 -101 68 -233 -97 -26 -113 -173 8 -109 -77
5708 -77 -108 227 -6 91 -38 419 113 25 -112 -14 -50 103 -43 153 31 -7 -100 -202 140 -5 80 -120 27
5731 27 150 -32 111 -21 -75 60 -125 65 123 -130 -38 62 -29 176 -16 357 -43 169 -80 157 -183 144
5753 144 -189 -86 140 413 -117 -58 -120 -44 -223 100 137 9 60 -181 163 -229 14 30 -56 -139 -25 -45 -216
5776 -216 89 162 205 71 -160 79 -108 -190 59 -32 -200 -271 -228 24 -129 -2 -95 -187 -150 257 -90 -193 -69
5799 -69 -39 80 254 92 -97 -210 -37 -85 -69 90 -24 -50 97 -76 -154 217 -78 -229 113 -237 -71 3
5821 3 1 65 -179 117 -28 -54 62 110 -203 213 146 -82 -167 -50 402 179 128 90 -25 15 6 -108 -127 135 141 -55
5847 -55 0 -80 -72 33 42 14 -63 0 -26 79 -155 -57 14 -12 225 -144 75 -277 36 35 -265 -35 165 193 -110 18
5873 18 101 3 -54 54 227 -126 108 18 -82 141 120 246 138 -183 -48 40 34 -184 -49 103 65 32 -160 -83
5897 -83 165 53 58 -33 -153 21 -49 -332 -60 99 69 7 -10 -403 97 99 -13 -145 288 12 138 -21 229
5920 229 85 131 -120 -245 154 -126 134 179 -129 70 -50 53 -131 34 -59 -5 48 -148 100 -51 -24 232
5942 232 205 -156 115 194 -9 -36 52 -47 108 137 -13 119 145 12 74 -81 149 78 4 107 156 77 35 71 121
5967 121 -21 73 -11 -23 -70 127 22 -56 79 -272 150 -64 -117 79 -10 -17 91 -45 -9 -75 107 -33 -221 -191
5991 -191 -167 36 -7 -43 -292 0 28 174 103 -127 84 -59 102 151 -98 238 -233 21 -135 -114 35 19 -171
6014 -171 -26 -25 -268 123 146 -171 -24 133 -60 -123 -340 -122 71 -11 101 153 -19 -49 -181 195 81 71 16
6037 16 -28 55 -143 -101 105 201 148 -58 78 -6 125 -35 18 -18 36 259 35 37 21 49 -156 219 42 74 -324
6062 -324 87 -1 -114 23 -181 261 215 -107 10 -105 -127 -56 19 127 -138 -60 0 53 -1 42 -8 -57 219 -39
6086 -39 -42 33 186 85 38 -31 46 80 -11 15 4 23 -1 -20 16 -16 270 6 -7 -48 -42 -61 -157 67 170 -138 -119 22
6114 22 118 143 -36 18 49 -151 -158 -51 -83 109 74 -27 -24 93 -16 25 126 168 -148 154 -138 171 38 106 124
6139 124 18 157 -144 -13 -98 60 82 190 -2 -152 66 -100 -227 -212 82 302 247 -247 124 -72 -161 363
6161 363 -14 27 73 -13 -39 -27 -80 62 -4 -58 153 133 -99 -150 170 -2 142 -217 -115 -67 40 -50 -223 -190
6185 -190 -269 131 -100 20 69 -205 48 10 4 -48 249 -53 112 280 162 143 -39 39 31 -119 -231 172 23
6208 23 105 -106 -285 48 4 95 245 -97 121 -72 -17 -66 -150 44 -275 1 -241 -57 -127 93 153 -125 -33
6231 -33 -188 69 38 -45 -79 -143 144 44 -274 28 7 -63 -211 -8 -85 52 -147 -71 -11 -203 162 -64 -55 -7
6255 -7 -267 -9 -153 -129 -28 -149 -19 86 0 139 24 -247 48 -86 -7 108 -29 2 27 -94 376 84
6277 84 -147 -142 -45 -173 -30 119 -232 -97 25 -171 -55 364 161 -46 -85 -284 -71 -60 60 80 237 -186
6299 -186 -74 -25 131 -78 -137 -37 38 10 21 -43 -104 -61 -64 -87 -258 -206 -9 162 -59 157 -136 -15 -44 -222
6323 -222 259 29 28 16 -37 70 1 12 -30 17 -314 -243 -62 16 -23 18 -170 142 -88 122 79 -177 190 -99
6347 -99 154 91 26 29 54 -155 -119 -58 58 -190 78 -185 -109 86 7 -120 -239 148 25 108 -128 -174 26 -109
6371 -109 -137 -121 -149 20 240 -89 36 -111 211 23 159 -211 -81 -37 81 270 246 235 57 -138 -173 -162 -206
6394 -206 -90 -20 -153 109 -219 -87 180 -21 11 -192 161 -90 184 76 6 216 93 -159 151 -75 -227
6415 -227 -134 61 -13 126 118 68 43 -211 15 -160 -45 10 -26 91 -63 -93 23 -22 55 75 -261 52 93 118 91
6440 91 -99 -78 200 -52 58 -129 -57 -148 -117 -71 39 159 -105 -272 28 4 233 -179 77 13 -177 -153 79
6463 79 32 -241 47 -28 83 -1 13 -59 -31 -56 -103 -151 221 43 119 -97 -134 36 -181 167 405 -45 155 214
6487 214 120 131 -146 -262 -10 5 34 -23 -35 -202 147 32 -64 68 -110 242 -362 -104 149 174 1 108 -82
6510 -82 -201 -194 -26 -88 -40 -127 256 -252 -192 -70 27 68 188 291 -63 -14 130 -61 -79 8 -221 10 44 -131
6534 -131 43 94 171 -81 119 145 37 -128 61 14 125 138 -100 -157 -110 122 -33 189 -54 -253 114 208 125
6557 125 40 109 -177 -44 -40 -145 19 29 -50 -37 67 -112 -62 -134 -276 64 -64 35 180 -252 3 309 103
6580 103 -205 -88 26 -147 108 36 35 -112 -15 99 -155 85 -46 22 -221 116 -111 -50 -23 46 -69 -421 -87
6603 -87 152 50 150 2 -43 142 365 -90 -235 140 49 -123 161 -4 -316 -86 -69 -179 204 157 -180 229
6625 229 104 -158 -48 10 51 -63 -327 175 360 136 147 -4 64 -117 -111 -57 -202 -223 -126 -53 -481 -14 -23 -124
6649 -124 -113 -40 -64 -217 102 223 -149 -24 51 12 -57 -84 -6 72 -61 -63 9 117 23 261 -142 80 237 64
6673 64 226 -137 -141 208 -28 61 113 -203 -14 -314 100 -147 -211 19 179 -40 98 236 -148 -178 -123 -128 69
6696 69 51 -2 -221 -23 -61 56 -143 -205 46 -35 -209 21 -72 79 171 154 -37 -19 145 148 -138 139 -186 168
6720 168 94 29 -163 -214 -150 -25 -46 -59 -152 1 -222 71 154 -66 35 86 -88 -120 110 1 135 30 28 -104
6744 -104 10 24 221 -28 -55 165 215 -173 -128 -122 -53 -177 -76 43 71 -19 7 -44 -34 -42 -38 157 -52 57 -237
6769 -237 45 -51 126 -168 -58 133 -14 277 -80 -85 -177 44 -19 21 -147 62 64 217 45 129 -93 -202 186
6792 186 49 111 -20 -8 241 229 -63 -134 123 -87 67 23 127 35 -25 7 -112 54 138 -17 -18 -88 -40 210
6816 210 -29 169 118 -18 -129 78 -135 -79 175 78 117 199 44 31 -145 -129 49 -181 70 -117 64 -61
6838 -61 12 216 144 -66 -166 244 86 -65 32 -130 296 -88 74 18 -42 95 148 17 -121 47 115 -94 21
6861 21 3 129 24 108 326 -111 95 199 186 79 -11 -178 -11 147 -109 34 65 60 154 -224 -24 117 38
6884 38 -281 17 149 140 153 -22 -57 -20 69 156 237 -31 315 118 -236 150 39 160 -102 59 -89 161 -92
6907 -92 127 73 -142 88 221 257 -28 -18 7 -81 -72 -108 -85 -17 -24 51 106 -133 -35 76 114 97 112 175 159 240 -139
6934 -139 271 -144 -7 34 -107 -187 24 -153 -129 -54 -38 81 177 318 246 35 -63 -56 -84 -83 -15 -128 -167 -11 -43
6959 -43 -282 -173 -79 209 -10 -152 -49 -99 -119 72 133 -38 55 62 -93 -44 106 -104 24 145 113 -121 146
6982 146 -279 24 -191 -154 241 111 -42 -31 -21 241 185 -24 25 171 60 -29 -111 -57 182 -48 3 -30 -61 14
7006 14 6 231 104 52 2 179 123 60 16 102 1 -125 -96 -219 -107 -39 -126 -24 -5 -51 -117 -180 -198 10 236 66
7032 66 111 -240 28 -155 154 -39 218 11 176 -64 72 11 91 193 -213 87 -78 -42 -16 297 -36 -110
7054 -110 31 156 -12 -307 63 -70 -26 -456 117 -39 -231 57 -238 -263 -64 -373 -160 -68 -34 215 -289
7075 -289 -215 -39 -36 -235 143 -243 9 76 145 -17 -157 -66 205 58 -46 -87 -46 87 -22 77 88 186 6 -102
7099 -102 137 -70 -139 51 167 -69 -7 56 -161 -174 3 48 3 165 53 -168 -31 124 -57 -152 -230 -121 217
7122 217 -25 51 192 -19 10 -258 -84 -97 -122 103 -70 46 -31 -30 294 97 -130 -1 -49 -22 39 147 -11
7145 -11 -57 108 -145 -144 69 -75 325 -262 -92 -6 5 61 86 195 -86 116 -119 -43 -44 55 -17 -217 11 -184
7169 -184 136 52 3 -123 90 246 -70 -29 201 -289 -63 162 -199 323 -273 -75 -103 119 -18 -59 5 -92
7191 -92 -113 149 141 -174 -41 108 -85 78 37 202 63 -141 118 105 -19 -102 -41 -33 126 22 76 -167 -29 -91
7215 -91 139 -146 -72 86 -74 -30 62 -102 13 -89 14 -51 46 2 271 -3 -115 -58 87 -29 139 211 51
7238 51 105 -133 -56 116 -29 120 98 -51 64 53 289 152 97 -162 -99 -146 -164 36 82 -47 -96 243 249 -226
7262 -226 186 122 185 -257 -175 184 -40 43 -89 -145 4 -41 185 39 -78 109 -216 71 -122 63 14 -6 81
7285 81 247 114 92 -178 -57 14 -121 -81 73 317 35 -203 -176 159 179 -131 -20 21 69 167 236 83 133 -88
7309 -88 -74 77 -116 -10 154 -28 -13 56 -138 156 -39 -217 91 -69 -78 -84 58 -66 67 78 32 21 61 -141
7333 -141 67 -172 -37 80 73 6 44 -99 -19 131 236 -72 12 -139 128 -67 182 86 -184 7 -38 12 -16
7356 -16 -113 30 -260 62 2 -174 59 -24 -125 -122 -29 -17 -66 35 21 -46 -93 -202 -42 -98 225 112 -10 339
7380 339 270 -170 -135 -24 -289 45 -7 -8 -78 -46 67 -104 4 -24 -2 52 10 106 -105 79 -150 1 128 81
7404 81 27 25 10 109 99 80 -4 -122 306 72 -71 112 238 -47 -270 -16 -16 -187 -161 -272 91 27 14 -93 -202
7429 -202 -275 -271 -214 -14 -119 170 -18 83 -213 -66 -112 -70 -88 196 10 81 130 -202 66 -54 139 -42 76
7452 76 29 -130 222 274 -102 -49 -245 160 89 81 202 -2 -136 -263 44 -153 56 104 -36 64 71 -149 -215 185
7476 185 -113 -198 -46 143 -184 -217 -141 270 -82 -80 82 -72 94 -147 33 -10 -235 -153 -126 -110 96 126 -87
7499 -87 -191 53 -37 146 12 236 158 -77 -31 125 -200 -40 30 -59 76 -40 61 4 162 13 -21 -61 210
7522 210 -59 -173 139 -50 -198 109 -213 -187 110 -227 29 -136 -87 34 -185 -208 -326 -62 150 -75 101
7543 101 177 165 120 -113 101 91 8 -80 72 129 104 154 154 129 212 -141 -18 -85 -249 186 13 35 148 -57 -165
7568 -165 125 121 -7 -10 -344 82 27 171 -118 -127 21 -108 254 -75 22 -101 -155 47 240 69 95 23 133 30
7592 30 -136 51 144 127 -152 -118 -14 -100 172 110 -208 10 -125 -168 30 -161 -284 -377 67 8 50 -260 30
7615 30 -22 -118 109 -110 -110 148 198 14 71 35 -53 -124 97 108 21 -108 -60 -84 178 -187 192 15 -211 -159 233
7640 233 58 -153 -43 126 -99 139 1 -48 -45 43 -76 61 99 -5 173 35 -151 -65 -46 -76 43 -36 -14
7663 -14 77 -89 160 -71 255 120 -30 -177 87 -44 46 103 -171 -56 171 75 336 50 -192 207 -106 -59
7685 -59 -97 147 61 58 3 96 -41 -24 20 142 -73 61 94 63 -290 -83 -14 -51 -25 182 49 170 184 -89 -190
7710 -190 -134 -174 116 157 -108 -167 -130 14 -74 -159 182 -111 -144 208 -145 -142 -109 -12 -87 87 -23 -98 -49 9 27 14
7736 14 85 140 26 -209 -3 43 93 -107 -61 -1 -20 173 -115 -41 -117 -96 -87 85 78 136 -32 39 -158 -140 -131 -13 -80
7763 -80 -59 134 86 -86 141 187 251 -71 -208 164 22 -65 -385 43 -278 -19 -166 -88 -107 28 31 68 -143 -73
7787 -73 126 27 144 -180 -4 166 124 127 189 -9 53 90 -108 -134 -97 26 -150 -58 0 326 -83 -187 -139 -14
7811 -14 -108 32 -85 134 -16 196 -7 5 49 7 128 90 -230 -159 153 25 -32 212 -15 123 35 18 79 -131
7835 -131 67 -137 -173 -3 90 119 -5 10 -114 -95 -92 -278 -338 -26 -252 -94 191 7 -74 -141 77 -121 56
7858 56 -24 -68 82 84 217 -66 93 18 -115 -23 157 -24 53 -66 -408 85 -82 -234 132 45 -169 -30 37
7881 37 -108 64 32 -76 -135 13 -187 69 -15 179 291 -44 -46 -68 -241 34 1 38 -12 143 3 -7 174 123
7905 123 -11 77 96 -66 -115 207 57 -225 -5 -35 -104 233 -130 -132 123 -54 -35 -87 -109 3 87 226 -38 -203
7929 -203 -73 33 -2 -283 183 -57 91 -333 -275 98 -63 -5 210 49 -151 23 105 32 -39 7 -37 186 -16
7952 -16 88 -86 120 -192 -5 50 -147 53 -49 78 214 145 -40 -91 -407 167 -132 0 72 -42 -279 -51
7974 -51 -185 -159 -19 103 -284 139 146 252 -115 -93 -102 -2 -276 -22 13 351 -196 -90 146 124 -105 -167 -72 99
7998 99 61 -13 -3 210 -57 390 66 -204 277 17 -204 40 155 -207 -1 45 -42 79 -90 -9 -59 -72 -25
8021 -25 -237 -83 -59 -215 -51 76 -18 356 -17 -115 -151 -18 -65 100 -60 -219 -37 -341 139 -35 -116 -100 125
8044 125 -41 27 -104 48 66 -103 28 168 -81 -194 -192 107 52 -120 -15 -192 -198 -152 -24 -195 -15 -89 -194
8067 -194 -113 155 230 234 -20 81 -152 -59 -57 -154 -102 156 -105 -126 -10 161 -3 18 -5 -158 61 -28 82 291
8091 291 78 1 -99 -196 10 -9 119 -18 -32 -349 -78 59 150 135 -276 282 114 -233 -129 -90 -199 27
8113 27 -2 218 -114 -13 -129 -38 -123 174 150 156 -16 -176 77 27 -75 -169 -99 -59 155 -76 -35 392 -70 -83
8137 -83 -62 124 -30 104 -142 75 -56 -45 11 77 69 80 -8 64 173 157 62 365 -259 -83 -64 -246 -95 -60 -97
8162 -97 -116 8 -130 8 -210 -15 -203 62 211 62 -144 -289 20 55 -13 -103 136 257 -16 -85 -276 -8
8184 -8 163 21 -4 58 63 66 53
8191E3
##END NTUPLES=NMR FID
##END=
