##TITLE=1H_Ser DNG-EA
 CDCl3, 8 sc, 
 16.1.2019
##JCAMPDX= 6.0         $$ Bruker NMR JCAMP-DX V2.0
##DATA TYPE= NMR FID
##DATA CLASS= NTUPLES
##ORIGIN= UXNMR, Bruker Analytische Messtechnik GmbH
##OWNER= root
$$ XWIN-NMR		Version 3.5
$$ Wed Jan 16 15:26:57 2019 Russian Standard Time (UT+4h)  she@DPX200
##.OBSERVE FREQUENCY= 200.1313
##.OBSERVE NUCLEUS= ^1H
##.DELAY= (6, 6)
##.ACQUISITION MODE= SIMULTANEOUS
##.ACQUISITION SCHEME= undefined
##.AVERAGES= 8
##.DIGITISER RES= 18
##SPECTROMETER/DATA SYSTEM= spect
##.PULSE SEQUENCE= zg30
##.SOLVENT NAME= CDCl3
##.SHIFT REFERENCE= (INTERNAL, CDCl3, 0, 15.7039)
##AUDIT TRAIL= $$ (NUMBER, WHEN, WHO, WHERE, WHAT)
$$ ##TITLE= Audit trail, XWIN-NMR		Version 3.5
$$ ##JCAMPDX= 5.01
$$ ##ORIGIN= Bruker BioSpin GmbH
$$ ##OWNER= she
$$ F:/spectra/data/she/nmr/H-F/1/audita.txt
$$ ##AUDIT TRAIL=  $$ (NUMBER, WHEN, WHO, WHERE, WHAT)
(   1,<2019-01-16 15:25:47.23 +0400>,<she>,<DPX200>,
      <created by zg, POWCHK disabled, PULCHK disabled
       configuration hash MD5:
       00 E9 B6 7A A2 85 ED C7 34 08 36 98 17 FE 4E 26
       data hash MD5: 16K
       51 D3 EE C7 0B 40 6E F8 CB 8E 98 EA 36 0E 7A 3B>)
$$ ##END=
$$ 
$$ hash MD5
$$ 45 A5 1C D1 03 F8 E9 18 FA AC B4 9C 5E 35 53 0A
##$RELAX= 
##$RELAX= 
##$RELAX= 
##$RELAX= 
##$RELAX= 
##$RELAX= 
$$ Bruker specific parameters
$$ --------------------------
##$DU= <F:/spectra>
##$EXPNO= 1
##$NAME= <H-F>
##$PROCNO= 1
##$TYPE= <nmr>
##$USER= <she>
##$AMP= (0..31)
100 100 100 100 100 100 100 100 100 100 100 100 100 100 100 100 100 100 
100 100 100 100 100 100 100 100 100 100 100 100 100 100 
##$AQSEQ= 0
##$AQ_mod= 1
##$AUNM= <au_zg>
##$AUTOPOS= <>
##$BF1= 200.13
##$BF2= 200.13
##$BF3= 200.13
##$BF4= 200.13
##$BF5= 200.13
##$BF6= 200.13
##$BF7= 200.13
##$BF8= 200.13
##$BYTORDA= 1
##$CFDGTYP= 0
##$CFRGTYP= 5
##$CHEMSTR= <none>
##$CNST= (0..31)
1 1 145 1 1 1 1 1 1 1 1 1 1 1 1 1 1 1 1 1 1 1 1 1 1 1 1 1 1 1 1 1 
##$CPDPRG= <>
##$CPDPRG1= <>
##$CPDPRG2= <>
##$CPDPRG3= <>
##$CPDPRG4= <mlev>
##$CPDPRG5= <mlev>
##$CPDPRG6= <mlev>
##$CPDPRG7= <mlev>
##$CPDPRG8= <mlev>
##$CPDPRGB= <>
##$CPDPRGT= <>
##$D= (0..31)
0 1.2 0 0 0 0 0 0 0 0 0 0.03 0 0 0 0 0 0 0 0 0 0 0 0 0 0 0 0 0 0 0 0 
##$DATE= 1547637946
##$DBL= (0..7)
120 120 120 120 120 120 120 120 
##$DBP= (0..7)
150 150 150 150 150 150 150 150 
##$DBP07= 0
##$DBPNAM0= <>
##$DBPNAM1= <>
##$DBPNAM2= <>
##$DBPNAM3= <>
##$DBPNAM4= <>
##$DBPNAM5= <>
##$DBPNAM6= <>
##$DBPNAM7= <>
##$DBPOAL= (0..7)
0.5 0.5 0.5 0.5 0.5 0.5 0.5 0.5 
##$DBPOFFS= (0..7)
0 0 0 0 0 0 0 0 
##$DE= 6
##$DECBNUC= <off>
##$DECIM= 32
##$DECNUC= <off>
##$DECSTAT= 4
##$DIGMOD= 1
##$DIGTYP= 9
##$DL= (0..7)
0 120 120 120 120 120 120 120 
##$DP= (0..7)
150 150 150 150 150 150 150 150 
##$DP07= 0
##$DPNAME0= <>
##$DPNAME1= <>
##$DPNAME2= <>
##$DPNAME3= <>
##$DPNAME4= <>
##$DPNAME5= <>
##$DPNAME6= <>
##$DPNAME7= <>
##$DPOAL= (0..7)
0.5 0.5 0.5 0.5 0.5 0.5 0.5 0.5 
##$DPOFFS= (0..7)
0 0 0 0 0 0 0 0 
##$DQDMODE= 0
##$DR= 18
##$DS= 0
##$DSLIST= <SSSSSSSSSSSSSSS>
##$DSPFIRM= 0
$$ [...]
##$SUBNAM2= <"">
##$SUBNAM3= <"">
##$SUBNAM4= <"">
##$SUBNAM5= <"">
##$SUBNAM6= <"">
##$SUBNAM7= <"">
##$SUBNAM8= <"">
##$SUBNAM9= <"">
##$SW= 20.0189088683792
##$SWIBOX= (0..15)
0 0 2 0 0 0 0 0 0 0 0 0 0 0 0 0 
##$SW_h= 4006.41025641026
##$TD= 16384
##$TD0= 1
##$TE= 0
##$TE2= 300
##$TE3= 300
##$TEG= 300
##$TL= (0..7)
0 120 120 120 120 120 120 120 
##$TP= (0..7)
150 150 150 150 150 150 150 150 
##$TP07= 0
##$TPNAME0= <>
##$TPNAME1= <>
##$TPNAME2= <>
##$TPNAME3= <>
##$TPNAME4= <>
##$TPNAME5= <>
##$TPNAME6= <>
##$TPNAME7= <>
##$TPOAL= (0..7)
0.5 0.5 0.5 0.5 0.5 0.5 0.5 0.5 
##$TPOFFS= (0..7)
0 0 0 0 0 0 0 0 
##$TUNHIN= 0
##$TUNHOUT= 0
##$TUNXOUT= 0
##$USERA1= <user>
##$USERA2= <user>
##$USERA3= <user>
##$USERA4= <user>
##$USERA5= <user>
##$V9= 5
##$VALIST= <valist>
##$VCLIST= <CCCCCCCCCCCCCCC>
##$VD= 0
##$VDLIST= <DDDDDDDDDDDDDDD>
##$VPLIST= <PPPPPPPPPPPPPPP>
##$VTLIST= <TTTTTTTTTTTTTTT>
##$WBST= 1024
##$WBSW= 4
##$XGAIN= (0..3)
0 0 0 0 
##$XL= 0
##$YL= 0
##$YMAX_a= 121245
##$YMIN_a= -201282
##$ZGOPTNS= <>
##$ZL1= 120
##$ZL2= 120
##$ZL3= 120
##$ZL4= 120
##$ABSF1= 10
##$ABSF2= 0
##$ABSG= 5
##$ABSL= 3
##$ALPHA= 0
##$AQORDER= 0
##$ASSFAC= 0
##$ASSFACI= 0
##$ASSFACX= 0
##$ASSWID= 0
##$AUNMP= <proc_1d>
##$AZFE= 0.1
##$AZFW= 0.1
##$BCFW= 1
##$BC_mod= 2
##$BYTORDP= 1
##$COROFFS= 0
##$CY= 11.3945322036743
##$DATMOD= 1
##$DC= 2
##$DFILT= <>
##$DTYPP= 0
##$F1P= 18.9103706918063
##$F2P= -1.10871071338519
##$FCOR= 0.5
##$FTSIZE= 0
##$FT_mod= 4
##$GAMMA= 1
##$GB= 0.15
##$INTBC= 1
##$INTSCL= 1
##$ISEN= 128
##$LB= 0.24
##$LEV0= 0
##$LPBIN= 0
##$MAXI= 10000
##$MC2= 0
##$MEAN= 0
##$ME_mod= 0
##$MI= 1.114404
##$NCOEF= 0
##$NC_proc= 0
##$NLEV= 6
##$NOISF1= 3.799351
##$NOISF2= 2.8
##$NSP= 1
##$NTH_PI= 0
##$NZP= 0
##$OFFSET= 15.70392
##$PC= 1
##$PHC0= -9054.035
##$PHC1= 14.00004
##$PH_mod= 1
##$PKNL= yes
##$PPARMOD= 0
##$PSCAL= 0
##$PSIGN= 0
##$REVERSE= no
##$SF= 200.130013532006
##$SI= 16384
##$SIGF1= 3
##$SIGF2= 2
##$SINO= 400
##$SIOLD= 16384
##$SREGLST= <1H.CDCl3>
##$SSB= 0
##$STSI= 0
##$STSR= 0
##$SW_p= 3612.71676300578
##$SYMM= 0
##$S_DEV= 0
##$TDeff= 0
##$TDoff= 0
##$TI= <>
##$TILT= no
##$TM1= 0
##$TM2= 0
##$TOPLEV= 0
##$USERP1= <user>
##$USERP2= <user>
##$USERP3= <user>
##$USERP4= <user>
##$USERP5= <user>
##$WDW= 1
##$XDIM= 8192
##$YMAX_p= 0
##$YMIN_p= 0
$$ End of Bruker specific parameters
$$ ---------------------------------
##NTUPLES= NMR FID
##VAR_NAME=  TIME,          FID/REAL,        FID/IMAG
##SYMBOL=    X,             R,               I
##VAR_TYPE=  INDEPENDENT,   DEPENDENT,       DEPENDENT
##VAR_FORM=  AFFN,          ASDF,            ASDF
##VAR_DIM=   8192,          8192,            8192
##UNITS=     SECONDS,       ARBITRARY UNITS, ARBITRARY UNITS
##FACTOR=    0.0002496,     1,               1
##FIRST=     0,             0,               0
##LAST=      2.0444736,     0,               0
##MIN=       0,             -201282,         0
##MAX=       2.0444736,     121245,          0
$$ Real data points
##PAGE= N=1
##DATA TABLE= (X++(R..R)), XYDATA
$$ plain form
0 0 0 0 0 0 0 0 0 0 0 0 0 0 0 8 -8 8 -8 8 -16 16 -23 24 -31 32 -40 48 -56 64 -73 85 -97 112 -125 142 -160
35 -160 182 -206 230 -254 285 -318 353 -392 435 -482 533 -589 648 -715 787 -866 956 -1051
53 -1051 1161 -1282 1417 -1572 1748 -1954 2193 -2478 2825 -3257 3815 -4562 5622 -7254 10115
68 10115 -16647 66967 -45531 -90474 1926 -139106 -60795 58483 -36396 -5539 116041
79 116041 -14364 -13526 100376 -35303 -95433 37498 -55102 -90889 97693 62750 -36861
90 -36861 91046 48221 -83843 4826 -16750 -125059 10051 41342 -73154 53240 117297
101 117297 -39191 13040 78900 -69469 -37061 59074 -67033 -49964 66533 -35238 -27030
112 -27030 103134 -4624 -52974 53433 -59719 -118006 64352 48010 -30315 93357 50544
$$ packed form
0@%%%%%%%%%%%%%Qj6J6j6J6k4L2l9M7n5O3p2Q8j04J20j37J58j82K09k37K67l02
35a60L42l88M36m84N39o03O71p45Q27r17J015j122J237j363J502j653J822k007
53a051K212k443K699k989L320l702M147m671N303o082P072q377J0184j2876J7369
68A0115k6762Q3614j12498m4943R2400j41032P8311J19278r4879L0857J21580
79A16041j30405Q38J13902j35679o0130J32931r2600l5787J88582l4943r9611
90c6861J27907m2825j32064Q8669k1576j08309J35110L1291j14496J26394O4057
101A17297j56488N2231O5860j48369L2408R6135j26107J7069J16497j01771Q208
112b7030J30164j07758m8350J06407j13152n8287J82358j6342p8325J23672m2813
$$ plain form
123 50544 -77106 22737 18589 -84400 28297 38756 -96142 6244 71956 -47448 28721
134 28721 89130 -75823 -53208 44897 -67242 -35636 96288 2475 -9643 87582 -30075
145 -30075 -69511 52762 -37598 -93787 61074 29021 -45711 80700 48322 -64909 32243
156 32243 17586 -96264 6276 31068 -79316 18634 73918 -40787 31326 87337 -69445
167 -69445 -51068 41083 -62261 -34111 86069 -2592 -15158 76130 -28433 -56355 70839
178 70839 -7469 -74414 41534 -11198 -81465 56066 48523 -41104 61442 44833 -83100
189 -83100 -3266 20223 -79401 12471 58308 -56735 16177 85756 -45666 -17593 66783 -50258
201 -50258 -45729 54409 -33953 -32246 81742 -6365 -41486 69060 -9398 -74080 35627 -14366
$$ packed form
123E0544j27650R9843m148j02989J12697J0459j34898J02386O5712j19404P6169
134B8721O0409j64953K2615R8105j12139L1606J31924r3813j2118R7225j17657
145c0075l9436J22273r0360n6189J54861l2053p4732J26411l2378j13231R7152
156C2243j4657j13850J02540K4792j10384R7950N5284j14705P2113N6011j56782
167f9445J8377R2151j03344K8150J20180q8661j2566R1288j04563k7922J27194
178G0839p8308o6945J15948n2732p0267J37531p543q9627J02546j6609j27933
189h3100P9834K3489r9624R1872M5837j15043P2912O9579j31422K8073Q4376j17041
201e0258M529J00138q8362J707J13988q8107l5121J10546p8458o4682J09707m9993
$$ plain form
213 -14366 -79749 53016 42129 -48947 51028 46118 -67136 10120 32579 -62518 20774 57376
225 57376 -62487 -4295 63522 -48303 -14204 66722 -42736 -39765 50251 -38103 -37672 75814
237 75814 852 -37645 56896 -12589 -61536 50111 5141 -62762 48460 26834 -64863 30688
249 30688 37052 -55079 24814 39636 -63258 9433 50837 -56299 -2213 60240 -44946 -14992
261 -14992 57525 -46833 -36329 57737 -29137 -37247 66892 -3301 -37142 56104 -9645 -56206
273 -56206 51768 9368 -58820 44804 25316 -58690 32057 32931 -58498 18108 32375 -69900
285 -69900 -2056 46638 -43232 10062 65702 -37539 -13196 51778 -47489 -36357 55909 -21662
297 -21662 -32897 60197 -4260 -32798 57249 -3898 -55332 38490 -1315 -64534 33259 23442
$$ packed form
213a4366o5383J32765j0887r1076R9975m910j13254P7256K2459r5097Q3292L6602
225E7376j19863N8192O7817j11825L4099Q0926j09458K971R0016q8354M31J13486
237G5814p4962l8497R4541o9485m8947J11647m4970o7903J11222k1626r1697R5551
249C0688O364r2131P9893J4822j02894P2691M1404j07136N4086O2453j05186K9954
261a4992P2517j04358J0504R4066q6874q110J04139p0193l3841R3246o5749m6561
273e6206J07974m2400o8188J03624j9488q4006R0747Q74r1429P6606J4267j02275
285f9900O7844M8694q9870N3294N5640j03241K4343O4974r9267J1132R2266p7571
297b1662j1235R3094o4457k8538R0047o1147n1434R3822l9805o3219R7793r817
$$ plain form
309 23442 -46984 39727 38194 -53244 15908 32417 -63527 -4574 39809 -44649 4974 59888
321 59888 -32793 -5295 60543 -34307 -32179 48216 -28795 -40615 48344 -11691 -34980 58794
333 58794 4760 -47271 40428 2694 -60785 27823 15451 -51801 34528 36335 -49514 21003
345 21003 42815 -48135 3060 39132 -47846 -4330 47646 -39560 -11074 56778 -28154 -26124
357 -26124 47679 -24810 -35793 46918 -13234 -40062 48371 2439 -45000 38833 9576 -45955
369 -45955 34656 18269 -49210 28505 31503 -49759 12978 36001 -45177 3195 37659 -43303
381 -43303 -3473 47409 -35412 -15125 47674 -28598 -25919 44720 -22526 -31370 50348 -6291
393 -6291 -36273 46713 4852 -40625 36384 6495 -47400 30998 16421 -50363 24905 31573
$$ packed form
309B3442p0426Q6711j533r1438O9152J6509r5944N8953M4383q4458M9623N4914
321E9888r2681K7498O5838r4850K128Q0395p7011j1820Q8959o0035k3289R3774
333E8794n4034n2031Q7699l7734o3479Q8608j2372o7252Q6329J807q5849P0517
345B1003K1812r0950N1195L6072q6978M3516N1976q7206K8486O7852q4932K030
357b6124P3803p2489j0983Q2711o0152k6828Q8433m5932m7439Q3833k9257n5531
369d5955Q0611j6387o7479P7715K998q1262O2737K3023q1178M8372L4464q0962
381d3303L9830N0882q2821K0287O2799p6272K679P0639o7246q844Q1718n6639
393f291k9982Q2986m1861m5477P7009k9889n3895P8398j4577o6784P5268O668
$$ plain form
405 31573 -45105 13798 33488 -45358 2199 35630 -44204 -7275 44616 -32150 -11913 48259
417 48259 -22912 -18357 48467 -19883 -33254 43799 -8988 -38475 39545 3009 -36426 37530
429 37530 9012 -43500 29546 15963 -49959 16466 23069 -44850 12594 33863 -37968 8498
441 8498 41765 -35616 -7355 38499 -31743 -14439 41034 -24582 -17397 49080 -14251 -29734
453 -29734 42578 -6667 -38259 31430 -3757 -40569 32391 9243 -40123 31343 22059 -41232
465 -41232 18666 22678 -44279 10692 31235 -40269 4323 42128 -29641 -4455 39228 -28850
477 -28850 -14028 36900 -29913 -24671 43991 -12768 -28654 41448 -3270 -33302 32304 -2426
489 -2426 -39480 31288 11495 -38122 26493 21109 -36353 19968 23365 -41596 10268 31578 -38759
$$ packed form
405C1573p6678N8903J9690p8846M7557L3431p9834L6929N1891p6766K0237O0172
417D8259p1171M555O6824o8350j3371P7053n2787k9487P8020l6536l9435P3956
429C7530k8518n2512P3046j3583o5922O6425O603o7919N7444K1269p1831M6466
441H498L3267p7381K8261M5854p0242J7304N5473o5616P185O6477o3331j5483
453b9734P2312m9245l1592O9689l5187l6812P2960k3148m9366P1466r284o3291
465d1232N9898M012o6957N4971K0543p1504M4592L7805p1769K5186M3683o8078
477b8850J4822N0928o6813N242O8662n6759j5886P0102m4718l0032O5606l4730
489b426l7054P0768j9793m9617O4615n384n7462N6321L397o4961N1864K1310p0337
$$ plain form
502 -38759 -1898 35908 -28265 -6081 34551 -27775 -12376 37781 -25281 -24933 39693 -10555
514 -10555 -26132 38184 -2695 -29611 34965 2711 -38146 26523 11773 -35349 23116 17012
526 17012 -35505 19888 22883 -43639 4917 29881 -35786 -2084 33848 -26811 -3916 35149
538 35149 -27980 -14511 38442 -18977 -20809 38331 -10547 -24035 37951 -4669 -32741 33531
550 33531 5608 -36552 22758 9371 -33619 21763 13832 -38535 17440 24987 -38206 4735
562 4735 28871 -31526 -663 31288 -27450 -3950 38130 -21102 -14480 33743 -17421 -19516 33727
575 33727 -12212 -23592 37964 -3064 -34675 25982 4120 -33655 21385 8939 -31047 23566
587 23566 16634 -36569 13043 23696 -33583 6414 28363 -29439 2243 33444 -27582 -8868
$$ packed form
502c8759L6861L7806o4173K2184M0632o2326J5399N0157o3062L48O4626n0248
514a0555j5577O4316m0879k6916O4576l2254m0857O4669j4750m7122N8465o104
526A7012n2517N5393K995o6522M8556K4964o5667L3702L5932o0659K2895L9065
538C5149o3129J3469N2953n7419j832N9140m8878j3488O1986m2620k8072O6272
550C3531k7923m2160N9310j3387m2990N5382p931n2367N5975P547o3193M2941
562D735K4136o0397L0863L1951n8738K3500M2080n9232O622M8223n1164k095N3243
575C3727m5939j1380O1556m1028l1611O0657k1862l7775N5040j2446l9986N4613
587B3566o932n3203M9612J0653n7279L9997K1949n7802L1682L1201o1026J8714
$$ plain form
599 -8868 34634 -19519 -15132 29831 -18263 -18045 34193 -12964 -25890 35792 -970 -32961 25616
612 25616 4920 -30752 23015 8911 -33238 21240 20770 -29817 15333 23021 -33407 3004 21551
625 21551 -34414 239 37077 -20480 -7864 31128 -20360 -17023 25430 -19859 -18763 34513
637 34513 -8058 -23503 34089 2720 -27202 25088 3097 -32044 20992 10733 -31894 16994
649 16994 19436 -27158 13522 20844 -31702 4039 22106 -34875 -6014 31541 -19477 -7054
661 -7054 31421 -16261 -10877 31425 -15971 -21566 28672 -10261 -25239 31070 4703 -20365 29954
674 29954 3590 -36276 15531 8844 -32028 15340 18185 -26706 12853 19738 -31365 5267 26597
687 26597 -29938 -7247 26568 -20814 -5012 33795 -13401 -10003 31396 -14810 -23673 24625
$$ packed form
599h868M3502n4153M387M4963m8094K18N2238m7157j2926O1682l6762l1991N8577
612B5616k0696l5672N3767j4104m2149N4478m70n0587M5150P688n6428L6411J8547
625B1551n5965L4653L6838n7557J2616L8992n1488L337M2453m5289J096N3276
637C4513m2571j5445N7592l1369k9922N2290k1991l5141N3036j0259m2627M8888
649A6994K442m6594M0680P322n2546L5741J8067n6981K8861L7555n1018J2423
661g054L8475m7682N384M2302m7396n595N0238l8933j4978N6309k6367k5068N0319
674B9954k6364l9866N1807o687m0872M7368K845m4891L9559O885n1103L6632K1330
687B6597n6535K2691L3815m7382J5802L8807m7196L398M1399m6206q863M8298
$$ plain form
699 24625 -8774 -22040 29187 1726 -22378 28443 5125 -35587 11143 6985 -30279 14137
711 14137 18688 -22583 15733 23877 -28034 2620 23531 -28868 -9033 22473 -20622 -2099
723 -2099 37848 -9374 -12133 25971 -17291 -26392 20662 -7927 -19236 30025 437 -25245 26570
736 26570 10302 -27257 15447 6638 -33769 8731 13377 -25478 17116 30290 -20209 4907
748 4907 22564 -28143 -9432 18563 -27493 -10352 32753 -8858 -8421 31607 -8787 -20811 19400
761 19400 -13525 -26157 24800 1855 -21859 28386 15821 -19391 18109 5494 -36218 3805
773 3805 10617 -26173 12927 29100 -17920 3122 18979 -27289 -6197 23627 -22057 -12154 26712
786 26712 -11131 -10252 30064 -5495 -16245 22263 -11641 -27532 23083 5748 -18465 24979
$$ packed form
699B4625l3399j3266N1227k7461k4104N0821k3318m0712M6730m158l7264M4416
711A4137M551m1271L8316Q144n1911L0654K0911n2399J9835L1506m3095J8523
723b099L9947m7222k759L8104m3262r101M7054k8589j1309M9261k9588k5682N1815
736B6570j6268l7559M2704q809m0407M2500M646l8855M2594J3174n0499K5116
748D907J7657n0707J8711K7995m6056J7141M3105m1611M37M0028m0394j2024M0211
761A9400l2925j2632N0957k2945k3714N0245j2565l5212L7500j2615m1712M0023
773C805O812l6790L9100J6173m7020K1042J5857m6268K1092K9824m5684R903L8866
786B6712l7843Q79M0316l5559j0750L8508l3904j5891N0615j7335k4213M3444
$$ plain form
798 24979 9820 -24708 15060 7215 -31805 7904 14354 -26804 6649 22107 -20110 3976
810 3976 22363 -24014 -5610 24775 -18895 -10765 25657 -11384 -8959 30610 -5475 -16880 22411
823 22411 -10114 -29816 16968 2468 -18356 24284 9542 -23621 15664 10365 -28047 7453
835 7453 12475 -28119 3035 19971 -16748 9238 28780 -19013 -8952 16568 -22678 -12519
847 -12519 25315 -7661 -6273 30594 -5683 -18652 20196 -7546 -27028 14587 -1017 -21170
859 -21170 22179 11338 -20094 17294 12377 -26261 6261 12234 -25219 5326 20426 -18409
871 -18409 5872 26407 -18837 -9125 16557 -21394 -11498 24153 -9765 -10030 26741 -6840 -17482
884 -17482 23327 -1064 -20454 17076 -2471 -25406 17717 10622 -18552 18112 14888 -23838
$$ packed form
798B4979j5159l4528L9768p845l9020L9709O450m1158L3453J5458m2217K4086
810C976J8387m6377J8404L0385m3670Q130L6422l7041K425L9569l6085j1405L9291
823B2411l2525j9702M6784j4500k0824M2640j4742l3163L9285n299l8412L5500
835G453N022m0594L1154J6936l6719K5986J9542m7793J0061K5520l9246J0159
847a2519L7834l2976J388L6867l6277j2969L8848k7742j9482M1615j5604k0153
859b1170M3349j0841l1432L7388m917l8638L2522N973l7453L0545J5100l8835
871a8409K4281K0535m5244R712K5682l7951R896L5651l3918k65L6771l3581j0642
884a7482M0809k4391j9390L7530j9547k2935M3123p095k9174L6664l224l8726
$$ plain form
896 -23838 5646 10784 -24752 5017 19658 -20143 818 23097 -16095 -5224 20286 -17588
908 -17588 -12718 19022 -13408 -12964 26253 -1498 -12581 23857 -772 -19979 15973 -993 -24312
921 -24312 16264 10451 -18500 14638 12008 -23763 4352 9914 -24632 4365 20109 -18169 499
934 499 22100 -14604 -3710 21135 -16359 -12446 19414 -11792 -12400 25916 229 -12248 20639
947 20639 -4669 -22914 15414 996 -21706 16597 10385 -19310 12803 11094 -21790 6711
959 6711 11450 -25262 241 17308 -16408 2921 24158 -11485 -1426 21281 -16650 -14328 16855
972 16855 -11987 -13928 21979 -1297 -11086 21921 -1610 -20804 13976 -461 -23772 11031
984 11031 6725 -17754 15538 16190 -15787 10170 13959 -24181 -4043 11645 -19119 952 22450
$$ packed form
896b3838K9484N138l5536K9769J4641l9801K0961K2279l9192J0871K5510l7874
908a7588M870L1740l2430M44L9217k7751j1083L6438k4629j9207L5952j6966k3319
921b4312M0576n813k8951L3138k630l5771K8115N562l4546K8997J5744l8278J8668
934D99K1601l6704J0894K4845l7494L913L1860l1206o08L8316k5687j2477L2887
947B0639k5308j8245L8328j4418k2702L8303o212k9695L2113j709l2884K8501
959F711M739l6712K5503J7067l3716J9329K1237l5643J0059K2707l7931K322L1183
972A6855k8842j941L5907k3276r789L3007k3531j9194L4780j4437k3311L4803
984A1031m306k4479L3292O52l1977K5957L789l8140K0138J5688l0764K0071K1498
$$ plain form
997 22450 -10898 -528 23364 -12873 -12332 16561 -12282 -16275 17014 -5476 -13141 23339 3139
1010 3139 -15747 16541 1726 -22538 9586 4336 -19445 14212 15004 -16931 9119 15562 -19949
1023 -19949 -1030 12706 -19029 -1930 18108 -14808 -4143 21298 -10198 -9275 18150 -9713
1035 -9713 -13437 17716 -5303 -14155 20659 3429 -15344 14728 2229 -19446 10738 4788 -19422
1048 -19422 11823 13589 -18072 5706 13726 -18273 -374 12628 -18649 -2356 18228 -11807
1060 -11807 -2854 21147 -8250 -8325 16351 -11435 -14441 18410 -3152 -13507 19805 4071 -14037
1073 -14037 13465 821 -19953 9633 3605 -21211 9034 12533 -15522 8113 15420 -16341
1085 -16341 1774 13550 -18775 -5404 16007 -11217 -2481 20230 -6964 -5081 18989 -10277
$$ packed form
997B2450l3348J0370K3892l6237N41K8893k8843l993L3289k2490p665L6480k0200
1010C139j8886L2288j4815k4264L2124n250k3781L3657P92l1935K6050O443l5511
1023a9949J8919J3736l1735J7099K0038l2916J0665K5441l1496R23K7425k7863
1035i713l724L1153k3019q852L4814j7230j8773L0072j2499k1675L0184n950k4210
1048a9422L1245J766l1661K3778Q020l1999J7899J3002l1277J6293K0584l0035
1060a1807Q953K4001k9397p5K4676k7786l006L2851k1562j0355L3312j5734j8108
1073a4037K7502j2644k0774K9586o028k4816L0245L499k8055K3635P307l1761
1085a6341J8115J1776l2325J3371K1411k7224Q736K2711k7194J883K4070k9266
$$ plain form
1097 -10277 -15702 14967 -5345 -16479 15052 2225 -12820 15771 4376 -17177 10419 4948
1109 4948 -19736 6288 9185 -15782 7839 15076 -15459 2748 16212 -14587 -4627 14440 -11792
1122 -11792 -5226 15096 -10478 -6730 19140 -6385 -12327 16045 -3816 -15438 13078 -627
1134 -627 -14885 14777 5961 -15269 10800 7378 -16050 7196 8028 -17073 6541 13742 -16100
1147 -16100 1058 15269 -13354 -3755 13949 -11455 -4723 15903 -10081 -8373 16637 -6228
1159 -6228 -10975 16172 -2547 -12456 15420 504 -15587 12523 4914 -15078 9065 6566 -14209
1172 -14209 8196 7833 -17397 4443 12075 -15547 -8 14170 -11805 -2578 13987 -11281 -5598
1185 -5598 15383 -8010 -7541 16065 -4590 -8883 15085 -3569 -13039 14417 1150 -14971 10806
$$ packed form
1097a0277n425L0669k0312j1134L1531j2827j5045K8591j1395k1553K7596n471
1109D948k4684K6024K897k4967K3621P237l0535J8207J3464l0799R960J9067k6232
1122a1792O566K0322k5574L748K5870k5525n942K8372j9861j1622K8516j3705
1134f27j4258K9662q816k1230K6069l422k3428K3246Q32k5101K3614P201k9842
1147a6100J7158J4211k8623R599J7704k5404O732K0626k5984J708K5010k2865
1159f228m747K7147j8719r909K7876j4916j6091K8110p609j9992K4143k499k0775
1172a4209K2405l63k5230K1840P632k7622J5539J4178k5975R227J6565k5268N683
1185e598K0981k3393M69K3606k0655m293K3968j8654r470K7456j3267j6121K5777
$$ plain form
1198 10806 4841 -14206 7873 5078 -14618 7697 8551 -15957 3929 11858 -13930 444 12949
1211 12949 -12101 -1031 15657 -9970 -5737 14395 -7536 -7490 13748 -5644 -8047 15707 -3322
1224 -3322 -13606 12759 837 -15029 9425 3658 -12963 9401 5977 -14211 6857 8976 -14396
1237 -14396 2688 10522 -12589 2177 13291 -11883 -2106 14840 -8943 -6399 12735 -7001
1249 -7001 -7331 12007 -6530 -9233 14618 -1341 -11531 12028 1421 -13084 8620 2662 -13622
1262 -13622 8453 7685 -12023 6705 9647 -11822 3191 8337 -14081 299 12215 -11146 -2997
1275 -2997 14306 -7433 -5321 11849 -7388 -7194 12272 -5742 -10092 13015 -602 -9656 12346
1288 12346 1536 -11749 10209 3274 -13938 6625 6248 -12477 4516 8144 -11042 4146 9584
$$ packed form
1198A0806n965j9047K2079k795j9696K2315Q54k4508J9886P929k5788J4374J2505
1211A2949k5050J1070J6688k5627M233K0132k1931M6K1238j9392k403K3754j9029
1224c322j0284K6365j1922j5866K4454n767j6621K2364l424k0188K1068K119k3372
1237a4396J7084P834k3111J4766J1114k5174R777J6946k3783K544J9134j9736
1249g001l30J9338j8537k703K3851j5959j0190K3559j0607j4505K1704n958j6284
1262a3622K2075p68j9708J8728K942k1469J5013N146k2418J4380J1916k3361Q149
1275b997J7303k1739K112J7170j9237J94J9466j8014m350K3107j3617r054K2002
1288A2346j0810j3285K1958o935j7212K0563l77j8725J6993L628j9186J5188N438
$$ plain form
1301 9584 -13104 -848 10765 -11103 -3609 12109 -6889 -3470 13005 -5831 -6893 12255 -3799
1314 -3799 -9312 11163 -1056 -9090 11156 1174 -11594 9111 3778 -13108 5277 5705 -11376
1327 -11376 4221 7200 -11124 3013 9848 -11181 -495 10438 -9220 -2386 11697 -6753
1339 -6753 -3746 12830 -5072 -6983 10899 -3744 -9104 9875 -1852 -9291 10764 1616 -11214
1352 -11214 8162 3534 -12299 4580 4712 -10978 4869 8429 -10068 3464 10202 -9949 -884
1365 -884 9292 -9317 -2863 10551 -6964 -3824 12535 -3878 -6445 9749 -3715 -9395 8157
1378 8157 -2393 -9457 9918 2744 -9045 8313 4604 -10420 4757 4205 -11310 3573 7785
1391 7785 -9202 2889 10073 -7813 -227 8247 -9618 -3697 9133 -7382 -4637 11121 -2992
$$ packed form
1301I584k2688J2256J1613k1868P494J5718j8998L419J6475j8836j062J9148j6054
1314c799n513K0475j2219q034K0246r982j2768K0705n333j6886J8385M28j7081
1327a1376J5597K979j8324J4137O835k1029J0686J0933j9658O834J4083j8450
1339f753L007J6576j7902j911J7882j4643n360J8979j1727p439K0055r148j2830
1352a1214J9376m628j5833J6879J32j5690J5847L560j8497J3532O738k0151R065
1365h84J0176j8609O454J3414j7515L140J6359j6413k567J6194j3464n680J7552
1378H157j0550p064J9375p174j1789J7358l709j5024J5177n52j5515J4883M212
1391G785j6987J2091P184j7886P586Q474j7865N921J2830j6515K745J5758j4113
$$ plain form
1404 -2992 -5013 10023 -2791 -7828 8583 -1871 -9605 8482 2506 -8444 7758 4101 -8864
1417 -8864 5824 4535 -11319 2200 6472 -9490 1592 8469 -7540 98 8275 -8911 -3462
1430 -3462 9154 -6376 -4694 9753 -3099 -4677 10185 -1900 -6921 8511 -1269 -9241 6986
1443 6986 1686 -7728 7233 3474 -8982 4657 4376 -10438 1882 5707 -8281 1570 7900 -7179
1457 -7179 352 8872 -6923 -3408 8076 -5259 -4176 9024 -3083 -4423 9522 -1882 -7177
1470 -7177 7121 -1007 -8571 6110 1460 -7855 6659 3490 -8575 4289 4422 -8964 2419
1483 2419 5666 -7726 1470 7529 -6980 364 8673 -5978 -2458 7812 -5404 -4185 8260
1496 8260 -3383 -4945 8271 -2109 -6826 6993 -258 -7154 6259 1419 -7750 5712 3263
$$ packed form
1404b992k021J5036j2814n037J6411j0454p734J8087n976j0950J6202l657j2965
1417h864J4688j289j5854J3519M272j5962J1082O877j6009P638Q177j7186N449
1430c462J2616j5530J682J4447j2852j578J4862j2085n021J5432r780p972J6227
1443F986n300r414J4961l759j2456J3639k81j4814J2320L825j3988R851O330j5079
1457g179P531Q520j5795L515J1484j3335J083J3200j2107j340J3945j1404n295
1470g177J4298q128p564J4681m650r315J4514l169j2065J2864J33j3386J1383
1483B419L247j3392R196O059j4509P344Q309j4651L520J0270j3216J219J2445
1496H260j1643j562J3216j0380m717J3819p251o896J3413m840r169J3462k449
$$ plain form
1509 3263 -7619 4133 4813 -7583 2250 5361 -7258 839 6709 -6628 -916 7544 -5510 -2643
1523 -2643 7120 -4879 -3530 7737 -2992 -5115 7397 -1147 -6264 6348 -21 -6140 6458
1536 6458 1613 -7306 5155 3472 -7161 3320 4115 -7348 2077 4763 -7227 887 6744 -5949
1550 -5949 -1101 6074 -5657 -2226 6836 -4323 -3078 7991 -2616 -4878 6943 -1156 -5550 5725
1564 5725 -550 -6002 6124 1972 -6557 4689 2865 -6938 2988 3077 -7487 2155 4997 -6378
1578 -6378 806 6329 -5415 -1221 5462 -5245 -1564 6723 -3673 -3230 6958 -1996 -4474 6012
1592 6012 -1073 -4984 5444 -461 -6525 4443 1577 -5866 4177 2520 -6375 2891 3197 -6613
1606 -6613 1754 5220 -5518 438 5620 -4228 -240 5775 -4770 -2088 6215 -3755 -3394 6311 -1862
$$ packed form
1509C263j0882J1752O80j2396R833L111j2619Q097N870j3337N712Q460j3054K867
1523b643R763j1999J349J1267j0729k123J2512q544n117J2612o369o119J2598
1536F458m845q919J2461j683j0633J0481P95j1463R425K686j1990Q114N857j2693
1550e949M848P175j1731L431R062j1159J245J1069j0607k262J1821q099m394J1275
1564E725o275n452J2126m152q529J1246j824r803R926Q9j0564R642K842j1375
1578f378P184N523j1744M194O683j0707L681Q287j0396M43J0188q954k478J0486
1592F012p085l911J0428n905o064J0968k866p443J0043j657q895R266L06r810
1606f613Q367L466j0738N956N182r848L988O015j0545K682Q303r970L61R705q173
$$ plain form
1621 -1862 -3700 6001 -1319 -5517 5070 -66 -6109 4133 1970 -4869 4072 2189 -5992 3011
1635 3011 3125 -6447 1330 4965 -5107 323 5232 -4288 -207 5507 -4251 -2754 5007 -3669 -3280
1650 -3280 5474 -1969 -2996 6281 -953 -5013 4780 637 -5340 3518 1549 -4590 3976 2480 -5189
1665 -5189 2771 3429 -6089 667 3710 -5192 282 4996 -4317 -601 5348 -3802 -2487 4661 -2801
1680 -2801 -2512 5136 -2121 -3355 5730 -424 -4523 4314 885 -4518 3298 462 -4975 3602 2237
1695 2237 -4970 2741 3159 -5376 774 2891 -5403 426 4834 -3706 -562 5044 -2847 -1761 4124
1710 4124 -2696 -2192 5300 -2031 -3245 5461 -285 -4256 3822 -103 -4906 3117 731 -4757 2987
1725 2987 2552 -4412 1996 2415 -4905 1128 3227 -5047 314 4497 -3198 -875 4738 -2308 -1105
$$ packed form
1621a862j838R701p320m198J0587n136o043J0242k163o839Q941j883q181R003
1635C011J14r572P777L635j0072N430M909r520M081N714r758J497P761q676L89
1650c280Q754p443j027R277p234m060R793m143n977Q858j969o139Q566j496p669
1665e189P960O58r518O756L043q902N474M714r313L716N949r150J315P148p462
1680b801K89P648p257j234R085o154m099Q837l429n403P816k836n437Q577j365
1695B237p207P711M18q535O150K117q294N829M408q540L144N606p891J086N885
1710D124o820N04P492p331j214Q706n746l971Q078l925m803Q023k386n488P744
1725B987m35o964O408M19p320O033K099q274N361M183p695K323N613p046J203
$$ plain form
1740 -1105 3906 -3226 -2586 4333 -1748 -3278 4701 83 -3305 3752 -309 -4954 2660 767 -4632
1755 -4632 2675 2459 -3217 2747 2551 -4461 1268 3236 -4710 -317 4114 -2844 -508 4051 -2581
1770 -2581 -1056 3849 -2703 -2879 3443 -1620 -2785 4186 -328 -2958 4262 397 -4217 2646 1241
1785 1241 -4264 1669 1672 -3422 2641 2885 -3724 1135 3012 -4317 -427 3291 -3258 -474 4276 -2327
1801 -2327 -1563 3535 -2334 -2492 3369 -1369 -2255 3887 -496 -2833 4229 694 -3779 2294 1061 -3712
1817 -3712 1921 1677 -3520 2096 2339 -3688 733 2493 -3886 -231 2998 -3234 -587 4206 -1953
1832 -1953 -1037 3823 -1753 -1878 2909 -1876 -2461 4010 -442 -2956 3907 794 -3579 2112 351 -3952
1848 -3952 1835 1227 -3534 1781 2637 -3279 778 2250 -3529 490 2943 -3102 -342 3618 -1643
$$ packed form
1740a105N011p132O40O919o081j530P979m618l388P057m061m645P614j893n399
1755d632P307k16n676N964j96p012N729J968p946M393M431o958K336M559o632
1770b581J525M905o552j76O322n063j165O971m514k630P220l865m614O863j405
1785A241n505N933Ln094O063K44o609M859J877p329L890L718o549K784M750o603
1801b327P64N098n869j58N861m738q86O142m383k337P062l535m473O073j233m773
1817c712N633k44n197N616K43o027M421J760o379L655L229o232K647M793o159
1832a953R16M860n576j25M787m785n85O471m452k514O863l113m373N691j761m303
1848c952N787o08m761N315Q56n916M057J472n779M019K453o045K760L960n261
$$ plain form
1863 -1643 -923 3355 -1503 -1684 2660 -1624 -2444 3148 -378 -2836 3129 320 -2850 2293 571 -3455
1879 -3455 1659 1468 -3168 1538 2239 -2725 1057 2415 -3243 202 2875 -2849 -756 3306 -1746
1894 -1746 -973 3094 -1587 -1649 3030 -1252 -2565 2874 -456 -2347 2608 110 -2731 2750 789 -3357
1910 -3357 1753 1222 -2730 1294 1643 -2553 1111 2327 -2701 298 2634 -2523 -872 2574 -2166
1925 -2166 -894 2801 -1510 -1193 2772 -884 -2171 2635 -352 -1976 2508 143 -2589 2115 774
1940 774 -2927 1719 1574 -2750 1066 1503 -2925 528 2146 -2638 -102 2279 -2132 -386 2890 -1874
1956 -1874 -840 3001 -1438 -1424 2500 -988 -1849 2558 -266 -2088 2610 -29 -2628 1830 666 -2942
1972 -2942 1476 709 -2670 1443 1562 -2687 681 2066 -2281 44 2027 -2101 -169 2524 -1750
$$ packed form
1863a643P20M278m858j81M344m284q20N592l526k458N965k809l170N143j722m026
1879c455N114j91m636M706P01m964L782J358n658L445K673n724K093M062n052
1894a746P73M067m681o2M679m282j313N439l330j891M955k498k841N481j961m146
1910c357N110n31l952M024L49m196L664J216n028K999K336n157J651L446m740
1925b166J272L695m311L17L965l656j287M806k987j624M484k365k732M704j341
1940G74l701M646j45m324L816M37m428L453J618m784K536K381m411J746L276m764
1956a874J034L841m439J4L924l488q61M407k824j822M698k639k599M458j164l608
1972b942M418p67l379M113J19m249L368J385m347K325J983m128J932K693m274
$$ plain form
1987 -1750 -672 2593 -1175 -1346 2525 -1094 -1778 2240 -731 -2080 2299 111 -2247 1924 787
2002 787 -2464 1536 706 -2459 1335 1444 -2207 841 1854 -2046 289 1995 -1953 -172 1956 -1780
2018 -1780 -991 2523 -1458 -1258 2099 -957 -1470 2176 -618 -1744 2062 -55 -1905 1884 343 -2253
2034 -2253 1710 773 -2289 1474 1505 -2059 517 1613 -2247 90 1443 -2115 -67 2080 -1405 -605
2050 -605 2214 -1120 -926 2062 -1174 -1430 2197 -531 -1415 2135 184 -1692 1701 232 -2398 1437
2066 1437 560 -2421 1260 1196 -1865 527 1384 -2006 37 1355 -2318 -237 2027 -1277 -80 2513
2082 2513 -923 -793 1785 -1048 -1199 2001 -484 -1195 1775 -35 -1473 1812 -106 -2205 1494 476
2098 476 -2326 909 1018 -1893 1012 1356 -1894 470 1611 -1997 -314 1461 -1343 -275 1961 -1200
$$ packed form
1987a750J078L265l768j71L871l619o84M018k971j349M379k188k358M171j137
2002G87l251M000q30l165L794J09l651L048J013l900K335J706l948J781K128l736
2018a780P89L514l981K00L357l056n13L646k794j126L806k117j850L789j541k596
2034b253L963r37l062L763L1l564K576J096l860K337J353l558K048K147l485Q00
2050f05K819l334J94K988l236k56L627k728q84L550j951j876L393j469k630L835
2066A437q77k981L681o4l061K392Q57l390K043J318l673K081K264l304J197K593
2082B513l436J30K578k833j51L200k485p11K970j810j438L285j918k099L699j018
2098D76k802L235J09k911K905L44l250K364J141l608J683J775k804J068K236l161
$$ plain form
2114 -1200 -571 1910 -1038 -1442 1883 -452 -1432 2037 -140 -1543 2139 -119 -2119 1193 503 -1885
2130 -1885 1089 1071 -1611 1113 1416 -1723 379 1483 -1806 -93 1487 -1613 28 1857 -1345 -859
2146 -859 1749 -942 -1370 1599 -805 -1403 1944 -157 -1256 1761 320 -1695 1255 456 -1877 1207
2162 1207 753 -1744 1030 1361 -1683 277 1142 -1769 -52 1225 -1648 -14 1900 -1096 -554 1882
2178 1882 -1084 -1103 1739 -794 -1027 1504 -227 -1348 1540 426 -1638 1132 225 -1763 1316 663
2194 663 -1689 717 1201 -1241 426 1068 -1497 99 1441 -1582 -364 1760 -909 -403 1472 -1061
2210 -1061 -809 1578 -620 -955 1450 -176 -962 1504 -22 -1236 1082 223 -1756 1191 768 -1560
2226 -1560 803 1155 -1489 581 1358 -1653 -53 1289 -1300 -111 1454 -1198 -213 1551 -722 -799
$$ packed form
2114a200O29K481k948m04L325k335r80L469k177j403L682k258k000L312o90k388
2130a885K974j8k682K724L03l139K102J104l289J713J580l100J641J829l202M86
2146h59K608k691m28K969k404n98L347k101j099L017j441k015K950p99k333L084
2162A207m54k497K774L31l044J960Q65k911J717J277k873J634J914k996N42K436
2178A882k966j9K842k533k33K531j731j121K888j114k064K770r07j988L079o53
2194F63k352K406M84k442J667O42k565J596J342l023J218K124k669N06J875k533
2210a061K52K387k198l35K405j626p86K466j526j214K318q59j979K947m23k328
2226a560K363L52k644K070P77l011J600J342k589J189J565k652R85J764k273p7
$$ plain form
2242 -799 1402 -652 -990 1239 -304 -968 1343 -302 -1320 1352 134 -1530 1135 773 -1513 835
2258 835 848 -1376 482 869 -1428 240 1234 -1098 -45 1259 -1232 -435 1668 -824 -754 1401 -588
2275 -588 -953 1277 -390 -923 1315 -54 -1067 1343 275 -1529 820 412 -1405 625 631 -1327 585
2292 585 1146 -1239 -46 750 -1242 149 1412 -1069 -311 1672 -919 -622 1179 -550 -691 1310
2308 1310 -394 -1058 1390 37 -800 1049 457 -1044 896 122 -1630 502 723 -1483 449 975
2324 975 -1026 130 881 -1051 -199 959 -1058 -121 1285 -835 -406 1242 -733 -705 1364 -198 -1110
2341 -1110 1357 -89 -848 1007 169 -1208 779 443 -1485 661 660 -1332 128 1008 -894 347 982
2358 982 -980 158 1029 -825 -573 1043 -728 -290 1196 -624 -967 1167 -297 -917 823 -9 -771
$$ packed form
2242g99K201k054l38K229j543o64K311j645j018K672j218j664K665l62k286K348
2258H35J3k224J858L87k297J668R94k332J053J304k491P97K103k492P0K155j989
2275e88l65K230j667n33K238j369j013K410j068j804K349m08j817K030Oj958J912
2292E85N61k385J193P96j992J391J263k481P58J983k591K97J801j729j41K001
2308A310j704o64K448j353q37J849n92j501J940p74j752K132K21k206J932N26
2324I75k001J156P51j932Q52J158k017R37J406k120M29J648j975K8K069j562r12
2341a110K467j446p59J855q38j377J987l36j928K146jj992J460Q80j902J241O35
2358I82j962J138Q71j854K52J616j771M38J486j820l43K134j464o20J740q32p62
$$ plain form
2375 -771 1060 177 -1183 968 353 -1262 618 925 -1134 501 772 -1089 202 817 -1102 -46
2391 -46 917 -869 -23 682 -621 -364 1135 -563 -688 1102 -332 -892 835 -39 -993 993 172 -1048
2409 -1048 718 379 -1074 672 261 -1158 223 787 -1014 114 783 -983 -158 953 -944 -478
2425 -478 880 -677 -366 1226 -304 -530 1088 -235 -518 906 -365 -990 869 219 -746 547 372
2442 372 -1061 198 519 -980 282 541 -1088 205 798 -598 -58 615 -1003 -373 912 -753 -258
2459 -258 765 -151 -357 910 -470 -599 893 -425 -1019 895 62 -866 558 409 -606 848 564
2476 564 -915 349 507 -770 31 550 -612 293 778 -715 -138 804 -811 -119 796 -382 -403 974
2494 974 -72 -443 871 -135 -520 647 86 -765 495 109 -787 490 163 -774 106 310 -909 120
$$ packed form
2375g71J831q83j360K151o15j615J880L07k059J635K71j861J291O15j919J056
2391d6R63j786Q46P05j303K57J499j698j25J790j434n60J727q74r54J986q21j220
2409a048J766l39j453J746m11j419J381N64j801J128O69j766Q25J111j897M66
2425d78J358j557L11J592j530k26J618j323k83J424j271o25J859o50r65J293j75
2442C72j433J259L21j499J262K59j629J293N93j396N40O73j618O30J285j665M95
2459b58J023r16k06J267j380j29J492j318n94J914q33r28J424j49j015J454k84
2476E64j479J264J58j277Q01N19j162R05M85j493N77R42j615O92R15j178k1J377
2494I74j046l71J314j006l85J167n61q51J260l86q96J277l27r37Q80K04j219J029
$$ plain form
2512 120 791 -890 566 770 -563 -26 586 -621 -187 618 -500 -266 764 -461 -363 834 -49 -793
2530 -793 750 -267 -435 479 92 -595 477 293 -485 518 362 -815 248 277 -771 190 561 -281
2548 -281 25 669 -476 70 486 -190 -458 884 19 -655 610 72 -567 504 -133 -733 538 259
2566 259 -637 471 229 -638 558 211 -469 254 292 -611 181 515 -348 -20 675 -553 -42 798 -505
2585 -505 -401 552 -39 -107 567 -302 -360 513 -206 -470 123 61 -654 455 327 -598 582 276 -772 183
2605 183 347 -497 195 471 -546 -188 485 -350 -153 391 -310 -219 565 -259 -101 550 -5 -284 371 -90
2625 -90 -528 670 -44 -518 319 252 -596 136 358 -626 111 350 -535 106 408 -234 81 369 -539 -29
2645 -29 288 -410 63 276 -312 -184 573 -359 -265 249 -79 -351 417 66 -288 235 214 -432 367 207 -534
$$ packed form
2512A20O71j681J456K04j333N37O12j207M34Q05j118K34J030j225R8J197q83p44
2530g93J543j017j68R14l87o87J072j84p78J003j56j177J063K9j048R61L71q42
2548b81L06O44j145N46M16o76k68J342q65o74J265n38o39J071o37o00J271k79
2566B59q96J108k42q67J196l47o80P23L8r03P92L34q63L28O95j228N11Q40j303
2585e05J04R53n91o8O74q69n8Q73p19k64N93o2p15J109j28r25J180l06j048R55
2605A83J64q44O92K76j017L58O73q35J97N44p01R1P84q24J58O51n55k79O55m61
2625i0m38J198p14m74Q37o7q48P32K22r84P37K39q85O41L02o42L15K88r08N10
2645b9L17o98M73K13n88J28P57r32R4N14l28k72P68l51l54N23k1o46P99j60p41
$$ plain form
2666 -534 214 86 -274 175 272 -472 -1 470 -274 67 630 -286 -93 366 -369 -315 614 -237 -173 376 27
2687 27 -342 403 29 -529 314 15 -193 418 -4 -200 233 77 -502 169 130 -287 59 298 -182 96 427
2708 427 -258 -255 353 -289 -243 195 -179 -105 98 -96 5 40 -164 -336 504 -71 -431 199 172 -464 -37 257
2730 257 -355 20 320 -381 233 355 -220 179 261 -146 19 373 -262 -398 148 -108 -424 349 -52 -332
2750 -332 363 -203 -207 348 -69 -235 390 237 -118 247 287 -447 84 381 -381 -45 86 -219 -60 51 -199
2771 -199 10 113 -93 -296 179 -105 -55 339 52 -357 180 105 -169 13 183 -161 160 40 -235 264 -15
2792 -15 -498 83 101 -490 62 371 -106 -31 200 -87 72 229 24 15 233 -239 160 393 -18 -10 257 -2
2814 -2 -109 -31 102 -45 129 173 18 145 -30 -365 99 62 -213 -140 173 -342 258 -6 -199 -10 34 -285
$$ packed form
2666e34P48j28l60M49R7p44M71M71p44L41N63r16J93M59p35N4R29q51O4N49l49
2687B7l69P45l74n58Q43k99k08O11m22j96M33j56n79O71l9m17L46K39m80K78L31
2708D27o85LO08o42M6M38l74P4K03j94J01L5k04j72Q40n75l60O30k7o36M27K94
2730B57o12L75L00p01O14J22n75L99Q2m07J65L54o35j36N46k56l16P73m01k80
2750c32O95n66mN55m17j66O25j53l55L65M0p34N31K97p62L36J31l05J59J11k50
2771a99K09J03k06k03M75k84N0L94k87m09N37p5k74J82J70l44L21j20k75M99k79
2792a5m83N81J8n91N52L09m77P5K31k87J59J57k05rK18m72L99K33m11QK67k59
2814bj07P8J33j47J74M4j55J27j75l35M64l7k75P3L13n15O00k64j93J89M4l19
$$ plain form
2836 -285 64 303 -230 -94 230 -350 41 152 -146 -31 323 -61 -148 45 87 -73 171 193 -139 170 -97
2857 -97 -154 81 -67 -150 305 37 -76 -54 117 -235 -193 130 -100 51 299 -67 -144 96 -76 -278 110 -231
2879 -231 -123 157 -43 -16 282 -41 -132 219 155 -90 239 0 -81 184 -138 -49 -89 -171 -238 -331 128 -239 -18
2902 -18 139 -280 -255 90 1 76 284 -251 -129 116 -134 -213 233 93 51 -51 38 -119 -144 0 -21 211 -122
2925 -122 89 17 182 43 142 249 36 26 46 -143 -141 207 -43 202 137 -195 -84 124 -120 -189 61 83 -129
2948 -129 172 -14 -170 -97 -127 88 175 76 37 55 -41 -63 -13 218 39 103 73 23 14 -250 -120 152 238 -185 -12
2973 -12 34 59 -223 100 -235 112 130 41 14 67 255 208 129 131 95 87 158 -59 -106 25 -19 -2 38 -25 95 26 -31
3000 -31 95 179 -79 -159 -111 -118 -52 -12 -79 113 90 -140 -62 212 -244 1 231 6 -300 135 -142 -279 50 -113
$$ packed form
2836b85L49K39n33J36L24n80L91J11k98J15L54l84q7J93M2j60K44K2l32L09k67
2857i7n7K35j48q3M55k68j13K2J71l52M2L23k30J51K48l66p7K40j72k02L88l41
2879b31J08K80k00K7K98l23r1L51o4k45L29k39q1K65l22Q9m0q2o7r3M59l67K21
2902a8J57m19K5L45q9P5K08n35J22K45k50p9M46j40m2j02Q9j57k5J44k1K32l33
2925a22K11p2J65j39R9J07k13j0K0j89KL48k50K45o5l32J11K08k44o9K50K2k12
2948a29L01j86j56P3l0K15Q7r9l9J8r6k2N0K31j79O4l0n0rk64J30K72Q6m23J73
2973a2M6K5k82L23l35L47J8q9k7N3J88m7p9Kl6qP1k17m7J31m4J7M0o3J20o9n7
3000c1J26Q4k58q0M8pO6M0o7J92k3k30P8K74m56K45K30k25l06M35k77j37L29j63
$$ plain form
3024 -113 -127 261 63 169 247 42 -87 137 -52 -196 172 236 -425 106 -68 -187 -36 150 -97 -137 -19
3045 -19 -39 68 75 -111 136 -16 -172 67 60 -261 -147 13 -151 160 47 -90 -110 302 259 -257 -123 -31 -39 208
3069 208 -5 75 202 -40 -288 -96 45 113 130 34 -85 -283 113 31 -252 93 -157 108 71 -168 179 482
3091 482 -205 -36 202 -279 -274 -40 3 -267 454 20 -206 -47 8 -252 -28 -161 -100 -9 -44 -3 -156 224 -119
3114 -119 27 -1 -115 47 -201 -97 -254 21 86 -153 274 -97 -62 7 -49 -175 -21 -37 -175 149 46 -2
3136 -2 -124 189 -33 -22 10 -93 318 284 -179 57 117 -142 231 256 -105 89 207 94 -140 109 -54 -138 103
3159 103 -94 -82 -12 -356 -216 69 94 -34 226 -34 -193 126 279 -11 69 286 -318 40 193 -292 -82
3180 -82 192 -64 -39 171 -416 -227 119 291 -7 214 -110 -399 161 92 -121 -2 20 -207 117 -144 -313
$$ packed form
3024a13j4L88j98J06P8k05j29K24j89j44L68O4o61N31j74j19J51J86k47m0J18
3045a9k0J07Pj86K47j52j56K39pl21J14J60j64L11j13j37k0M12m3n16J34R2qK47
3069B08k13Q0J27k42k48J92J41O8J7r6j19j98L96q2k83L45k50K65l7k39L47L03
3091D82o87J69K38m81NK34M3k70P21m34k26J59N5k60K24j33O1R1l5M1j53L80l43
3114a19J46k8j14J62k48J04j57K75O5k39M27l71L5O9n6j26J54j6j38L24j03m8
3136bj22L13k22J1L2j03M11l4m63K36O0k59L73K5l61J94J18j13k34K49j63q4K41
3159A03j97J2P0l44J40K85K5j28K60k60j59L19J53k90Q0K17o04L58J53m85K10
3180h2K74k56K5K10n87J89L46J72k98K21l24k89N60o9k13J19K2k27L24k61j69
$$ plain form
3201 -313 -55 -56 -124 31 -22 55 -195 137 -233 13 148 -403 118 193 -106 -403 35 -239 -208 270 108 -315
3223 -315 70 -170 -203 230 286 -178 238 132 -128 110 206 -244 -69 249 -77 -72 102 -150 138 254 -83 -86
3245 -86 259 -149 -203 96 -105 -182 160 -22 -76 94 21 -203 249 -255 -274 159 110 -40 144 101 -92 49 189
3268 189 -357 118 161 -34 -38 69 -163 -223 88 -235 -133 353 -114 45 186 193 -354 178 -112 -283 56 58 -208
3291 -208 228 134 -333 100 152 -417 156 387 -490 -386 165 -41 190 192 -362 -44 317 0 -333 497 -208
3312 -208 -152 320 157 -19 328 59 -354 296 -109 -50 114 -83 -156 93 496 -328 209 284 -293 -188 323
3333 323 -8 19 400 -199 -191 519 -330 -261 332 -124 -367 227 -83 -266 571 -45 -181 371 -73 -143 341 36
3355 36 -385 237 182 -279 241 137 -149 116 181 -84 57 290 -231 -147 263 -222 -213 386 -76 -106 4 -241
$$ packed form
3201c13K58jo8J55n3P7k50L32l70K46J35n51N21P5k99k97M38k74L1M78j62m23
3223c15L85k40l3M33N6m64M16j06k60K38R6m50J75L18l26NJ74k52K88J16l37l
3245h6L45m08n4K99k01p7L42j82n4J70p3k24M52n04j9M33m9j50J84m3j93J41J40
3268A89n46M75M3j95mJ07k32o0L11l23J02M86m67J59J41Pn47N32k90j71L39Kk66
3291b08M36r4m67M33N2n69N73K31q77J04N51k06K31Kn54L18L61l17l33Q30p05
3312b08N6M72j63j76L47k69m13O50m05N9J64j97p3K49M03q24N37P5n77J05N11
3333C23l31K7L81n99QP10q49O9N93m56k43N94l10j83Q37o16j36N52m44p0M84l05
3355C6m21O22n5m61N20j04k86K65O5k65J41K33n21Q4M10m85RN99m62l0J10k45
$$ plain form
3377 -241 -180 350 37 -390 124 -85 -328 139 124 -351 138 276 -212 418 143 -434 27 183 -242 -32 304
3398 304 -207 -128 360 -257 54 187 -308 -323 492 -65 -346 552 -73 -123 378 203 -502 98 87 -243 502
3419 502 71 -395 218 147 -529 168 291 -525 -27 226 -392 6 381 -318 176 479 62 -107 490 -133
3439 -133 -332 447 -74 -174 222 -51 -372 349 -74 -230 323 131 -278 136 120 -475 143 177 4 157 533
3460 533 -536 -10 236 -417 -48 250 -76 -290 469 -335 -171 419 -55 -139 407 -143 -413 141 -195 -391
3480 -391 170 276 -408 253 61 -414 94 174 -248 56 492 -356 -57 530 -288 -182 464 -112 -1 346
3500 346 -126 -293 411 -75 -249 196 32 -335 354 -152 -239 359 -1 -362 416 219 -344 335 -47 -376
3520 -376 168 296 -508 81 327 -301 -213 406 -184 -189 346 7 -140 583 -79 -193 430 -100 -435 269 -117
$$ packed form
3377b41O1N30l13m27N14k09k43M67j5m75M89J38m88O30k75n77M61J56m25K10L36
3398C04n11P9M88o17L11J33m95j5Q15n57k81Q98o25n0N01j75p05O00j1l30P45
3419E02m31m66O13p1o76O97J23q16M98K53o18L98L75o99M94L03m17j69N97o23
3439a33j99P79n21j00L96k73l21P21m23j56N53j92m09M14j6n95O18L4j73J53L76
3460E33j069N26K46o53L69K98l26k14P59q04J64N90m74q4N46n50k70N54l36j96
3480c91N61J06o84O61j92m75N08Q0m22L04M36q48K99N87q18J06O46n76J11L47
3500C46m72j67P04m86j74M45j64l67O89n06q7N98l60l61P78j97n63O79l82l29
3520c76N44J28q04N89K46o28Q8O19n90nN35l39j47P23o62j14O23n30l35P04l86
$$ plain form
3541 -117 -315 338 157 -655 442 47 -400 17 399 -499 -68 198 -538 169 235 -76 129 382 -266 -278
3561 -278 563 -13 -396 436 -9 -484 428 -141 -540 452 -48 -277 400 32 -514 172 138 -348 276 389
3581 389 -432 -220 493 -426 -125 189 -200 22 518 -186 -283 338 -319 -118 599 -123 -145 501 -14 -353 362
3602 362 -75 -566 400 18 -332 220 102 -479 294 249 -608 157 423 -516 -24 358 -370 -91 14 -228
3622 -228 -233 511 -190 -375 428 -126 -644 148 -132 -325 562 204 -439 258 -139 -152 222 -18 -299 452 361
3643 361 -313 133 416 -443 159 441 -532 -137 427 -503 -64 515 -350 6 359 -174 -363 660 -165 -211
3663 -211 337 160 -345 506 128 -694 322 67 -614 418 337 -432 364 371 -492 37 367 -385 80 317
3683 317 -550 -326 484 -472 -91 606 -153 -260 307 -275 -399 291 -41 -237 522 -21 -401 428 113 -262
$$ packed form
3541a17j98O53j81q12J097l95m47M17L82q98M31K66p36P07O6l11K05K53o48j2
3561b78Q41n76l83Q32m45m75R12n69l99R92n00k29O77l68n46O86l4m86O24J13
3581C89q21K12P13r19L01L14l89K22M96p04r7O21o57K01P17p22k2O46n15l39P15
3602C62m37m91R66l82l50N52j18n81P73m5q57P65K66r39M92L82p28K79J05k42
3622b28nP44p01j85Q03n54n18P92k80j93Q87l58o43O97l97j3L74k40k81P51r1
3643C61o74M46K83q59O02K82r73L95N64r30M39N79q65L56L53n33j89J023q25m6
3663b11N48j77n05Q51l78q22J016k55o81J032q1p69P96Pq63N29L30p52M65K37
3683C17q67K24Q10r56L81O97p59j07N67n82j24O90l32j96P59n43l80Q29l15l75
$$ plain form
3703 -262 143 370 -404 315 308 -475 34 220 -365 -48 410 -434 -240 510 -410 -408 542 -181 -176 329 -185 -419
3725 -419 457 -227 -501 317 59 -538 593 37 -432 358 284 -542 84 239 -523 -82 366 -276 69 449
3745 449 -431 -203 487 -273 -64 538 -372 -233 698 -159 -455 715 25 -419 347 276 -555 205 203 -529 286
3766 286 358 -416 332 134 -616 -61 453 -701 90 107 -462 -26 325 -390 -29 550 -54 -362 661 -230
3786 -230 -149 331 -221 -375 382 168 -365 385 68 -451 401 27 -357 242 32 -632 56 508 -526 110
3806 110 414 -437 -125 636 -353 -44 365 -190 -214 507 -149 -246 196 -183 -230 374 102 -462 331 44 -487
3827 -487 -20 121 -290 289 326 -487 158 277 -467 36 247 -506 -255 404 -473 -276 363 -221 -341 281
3847 281 20 -334 496 -140 -384 491 71 -515 375 24 -532 212 -86 -418 196 274 -375 -3 340 -422
$$ packed form
3703b62M05K27p74P19pp83N09J86n85L17M58q44J94P50r20KR50p23NN05n14k34
3725d19Q76o84k74Q18k58n97J131n56m69P90p4q26O26J55p62M41M48o42L45L80
3745D49q80K28O90p60K09O02r10J39R31q57k96J170o90m44P66p1q31P60kp32Q15
3766B86P2p74P48j98p50N55N14j154P91J7n69M36L51p15L61N79o04l08J023q91
3786b30Q1M80n52j54P57k14n33P50l17n19Q52l74l84N99k10o64O88M52j034O36
3806A10L04q51L12P61r89L09M09n55k4P21o56r7M42l79m7O04k72n64P93k87n31
3827d87M67J41m11N79L7q13O45J19p44N03K11p53K51O59q77J97O39n84j20O22
3847B81k61l54Q30o36k44Q75m20n86Q90l51n56P44k98l32O14P8o49L72L43p62
$$ plain form
3867 -422 102 450 -529 150 361 -257 -53 641 -267 -146 662 -126 -310 573 -436 -452 157 -80 -392 384
3887 384 302 -455 402 45 -514 209 255 -438 221 274 -447 76 412 -526 69 471 -357 -359 456 -133 -96 476
3909 476 -221 -271 305 -40 -514 352 -117 -198 220 51 -489 671 54 -250 221 215 -491 -92 235 -247 -292
3930 -292 200 -374 8 712 -499 136 290 -327 -293 439 -294 -199 563 -236 -268 519 400 -301 528 155 -481
3951 -481 346 222 -511 291 184 -136 261 103 -337 -60 405 -579 -115 538 -283 -242 550 -397 -300 318 -289
3972 -289 -292 476 -294 -388 334 -68 -356 367 127 -406 516 -133 -448 165 243 -407 136 157 -617 -180 468 -360
3994 -360 -53 478 -386 -100 544 -396 -167 446 -242 -198 297 -347 -468 595 -79 -398 356 240 -380 255
4014 255 -16 -305 103 122 -537 48 368 -436 68 247 -419 120 297 -374 12 521 -165 -107 635 128 -224
$$ packed form
3867d22N24L48r79O79K11o18K04O94r08J21Q08p88j84Q83j009j6O09k37l12P76
3887C84q2p57Q57l57n59P23M6o93O59N3p21N23L36r38N95M02q28kQ15n89L7N72
3909D76o97n0N76l45m74Q66m69q1M18j69n40J160o17l04M71op06L99L27m82m5
3930b92M92n74L82P04j211O35J54o17L4P32p33R5P62p99l2P87j19p01Q29l73o36
3951d81Q27j24p33Q02j07l20L97j58m40K77M65r84M64O53q21M1P92r47R7O18o07
3972b89lP68p70r4P22m02k88P23k40n33R22o49l15O13P8o50N43K1p74M37O48q28
3994c60L07N31q64K86O44r40K29O13o88M4M95o44j21J063o74l19P54j16o20O35
4014B55k71k89M08J9o59N85L20q04N04J79o66N39J77o71L86N09o86N8P42n07l52
$$ plain form
4035 -224 390 -216 -317 454 -11 -294 341 38 -485 440 291 -342 242 455 -453 136 258 -556 386 239
4055 239 -206 -83 506 -142 -266 571 -184 -131 337 10 -57 475 -199 -434 500 -140 -147 327 77 -413 295
4076 295 -28 -503 170 4 -434 174 228 -406 -87 517 -418 25 472 -532 -1 647 -118 -258 294 -39
4096 -39 -236 246 -306 -247 665 102 -597 373 -12 -443 147 110 -492 273 239 -438 91 418 -291 25 488
4117 488 -272 -76 465 -585 -161 593 -553 -105 477 -182 37 428 -90 -280 79 29 -383 636 -81
4136 -81 -496 360 100 -354 369 214 -428 -33 217 -508 69 447 -218 -42 316 -229 -58 345 -175 -45
4156 -45 291 -203 -133 298 -150 -434 264 -11 -412 256 53 -280 168 9 -320 249 221 -491 50 -90 -444
4177 -444 143 511 -262 -163 292 -272 -20 135 -286 -193 385 -141 -242 458 -98 -530 467 -146 -312 263 477
$$ packed form
4035b24O14o06j01P71m65k83O35l03n23R25j49o33N84K13r08N89J22q14R42j47
4055B39m45J23N89o48j24Q37p55N3M68l27o7N32o74k35R34o40pM74k50m90P08
4076B95l23m75O73j66m38O08N4o34L19O04r35M43M47j004N31O48p65j40N52l33
4096c9j97M82n52N9R12n63o99R70l85m31N90l7o02P65l4o77N29L27p09L16M63
4117D88p60J96N41j050M24P54j146M48N82o59K19L91n18j90L59n0m12J019p17
4136h1m15Q56k60m54P23j55o42L95K50p25N77L78o65J76L58n45J71M03n20J30
4156d5L36m94P0M31m48k84O98k75m01O68k03l33M48j59l29N69k8p12N41j40l54
4177d44N87L68p73R9M55n64K52J55m21R3N78n26j01P00n56m32R97o13j66N75K14
$$ plain form
4198 477 -106 361 98 -421 385 428 -21 86 431 -461 57 301 -128 74 246 -264 -109 270 -173 -200 363
4219 363 -67 -57 202 47 -219 256 87 -409 358 -199 -370 473 57 -247 155 81 -457 89 152 -327 -148
4240 -148 326 -226 -9 328 -535 85 505 -118 -272 432 -249 -1 518 11 -388 208 5 -378 356 2
4260 2 -229 500 213 -500 -22 390 -592 269 211 -475 -86 138 -475 19 245 -231 -74 471 -297 -290 461 -245
4282 -245 -255 182 -145 -393 345 97 -178 274 64 -369 294 2 -374 274 227 -434 87 246 -164 -56 322
4303 322 -195 -6 426 -361 -88 446 -326 100 213 -208 -197 171 103 -378 188 51 -276 312 168 -446 408
4324 408 194 -644 410 -82 -323 -135 367 -391 105 457 -172 -34 305 -171 -73 326 -372 38 472 107
4344 107 -202 184 -100 -74 184 -107 -383 318 43 -434 223 96 -405 326 161 -265 155 319 -377 228
$$ packed form
4198D77n83M67k63n19Q06M3m49J07L45q92N18K44m29K02J72n10J55L79m43k7N63
4219C63m30J0K59j55k66M75j69m96P67n57j71Q43m16l04M02p4n38N46O3m79J79
4240a48M74n52K17L37q63O20M20o23j54P04o81K48N19n07l99N96k03l83P34l54
4260Bk31P29k87p13M78M12r82Q61n8o86L89K24o13M94K26m76J57N45p68PP51p06
4282b45j0M37l27k48P38k48k75M52k10m33O63k92l76O48m7o61N21J59m10J08L78
4303C22n17J89M32p87K73N34p72M26J13m21J1L68o8m81N66j37l27N88j44o14Q54
4324D08k14q38J054m92k41J88N02p58M96L52o29J38L39m76R8L99o98M10M34l65
4344A07l09L86k84K6K58k91k76P01k75m77O57j27n01P31j65m26M20J64o96O05
$$ plain form
4364 228 244 -500 -83 244 -133 168 295 -325 -418 256 -228 -372 337 -258 -207 205 78 -176 352 174 -146
4385 -146 229 -94 -478 330 262 -438 10 -73 -493 214 331 -230 -60 299 -92 -25 426 -272 -243 435 -231
4406 -231 -186 381 -344 -585 363 -52 -205 83 4 -432 269 238 -473 264 153 -182 3 177 -331 223 431
4427 431 -400 -75 511 -469 -20 280 -274 -128 399 -251 -57 372 -79 -2 81 -11 -383 453 292 -368 -46
4448 -46 -42 -239 126 202 -258 431 448 -270 -21 354 -444 -279 391 -284 29 485 -278 -120 507 -14 -287 265
4470 265 -229 -459 157 77 -352 229 -126 -370 226 49 -424 189 -56 -460 99 317 -441 -88 195 -412
4490 -412 -146 238 -271 -70 422 -62 -167 261 -125 -114 381 -134 -255 451 102 -229 154 176 -506 143 253
4511 253 -542 314 178 -497 129 33 -206 -35 244 -287 86 358 -464 0 277 -108 -272 307 -98 -247
$$ packed form
4364B28J6p44M17L27l77L01J27o20r3O74m84j44P09n95N1M12j27k54N28j78l20
4385a46L75l23l84Q08o8p00M48q3m20P07J17n61J70L59l91O7M51o98K9O78o66
4406b31M5N67p25k41R48m15j53K88p9m36P01l1p11P37j11l35J85J74n08N54K08
4427D31q31L25N86r80M49L00n54J46N27o50J94M29m51P7Q3r2l72Q36j61o60L22
4448d6Mj97L65P6m60O89J7p18K49L75p98J65O70o75L13M56p63J58O27n21k73N52
4470B65m94k30O16q0m29N81l55k44N96j77m73O13k45m04N59K18p58L53K83o07
4490d12K66L84n09K01M92m84j05M28l86J1M95n15j21P06l49l31L83K2o82O49J10
4511B53p95Q56j36o75O26r6k39J71K79n31L73K72q22M64K77l85j64N79m05j49
$$ plain form
4531 -247 424 109 -243 412 89 -229 191 124 -273 318 299 -498 204 415 -364 246 253 -356 70 326 -261
4552 -261 -91 479 -132 -166 456 -277 -211 320 6 -498 385 -29 -202 213 -63 -424 -55 -52 -164 89 139 -388
4574 -388 76 98 -253 -90 290 -452 2 575 -576 -71 258 -414 -381 450 -139 -89 379 -36 -342 277 -151
4595 -151 -367 351 -77 -189 325 -62 -459 187 76 -297 124 310 -198 299 289 -618 145 303 -232 150
4615 150 350 -404 -145 371 -51 -230 130 -237 -249 232 -405 -52 479 133 -134 73 -62 -416 139 120 -375
4636 -375 235 190 -348 52 274 -111 87 295 -396 98 531 -579 -24 416 -220 -14 190 -349 -87 165
4656 165 -316 -420 444 -52 -336 123 -108 -497 334 139 -499 37 171 -487 159 169 -487 218 213 -322 128
4677 128 349 -280 -72 526 31 -33 410 -162 -70 555 -180 -330 512 248 -234 371 13 -416 255 81 -303
$$ packed form
4531b47O71l15l52O55l23l18M20o7l97N91j9p97P02K11p79O10Po09M26K56n87
4552b61J70N70o11l4O22p33O6N31l14n04Q83m14j73M15k76l61L69Lj12K53N0n27
4574c88M64K2l51J63L80p42M54N73j151N05L29o72L3Q31n89N0M68m15l06O19m28
4595a51k16P18m28j12N14l87l97O46j11l73M21J86n08M97j0r07P63J58n35L82
4615A50K00p54K59N16m22j79L60l67j2M81o37L53N31l46k67K07j35l54N55j9m95
4636c75O10m5n38M00K22l85J98K08o91M94M33j110N55M40o36K06K04n39K62K52
4656A65m81j04Q64m96k84M59k31l89Q31j95o38N36J34o58O46J0o56P05nn35M50
4677A28K21o29K08N98m95o4M43n72R2O25p35j50Q42k64m82O05l58m29O71j74l84
$$ plain form
4698 -303 253 400 -360 408 18 -282 124 371 -264 -57 204 -429 107 369 -226 30 598 -213 -142 272
4718 272 -62 -192 395 7 -375 402 82 -296 322 260 -578 129 312 -354 65 418 -539 -102 364 -354
4738 -354 -131 377 -59 -107 324 -70 -409 583 -65 -342 399 126 -361 456 5 -551 373 -29 -249 300
4758 300 -107 -290 137 166 -466 285 289 -327 106 96 -558 155 452 -333 -230 338 12 -35 438 -212 -354 455
4780 455 -222 -175 300 231 -66 303 21 -474 150 -30 -370 237 -73 -312 263 254 -375 190 224 -249 50 250
4802 250 -156 -129 502 -370 -252 68 -317 -191 275 -301 -367 314 -2 -573 155 166 -450 323 199 -193 285
4823 285 147 -311 240 130 -232 -136 404 -135 75 541 -170 -289 699 -300 -167 288 -80 -142 311 -216 -201
4844 -201 121 100 -318 257 -84 -350 154 203 -286 339 281 -235 105 184 -211 -30 218 -133 151 274 -145
$$ packed form
4698c03N56J47p60P68l90l00M06K47o35K07K61o33N36K62n95K56N68q11P1M14
4718B72l34j30N87l88l82P77l20l78O18o2q38P07J83o66M19L53r57M37M66p18
4738c54K23N08m36m8M31l94l39R92o48k77P41k73m87Q17m51n56R24m02k20N49
4758C00m07j83M27K9o32P51Mo16M33j0o54P13K97p85J03N68l26m7M73o50j42Q09
4780D55o77M7M75o9k97L69k82m95O24j80l40O07l10k39N75ro29N65L4m73K99K00
4802B50m06K7O31q72J18L20l85J26M66n76o6O81l16n71P28J1o16P73j24l92M78
4823B85j38m58N51j10l62R6N40n39K10M66p11j19R88r99J33M55l68o2M53n27J5
4844b01L22k1m18N75l41k66N04M9m89O25n8n16L40P9l95J81K48l51K84J23m19
$$ plain form
4865 -145 -136 216 -282 -128 383 -141 -284 386 -276 -371 262 69 -164 179 -86 -478 241 231 -320 305 166
4886 166 -397 153 582 -388 142 277 -227 66 204 -200 -224 311 -316 -170 367 -156 -250 627 -62 -289 296
4907 296 -191 -326 235 5 -401 164 7 -503 70 276 -379 127 179 -238 188 341 -271 5 416 -257
4927 -257 195 289 -141 -191 174 -110 -299 39 -58 -269 220 -50 -267 46 113 -297 162 168 -545 146 101 -312
4949 -312 -116 277 -177 -9 293 -272 -17 122 -202 -112 293 -118 -359 270 -262 -145 329 82 -234 528
4969 528 -198 -280 167 93 -303 205 189 -494 3 158 -219 174 393 -282 241 68 -123 -9 356 -114 -242
4990 -242 231 -65 -33 193 56 -307 163 -186 -189 185 -94 -176 322 -7 -182 249 -58 -123 177 209 -289 -7
5012 -7 148 -68 -15 252 -95 6 213 -133 -50 487 -249 -279 376 -79 -203 266 252 -188 86 140 -194 178
$$ packed form
4865a45RL52m98J54N11n24j43O70o62r5O33j93k33L43k65l92P19j0n51O25j39
4886A66n63N50M29r70N30J35n04K93J38m04k4N35o27J46N37n23r4Q77o89k27N85
4907B96m87j35N61k30m06N65j57n10N73K06o55N06N2m17M26J53o12K76M11o73
4927b57M52R4m30n0L65k84j89L38r7k11M89k70k17L13O7m10M59Op13O91m5m13
4949c12J96L93m54J68L02n65K55J39l24R0M05m11k41O29n32J17M74k47l16P62
4969E28p26q2M47p4l96N08j6o83M97J55l77L93K19o75N23j73j91J14L65m70j28
4990b42M73k96L2K26j37l63M70l49lL74k79q2M98l29j75M31l07o5L00L2m98K82
5012gJ55k16N3K67l47J01K07l46Q3N37p36l0O55m55j24M69j4m40K74N4l34L72
$$ plain form
5034 178 -251 -203 263 -141 -443 127 417 -106 -8 87 -215 164 105 -215 -71 271 -96 34 289 -70 -123 306
5056 306 -203 -372 325 -297 -232 181 22 -222 140 211 -77 387 299 -373 203 34 47 115 143 -137 -201 328
5078 328 -147 -36 310 19 -364 391 129 -104 200 9 -109 220 160 -185 326 72 -110 232 -10 -319
5098 -319 334 -27 -182 -148 332 -208 -106 216 -238 -37 200 -23 90 163 -327 21 16 -399 -101 241 -191
5119 -191 -64 269 -36 -321 75 181 -176 116 -99 -328 247 -31 -184 -99 479 -215 137 282 -147 -128 103
5140 103 41 -91 207 -56 -259 87 -15 -90 203 -261 -247 260 87 -185 397 275 -378 152 206 -112 0
5161 0 122 -383 156 247 -189 374 102 -85 -73 70 -212 -62 -3 77 -21 338 -25 -9 162 -189 -394 240 -180
5184 -180 -201 224 -125 -10 195 -111 -132 174 205 165 173 367 -363 -8 234 -290 -41 175 -98 -336 70 -144
$$ packed form
5034A78m29M8M66m04l02N70K90n23R8R5l02L79n9l20J44L42l67J30K55l59n3M29
5056C06n09j69O97o22O5M13j59k44L62P1k88M64q8o72N76j69J3O8K8k80o4N29
5078C28m75J11L46k91l83P55k62k33L04j91j18L29o0l45N11k54j82L42k42l09
5098c19O53l61j55L4M80n40J02L22m54K01K37k23J13P3m90L48nm15K98L42m32
5119a91J27L33l05k85L96J06l57K92k15k29N75k78j53Q5N78o94L52J45m29J9K31
5140A03o2j32K98k63k03L46j02p5K93m64J4N07j73k72N82j22o53N30N4l18J12
5161@J22n05N39R1m36N63k72j87J2J43k82J50N9Q0r8L59l63J6J71l51k05O34m20
5184a80k1M25l49J15K05l06k1L06L1m0QJ94p30L55K42n24K49K16k73k38M06k14
$$ plain form
5206 -144 -324 192 -118 -61 230 -260 -30 28 -135 -297 193 16 -234 155 -61 112 158 135 -305 17 0 -217
5228 -217 92 141 -204 68 245 -303 -90 185 -184 -338 21 4 -164 103 97 -184 302 -82 -363 230 -181
5249 -181 -137 147 115 -135 184 6 -346 -19 185 -88 65 205 -69 -188 87 1 -280 117 34 -230 210
5270 210 168 -415 51 -138 -212 -4 43 -158 21 -4 154 335 -80 7 176 -16 -232 266 153 -227 -32 228
5292 228 18 196 171 -251 131 234 -34 -103 91 -274 -95 7 20 88 -190 49 -114 43 -101 -308 209
5313 209 164 -87 -2 -37 -389 51 124 -258 233 205 -137 -31 101 -219 -339 237 -179 -30 328 -135 -176 153
5335 153 -47 54 53 6 -126 282 -60 -216 261 224 -127 67 107 -154 -51 97 -126 4 127 -214 -157 0
5357 0 -167 -76 320 -212 -137 246 -257 -86 244 -15 -298 190 -138 -79 89 -98 -81 16 219 -226 61 166
$$ packed form
5206a44j80N16l10N7K91m90K30N8j63j62M90j77k50L89k16J73M6k3m40L22j7k17
5228b17L09M9l45K72J77n48K13K75l69j54L59j7j68K67ok81M86l84k81N93m11
5249a81M4K84l2k50L19j78l52L27K04k73J53J40k74j19K75q6k81L97q3k64M40
5270B10m2n83M66j89p4K08M7k01J79k5J58J81m15Q7J69j92k16M98j13l80J95K60
5292B28k10J78k5m22L82J03k68o9J94l65J79J02J3O8k78K39j63J57j44k07N17
5313B09m5k51Q5l5l52M40P3l82M91k8l42J06J32l20j20N76m16J49L58m63m1L29
5335A53k00J01jm7j32M08l42j56M77l7l51J94M0k61J03J48k23J30J23l41N7J57
5357@j67R1L96n32P5L83n03J71L30k59k83M88l28N9J68j87J7R7K03m45K87J05
$$ plain form
5379 166 -56 137 274 -242 18 205 -224 81 82 -348 -32 155 -53 160 366 -100 15 162 110 -73 30
5400 30 71 50 90 12 -149 85 13 -165 -180 -25 -121 -52 48 -62 -44 190 -252 -123 -119 171 68 363 -22 -106
5424 -106 111 -90 214 81 78 -184 1 -49 -242 28 91 -268 -95 22 -174 35 158 -156 30 530 -84
5445 -84 111 -13 -169 207 179 112 72 317 54 -123 363 -27 -15 168 -57 -76 -92 22 -168 85 -6 -8 55 60
5469 60 -250 -24 61 -235 7 123 -198 -198 289 -174 193 64 -135 89 330 26 47 226 116 52 29 13 -356
5492 -356 175 280 43 243 73 -178 -30 147 -152 11 214 -59 -112 134 -136 -185 267 48 -30 281 -73
5513 -73 -252 189 -187 23 115 -108 -143 107 37 -311 -101 45 15 75 97 -201 -102 38 -266 -234 9 -177 -121
5536 -121 74 -257 -120 35 -119 56 125 -207 -20 112 -101 -23 179 -224 -282 -8 0 -191 168 35 -64 251
$$ packed form
5379A66k22J93J37n16K60J87m29L05Jm30L16J87k08K13K06m66J15J47n2j83J03
5400C0M1k1M0p8j61K34p2j78j5J55r6O9J00j10J8K34m42J29MK90j03K95l85q4
5424a06K17k01L04j33lk62J85n0j93K70O3l59J73J17j96K09J23l14J86N00o14
5445h4J95j24j56L76k8o7m0K45k63j77M86l90J2J83k25j9j6J14j90K53r1kO3N
5469F0l10K26Q5k96K42J16l21%M87m63L67j29j99K24K41l04K1J79j10o4k3j6l69
5492c56N31J05k37K00j70k51J48J77k99J63K03k73n3K46k70m9M52k19p8L11l54
5513g3j79M41l76K10R2k23l5K50p0l48K10J46l0O0K2k98R9J40l04L2K43j86N6
5536a21J95l31J37J55j54J75O9l32J87J32k13P8K02m03n8K74Qj91L59j33r9L15
$$ plain form
5558 251 184 -224 280 78 79 0 73 47 -349 190 -115 -30 -27 26 -111 122 -38 -62 163 -98 -129 266 -156 -167
5582 -167 -19 -72 54 58 -172 -19 104 34 -87 104 -38 -101 122 87 46 -131 210 129 -149 92 -278 9 157
5605 157 -102 -128 116 -241 -201 322 51 98 -57 -293 -12 188 -21 -193 14 -26 64 -77 -90 -170 118 -62
5627 -62 91 115 -38 -88 -146 328 -384 -161 167 20 9 253 32 68 113 19 -167 163 232 -31 29 171 -201
5650 -201 -24 -29 -251 20 128 -318 122 67 69 -164 -76 148 -33 112 -290 -237 -132 48 151 202 -102 -116 172
5673 172 221 -234 95 141 -276 122 20 155 134 32 -17 188 70 -160 -179 98 -142 13 268 28 79 306
5695 306 -251 -116 -60 -230 126 -5 149 -211 273 -12 4 14 65 -116 106 89 -67 232 -71 -21 -384 171
5717 171 92 120 278 -58 70 19 81 -205 179 157 -71 156 -235 -264 -56 -313 -68 44 29 -178 452 -141
$$ packed form
5558B51o7m08N04k02Jp9P3k6l96N39l05Q5LN3j37K33j60k4K25k61l1L95m22j1
5582a67J48n3J26Mk30J53J23p0j21J91j42o3K23l5m1j77L41q1k78K41l70K87J48
5605A57k59k6K44l57M0N23k71M7j55k36K81K00k09j72K07m0R0j41j3q0K88j80
5627f2J53K4j53n0n8M74p12K23L28j47j1K44k21L6M5r4j86L30O9k63O0J42l72
5650b01J77nk22K71J08m46M40n5Kk33Q8K24j81J45m02N3J05J80J03N1l04j4K88
5673A72M9m55L29M6m17L98j02J35k1j02m9K05j18k30j9K77k40J55K55k40N1K27
5695C06n57J35N6j70L56j31J54l60M84k85J6J0N1j81K22j7j56K99l03N0l63N55
5717A71p9K8J58l36J28n1O2k86L84k2k28K27l91k9K08k57K45J12j5k07O30n93
$$ plain form
5739 -141 -140 214 196 -6 -4 15 -162 30 263 17 -37 40 146 -120 -165 -80 12 160 74 -49 -20 -47 -240 30 40
5764 40 -307 -19 197 -164 -60 -12 -166 -18 15 36 54 55 15 -20 80 -91 -18 204 28 -114 237 64 47 47
5788 47 -145 17 210 -62 -287 377 -90 -132 58 131 -102 -164 371 -224 91 114 -4 71 88 111 -134 71 -260
5811 -260 -253 97 -125 71 70 -79 -308 112 -115 25 -101 119 -172 265 146 -2 -6 -67 -199 -53 27 196 219
5834 219 235 147 17 322 -97 -59 56 -223 -209 323 -93 39 137 62 -63 331 311 121 110 -117 -42 97 -7
5857 -7 -3 312 -110 -170 42 210 -184 -66 81 -93 141 88 3 39 117 13 -280 117 155 3 -74 69 85 104
5881 104 -96 -66 69 -4 -307 -267 33 -203 228 345 -91 251 15 -139 17 85 -141 62 1 -278 3 260
5903 260 68 -43 169 14 8 10 -113 -107 -30 -139 -156 -52 -34 88 283 269 80 30 -201 -152 95 355 -237 290
$$ packed form
5739a41JL54j8k02KJ9j77J92K33k46n4P7J06k66m5Q5R2J48q6j23K9k7j93K70J0
5764D0l47K88K16l61J04M8j54J48L3K1J8Jm0l5J00j71P3K22j76j42L51j73j7%
5788D7j92J62J93k72k25O64m67m2J90P3k33o2N35n95L15K3j18P5J7K3k45K05l31
5811b60PL50k22J96jj49k29M20k27J40j26K20k91M37j19j48mo1j32J46Q0J69K3
5834B19J6q8j30L05m19L8J15k79J4N32m16J32R8p5j25L94k0j90j1k27P5J39j04
5857gML15m22o0K12J68l94J18J47j74K34n3q5L6P8j04k93L97L8j52p7J43J6J9
5881A04k00L0J35p3l03M0L00k36M31J17m36L42k36j54J56O8k26K03o1k79K81K57
5903B60j92j11K12j55oKj23OP7j09j7J04J8J22J95j4j89n0k31M9K47K60n92N27
$$ plain form
5927 290 39 -188 52 -18 -233 -38 -30 -236 51 38 -152 -15 292 34 -22 220 67 -344 118 -3 165 112
5949 112 -140 -175 25 -95 -72 74 -104 -65 -70 152 160 -126 -176 11 76 86 -1 65 74 -19 302 183 27 196 484
5974 484 194 -101 93 -206 268 268 -201 46 160 -158 -16 19 221 -181 77 -94 -414 -137 145 85 -244
5995 -244 -34 7 -124 130 68 -174 -2 22 183 144 50 -244 150 -153 -75 87 -98 5 -5 28 -99 -12 -168
6018 -168 30 15 -20 -266 61 -195 139 39 191 -208 -76 189 4 103 -148 -38 -85 113 22 -113 65 47
6040 47 39 290 165 -249 113 179 -133 -48 179 -185 85 98 -56 -20 229 -236 -63 354 -179 144 154 -1 186
6063 186 3 -314 -178 33 91 -189 -7 -112 29 -186 -1 -191 192 -9 -74 -13 92 -219 284 -35 -106
6084 -106 109 -76 11 138 153 -238 -331 161 102 36 236 -87 125 -21 49 -80 106 -32 12 -60 45 -343 -265
$$ packed form
5927B90k51k27K40p0k15J95Qk06K87j3j90J37L07k58n6K42j53m11M62j21J68n3
5949A12k52l5K00j20K3J46j78L9nK22Qk86n0J87O5J0q7O6Rr3L21j19j56J69K88
5974D84k90k95J94k99M74%m69K47J14l18J42L5K02m02K58j71l20K77K82o0l29
5995b44K10M1j31K54o2k42J72K4J61l9r4k94L94l03P8J62j85J03j0L3j27Q7j56
6018a68J98j5l5k46L27k56L34j00J52l99J32K65j85R9k51J10m7J98r1j35J78j8
6040D7qK51j25m14L62O6l12Q5K27l64K70J3j54L6K49m65J73M17n33L23J0j55J87
6063A86j83l17J36K11N8k80J82j05J41k15J85j90L83k01o5O1J05l11N03l19p1
6084a06K15j85Q7J27J5l91r3M92n9o6K00l23K12j46P0j29J86j38M4p2J05l88P8
$$ plain form
6107 -265 32 -190 77 176 -29 110 125 -152 141 1 -80 -58 73 -101 -138 -50 97 87 -220 28 -195 -69
6129 -69 2 84 -30 -8 16 80 -53 -58 7 -119 -8 -36 101 -249 29 136 -40 -49 88 -132 -188 80 -76 -137 -213
6154 -213 -3 52 155 112 -274 173 215 -98 152 48 -99 179 -127 -69 -65 22 -21 -340 -169 -103 169 -14 61
6177 61 -33 -93 -30 -37 25 -185 -42 214 -403 103 192 -19 38 98 -148 -236 326 -6 -328 158 86 -246 41 -191
6201 -191 -50 -62 -159 98 -38 14 84 -1 -47 121 -141 -191 -113 -164 -156 69 -74 94 -232 -153 120 -77 -121 360
6225 360 -86 -259 85 49 -230 -62 107 -120 -95 -12 -96 113 297 -160 -238 257 -119 -115 -140 -77 140 110 61 -73
6249 -73 82 65 -26 70 -98 -212 -20 77 -66 81 252 29 153 38 -177 24 -150 -92 18 20 -16 151 -72
6272 -72 -136 -42 128 -34 -103 2 -71 -105 -53 43 -175 65 -83 -75 47 120 -122 98 46 -252 20 253 -23 15
$$ packed form
6107b65K97k22K67R9k05J39J5k77K93j40q1K2J31j74l7Q8J47j0l07K48k23J26
6129f9P1Q2j14K2K4O4j33nO5j26J11k8J37l50K78J07j76rJ37k20n6K68j56o1p6
6154b13K10N5J03m3l86M47M2l13K50j04j47K78l06N8MQ7m3l19J71O6K72j83P5
6177F1r4o0O3pO2k10J43K56o17N06Q9k11N7O0k46q8N62l32l22M86p2l32K87k32
6201a91J41j2r7K57j36N2P0q5m6J68k62n0P8n1QK25j43J68l26P9K73j97m4M81
6225C60m46j73L44l6k79J68J69k27K5Q3q4K09J84m57p8M95l76Mk5O3K17l0m9j34
6249g3J55j7r1R6j68j14J92R7j43J47J71k23J24j15k15K01j74N8J10Kl6J67k23
6272g2o4R4J70j62o9J05p3l4N2R6k18K40j48QJ22P3k42K20n2k98K72K33k76L8
$$ plain form
6296 15 297 -215 -98 21 -15 -87 64 24 -40 2 -214 -62 60 153 -26 64 88 138 112 209 -151 31 20 128
6320 128 -101 41 243 -3 -69 -222 -71 13 -125 -85 -16 -58 -271 23 -118 -23 48 24 -149 -18 2 -130 151
6343 151 130 -224 101 -79 -223 -23 111 40 -35 -20 -195 138 -44 212 -94 80 -154 -26 -34 -167 19 -54
6365 -54 -357 -159 356 -165 -85 108 -180 -373 -9 -190 10 -8 140 -273 -58 -101 56 33 138 -21 276 -237
6387 -237 86 58 84 -268 6 73 147 -203 125 -131 -165 -14 -364 -88 4 -167 -279 -124 -180 -82 -196 35 237
6410 237 61 230 -63 -10 133 -95 -5 61 -88 0 -4 -20 74 313 -461 -116 126 66 -115 351 9 122 279
6433 279 -149 -202 142 130 -257 295 -196 -9 -15 246 3 216 7 21 39 -35 164 -43 49 29 -112 211 -100
6456 -100 41 111 -111 -145 131 -80 214 -251 96 42 -56 56 53 77 191 -9 340 248 -354 164 -76 -40 -101
$$ packed form
6296A5K82n12J17J19l6p2J51m0o4M2k16J52J22R3j79R0K4N0k6R7l60J82j1J08
6320A28k29J42K02k46o6j53J51Q4j38M0O9m2k13K94j41R5P1k4j73J31K0j32K81
6343A51k1l54L25j80j44K00J34p1p5J5j75L33j82K56l06J74k34J28qj33J86p3
6365e4l03J98N15n21Q0J93k88j93L64j81K00j8J48m13K15m3J57k3J05j59K97n13
6387b37L23k8K6l52K74O7P4l50L28k56l4J51l50K76R2j71j12J55n6R8j14K31K02
6410B37j76J69k93N3J43k28R0O6j49Q8mj6R4K39p74L45K42o0j81M66l42J13J57
6433B79m28n3L44j2l87N52m91J87oK61k43K13k09J4J8p4J99k07R2k0j41L23l11
6456a00J41P0k22l4K76k11K94m65L47n4r8J12lK4J14k00L49r2o02N18k40L6o1
$$ plain form
6479 -101 -48 -226 -48 53 -222 77 -64 -132 105 16 -204 99 101 -3 64 189 -275 -154 51 -11 -42 103 -59
6502 -59 -133 16 190 -82 14 67 -156 19 111 -9 104 -62 -214 -112 252 46 -15 407 -73 -136 25 -187
6524 -187 71 211 -208 72 -36 -118 68 -98 109 -21 46 -18 -21 84 3 -171 -128 68 -135 182 -60 -39 -128
6547 -128 90 122 -142 37 -92 -44 205 29 -37 50 -249 71 -68 -121 51 9 -51 -108 96 3 -181 37 -179
6570 -179 43 -172 179 -236 31 205 284 115 101 -16 -204 267 -144 82 109 -76 77 218 185 -117 167
6591 167 56 -89 131 45 -6 -72 31 171 20 -75 -364 7 30 -183 187 3 -54 117 77 -20 -72 48 165
6614 165 32 90 -77 -28 156 -279 53 -78 68 -63 28 -95 -124 233 41 25 69 -204 -142 199 -135 45
6636 45 9 55 -145 -30 -128 -123 -179 76 -67 26 101 -297 6 73 95 -66 171 -61 -4 306 -174 -433 -94 -183
$$ packed form
6479a01N3j78J78J01k75K99j41o8K37q9k20L03Kj04O7J25m64J21K05o2l1J45j62
6502e9p4J49J74k72R6N3k23J75R2j20J13j66j52J02L64k06o1M22m80o3J61k12
6524a87K58J40m19K80j08q2J86j66K07j30O7o4lJ05q1j74M3J96k03L17k42K1q9
6547a28K18L2k64J79j29M8K49j76o6Q7k99L20j39n3J72m2o0n7K04r3j84K18k16
6570a79K22k15L51m15K67J74P9j69j4j17j88M71m11K26K7j85J53J41l3l02K84
6591A67j11j45K20q6n1o6J03J40j51r5k89L71K3k13L70j84n7J71m0r7n2J20J17
6614A65j33N8j67M9J84m35L32j31J46j31R1j23k9L57j92j6M4k73O2L41l34J80
6636D5l6M6k00J15r8Nn6K55j43R3P5l98L03O7K2j61K37k32N7L10m80k59L39q9
$$ plain form
6660 -183 85 -58 147 30 -78 -28 -102 -48 -136 76 -25 -34 193 -3 48 -8 -209 -73 61 -55 32 93 -61
6683 -61 -54 230 80 160 -1 -210 -81 -240 143 -31 83 -93 44 12 -346 103 -61 70 -2 335 51 -157
6705 -157 -8 -27 -57 -51 -205 -253 -144 -59 -177 -28 115 -8 216 216 -185 -44 -15 -43 -9 -34 117 -152 190 -267
6729 -267 -71 62 -5 95 -178 -42 108 149 -51 -257 -58 -164 281 -14 211 -36 -19 -153 174 146 -172
6750 -172 -160 -139 -23 -78 176 -265 -34 -86 -42 -5 14 -112 71 38 60 71 -34 102 179 -130 133 -233 -21 230
6774 230 55 16 -16 105 10 1 -11 129 94 -33 -46 69 -141 -226 -38 18 62 -302 -10 115 -92 49 -120 68
6798 68 284 49 -82 39 -79 -182 -194 -37 -100 -73 -80 160 95 -109 -90 -6 35 -154 -25 -56 -55 -150 38 -54 -82
6823 -82 295 -23 -102 -289 180 -145 10 -93 52 92 100 -18 -30 -9 -32 81 -16 79 85 -104 35 -213 -171 91
$$ packed form
6660a83K68j43K05j17j08N0p4N4q8K12j01rK27j96N1n6k01J36J34j16Q7O1j54
6683f1PK84j50Q0j61k09J29j59L83j74J14j76J37l2l58M49j64J31p2L37k84k08
6705a57J49j9l0Oj54m8J09Q5j18J49J43j23K24%m01J41K9k8L4k5J51k69L42m57
6729b67J96J33o7J00k73J36J50M1k00k06J99j06M45k95K25k47J7j34L27k8l18
6750a72J2K1J16n5K54m41K31n2M4L7J9j26J83l3K2J1j05J36P7l09K63l66K12K51
6774B30j75l9l2J21r5rj2J40l5j27j3J15k10q5J88N6M4l64K92J25k07J41j69J88
6798F8K16k35j31J21j18j03j2J57o3K7pK40o5k04J9Q4M1j89J29l1Jr5J88r2k8
6823h2L77l18p9j87M69l25J55j03J45M0Qj18j2K1k3J13r7R5Oj89J39k48M2K62
$$ plain form
6847 91 127 75 2 323 4 -24 -45 26 81 17 1 41 217 117 -85 16 127 35 -177 -36 50 63 83 -79 52
6872 52 40 3 -137 -63 -222 -274 63 -20 98 -176 -205 54 -99 -11 16 76 19 60 90 -150 0 121 -163 48
6896 48 -145 185 28 11 141 -153 43 -139 -54 -106 -124 -163 -152 -217 32 -61 103 -72 107 4 -55 229 82
6919 82 17 -88 129 213 -130 -149 -206 281 218 55 -63 -120 -34 9 -6 100 -149 70 122 -12 271 9 -182 18
6943 18 49 39 17 90 -32 -59 -133 56 20 -208 -108 203 -49 -52 -96 -76 -72 -14 67 -150 -136 175 -105 180 188 119 105
6970 105 165 -83 -125 1 219 -100 135 101 -159 74 -323 54 90 159 50 -43 91 89 -272 -84 9 -130 224
6993 224 47 99 67 7 -164 178 -21 -28 198 6 -114 -73 -23 -181 146 -102 -28 160 85 197 102 -46 -80 -125
7017 -125 135 -191 235 -33 -36 17 -93 -64 -13 66 -78 -80 159 108 -67 102 161 -245 -112 160 260 -92 -77 -69
$$ packed form
6847I1L6n2p3L21l19k8k1P1N5o4j6M0J76j00k02J01J11r2k12J41Q6J3K0j62J31
6872E2j2l7j40P4j59n2L37q3J18k74k9K59j53Q8K7O0n7M1L0k40J50J21k84K11
6896D8j93L30j57j7J30k94J96j82Q5n2j8l9J1o5K49r3J64j75J79j03n9K84j47
6919H2o5j05K17Q4l43j9n7M87o3j63j18n7Q6M3j5J06k49K19N2j34K83k62j91K00
6943A8L1j0k2P3j22k7p4J89l6k28J00L11k52lm4K0MN8Q1k17J4L11k80K85Qo9j4
6970A05O0k48m2J26K18l19K35l4k60K33l97L77L6O9j09r3J34kl61J88R3j39L54
6993B24j77N2l2o0j71L42j99pK26j92j20M1N0j58L27k48P4J88p5J12r5j48l4m5
7017a25K60l26M26k68lN3j10K9N1P9j44kK39n1j75J69N9m06J33K72J00l52J5Q
$$ plain form
7041 -69 -2 -43 -179 110 105 -19 11 90 -170 -8 108 40 36 -158 1 -235 128 57 64 -115 -80 -10 96 171 -77
7066 -77 44 -33 78 155 196 -111 39 119 -152 145 103 2 -133 184 93 126 322 36 -111 -5 138 140 190 83
7090 83 101 124 20 -50 338 227 124 -80 -91 -88 -5 128 -4 -185 7 -399 -72 393 52 92 408 -215 -211 36
7114 36 58 -31 76 17 -104 168 -52 -100 228 -11 -130 -149 -130 -191 77 238 -89 46 70 21 0 377 -75 -5
7138 -5 -63 -220 -300 89 -131 -7 -134 -269 -53 250 -61 -285 -27 72 -284 252 -5 -88 260 71 -86 -1
7160 -1 -44 -16 -77 -103 -68 -238 6 -182 229 83 127 71 37 46 -42 118 -184 -185 140 54 -218 -23 -11 -112 174 6
7186 6 -47 111 276 50 124 103 -119 85 182 -45 -199 185 -14 -158 -31 -88 246 41 -279 313 24 -176
7208 -176 25 -129 -15 7 113 3 34 382 48 192 193 82 90 107 -21 -416 98 72 -315 -153 170 -43 -60
$$ packed form
7041f9O7m1j36K89nj24L0P9k60J62J16o8mj94J59k36L63p1Pj79L5P0J06P5k48
7066g7J21p7J11P7M1l07J50Q0k71K97m2j01j35L17r1L3J96k86j47J06J43KN0j07
7090H3J8K3j04p0L88j11j03k04j1LQ3J33j32j81J92m06L27M65l41M0L16o23MK47
7114C6K2q9J07n9j21K72k20m8L28k39j19j9J9o1K68J61l27J35K4m9k1L77m52P0
7138en8j57q0L89k20J24j27j35K16L03l11k24K58R9l56N36k57q3L48j89j57Q5
7160am3K8o1k6L5j70K44j88M11j46M4n6l4Rq8J60l02jL25q6k72J95J2j01K86j68
7186Fn3J58J65k26P4k1k22K04R7k27j54L84j99j44J27n7L34k05l20N92k89k00
7208a76K01j54J14K2J06j10L1L48l34J44Jj11QJ7j28l95N14k6l87J62L23k13j7
$$ plain form
7231 -60 -90 -256 11 63 -107 -220 -42 -62 -14 10 102 -82 -3 126 69 259 111 -118 140 -62 -225 61 129
7254 129 106 -55 -81 -191 -138 144 -207 185 -248 -174 62 144 6 -111 81 -20 -279 272 87 -2 340 107
7276 107 -112 111 131 -270 281 -168 -185 149 60 -121 -3 87 -82 161 8 -10 9 197 -101 -105 103 -59 -355
7299 -355 382 -39 -227 452 30 -265 140 128 -144 -168 -203 -227 92 133 -26 38 59 103 -67 154 14 -42 146
7322 146 -176 79 92 -108 -56 120 -269 -132 354 -297 142 91 32 68 -149 -10 -238 -1 43 -148 104 -29
7344 -29 -284 -93 264 -278 179 -104 -120 163 -11 -45 -99 -68 -27 54 84 -100 -191 152 -97 4 13 -51 -129 253
7368 253 -104 78 144 -28 -24 257 113 -224 294 114 -207 199 9 -98 401 6 -20 -172 371 4 -94 118
7390 118 172 -229 125 -53 314 513 -97 -40 11 -17 -252 67 69 -94 190 148 -232 -54 -122 -373 -26 -63 -238
$$ packed form
7231f0l0j66K67N2j70j13J78k0M8K4R2j84P9J29n7J90j48k29K58k02j63K86O8
7254A29k3j61k6j10N3K82l51L92m33P4K36Q2j38j17J92j01k59N51j85q9L42k33
7276A07k19K23K0m01N51m49j7L34q9j81J18R0j69K43j53j8J9J88k98mK08j62k96
7299c55P37m21j88O79m22k95M05j2k72k4l5k4L19M1j59O4K1M4j70K21j40n6J88
7322A46l22K55J3k00N2J76l89J37M86o51M39n1n9L6k17J39k28K37M4j91K52j33
7344b9k55J91L57n42M57k83j6K83j74l4n4L1M1Q1L0j84r1L43k49J01Ro4p8L82
7368B53l57J82O6j72MK81j44l37N18j80l21M06j90j07M99l95k6j52N43l67r8K12
7390A18N4m01L54j78L67J99o10N7N1k8k35L19Kj63K84m2l80J78o8k51L47l7j75
$$ plain form
7413 -238 -5 45 -14 148 169 -260 -315 57 -126 107 11 -133 102 275 -101 28 286 -11 -146 -33 255 103
7435 103 151 105 16 114 115 -215 50 181 -198 171 244 -271 54 11 -259 41 13 -23 -367 368 -37 -6 505 -234
7459 -234 -209 123 -142 -146 111 -43 -213 243 -111 -264 -94 160 -71 122 205 -350 50 223 -139 -101 310 -69
7481 -69 104 253 129 -76 295 -142 -168 206 -75 -318 85 67 -151 22 37 -392 -6 -5 -118 91 -44 -47 204
7504 204 242 -152 -29 63 -420 91 318 -253 40 223 -170 -283 67 68 -53 125 17 -181 340 65 -2 213
7526 213 234 -183 194 -75 -152 54 72 -366 54 251 -370 -113 35 -316 -122 92 -165 -86 71 -424 -64
7547 -64 225 -257 -149 303 -114 -237 -43 225 -300 290 134 -124 162 -179 -198 -1 61 -229 132 55 -376
7568 -376 186 316 -243 -103 265 9 -81 254 -154 -133 73 -28 -72 160 2 65 58 235 -55 211 -278 -105
$$ packed form
7413b38K33N0n9J62K1m29n5L72j83K33r6j44K35J73l76J29K58k97j35J13K88j52
7435A03M8m6q9R8Jl30K65J31l79L69P3n15L25m3k70L00k8l6l44P35m05L1N11p39
7459b34K5L32k65mK57j54j70M56l54j53J70K54k31J93Q3n55M00J73l62L8M11l79
7481f9J73J49j24k05L71m37k6L74k81k43M03j8k18J73J5m29L86Jj13K09j35lK51
7504B04L8l94J23R2m83N11K27n71K93J83l93j13L50Jj21J78j08j98N21k75o7K15
7526B13K1m17L77k69p7K06J8m38M20J97o21K57J48l51J94K14k57P9J57m95L60
7547f4K89m82J08M52m17j23J94K68n25N90j56k58K86l41j9J97O2k90L61p7m31
7568c76N62J30n59J40L68k56r0L35m08K1K06j01m4K32j58O3pJ77k90K66m89J73
$$ plain form
7590 -105 364 -78 -251 -124 -72 -347 -75 78 -131 193 120 -162 -30 208 -182 34 253 53 -4 234 -57
7611 -57 -64 258 -39 -123 142 6 7 119 43 -274 95 6 -286 -18 71 -287 -73 125 -91 -11 151 -115 30
7634 30 130 -149 90 302 -414 -200 51 32 -122 368 -211 -184 135 -159 -180 215 -68 -82 225 -71 -354 -20
7656 -20 1 -113 137 39 -125 81 168 -213 111 217 -167 44 433 -57 38 -65 93 -219 172 -318 -304 42
7678 42 -114 -45 347 -34 -219 528 88 65 110 107 -248 318 194 -490 -169 89 -214 3 325 -174 -85 255
7700 255 -93 -1 -19 47 -113 -20 15 -262 292 193 -112 -9 -143 -377 221 28 -244 157 161 -144 136 139 -76
7723 -76 27 34 -190 -56 188 -107 137 221 119 -42 182 -31 -10 30 -147 -351 261 -299 -260 -133 -278 -344 -33
7746 -33 145 -286 216 -26 -170 98 -8 -48 177 2 -267 -29 361 -185 207 368 -356 -122 369 -277 -64
$$ packed form
7590a05M69m42j73J27N2k75K72J53k09L24p3k82J32K38l90K16K19k00n7K38k91
7611e7pL22k97q4K65j36JJ12p6l17L69q9k92K68Q9l58K14J98k16Q0J62k66J45
7634C0J00k79K39K12p16K14K51j9j54M90n79K7L19k94k1L95k83j4L07k96k83L34
7656b0K1j14K50r8j64K06Q7l81L24J06l84K11L89m90R5j03J58l12L91m90J4L46
7678D2j56O9L92l81j85P47m40k3M5ll55N66j24o84L21K58l03K17L22m99Q9L40
7700B55l48R2j8O6j60R3L5k77N54r9l05J03j34k34N98j93k72M01Ml05K80Lk15
7723g6J03Pk24J34K44k95K44Q4j02j61K24k13K1M0j77k04O12n60L9J27j45o6L11
7746c3J78m31N02k42j44K68j06m0K25j75k69K38L90n46L92J61p24K34M91o46K13
$$ plain form
7767 -64 180 -93 -97 323 -4 -206 151 -46 -168 21 148 -93 156 -19 -37 -98 174 -195 43 76 -297 -91
7789 -91 71 -6 -5 405 -2 -100 99 -219 -189 315 -183 -163 350 -277 -339 98 34 -154 175 36 -439 180 70
7812 70 -252 60 77 -192 -55 162 -104 362 206 33 26 83 -163 152 268 -72 -85 282 -185 -196 131 28
7834 28 -280 170 328 -233 -28 192 -299 181 130 -170 226 225 -171 49 63 -124 207 15 -346 21 150 121
7856 121 -81 150 119 -168 306 -102 -200 217 -199 -49 314 -65 -215 25 -137 -279 271 140 -331 -36 241
7877 241 -440 -110 330 -144 -208 55 -241 -84 258 -252 100 113 -97 16 47 -182 -165 240 -161 -242 288 -260
7899 -260 -245 206 -20 -376 212 -16 -150 -42 -79 -204 -74 326 -433 56 56 -184 2 359 -351 -175 192
7920 192 -167 -96 130 -182 -90 424 160 -377 270 -41 -184 278 -57 -339 184 71 -433 -11 -25 -546 77
$$ packed form
7767f4K44k73mM20l27k02L57j97j22J89J27k41K49j75j8o1K72l69K38L3l73K06
7789i1J62p7JM10m07r8J99l18L0N04m98K0N13o27o2M37o4j88L29j39m75O19j10
7812G0l22L12J7k69J37K17k66M66j56j73pN7k46L15J16l40j3L67m67j1L27j03
7834B8l08M50J58n61K05K20m91M80n1l00L96jl96K20J4j87L31j92l61L67J29k9
7856A21k02K31l1k87M74m08r8M17m16J50L63l79j50K40j62j42N50j31m71K95K77
7877B41o81L30M40m74o4K63k96J57L42n10L52J3k10J13L1k29J7M05m01q1N30n48
7899b60J5M51k26l56N88k28j34J08l7j25J30M00p59M89%k40J86L57p10J76L67
7920A92l59P1K26l12R2N14k64n37O47l11j43M62l35k82N23j13n04M22j4n21O23
$$ plain form
7941 77 191 -374 -16 99 -93 -86 184 -115 -112 50 -211 -44 175 68 -269 203 -240 -127 163 170 -501 323
7963 323 -176 -109 -98 -86 -242 77 102 -429 226 212 -2 -148 317 0 -78 324 -324 -44 104 -298 -164 274
7985 274 -179 -69 51 -152 -241 7 24 -216 199 67 221 363 298 -143 106 279 -398 -80 238 -466 115
8006 115 -46 -30 78 551 -83 -22 368 -369 -273 71 15 -193 303 207 -486 317 236 -192 163 27 59 128 98
8029 98 -260 122 -121 -68 -1 458 -195 -2 243 -280 -85 227 -25 11 178 -174 0 296 120 -1 263
8050 263 -55 -284 207 23 -7 73 -45 -238 361 217 -456 -83 10 -266 71 204 -284 50 427 -372 91
8071 91 327 -191 -107 328 -38 -18 252 -332 -251 323 -9 -292 378 4 -328 183 81 -26 108 45 -348 107
8093 107 -85 -234 71 -88 -157 111 410 -332 -122 94 -119 206 282 -282 144 136 -47 -86 131 -95 -181 175
$$ packed form
7941G7J14n65L58J15j92PK70k99LJ62k61J67K19j07l37M72m43J13K90Po71Q24
7963C23m99O7J1J2j56L19K5n31O55j4k14j46M65l17p8M02o48K80J48m02J34M38
7985B74m53J10J20k03q9K48J7k40M15j32J54J42o5m41K49J73o77L18L18p04N81
8006A15j61J6J08M73o34O1L90p37R6L44n6k08M96r6o93Q03q1m28L55j36L2O9l0
8029I8l58L82k43N3O7M59o53J93K45n23J95L12k52L6J67l52J74K96j76j21K64
8050B63l18k29M91j84l0Q0j18j93N99j44o73L73R3k76L37J33m88L34L77p99M63
8071I1K36n18Q4M35l66K0K70n84Q1N74l32k83O70l74l32N11j02j07J34o3l93M55
8093A07j92j49L05j59o9K68K99p42K10K16k13L25P6n64M26qj83l9K17k26q6L56
$$ plain form
8115 175 -32 -228 -66 13 -323 -62 113 -261 32 158 -370 245 410 -391 -185 106 33 -146 -77 -47 -100 284
8137 284 -142 -193 288 10 -178 98 -44 -186 191 68 -213 218 48 -377 171 -42 -223 -56 353 -185
8157 -185 84 173 -294 -160 40 -327 159 409 -129 4 143 -192 -74 365 -173 -100 97 -317 -71 135 157
8178 157 -327 267 17 -226 104 27 -393 -110 126 -242 40 155 -133
$$ packed form
8115A75k07j96J62P9l36K61J75l74K93J26n28O15J65q01K06K91p3j79O9L0n3L84
8137B84m26n1M81k78j88K76j42j42L77j23k81M31j70m25N48k13j81J67M09n38
8157a85K69Q9m67J34K00l67M86K50n38J33J39l35J18M39n38P3J97m14K46K06K2
8178A57m84N94k50k43L30p7m20K83K36l68K82J15k88
8191a33
$$ Imaginary data points
##PAGE= N=2
##DATA TABLE= (X++(I..I)), XYDATA
$$ plain form
0 0 0 0 0 0 0 0 0 0 0 0 0 0 0 -8 8 -8 8 -9 16 -16 19 -24 29 -32 40 -48 55 -62 72 -80 91 -105 119 -135 152
35 152 -170 192 -214 239 -265 296 -328 363 -403 446 -492 543 -599 658 -726 799 -880 971
53 971 -1071 1185 -1313 1459 -1626 1826 -2059 2343 -2693 3140 -3732 4552 -5770 7765 -11590
68 -11590 21526 -102898 -201282 3612 -63279 -32105 119823 40945 -14164 110038 6696
79 6696 -66873 56363 -20304 -121430 35126 23269 -60062 97570 98166 -69631 11917 29251
91 29251 -121081 -48000 20528 -81387 18482 107456 -24344 27080 121245 -43122 -57059
102 -57059 58894 -55909 -73715 65048 -19797 -58809 80375 15249 -47158 78588 8109
113 8109 -97353 20241 -10907 -95118 76209 103726 -41048 31415 42644 -104005 -25712
$$ packed form
0@%%%%%%%%%%%%%qJ6j6J6j7K5l2L5m3N3o1P2q8J03j17J34j52J71j96K24k54K87
35A52l22L62m06M53n04N61o24O91p66Q49r38J035j142J257j384J525j679J851
53I71k042K256k498K772l085L452l885M402n036N833o872Q284j0322J3535j9355
68a1590L3116j24424r8384K04894o6891L1174J51928p8878n5109J24202j03342
79F696p3569J23236p6667j01126J56556j1857q3331J57632N96j67797Q1548J7334
91B9251j50332P3081O8528j01915R9869Q8974j31800N1424R4165j64367j3937
102e7059J15953j14803j7806J38763q4845l9012J39184o5126o2407J25746p0479
113H109j05462J17594l1148q4211J71327K7517j44774P2463J1229j46649P8293
$$ plain form
124 -25712 44500 -66152 3555 72159 -62250 -9227 103286 -21977 -20966 72952 -65237
135 -65237 -86819 62049 -7677 -38672 99295 25867 -59811 41151 -22683 -101507 34573
146 34573 13523 -77936 64407 80906 -46528 38188 54775 -84696 -16151 38190 -77736
157 -77736 -8359 73735 -40453 1990 93815 -28822 -25936 62552 -68024 -88852 52710
168 52710 -8366 -36972 91331 25022 -52277 45284 -8791 -77854 50717 24405 -81637
179 -81637 28369 39239 -60659 47468 80844 -49460 5923 39506 -92666 -38144 49246
190 49246 -46397 -3141 81983 -31931 -19178 80882 -35152 -60349 58331 -21715 -63037
201 -63037 61754 12051 -41248 71259 18293 -68219 37932 11430 -86557 20031 31509
$$ packed form
124b5712P0212j10652O9707O8604j34409N3023J12513j25263J011R3918j38189
135f5237k1582J48868o9726l0995J37967p3428q5678J00962o3834p8824J36080
146C4573k1050r1459J42343J6499j27434Q4716J6587j39471O8545N4341j15926
157g7736O9377Q2094j14188M2443R1825j22637K886Q8488j30576k0828J41562
168E2710o1076k8606J28303o6309p7299R7561n4075o9063J28571k6312j06042
179h1637J10006J0870r9898J08127L3376j30304N5383L3583j32172N4522Q7390
190D9246r5643M3256Q5124j13914J2753J00060j16034k5197J18680q0046m1322
201f3037J24791m9703n3299J12507n2966q6512J06151k6502r7987J06588J1478
$$ plain form
212 31509 -62095 42766 73445 -52754 5684 48875 -72358 -25401 52236 -42324 -6153
223 -6153 68755 -43317 -31863 71999 -21981 -41039 64531 -16387 -59279 52992 3425
234 3425 -45034 66893 22415 -65155 26912 7884 -72309 30144 34523 -63406 23873 50277
246 50277 -61463 4310 58494 -45931 -4802 54906 -47008 -15387 65933 -34236 -27916
257 -27916 65109 -24989 -43944 53842 -21059 -54977 56646 4052 -51487 54774 18886 -59805
269 -59805 31236 13614 -64004 33981 38083 -58934 22590 49250 -55727 5354 51499 -51246
281 -51246 -9442 49408 -49454 -17897 67654 -20215 -18535 60107 -30143 -49479 43298 -24394
293 -24394 -52207 57217 10164 -45504 50038 18729 -50461 34797 15252 -64237 22253 30322
$$ packed form
212C1509r3604J04861L0679j26199N8438M3191j21233M6957P7637r4560L6171
223f153P4908j12072J1454J03862r3980j9058J05570q0918m2892J12271m9567
234C425m8459J11927m4478q7570R2067j9028q0193J02453M379r7929Q7279K6404
246E0277j11740O5773N4184j04425M1129N9708j01914L1621Q1320j00169O320
257b7916R3025r0098j8955R7786p4901l3918J11623n2594n5539J06261l5888p8691
269e9805R1041j7622p7618R7985M102r7017Q1524K6660j04977O1081M6145j02745
281e1246M1804N8850r8862L1557Q5551q7869J680P8642r0250j9336R2777o7692
293b4394k7813J09424m7053n5668R5542l1309o9190Q5258j9545p9489Q6490Q069
$$ plain form
305 30322 -55068 23325 53334 -41056 11014 46261 -55452 -17930 41442 -49318 -22904 57480
317 57480 -20710 -16248 61258 -19010 -36336 50307 -18369 -53361 45154 2243 -46881 47185
329 47185 21042 -42144 42058 22690 -61042 16428 23686 -60114 11959 41844 -43691 11459
341 11459 49770 -46706 -9432 49247 -40538 -23493 47992 -28271 -22858 56296 -15740 -29534
353 -29534 55898 -8254 -46055 41650 -273 -47744 39389 12094 -49108 33507 22150 -53534
365 -53534 18720 28420 -48509 12839 35614 -46510 6163 45568 -42356 -8828 49027 -31191
377 -31191 -16665 48112 -24100 -21243 51345 -17487 -35251 45063 -9567 -43335 39265 685
389 685 -43299 40032 13698 -48210 29036 21878 -49545 16981 25970 -46415 14757 37682 -42631
$$ packed form
305C0322q5390P8393L0009r4390N2070L5247j01713L7522N9372r0760K6414Q0384
317E7480p8190M462P7506q0268j7326Q6643o8676l4992R8515m2911m9124R4066
329D7185k6143o3186Q4202j9368q3732P7470P258q3800P2073K9885q5535N5150
341A1459L8311r6476L7274N8679q9785J7045P1485p6263N413P9154p2036j3794
353b9534Q5432o4152l7801Q7705m1923m7471Q7133k7295o1202Q2615j1357p5684
365e3534P2254R700p6929O1348K2775q2124N2673L9405q7924L3528N7855q0218
377c1191J4526O4777p2212K857P2588o8832j7764Q0314n4630l3768Q2600l8580
389F85m3984Q3331k6334o1908P7246p158p1423O6526Q989p2385O1172K2925q0313
$$ plain form
402 -42631 7458 47966 -37451 -9413 43393 -34259 -18880 43819 -27109 -24656 49109 -14441
414 -14441 -31949 44023 -7192 -38974 37973 -2355 -46487 35324 13973 -43713 29687 25672
426 25672 -39892 21272 26736 -44916 10769 32150 -45085 -642 40107 -34393 -5817 44033
438 44033 -28279 -15129 42426 -26689 -29754 39267 -14540 -29294 42009 -3259 -30140 43257
450 43257 3729 -42407 31616 12217 -45248 21373 19106 -39767 21051 28728 -39914 11797
462 11797 32891 -42801 -4507 32833 -37116 -7894 42056 -27233 -13307 47434 -17788 -24930
474 -24930 38914 -13322 -29629 37008 -7467 -32614 42627 7958 -39248 30006 12809 -43547
486 -43547 17364 14756 -42058 17394 28057 -38433 8752 33211 -35263 -551 33389 -33913
$$ packed form
402d2631N0089M0508q5417K8038N2806p7652J5379O2699p0928K453P3765o3550
414a4441j7508P5972n1215l1782P6947m0328m4132Q1811k1351n7686P3400m015
426B5672o5564O1164N464p1652N5685K1381p7235M4443M0749p4500K8576M9850
438D4033p2312J3150N7555o9115l065O9021n3807j4754P1303m5268k6881P3397
450D3257l9528m6136P4023j9399n7465O6621k267n8873O0818P677o8642N1711
462A1797K1094p5692L8294L7340o9949K9222M9950o9289J3926O0741o5222p142
474b4930O3844n2236j6307O6637m4475k5147P5241l4669m7206O9254j7197n6356
486d3547O0911k608n6814N9452J0663o6490M7185K4459o8474L4712L3940o7302
$$ plain form
498 -33913 -6791 41835 -25702 -16385 43404 -13235 -22198 35625 -12576 -27600 35170 -8204
510 -8204 -35714 35250 7044 -36891 26524 11738 -39132 19859 16975 -41085 13493 28566
522 28566 -33426 8404 31592 -31630 2340 33234 -34549 -9740 41029 -22303 -16845 38825
534 38825 -14454 -22288 33017 -15108 -29609 35337 -3670 -33637 31779 5899 -34175 27553
546 27553 11490 -38175 22167 21853 -37641 11068 26611 -30887 7568 27362 -33261 1213
558 1213 34233 -31852 -12137 35706 -21871 -17430 34397 -15283 -20125 36045 -10080 -29159 30680
571 30680 -1564 -29095 30198 6197 -30411 28852 11877 -39777 16143 21135 -33513 10104
583 10104 24215 -29693 7154 25458 -34786 -3708 31857 -26817 -9988 34410 -19900 -14249
$$ packed form
498c3913K7122M8626o7537R317N9789n6639q963N7823m8201j5024O2770m3374
510h204k7510P0964k8206m3935O3415j4786n0870N8991k884n8060N4578J5073
522B8566o1992M1830K3188o3222L3970L0894o7783K4809N0769o3332N458N5670
534C8825n3279p834N5305m8125j4501O4946l9007k9967O5416k5880m0074O1728
546B7553j6063m9665O0342l14n9494M8709J5543n7498L8455J9794o0623L4474
558A213L3020o6085J9715M7843n7577M441N1827m9680m842N6170m6125j9079N9839
571C0680l2244k7531N9293k4001l6608N9263j6975n1654N5920M992n4648M3617
583A0104J4111n3908L6847J8304o0244L1078L5565n8674J6829M4398n4310N651
$$ plain form
595 -14249 35274 -15726 -22797 35448 -5455 -26486 28908 -840 -26014 30003 3758 -33420
607 -33420 26125 12565 -39329 13619 19033 -33122 9067 21605 -31193 7201 30095 -28390
619 -28390 -3151 28807 -27770 -11045 31954 -18834 -9430 42031 -9700 -23905 28041 -8790
631 -8790 -28318 24438 -2302 -24951 30476 6198 -32113 22820 13153 -35279 10956 15253 -32761
644 -32761 10150 24546 -27713 5928 30985 -23202 -2353 27070 -25601 -10474 29681 -21533
656 -21533 -15081 37588 -7303 -20999 27990 -6696 -25678 24414 -5126 -31413 24009 6540
668 6540 -28603 25037 18311 -27427 14665 13128 -37574 5935 25527 -25033 5727 29824 -22590
681 -22590 -3305 25125 -26145 -9987 30076 -21222 -19830 30955 -7274 -16937 31309 -4470
$$ packed form
595a4249M9523n1000p071N8245m0903k1031N5394k9748k5174N6017k6245l7178
607c3420N9545j3560n1894N2948N414n2155M2189J2538n2798L8394K2894n8485
619b8390K5239L1958n6577J6725M2999n0788R404N1461n1731j4205N1946l6831
631h790j9528N2756k6740k2649N5427k4278l8311N4933r667m8432M6235M297m8014
644c2761M2911J4396n2259L3641K5057n4187K0849K9423n2671J5127M0155n1214
656b1533O452N2669m4891j3696M8989l4686j8982N0092k9540k6287N5422j7469
668F540l5143N3640o726m5738M2092j537n0702M3509J9592n0560L0760K4097n2414
681b2590J9285K8430n1270J6158M0063n1298J392N0785l8229r663M8246l5779
$$ plain form
693 -4470 -24927 24306 -3416 -30954 22540 9953 -23739 23875 15644 -27675 14211 14059 -37243
706 -37243 1677 22460 -23112 4942 28819 -20048 -2063 24322 -26612 -14703 25748 -19153
718 -19153 -18087 30559 -3468 -10264 35375 -3023 -27897 18531 -4729 -30369 21541 11611 -20852
731 -20852 22773 12134 -30603 13175 17670 -32752 -327 15813 -28790 1274 27970 -16353
743 -16353 4878 33118 -19833 -14839 21819 -20703 -19383 26205 -8511 -13124 36683 3323 -21522
756 -21522 21773 -2479 -32601 12592 1600 -26323 21613 17232 -23895 16199 20966 -27927
768 -27927 -730 11183 -32383 -1285 28195 -13071 5113 34202 -15487 -14330 19065 -18940
780 -18940 -15833 26966 -9205 -19662 27092 354 -19941 22465 906 -28070 13272 1385
$$ packed form
693d470k0457M9233k7722k7538N3494j2587l3692M7614q231m3319M1886j52n1302
706c7243L8920K0783m5572K8054K3877m8867J7985K6385n0934J1909M0451m4901
718a9153J066M8646l4027o796M5639l8398k4874M6428k3260k5640N1910r930l2463
731b0852M3625j0639m2737M3778M495n0422L2425J6140m4603L0064K6696m4323
743a6353K1231K8240n2951M994L6658m2522J320M5588l4716m613M9807l3360k4845
756b1522M3295k4252l0122M5193j0992k7923M7936m381m1127M0094M767m8893
768b7927K7197J1913m3566L1098K9480m1266J8184K9089m9689J157L3395l8005
780a8940L107M2799l6171j0457M6754k6738k0295M2406k1559k8976M1342j1887
$$ plain form
792 1385 -27598 20625 20830 -20384 13042 16584 -27740 2130 16881 -26455 421 26159 -17956
805 -17956 -2827 27824 -15207 -10796 22315 -17594 -17417 25813 -7896 -19724 25598 754 -18411
818 -18411 23719 1849 -27209 13987 2727 -28372 17171 20971 -16825 14449 16442 -26939
830 -26939 1768 16719 -26734 -3956 21022 -20301 -4618 27809 -10163 -5303 24969 -17499
842 -17499 -23227 18453 -8095 -14627 29690 6212 -14917 22331 232 -28778 12329 3993 -27322
855 -27322 12105 15403 -18384 14688 18967 -23877 1707 15928 -26425 -5384 20478 -17449
867 -17449 -2427 27472 -11265 -6882 25122 -14657 -20552 19395 -6721 -14525 27018 2785 -17763
880 -17763 20700 1258 -25405 15033 6664 -26608 8367 9036 -23965 11967 21284 -18690 5064
$$ packed form
792A385k8983M8223K05m1214L3426L542m4324K9870J4751m3336K6876K5738m4115
805a7956J5129L0651m3031M411L3111l9909J77M3230l3709j1828M5322k4844j9165
818a8411M2130k1870k9058M1196j1260l1099M5543L800l7796L1274J993m3381
830b6939K8707J4951m3453K2778K4978m1323J5683L2427l7972M860L0272m2468
842a7499n728M1680k6548o532M4317k3478k1129L7248k2099k9010M1107q336l1315
855b7322L9427L298l3787L3072M279m2844K5584J4221m2353K1041K5862l7927
867a7449J5022K9899l8737M383L2004l9779n895L9947k6116p804M1543k4233k0548
880a7763L8463j9442k6663M0438q369l3272L4975O69l3001L5932R317l9974K3754
$$ plain form
893 5064 18358 -24016 -5354 19178 -16235 -1862 26262 -12465 -9291 24468 -9895 -16819 18887
906 18887 -8655 -19862 19581 -578 -17310 22741 7095 -21486 13434 5137 -25735 8454
918 8454 10103 -21473 11685 21205 -17798 3241 17095 -21850 -4758 18644 -15854 -2325 25720
931 25720 -11512 -10753 21936 -9916 -15909 17960 -8911 -20028 19464 1341 -16410 22900 8157
944 8157 -20770 11391 3714 -24601 11268 14214 -19251 10483 18655 -19640 1244 15781 -21308
957 -21308 -4473 17047 -18735 -6266 24053 -8510 -6774 23484 -8039 -15010 16663 -9975
969 -9975 -21029 18357 2433 -14991 21390 9188 -16809 13161 4509 -25544 6734 10093 -21784
982 -21784 6668 17946 -14991 5497 19224 -18146 -5166 14269 -21123 -11024 19866 -7010
$$ packed form
893E064J3294m2374J8662K4532l5413J4373K8124l8727L174L3759l4363o924L5706
906A8887k7542j1207L9443k0159j6732M0051j5646k8581L4920q297l0872L4189
918H454J649l1576L3158R520l9003K1039J3854l8945J7092K3402l4498J3529K8045
931B5720l7232P59L2689l1852n993L3869k6871j1117L9492j8123j7751L9310j4743
944H157k8927L2161p677k8315L5869K946l3465K9734Q172l8295K0884J4537l7089
957b1308J6835K1520l5782J2469L0319l2563J736L0258l1523o971L1673k6638
969i975j1054L9386j5924j7424L6381j2202k5997K9970q652l0053L2278L359l1877
982b1784K8452J1278l2937K0488J3727l7370J2980J9435l5392J0099L0890k6876
$$ plain form
994 -7010 -3616 26240 -3990 -11600 19014 -7909 -21106 15074 -920 -18478 16877 6857 -15677
1007 -15677 16528 8750 -22795 5500 7683 -23550 3481 15372 -15291 7099 20753 -16145
1019 -16145 -2905 17927 -16861 -9586 18070 -9730 -7236 21557 -6147 -11597 20115 -4092
1031 -4092 -18041 14877 -1399 -18722 14771 4273 -17630 14776 9959 -20463 5999 9295
1043 9295 -19477 4959 14560 -15057 5498 19170 -15787 -4152 17002 -14259 -8759 16353
1055 16353 -10547 -8155 20848 -4930 -11938 17724 -4133 -17607 12463 -2455 -17304 17237
1067 17237 7532 -15935 14447 10603 -18676 4931 7365 -19249 4397 13244 -16548 3990 19537
1080 19537 -13140 -2269 16436 -15229 -9107 15058 -12849 -11023 19865 -2192 -9337 19016
$$ packed form
994g010L394K9856l0230p610L0614k6923j3197L6180j5994j7558L5355j0020k2534
1007a5677L2205p778l1545K8295K183l1233K7031J1891l0663K2390J3654l6898
1019a6145J3240K0832l4788P275K7656k7800K494K8793k7704n450L1712k4207
1031d092j3949L2918j6276j7323L3493j0498k1903L2406m817l0422K6462L296
1043I295k8772K4436R601k9617K0555J3672l4957J1635K1154l1261N500K5112
1055A6353k6900K392K9003k5778p008K9662k1857j3474L0070j4918j4849L4541
1067A7237r705k3467L0382l844k9279K3607K434k6614K3646Q847k9792K0538J5547
1080A9537l2677J0871J8705l1665O122K4165k7907J826L0888k2057p145K8353
$$ plain form
1092 19016 -1779 -14178 14048 -3311 -19685 14114 6159 -16371 12833 11586 -14766 7766
1104 7766 8868 -19773 1755 10984 -17940 266 16168 -11795 -376 17577 -12534 -7130 17276
1117 17276 -9992 -11442 16363 -3528 -10159 16391 -1625 -11775 16625 448 -17601 11608
1129 11608 3587 -18234 8987 7824 -15636 8468 11435 -16730 2401 11986 -15576 -231 13671
1142 13671 -13293 -285 17844 -11778 -6545 17963 -7746 -10354 15486 -4451 -10384 15266
1154 15266 -3316 -13746 14514 577 -15784 11902 4403 -16132 9949 6948 -17479 6747
1166 6747 11642 -14804 2828 12883 -12713 1288 12779 -13729 -1805 16297 -10975 -6715
1178 -6715 16789 -6952 -9800 13619 -5620 -11571 14208 -1525 -12674 13135 1554 -13733
$$ packed form
1092A9016k0795j2399K8226j7359j6374L3799p955k2530K9204j247k6352K2532
1104G766J102k8641K1528R229k8924J8206J5902k7963J1419J7953l0111N404K4406
1117A7276k7268j450K7805j9891o631K6550j8016j0150K8400j6177j8049K9209
1129A1608q021k1821K7221j163k3460K4104K967k8165J9131R585k7562J5345J3902
1142A3671k6964J3008J8129k9622N233K4508k5709k608K5840j9937n933K5650
1154A5266j8582j0430K8260j3937j6361K7686p499k0535K6081l001k4427K4226
1166F747M895k6446J7632J0055k5596J4001J1491k6508J1924J8102k7272M260
1178f715K3504k3741k848K3419j9239n951K5779j5733j1149K5809j1581j5287
$$ plain form
1190 -13733 10761 3096 -15461 10265 8368 -15709 5892 11173 -13373 2089 10900 -12626 1441
1203 1441 12924 -13310 -2997 14814 -10353 -6753 14942 -7278 -8055 14932 -5021 -11721 13618
1216 13618 -748 -12082 12345 2139 -11495 12040 3172 -16057 8844 7608 -15564 4995
1228 4995 10467 -12521 2966 10451 -13552 -261 12319 -12193 -3732 13669 -8399 -4306 14836
1241 14836 -7145 -8059 14989 -3620 -11548 11940 98 -10824 10587 668 -11682 11839 4586
1254 4586 -14475 6871 6364 -15004 3164 8143 -12982 3479 12158 -11175 -345 11978 -10479
1267 -10479 -3647 11323 -9179 -3998 15347 -5649 -7748 14525 -2596 -10818 10332 -1709 -11440
1280 -11440 10396 343 -12565 10045 5085 -12572 7193 6192 -13523 4717 8182 -13317
$$ packed form
1190a3733K4494p665j8557K5726j897k4077K1601N281k4546J5462Q811k3526J4067
1203A441J1483k6234J0313J7811k5167L600K1695k2220p77K2987j9953o700K5339
1216A3618j4366j1334K4427j0206j3634K3535q868j9229K4901j236k3172K0559
1228D995N472k2988J5487P485k4003J3291J2580k4512Q461J7401k2068M093J9142
1241A4836k1981r14K3048j8609p928K3488j1842j0922K1411r919j2350K3521p253
1254D586j9061K1346n07k1368J8168M979k1125J6461Q679k3333J0830J2323k2457
1267a0479O832J4970k0502N181J9345k0996k099K2273j7121q222K1150j2041r731
1280a1440K1836j0053j2908K2610m960j7657J9765j001j9715J8240L465k1499
$$ plain form
1292 -13317 2162 11954 -10139 -334 12139 -8400 -2068 11583 -9811 -6234 12669 -6080 -8210
1305 -8210 12737 -2042 -9072 10970 -1433 -11713 9367 1245 -11853 8279 4860 -10830 6993
1318 6993 6500 -12174 4719 8779 -12220 954 10609 -9247 -632 10589 -8869 -2454 11141
1331 11141 -8424 -6147 11487 -4932 -7252 11878 -2317 -8397 11183 -811 -11181 8926
1343 8926 2155 -10767 8023 4924 -10196 7213 6396 -12134 3369 7674 -12115 265 9446
1356 9446 -8818 44 10817 -8114 -2666 10762 -8060 -6302 10303 -4967 -6426 11983 -1204
1369 -1204 -7114 11479 301 -10613 7166 826 -10887 6694 3851 -9817 6952 6971 -10990
1382 -10990 2447 6909 -11406 -495 7677 -8989 -111 11154 -6342 -1854 11269 -5711 -5742
$$ packed form
1292a3317J5479R792k2093R805J2473k0539O332J3651k1394L577J8903j8749k130
1305h210K0947j4779p030K0042j2403j0280K1080q122j3098K0132l419j5690J7823
1318F993m93j8674J6893M060k0999J3174R655j9856Q615J1221j9458O415J3595
1331A1141j9565K277J7634j6419k320J9130j4195o080J9580j1994j0370K0107
1343H926o771j2922J8790l099j5120J7409q17j8530J5503M305j9789J2380R181
1356I446j8264Q862J0773j8931N448J3428j8822J758J6605j5270j459J8409j3187
1369a204n910J8593j1178j0914J7779o340j1713J7581k843j3668J6769J9j7961
1382a0990J3437M462j8315J0911Q172j6666Q878J1265j7496M488J3123j6980l1
$$ plain form
1395 -5742 8728 -5449 -6578 10606 -1445 -7037 10789 1183 -9295 6782 523 -10811 5678
1408 5678 3149 -10088 5801 7008 -9049 3538 7112 -9794 683 7542 -9187 -824 10226
1421 10226 -5660 -1759 10325 -5031 -4911 8596 -5389 -6996 9426 -1905 -7643 9053 779
1434 779 -7961 7403 1346 -9974 5531 3411 -9717 5027 6614 -7708 3647 6670 -8919
1447 -8919 638 7235 -8703 -1376 8884 -5721 -2340 8955 -4914 -4569 8420 -4344 -7283
1460 -7283 8144 -1584 -6629 8439 774 -6925 7319 1847 -9137 5206 3251 -8820 4343
1473 4343 5665 -7450 2795 6281 -8780 -6 7004 -7623 -1459 7916 -5867 -2544 8298
1486 8298 -4698 -3800 8728 -3550 -6141 7799 -1564 -6395 8078 739 -6823 6768 1705 -8436
$$ packed form
1395e742J4470j4177j129J7184j2051n592J7826r606j0478J6077o259j1334J6489
1408E678k529j3237J5889J207j6057J2587L574j6906J0477O859j6729Q363J1050
1421A0226j5886L901J2084j5356J20J3507j3985j607J6422j1331n738J6696q274
1434G79q740J5364o057j1320J5505k120j3128J4744J587j4322J1355L023j5589
1447h919R557O597j5938P327J0260j4605L381J1295j3869L45J2989j2764k939
1460g283J5427r728n045J5068p665p699J4244n472j0984J4343j955j2071J3163
1473D343J322j3115J0245L486j5061Q774P010j4627O164R375j3783L323J0842
1486H298j2996Q98J2528j2278k591J3940r363m831J4473p339p562J3591n063j0141
$$ plain form
1500 -8436 4570 3532 -8115 3649 4300 -7842 2491 6010 -7748 142 6910 -6606 -970
1513 -970 7252 -5045 -2302 8080 -4013 -3653 8128 -2592 -5436 7090 -1299 -5991 6974 209
1527 209 -7061 5680 1709 -8069 4129 3167 -6855 3441 4325 -7511 2221 6024 -6985 46
1541 46 6495 -5931 -936 7110 -4915 -1846 7827 -4031 -4669 6413 -2798 -4934 6866 -1229
1555 -1229 -5456 6958 -99 -7446 5212 1628 -7119 3820 2985 -6453 3906 4650 -6739 1901
1569 1901 5024 -6424 34 5702 -5726 -582 7131 -4640 -2595 6865 -3868 -4465 5732 -2474
1583 -2474 -3985 6544 -878 -5008 5972 773 -6154 4996 2183 -6337 3933 2996 -6785 2879
1597 2879 4499 -5743 1375 4771 -6126 -223 4832 -5743 -809 6496 -4286 -2752 6627 -2793
$$ packed form
1500h436J3006j038j1647J1764O51j2142J0333L519j3758P890O768j3516N636
1513i70Q222j2297K743J0382j2093L60J1781j0720k844J2526q389m692J2965o765
1527B09p270J2741l971r778J2198r62j0022J0296Q84j1836R732L803j3009P031
1541D6O449j2426M995Q046j2025L069R673j1858o38J1082r211k136J1800q095
1555a229m227J2414p057p347J2658l584q747J0939q35r438J0359P44j1389Q640
1569A901L123j1448O458N668j1428N144P713j1771K045R460j0733n97J0197q206
1583b474j511J0529p422m130J0980n199o927J1150k813q520J0270r37r781R664
1597B879J620j0242P118L396j0897N903N055j0575M934P305j0782J534R379r420
$$ plain form
1611 -2793 -3087 5851 -2739 -4098 6015 -854 -4782 5866 1026 -5337 4584 1173 -6522 3293 2670
1626 2670 -6254 2757 4220 -5383 1130 3927 -5808 -21 4845 -5410 -904 6443 -3448 -2083 6114
1641 6114 -2354 -2804 5562 -2085 -4462 5149 -795 -4431 5410 849 -4841 4313 1005 -6400 2713
1656 2713 2899 -5761 1899 4001 -4290 1437 4039 -4983 365 4778 -4870 -1395 5480 -3143 -1448
1671 -1448 5697 -2579 -3022 5370 -1984 -4359 4278 -916 -4212 4392 -45 -4706 4556 1609 -5707
1686 -5707 2812 2825 -5162 1535 3088 -4479 2074 4414 -4119 377 4381 -4502 -1457 4436 -3313
1701 -3313 -1416 5542 -2294 -3246 4823 -1606 -4049 3841 -515 -3573 4645 268 -4313 4174 1843
1716 1843 -5088 2241 2436 -4726 1974 3242 -4358 1453 3916 -4158 -352 3438 -4068 -776 4393
$$ packed form
1611b793k94Q938q590j359J0113o869l928J0648m840o363R921l411p695R815o23
1626B670q924R011J463r603O513K797r735N787M866j0255M506P347r891J365Q197
1641F114q468m50Q366p647k377R611n944l636R841m561n690R154l308p405R113
1656B713J86q660P660K102q291N727K602r022N348M413r648L475O875q623J695
1671a448P145q276m43Q392p354k375Q637n194l296Q604m437m661R262k947p316
1686e707Q519J3p987O697J553p567O553K340q533M496M004q883L045N893p749
1701c313J897O958p836r52Q069o429k443P890m356l058Q218m377m581Q487k331
1716A843o931P329J95p162O700J268p600N811K463q074L806L790p506L292N169
$$ plain form
1731 4393 -3455 -1669 5561 -1916 -2996 4462 -1190 -3276 3346 -1107 -3600 4353 901 -3556 4344
1746 4344 2273 -4350 2128 1297 -5042 1342 3089 -4119 1012 4053 -3219 -114 2907 -4310 -940
1761 -940 4119 -3517 -1536 5217 -859 -2230 4404 -838 -2830 3593 -1140 -3705 3627 624 -3591
1776 -3591 3325 1514 -4037 2537 1667 -5057 1160 2866 -4091 717 3185 -2877 681 3389 -3405
1791 -3405 -875 4020 -3532 -1978 4317 -1143 -1860 4117 -1028 -3177 3131 -777 -4056 2826 423
$$ packed form
1731D393p848J786P230p477j080P458n652k086O622m453k493P953l452m457P900
1746D344k071o623O478q31o339O384J747p208N131L041p272L105L021p217L370
1761i40N059p636J981O753o076j371O634n242j992O423m733k565P332l003m215
1776c591O916j811n551O574q70o724O217J706o957M808K468o062L558K708o794
1791c405K530M895p552J554O295n460p17N977n145k149O308l908l279O882k403
$$ [...]
8191a92
##END NTUPLES=NMR FID
##END=
