##TITLE=1H_Ser DNG-Co-Pip-OH
 CDCl3, 8 sc, 
 11.2.2019
##JCAMPDX= 6.0         $$ Bruker NMR JCAMP-DX V2.0
##DATA TYPE= NMR FID
##DATA CLASS= NTUPLES
##ORIGIN= UXNMR, Bruker Analytische Messtechnik GmbH
##OWNER= root
$$ XWIN-NMR		Version 3.5
$$ Mon Feb 11 14:45:44 2019 Russian Standard Time (UT+4h)  she@DPX200
##.OBSERVE FREQUENCY= 200.1313
##.OBSERVE NUCLEUS= ^1H
##.DELAY= (6, 6)
##.ACQUISITION MODE= SIMULTANEOUS
##.ACQUISITION SCHEME= undefined
##.AVERAGES= 8
##.DIGITISER RES= 18
##SPECTROMETER/DATA SYSTEM= spect
##.PULSE SEQUENCE= zg30
##.SOLVENT NAME= CDCl3
##.SHIFT REFERENCE= (INTERNAL, CDCl3, 0, 15.7039)
##AUDIT TRAIL= $$ (NUMBER, WHEN, WHO, WHERE, WHAT)
$$ ##TITLE= Audit trail, XWIN-NMR		Version 3.5
$$ ##JCAMPDX= 5.01
$$ ##ORIGIN= Bruker BioSpin GmbH
$$ ##OWNER= she
$$ F:/spectra/data/she/nmr/H-F/1/audita.txt
$$ ##AUDIT TRAIL=  $$ (NUMBER, WHEN, WHO, WHERE, WHAT)
(   1,<2019-02-11 14:44:34.23 +0400>,<she>,<DPX200>,
      <created by zg, POWCHK disabled, PULCHK disabled
       configuration hash MD5:
       00 E9 B6 7A A2 85 ED C7 34 08 36 98 17 FE 4E 26
       data hash MD5: 16K
       E5 85 1F BB FE 9C F1 85 11 7F 71 FC 3B C8 C6 24>)
$$ ##END=
$$ 
$$ hash MD5
$$ 0E C3 40 9D 26 5B 8B 9F DE D2 67 8C 5B 35 6E DF
##$RELAX= 
##$RELAX= 
##$RELAX= 
##$RELAX= 
##$RELAX= 
##$RELAX= 
$$ Bruker specific parameters
$$ --------------------------
##$DU= <F:/spectra>
##$EXPNO= 1
##$NAME= <H-F>
##$PROCNO= 1
##$TYPE= <nmr>
##$USER= <she>
##$AMP= (0..31)
100 100 100 100 100 100 100 100 100 100 100 100 100 100 100 100 100 100 
100 100 100 100 100 100 100 100 100 100 100 100 100 100 
##$AQSEQ= 0
##$AQ_mod= 1
##$AUNM= <au_zg>
##$AUTOPOS= <>
##$BF1= 200.13
##$BF2= 200.13
##$BF3= 200.13
##$BF4= 200.13
##$BF5= 200.13
##$BF6= 200.13
##$BF7= 200.13
##$BF8= 200.13
##$BYTORDA= 1
##$CFDGTYP= 0
##$CFRGTYP= 5
##$CHEMSTR= <none>
##$CNST= (0..31)
1 1 145 1 1 1 1 1 1 1 1 1 1 1 1 1 1 1 1 1 1 1 1 1 1 1 1 1 1 1 1 1 
##$CPDPRG= <>
##$CPDPRG1= <>
##$CPDPRG2= <>
##$CPDPRG3= <>
##$CPDPRG4= <mlev>
##$CPDPRG5= <mlev>
##$CPDPRG6= <mlev>
##$CPDPRG7= <mlev>
##$CPDPRG8= <mlev>
##$CPDPRGB= <>
##$CPDPRGT= <>
##$D= (0..31)
0 1.2 0 0 0 0 0 0 0 0 0 0.03 0 0 0 0 0 0 0 0 0 0 0 0 0 0 0 0 0 0 0 0 
##$DATE= 1549881873
##$DBL= (0..7)
120 120 120 120 120 120 120 120 
##$DBP= (0..7)
150 150 150 150 150 150 150 150 
##$DBP07= 0
##$DBPNAM0= <>
##$DBPNAM1= <>
##$DBPNAM2= <>
##$DBPNAM3= <>
##$DBPNAM4= <>
##$DBPNAM5= <>
##$DBPNAM6= <>
##$DBPNAM7= <>
##$DBPOAL= (0..7)
0.5 0.5 0.5 0.5 0.5 0.5 0.5 0.5 
##$DBPOFFS= (0..7)
0 0 0 0 0 0 0 0 
##$DE= 6
##$DECBNUC= <off>
##$DECIM= 32
##$DECNUC= <off>
##$DECSTAT= 4
##$DIGMOD= 1
##$DIGTYP= 9
##$DL= (0..7)
0 120 120 120 120 120 120 120 
##$DP= (0..7)
150 150 150 150 150 150 150 150 
##$DP07= 0
##$DPNAME0= <>
##$DPNAME1= <>
##$DPNAME2= <>
##$DPNAME3= <>
##$DPNAME4= <>
##$DPNAME5= <>
##$DPNAME6= <>
##$DPNAME7= <>
##$DPOAL= (0..7)
0.5 0.5 0.5 0.5 0.5 0.5 0.5 0.5 
##$DPOFFS= (0..7)
0 0 0 0 0 0 0 0 
##$DQDMODE= 0
##$DR= 18
##$DS= 0
##$DSLIST= <SSSSSSSSSSSSSSS>
$$ [...]
##$SUBNAM2= <"">
##$SUBNAM3= <"">
##$SUBNAM4= <"">
##$SUBNAM5= <"">
##$SUBNAM6= <"">
##$SUBNAM7= <"">
##$SUBNAM8= <"">
##$SUBNAM9= <"">
##$SW= 20.0189088683792
##$SWIBOX= (0..15)
0 0 2 0 0 0 0 0 0 0 0 0 0 0 0 0 
##$SW_h= 4006.41025641026
##$TD= 16384
##$TD0= 1
##$TE= 0
##$TE2= 300
##$TE3= 300
##$TEG= 300
##$TL= (0..7)
0 120 120 120 120 120 120 120 
##$TP= (0..7)
150 150 150 150 150 150 150 150 
##$TP07= 0
##$TPNAME0= <>
##$TPNAME1= <>
##$TPNAME2= <>
##$TPNAME3= <>
##$TPNAME4= <>
##$TPNAME5= <>
##$TPNAME6= <>
##$TPNAME7= <>
##$TPOAL= (0..7)
0.5 0.5 0.5 0.5 0.5 0.5 0.5 0.5 
##$TPOFFS= (0..7)
0 0 0 0 0 0 0 0 
##$TUNHIN= 0
##$TUNHOUT= 0
##$TUNXOUT= 0
##$USERA1= <user>
##$USERA2= <user>
##$USERA3= <user>
##$USERA4= <user>
##$USERA5= <user>
##$V9= 5
##$VALIST= <valist>
##$VCLIST= <CCCCCCCCCCCCCCC>
##$VD= 0
##$VDLIST= <DDDDDDDDDDDDDDD>
##$VPLIST= <PPPPPPPPPPPPPPP>
##$VTLIST= <TTTTTTTTTTTTTTT>
##$WBST= 1024
##$WBSW= 4
##$XGAIN= (0..3)
0 0 0 0 
##$XL= 0
##$YL= 0
##$YMAX_a= 236800
##$YMIN_a= -606835
##$ZGOPTNS= <>
##$ZL1= 120
##$ZL2= 120
##$ZL3= 120
##$ZL4= 120
##$ABSF1= 10
##$ABSF2= 0
##$ABSG= 5
##$ABSL= 3
##$ALPHA= 0
##$AQORDER= 0
##$ASSFAC= 0
##$ASSFACI= 0
##$ASSFACX= 0
##$ASSWID= 0
##$AUNMP= <proc_1d>
##$AZFE= 0.1
##$AZFW= 0.1
##$BCFW= 1
##$BC_mod= 2
##$BYTORDP= 1
##$COROFFS= 0
##$CY= 11.3945322036743
##$DATMOD= 1
##$DC= 2
##$DFILT= <>
##$DTYPP= 0
##$F1P= 18.9103706918063
##$F2P= -1.10871071338519
##$FCOR= 0.5
##$FTSIZE= 0
##$FT_mod= 4
##$GAMMA= 1
##$GB= 0.15
##$INTBC= 1
##$INTSCL= 1
##$ISEN= 128
##$LB= 0.24
##$LEV0= 0
##$LPBIN= 0
##$MAXI= 10000
##$MC2= 0
##$MEAN= 0
##$ME_mod= 0
##$MI= 1.114404
##$NCOEF= 0
##$NC_proc= 0
##$NLEV= 6
##$NOISF1= 3.799351
##$NOISF2= 2.8
##$NSP= 1
##$NTH_PI= 0
##$NZP= 0
##$OFFSET= 15.70392
##$PC= 1
##$PHC0= -8677.802
##$PHC1= 10.60018
##$PH_mod= 1
##$PKNL= yes
##$PPARMOD= 0
##$PSCAL= 0
##$PSIGN= 0
##$REVERSE= no
##$SF= 200.130013532006
##$SI= 16384
##$SIGF1= 3
##$SIGF2= 2
##$SINO= 400
##$SIOLD= 16384
##$SREGLST= <1H.CDCl3>
##$SSB= 0
##$STSI= 0
##$STSR= 0
##$SW_p= 3612.71676300578
##$SYMM= 0
##$S_DEV= 0
##$TDeff= 0
##$TDoff= 0
##$TI= <>
##$TILT= no
##$TM1= 0
##$TM2= 0
##$TOPLEV= 0
##$USERP1= <user>
##$USERP2= <user>
##$USERP3= <user>
##$USERP4= <user>
##$USERP5= <user>
##$WDW= 1
##$XDIM= 8192
##$YMAX_p= 0
##$YMIN_p= 0
$$ End of Bruker specific parameters
$$ ---------------------------------
##NTUPLES= NMR FID
##VAR_NAME=  TIME,          FID/REAL,        FID/IMAG
##SYMBOL=    X,             R,               I
##VAR_TYPE=  INDEPENDENT,   DEPENDENT,       DEPENDENT
##VAR_FORM=  AFFN,          ASDF,            ASDF
##VAR_DIM=   8192,          8192,            8192
##UNITS=     SECONDS,       ARBITRARY UNITS, ARBITRARY UNITS
##FACTOR=    0.0002496,     1,               1
##FIRST=     0,             0,               0
##LAST=      2.0444736,     0,               0
##MIN=       0,             -606835,         0
##MAX=       2.0444736,     236800,          0
$$ Real data points
##PAGE= N=1
##DATA TABLE= (X++(R..R)), XYDATA
$$ [...]
3458e533N911M372r256L196N781p779K012N498p486R94O750o939J50P741p048
3473a636j875Q651n073m502Q743l509n467P854k352n272P673j786o958Q283j19
3488B655q315O982J890q171N417L530p783M328L983q222L380M937q338K373O488
3503E134q075N78P951o887j693P342n983k523P923m847l345Q726l805m780Q415
3518D131k245p126Q016j422o558P302J018p060O305J557p972N352K819r557M317
3533a123N100q283K991O063p198J325O133p856M30O935p358r88Q509n694j910
3548b924Q458m551m747P987l438n878P664k063n694Q405n88p255P734L94q557
3563e053N628K133q169N160L732p595M411N186p900K330N462q631R08O483p148
$$ plain form
3458 -5533 378 4750 -4506 -1310 4471 -3308 -1296 4202 -3284 -2290 4460 -2479 -2329 5412 -1636
3473 -1636 -3511 5140 67 -4435 4308 799 -4668 3186 834 -4438 3235 1449 -5509 2774 2655
3488 2655 -5660 1322 3212 -4959 458 3988 -3795 533 4516 -3706 -326 4611 -3727 -1354 5134
3503 5134 -2941 -2363 5588 -1299 -2992 4350 -1633 -4156 3767 -1080 -4425 4301 496 -4284 4131
3518 4131 1886 -5240 2776 1354 -5204 2098 3116 -3944 2361 3918 -4054 1298 4117 -5440 -1123
3533 -1123 3977 -4306 -1315 4748 -2450 -1125 5008 -2848 -2418 4517 -2841 -3829 4680 -1014 -2924
3548 -2924 5534 983 -3764 4223 785 -5093 2571 508 -5186 3219 2631 -4624 3110 3504 -5053
3563 -5053 575 2708 -5461 -301 3431 -4164 247 5433 -2467 -137 5325 -3306 -2398 4085 -3063
3578c063J3Q034o173j134P475n878l039P769n090m425Q524k922m919Q132r56o112
3594c764P375q90p480P057N84p747O238K128p814N224L722q725L569M628q086
3609c981J926O086p530J628O669p376J77P481o558k022Q173n252l518Q372l853
3624D22m711Q049k560n307P351j680o500P658l16p334O559J561p860N300K664
3639C296q045M680L837p971L711N476p894K114N737p570L60O772p113p07Q080
3654D763o109j854P907n373l110P480m087m919Q527k548n316P738n96o330O922
3669C095j45p647N966J552p627M960L417p723M843M618q517K821M848p830J039
3684b330O049o838N71P109o585o49P640n688k667P437m667l599P765k914m396
$$ plain form
3578 -3063 -3050 4984 -1189 -2323 5152 -726 -3765 4004 -1086 -5511 3013 91 -4828 3304 2348 -3764
3594 -3764 3611 2721 -4759 2298 2882 -4865 1373 3501 -4313 911 4633 -4092 -523 4105 -3981
3609 -3981 -2055 4031 -3499 -1871 4798 -2578 -2401 5080 -1478 -3500 4673 -579 -4097 4275 422
3624 422 -4289 3760 1200 -4107 3244 1564 -4936 2722 2406 -4928 1631 3192 -4668 632 3296
3639 3296 -4749 -69 3768 -4203 -492 4984 -2910 -796 4941 -2629 -2269 4503 -2610 -3317 4763
3654 4763 -1346 -3200 4707 -666 -3776 3704 -383 -5302 3225 677 -4639 3099 2503 -3827 3095
3669 3095 2950 -4697 1269 2821 -4806 154 3571 -4152 691 5309 -3208 -387 4461 -3369 -2330
3684 -2330 3719 -3119 -2548 4561 -2024 -2673 4967 -721 -3388 4049 -618 -4217 3548 634 -3762
3699c762P948k248n264O648j510o844O964r9p566O378K370p290N039L462q010
3714c784M074L861q471L272N185p633J749O816p113K54O873o614j395O801m979
3729a104k482P384m348l083P843l202n198P748k145o566O744o9o284O554P90o389
3745c807N940J947p681M691L088q454L508N152p826J833N889o885P73N830o781
3760b783M1O575o576j022Q404m592l390Q033m164l972P337l113m951O473j692
3775F08n154P368o91o272O658J060p922N329K129p541L699L370o278L708M079
3790D150p503K579N585p864P83O710o884q90P964n029j728O944m740k825O561
3805C813m780l906P653k936n523P946k97n892O564J36o483N520Q59o868N319J937
$$ plain form
3699 -3762 4186 1938 -3326 3322 1812 -5032 1932 1833 -5733 645 3015 -4275 764 4226 -3784
3714 -3784 290 4151 -4320 -1048 4137 -3496 -1747 5069 -2044 -1790 5083 -1531 -2926 3875 -1104
3729 -1104 -3586 3798 -550 -3633 4210 1008 -4190 3558 1413 -5153 1591 1522 -4762 1792 2582 -3807
3745 -3807 2133 4080 -3601 1090 4178 -4276 -768 4384 -3442 -1609 4280 -2605 -1832 3998 -2783
3760 -2783 -2742 3833 -2743 -3765 4639 47 -3343 4690 526 -3446 3891 778 -4173 2300 608
3775 608 -4546 2822 2131 -4141 2517 3577 -4345 984 3113 -4428 -729 2641 -3637 71 4150
3790 4150 -3353 -774 4811 -3053 -2270 4440 -2444 -3334 4630 -399 -2127 4817 77 -2748 3813
3805 3813 -967 -4873 2780 -156 -5679 2267 1970 -3922 2642 2778 -3705 1815 2674 -4194 1125 3062
3821C062p621N096M037p672K859M513p137Q73N563o343N64N818o078R4P620o102
3837h54k113P114m620m168P559k850m001O936k211m442P204j067o059O340m86
3852B282p028N928J981p671M149L315o662L740L446o849K902M233p356K332N663
3867D405o971k42P231n220j410O975n221k074O066m429k671O848l599m354P671
3882C005j714n371O928m1o282N201M61o093N184N13o757N456L463p070L876M141
3898D900p412J676N016o836N05M953n996J044O181n424l47O623n774l491P443
3913C061l561m200O960k105l358O975j567m700O240j818o660O257N05p012N114
3928A31K908o686M530L518o767K729K645o931K654M553p026J293O922n791j84
$$ plain form
3821 3062 -4559 537 4574 -3098 -239 4274 -2863 -1990 3573 -2770 -2206 3612 -2466 -2372 5248 -854
3837 -854 -2967 4147 -473 -4641 2918 68 -3933 3003 792 -3650 3554 2487 -3572 2768 2282
3852 2282 -4746 1182 3163 -4508 -359 2956 -3706 34 3480 -3369 -467 3766 -3590 -1258 4405
3867 4405 -2566 -2808 4423 -797 -2207 4768 -453 -2527 3539 -890 -3561 3287 -312 -4666 3005
3882 3005 1291 -4080 2848 2807 -3475 1726 2187 -3906 1278 1791 -4966 490 3953 -3117 759 4900
3898 4900 -2512 -836 4180 -2656 -2151 2802 -3194 -2150 4031 -1393 -1740 4883 -891 -4382 3061
3913 3061 -500 -4700 2260 155 -3203 3772 2205 -2495 3745 1927 -4733 1524 2029 -4983 131
3928 131 3039 -3647 883 4401 -2366 363 3008 -3923 -1269 3284 -3742 -2449 4473 -1318 -1502
3943a502O277n012k104N638m475k525O709l651k799P336k418m646O989j898o184
3958d265M980J76n458N296R44n192N307J868o657M098K786p516K501M571o534
3973c095K171M823n664Q99M977n490r1N414o164j109O603m132k914O828k503l651
3989c098O110j653m384N843j671n541O605q5o165N706J356o288M244K548o440
4004b913K766K664o045K796L970o672J930N360o324O15N936n127j173N554m214
4019h77j770O081l949k502O656l223l789O837k529n134N947o99n189N533J96n236
4035c647M862J409n829M461J876o974L337L866o280K307M367n488J032M594n540
4050a647O0N223n572o45O053m885j552O555l478l479O237k120m275N833j760m488
$$ plain form
3943 -1502 4775 -237 -2341 3297 -1178 -3703 3006 -645 -3444 3892 1474 -3172 3817 1919 -4265
3958 -4265 715 891 -4567 729 1673 -3519 1788 3656 -3001 1097 3883 -3633 -1132 3439 -3095
3973 -3095 -924 3899 -1765 -866 4111 -1379 -1470 3944 -2220 -3329 3274 -858 -3772 3056 553 -3098
3989 -3098 3012 1359 -3025 2818 1147 -4394 2211 2126 -4039 1667 3023 -3265 979 3527 -2913
4004 -2913 -147 2517 -3528 -732 3238 -3434 -1504 3856 -2468 -1853 4083 -1044 -2217 3337 -877
4019 -877 -2647 3434 -515 -3017 3639 416 -3373 3464 935 -4199 1748 1049 -4140 1393 1589 -3647
4035 -3647 1215 2624 -3205 1256 3132 -3842 -505 3361 -2919 -612 3755 -1733 -701 3893 -1647
4050 -1647 -1587 3636 -1936 -2581 3472 -1413 -2965 3590 112 -3367 2870 750 -3525 2308 548 -3940
4066c940O369o87n169N652N40o354M734J461o000L332K566n639K961L547n862
4081b489J864M244o573J167N120n783j69O101m580q51N656m058j975N684l561
4096b03l173O301k509m034O161j146n094N805n5n861M928O26n778M581J664n847
4112c634M191K449n962K669L947o185J574M216n567J000M648m936Q0N408m942
4127a044j307N754m441k135N745k914l348O280k183l565N507j172m502N552qn631
4143c412M795R87n558M146J723n865L844K664o037K299L755o180J637M222n715
4158b695Q58M964m497l86N296m115j562N335m015k188O109l229l106O361j992
4173A138m052N458r90m789M857j28n345M461J235n567M322J979n433L405K613
$$ plain form
4066 -3940 2429 1742 -3427 2225 2765 -3589 1145 2606 -3394 -62 2504 -3135 -174 3373 -2489
4081 -2489 -625 3619 -2954 -1787 3333 -2450 -2619 3482 -1098 -1949 3707 -351 -2326 3358 -203
4096 -203 -3376 2925 416 -3618 2543 1397 -3697 2108 2053 -3808 1120 1746 -4032 549 2213 -3634
4112 -3634 557 3006 -2956 -287 3660 -2525 -951 3265 -2302 -1302 3346 -1590 -1510 3898 -1044
4127 -1044 -2351 3403 -1038 -3173 2572 -342 -3690 2590 407 -3158 2349 1177 -3325 2227 2219 -3412
4143 -3412 1383 2370 -3188 958 2681 -3184 660 3324 -2713 -414 3341 -2839 -1202 3020 -2695
4158 -2695 -1837 3127 -1370 -1756 3540 -575 -2137 3198 -817 -3005 3104 -125 -3231 3130 1138
4173 1138 -2914 2544 1554 -3235 1622 1494 -3851 610 1845 -3722 600 2579 -2854 551 3164
4188C164n811K233L616n871J208M429n111J423M574n157l5M957m546j821N219
4203B471l480k377N938k395k978N446j716l754N603j812m662N119k17m902M722
4218A006J429m951L583K254n801K661K894o251K064L720n151J326M608n037L87
4233a259N130n320q31M991m410j334N562l035k141O210k415l450N376j910m480
4248c316M788n24m613M743N77m618M602J212n827L516J712n978K827L404n258
4263b753K133L924m703R53L938n284j01M956m838q57N702l521k074N810k746l294
4279b755N139k330l675N288j262l666N374p27m290M444N21n235L951J548n174
4294b849L171K492n255K951K641n879J831L966n372P71M782n006O1M814l856j534
$$ plain form
4188 3164 -2647 -414 3202 -2669 -1461 2968 -2143 -720 3854 -1303 -1338 3619 -927 -2748 2471
4203 2471 -1009 -3386 2552 157 -2821 2625 909 -2845 2758 946 -3716 1403 1186 -3716 1006
4218 1006 2435 -2516 1067 3321 -2480 181 3075 -3176 -1112 2608 -2543 -1217 3391 -1646 -1259
4233 -1259 3871 -1449 -2280 2711 -1699 -3033 2529 -506 -2647 3563 1148 -2302 3074 1164 -3316
4248 -3316 1472 948 -3665 1078 1655 -2963 1639 2851 -2976 540 2252 -3726 -899 2505 -2753
4263 -2753 -620 3304 -1399 -446 3492 -1792 -1893 3063 -1775 -2632 3070 -451 -2525 3285 539 -2755
4279 -2755 2384 54 -3621 1667 405 -3261 2113 1386 -2904 1540 2061 -3174 777 2325 -2849
4294 -2849 322 2814 -2441 510 3151 -2728 -897 3069 -2303 -1532 3250 -1756 -1695 3119 -737 -2271
4310b271M653l395j748N495l007k409N978k448l708N334j204m489M755m65m435
4325c364M708N74m825L860J340n211L003K298n681K601L375n209J909L774m142
4340i90J21M171m936O3M613m235r30N268l461k056N372k705l070M707j889l424
4356c381N264j247l670M810k80m576M664Q87n553L704J516m890L279J967m808
4371b314K262L108n349J542M351n658K60M490l884p86M731l587j617N297l127
4386b81k033N224k987k977N582j690l911M663J45m725M289K36m264M128K54m891
4402c238L547J843n308K961L070n482J963L719m818Q09L446m206L64M287m177
4417a220j37M929m389j509N562l113k775M585k227k511N124j893l286M845p05
$$ plain form
4310 -2271 2382 -1013 -2761 2734 -273 -2682 3296 848 -2860 2474 1270 -3219 1536 1071 -3364
4325 -3364 1344 1918 -2907 953 2293 -2918 85 2383 -3298 -697 2678 -2531 -622 3152 -990
4340 -990 -869 3302 -1634 -1571 3042 -1193 -2123 3145 -316 -2372 3000 295 -2775 1932 43 -3381
4356 -3381 1883 636 -3034 1776 1496 -3080 1584 2471 -3082 622 2138 -2752 527 2494 -2314
4371 -2314 -52 3056 -2293 -751 3600 -2058 -1798 2692 -1192 -1978 2753 -834 -2451 2846 -281
4386 -281 -2314 2910 -77 -3054 2528 838 -3073 1590 1735 -2990 1299 1535 -2729 1399 1653 -3238
4402 -3238 309 2152 -3156 -195 2875 -2607 -644 3075 -1743 -934 2512 -1694 -1330 2957 -1220
4417 -1220 -1357 3572 -817 -2326 3236 123 -2652 1933 -294 -2805 2319 426 -2860 1985 1280
4432A280m418M785J46n358M234J351m755L512K022m843K391K140n018J957L333
4447B759n132J045M328m305j60M427m126q26M376l402j434M746k751k158N187
4462B574k054l229N468j378m767M482K54m157M302J44m121L823J044n397L595
4477E83J626n480K720K833m604J529L588m502N64L666m216M31M288m646o92N287
4493B975k983k218N415l087k866M893k167k892M709j328l697N163m17m363M156
4508A293L78n058L690J882m848K601K171m176K563K466n231J609L429n248Q01
4523a678M513m257j56M270l409p49M124l440k103M925k588k071M957j519l270
4538b451M787p34m271M089m61l913M080M76m426M266J200n139K990K191n166J598
$$ plain form
4432 1280 -3138 1647 1793 -3565 669 2020 -2735 777 2799 -2044 347 2487 -2531 -574 2759
4447 2759 -2373 -1328 3000 -1305 -1465 2962 -1164 -1990 2386 -1016 -2450 2296 -455 -2613 2574
4462 2574 520 -2709 2759 1381 -3386 1096 1350 -2807 1495 1639 -2482 1341 2385 -3012 583
4477 583 2209 -3271 -551 2282 -2322 -793 2795 -1707 -1143 2523 -1693 -1262 3026 -1620 -2312 2975
4493 2975 -8 -2226 3189 102 -2764 2129 -38 -2930 1779 451 -3246 1917 1500 -2863 1293
4508 1293 1671 -3387 303 2185 -2663 -62 2109 -2067 496 2962 -2269 -660 2769 -2479 -1678
4523 -1678 2835 -1422 -1578 2692 -717 -1466 2658 -782 -2885 2040 -548 -2619 2338 819 -2451
4538 -2451 2336 1602 -2669 1420 959 -2954 1126 1602 -2824 1442 2642 -2497 493 2684 -2482 -884
4554h84L089m593R80M015m219P75L765m237q3M537m220j398N144l098k392N317
4570B498k030k541M299j486l453M442j194l712M161K36m298M411Q19m714L397
4585H35J511m757K207K306m381K405K696m765J672L642n198L14M137l864o68M390
4601B482l624j175M947l049j792N003k812k946N044j378l442M696m60m074L941
4616A361J56l928L610P84m639L157J829m982K567K606m741J923K781m605J352
4631g69L248m069L11M193m183n34M722l527j765N167k570k547M748j912k774M667
4647B406j935l049M205o64m238M419L29m343L632R01m187K725K398n181K390K414
4663B222m365J732L528m652Q13L801m406m8M220l755j019M358l194j424M855k936
$$ plain form
4554 -884 2205 -2388 -1408 2607 -1612 -837 2928 -1309 -1392 3145 -1075 -2473 2671 -427 -2819 2498
4570 2498 468 -2073 2226 740 -2713 1729 535 -3177 984 1220 -3078 1333 2152 -2562 835
4585 835 2346 -2411 -204 2102 -2279 126 2822 -1943 -271 3371 -1827 -1513 2624 -1240 -1908 2482
4601 2482 -1142 -2317 2630 -419 -2211 2792 -20 -2966 2078 700 -2742 1954 1494 -2580 1361
4616 1361 1517 -2411 1199 1983 -2656 501 2330 -2652 -85 2521 -2220 -297 2484 -2121 -769
4631 -769 2479 -1590 -1279 2914 -1269 -1803 2919 -608 -2373 2794 224 -2323 2425 513 -2261 2406
4647 2406 471 -2578 1627 963 -3275 1144 1473 -2870 762 1663 -2524 201 2599 -2582 -192 2222
4663 2222 -2143 -411 3117 -1535 -722 3079 -1327 -1375 2845 -910 -1929 2429 -765 -2189 2666 -270
4679b70k016M504j994l059M611j092l815M537J35m169L918Q94m762L473R60m587
4695b732K953K298m840K196K573m622J725K920m449N34L818m178J57M416l672
4710i03p38M404l170j926M853k410k498M458j565l014M462j305l254L910L2m154
4726b818L672Q38m604L396J412m426K771K324m824K270K691m815J369L368m051
4741a427K67M240m205j57M157l746r56M180l186j779M672k352k278M445j291l029
4757b445M210p46l826M247p9m005L623Q74m129L119J655m567K232K390m742J548
4773f41K891m475J219L403m059N69L879m130l39M329l542j217M228k589j782M763
4789B507k188k623M630j253l258M142j295l915M338Q8m141L546J480m323K736
$$ plain form
4679 -270 -2286 2218 224 -2835 1776 684 -3131 1406 1541 -2628 1290 2184 -2578 895 1855 -2732
4695 -2732 221 2519 -2321 -125 2448 -2174 -449 2471 -1978 -1444 2374 -1804 -1647 2769 -903
4710 -903 -1641 2763 -407 -2333 2520 110 -2388 2070 505 -2509 1953 648 -2606 1304 1336 -2818
4726 -2818 854 1692 -2912 484 1896 -2530 241 2565 -2259 11 2702 -2113 -744 2624 -1427
4741 -1427 -1160 3080 -1125 -1282 2875 -871 -1827 2353 -833 -2612 2060 -292 -2570 1875 584 -2445
4757 -2445 1765 1019 -2807 1440 1361 -2644 979 1853 -2276 843 2498 -2069 163 2553 -2189 -641
4773 -641 2250 -2225 -1006 2397 -1662 -1093 2786 -1344 -1683 2646 -896 -2113 2115 -474 -2256 2507
4789 2507 319 -2304 2326 1073 -2185 1957 662 -3253 1085 1173 -2968 578 2058 -2265 471
4804D71J777m677K211K296m559J779L120m646J672L367m085L68L726l620p48L613
4820B065l006j210M458k684j962M977k234k747M426j394l307M083q29l477L988
4835A147M48l693L442P30m229L123J310m768K083K691m446J372L113m016R63L355
4851B625l892L17L327l943p77M373l027j027M591k353k138M425j791k858M064
4866A916j758l124M334n56l501M110P10m171L007O60m000K348J523m082K268K895
4882B579m445J547L350m427P60L471m213O4L859l551m40L955k914j154M275k989
4898b73k246M765k097k836L926q79l035M105l61l318L636O9l976L601Q81m577
4914b615L056J673m100J759K731m121J213K655l936Q14L146l991J02L929l560
$$ plain form
4804 471 2248 -2429 -218 2078 -2481 -702 2418 -2228 -556 2811 -1274 -906 2820 -800 -1548 2065
4820 2065 -941 -2151 2307 -377 -2339 2638 404 -2343 2083 689 -2618 1465 636 -2841 1147
4835 1147 1595 -2098 1344 2074 -2155 968 2278 -2490 -407 2284 -2162 -790 2323 -1693 -730 2625
4851 2625 -1267 -950 2377 -1566 -2343 2030 -997 -2024 2567 214 -1924 2501 710 -2148 1916
4866 1916 158 -2966 1368 812 -2689 1421 2131 -2040 967 1627 -2373 -25 1498 -2584 -316 2579
4882 2579 -1866 -319 3031 -1396 -636 2835 -1378 -1314 2545 -1006 -1446 2509 -405 -1559 2716 -273
4898 -273 -2519 2246 149 -2687 1239 360 -2675 1430 1069 -2249 1387 1456 -2520 1081 1962 -2615
4914 -2615 441 2114 -1986 -227 2504 -1617 -404 2251 -1685 -871 2275 -1716 -1614 2315 -1245
4929a245r47M400k438j724M410k268k056L934j547k730L653p69l062M250l55l968
4945b462L692L19m311L054J063l946K336K153m024K008K543m173J209K999l864
4960a404N02L066l594k02L939k858p73L972k960j300L988k570k424M334j198l359
4976b841M058j36l152L463l01l522L204M80l795K881J580m158K665K028m172J675
4992d3K338l821P89K474l435K69L428l752L0M262l141j106M019k220k153M007
5008A945j706k270M040j664k638M031n41l723L998k12l688L078J052l865K371
5023B08J528l620K129J980m479J559K759l971R39L049l204J73L560l432l06L506
5039B378k983q39L661k536j419L706j766k651M176r51l163L408o49k902L595o8
$$ plain form
4929 -1245 -2192 2208 -230 -1954 2456 188 -1868 2066 519 -2211 1442 673 -2389 1861 1506 -2462
4945 -2462 1230 1549 -2762 292 1355 -2591 -255 1898 -2126 -118 2425 -1748 -539 2460 -1404
4960 -1404 -902 2164 -1430 -1632 2307 -551 -1324 2648 -312 -1612 2376 -194 -2618 1716 518 -2841
4976 -2841 1217 1081 -2071 1392 1091 -2431 773 1253 -2542 339 1919 -2239 426 2454 -1718 -43
4992 -43 2295 -1526 -737 1737 -1698 -1429 1999 -1753 -1723 2539 -602 -1708 2311 91 -2062 1945
5008 1945 239 -2031 2009 345 -2293 1738 1197 -2526 1472 1260 -2428 650 1702 -2163 208
5023 208 1736 -1884 245 2225 -2254 -695 2064 -1907 -968 2081 -1123 -950 2610 -822 -1128 2378
5039 2378 -605 -1444 2217 -319 -1738 1968 202 -2449 1727 776 -2387 1021 372 -2530 1065 997
5055I97l284L435O42l788K482J609m212J972K026m161J356L295l730R40K683l262
5071a000L4L292l354p06M049k994j039L792j870j912L511j604k421L903r45l195
5087b459L775j05l263L285N76l857K846Q08l709J957J357l511J870K155l465J210
5103e30L184l985L70L215l574R5L531l161l73L666k602j223L673k307k139M088
5119A928j826k620L724o33k670L215l3k875K733L98l901K810J385l883K345J800
5135A897l687J716K352l764J102K486l301K72L055l063j56L514l274p00L534k304
5151c21j726L743j709j820L613j421k661M014j062l032L720j11l228L256J69l276
5167a852K241J084l603K003J589l584J673K436l308M91L228l494j41K970k967
$$ plain form
5055 997 -2287 1148 1790 -1998 484 2093 -2119 -147 1879 -2282 -926 2369 -1361 -421 2262 -1000
5071 -1000 -966 2326 -1028 -1734 2315 -679 -1718 2074 204 -1708 1803 199 -2222 1681 736 -2459
5087 -2459 1316 1211 -2052 1233 1809 -2048 798 1606 -2103 -146 1211 -2300 -430 1725 -1740 -530
5103 -530 2654 -1331 -961 2254 -1320 -1225 2306 -855 -1228 2438 -164 -1387 2286 -21 -2160 1928
5119 1928 102 -2518 1206 573 -2097 1118 1085 -1790 943 1341 -2560 250 1635 -2248 97 1897
5135 1897 -1790 -74 2278 -1486 -384 2102 -1199 -927 2128 -935 -1091 2423 -851 -1551 1983 -321
5151 -321 -2047 1696 -13 -1833 1780 359 -2302 1712 650 -2382 1338 1227 -2001 1255 1424 -1852
5167 -1852 389 1473 -2130 -127 1462 -2122 -449 1987 -1321 -830 2398 -1096 -1237 1733 -1234
5182a234k31L358k575q49L915k362j602L765k073k059L521j477k433L226J9k606
5198a697K863j14l130K743N45l716K500J423l521K362K033l568J303K172l575
5213a377N80K634l382L39L201k928m8L213k426j216L079j755j643L126j639j644
5229a886L307q17k403L538p24k970K964k8k964K711O53l343K337J649l554J838
5245C08J337k989O41K392l234O72K747l247M21L020l000l52L232k443j226L570
5261A849j882j747L529j447j941L092o36k723L132m01k845K891J8k933K631P42
5277A329l663K644J389l396J468J992l159Q98K361l214M79K751k726r6K867k600
5293f76o52L068k600r41L404j895j603L134r78k294L291m96k659L130l24k751
$$ plain form
5182 -1234 -1465 1893 -682 -1531 2384 22 -1580 2185 112 -1947 1574 97 -2336 890 909 -1697
5198 -1697 1166 1052 -2078 665 1210 -2506 -6 1417 -2104 258 2291 -1277 26 2198 -1377
5213 -1377 -797 1837 -1545 -1206 1995 -933 -981 2232 -194 -1410 1669 -86 -1729 1397 -242 -1886
5229 -1886 1421 604 -1799 1739 1015 -1955 1009 981 -1983 728 1381 -1962 375 2024 -1530 308
5245 308 1645 -1344 -703 1689 -1545 -873 1874 -1373 -952 2068 -932 -1284 1948 -495 -1721 1849
5261 1849 -33 -1780 1749 302 -1639 1453 817 -1906 1226 825 -2020 871 889 -2044 587 1329
5277 1329 -2334 310 1699 -1697 -229 1763 -1396 -498 1863 -1351 -872 1879 -847 -943 1924 -676
5293 -676 -1328 1740 -860 -1801 1603 -292 -1895 1239 261 -2033 1258 762 -1897 1233 909 -1842
5309a842K457O55l307K806Q26l391J883J576l410J666J770l104P05K395k959K42
5325a032K899k859J69K601k643l26L216k250j311L127j400j915L326j274k146
5340a818L157n78k602L103k27k944K672M14l431K662J007l035J679J548l087J282
5356a98J589k976J163K035k621L43K646k575n37L041k471r52L226j978j426K990
5372A299j187j584K815r68k286L110l81k843K794M45l120K634P62l044K051J037
5388A534l107J657J553l282J392J811l003Q48K381k676k69K776k292q03L017k036
5404d99p84L118k098j247L233j409j693K806q63k276L103m60k611K459J59k654
5420a716K362N27l244K238J213l198J526K077l387J291K011k992R11K136k892
$$ plain form
5309 -1842 615 1270 -2037 769 1595 -1796 87 1663 -1747 -81 1689 -1415 -710 1685 -1274 -1032
5325 -1032 1867 -992 -823 1778 -865 -1191 2025 -225 -1536 1591 191 -1724 1602 328 -1818
5340 -1818 1339 761 -1841 1262 1035 -1909 763 1177 -2254 408 1415 -1620 59 1607 -1480 -198
5356 -198 1391 -1585 -422 1613 -1008 -665 1981 -594 -1131 1910 -561 -1513 1713 -265 -1691 1299
5372 1299 112 -1472 1343 375 -1911 1199 818 -2025 769 1214 -1906 728 1490 -1554 497 1534
5388 1534 -1573 84 1637 -1645 -253 1558 -1445 -597 1784 -892 -1161 1615 -677 -1480 1537 -499
5404 -499 -1283 1835 -263 -1510 1723 314 -1379 1427 564 -1712 1391 931 -1680 779 938 -1716
5420 -1716 646 1173 -2071 167 1380 -1818 -292 1785 -1602 -311 1700 -1292 -381 1755 -1137
5435a137K98K661k490l14L044k606p45K577j143j291K414j193j790K867p24k257
5451a829K880j60k857K710L49k718K077N62k583J930R15k797J412J619k802J051
5467b41K226k930M63K357k775j5K347j994n31K554k155o86K883j436j518K707
5483A256q27j871K826r22j923K548m49k449K596L83l055K356O59l041J996J271
5499A354k989J463J500k658O81K248k651M17K377k670k4K893k268r83L002j858
5515a66j251K609r13j869K804r96j916K947r86j980K627p9k335K013M46k291J971
5532F35N99k768J983J089k997J338K110l068R35J807k702M16K304k411j84K238
5548A324k213k10K610j971r42L172j658j473K626p32j931K479k71k041K090K53
$$ plain form
5435 -1137 -839 1822 -668 -982 2062 -544 -1289 1288 145 -1146 1268 75 -1715 1152 428 -1829
5451 -1829 1051 891 -1966 744 1093 -1625 452 1014 -1569 361 1276 -1521 -109 1510 -1292 -241
5467 -241 1985 -945 -482 1875 -900 -915 1432 -562 -1093 1461 -694 -1380 1503 67 -1451 1256
5483 1256 429 -1442 1384 462 -1461 1087 638 -1811 785 1168 -1887 469 1128 -1913 83 1354
5499 1354 -1635 -172 1328 -1330 -649 1599 -1052 -635 1742 -928 -952 1941 -327 -1310 1692 -166
5515 -166 -1417 1192 279 -1590 1214 218 -1698 1249 263 -1717 910 831 -1504 509 955 -1336 635
5532 635 1234 -1534 449 1538 -1459 -121 1989 -1079 -144 1663 -1039 -623 1681 -730 -914 1324
5548 1324 -889 -1099 1511 -460 -1402 1770 112 -1361 1265 533 -1398 1081 810 -1231 859 1112
5564A112k688K082N44k740K073Q88k831J592J331k852J194J610k341Q34J819k550
5580i23J13K436k289n31K887k136o41K694j688j096K185j211j576L280j201j888
5596a585K805o27k278K445J04k599K333K28k426K105N65j904R27J454k794J250
5612CJ399k624N47K133k270KK498k172n53K622k161o07K501j569j371K920j056
5629B42j739K846q71j689K246k92k218K377l07k311K343N27k656J608J031k640
5645a503J310J760k994R15J705k310P81K141k812N79K141k682P1K519j985r16
5661a280L141j972j392K966j426j470K580r31j794K421l91k267K290M56k608K323
5677F46N52k870J926Q62k364J333J362k688J147J903k795M36K234k523N6K143
$$ plain form
5564 1112 -1576 506 1050 -1690 383 1271 -1560 32 1363 -1489 -295 1315 -1026 -192 1627 -923
5580 -923 -810 1626 -663 -1194 1693 -443 -1084 1610 -78 -1174 1011 -200 -1776 1504 303 -1585
5596 -1585 1220 593 -1685 760 864 -1735 598 826 -1600 505 1070 -834 93 1547 -1247 3
5612 3 1402 -1222 -675 1458 -812 -810 1688 -484 -1037 1585 -576 -1183 1318 -251 -1622 1298 242
5629 242 -1497 1349 478 -1211 1035 743 -1475 902 595 -1716 627 1154 -1502 106 1137 -1503
5645 -1503 -193 1567 -1427 -512 1193 -1117 -336 1805 -1007 -428 1713 -969 -898 1621 -364 -1280
5661 -1280 1861 -111 -1503 1463 37 -1433 1147 216 -1578 843 452 -1815 475 931 -1677 646
5677 646 1198 -1672 254 1116 -1248 85 1447 -1241 -94 1809 -986 -550 1684 -839 -783 1360
5693A360k070l93K532j508j035K572j746j014K666j266j476K498o49k097K603
5708I77n04j993K207L69k528J900Q12k711J656J046k845J515J551k368N61K005
5724A650k883M25K149k480J86K643k162n87K775j654j165K616j244j770K761j086
5740A74j354K360m05k141K365m34k112K178O68l105J953Q16k202J352J243k560
5756a204J277J700l019O53K142k450M33J916k071j89K473k077q48K538j324j508
5772a558K771j459j075K243q25j655K461j61k201K517j38k245K008N38k640J618
5788A99O12k258J276J026k282J162J799k262M52J279k105J94K064j874J18K210
5804A610j932o87K464j669r31K300j680j161K979j076j699K762n40k024K563n44
$$ plain form
5693 1360 -710 -1103 1429 -79 -1114 1458 -288 -1302 1364 98 -1378 1120 471 -1626 977
5708 977 473 -1520 687 1056 -1472 428 1240 -1471 185 1231 -1614 -99 1452 -916 -355 1650
5724 1650 -1233 -808 1341 -1139 -953 1690 -472 -1059 1716 62 -1103 1513 269 -1501 1260 174
5740 174 -1180 1180 775 -1366 999 565 -1547 631 1299 -1806 147 963 -1239 113 1356 -1204
5756 -1204 73 1773 -1246 -593 1549 -901 -468 1448 -623 -812 1661 -416 -1264 1274 -50 -1558
5772 -1558 1213 -246 -1321 922 97 -1558 903 742 -1459 1058 920 -1325 683 1221 -1419 199
5788 199 811 -1447 -171 855 -1427 -265 1534 -728 -276 1003 -1102 -908 1156 -718 -600 1610
5804 1610 -322 -1009 1455 -214 -1145 1155 -525 -1686 1293 217 -1482 1280 740 -1284 1279 735
5820G35k493J915M87k223J533J138k340J563J267k834J121J629k811P27J930j949
5836f05K18J956j966n74K471j886p39K340j810j137K727r78j505K731m50j793
5852a000K197m03k549K504k06j984K093L93k502J821J296k965J365J179k503J008
5868b56J716k414K78K214k359J46K081k031n26K820k333o78K801j539j141K542
5884A321r63j297K256o00k052K174k55k206K330L9k203J669N93k357J868J061
5900A378k506J237J549k932J169J667k176j48K353k153k15K310k204k41K287j802
5916d27r15K671j495j042K711j072k011K746o98j857K075l4k281K280K22k240
5932a367J895P58k611J854Q88k527R40J507k590R30J831k625O18K024k319n2K383
$$ plain form
5820 735 -1758 157 644 -1579 -46 1092 -1248 315 1582 -1252 -131 1498 -1313 -586 1344 -605
5836 -605 -387 1569 -397 -971 1500 -386 -1125 1215 -595 -1732 995 17 -1488 1243 793 -1000
5852 -1000 1197 794 -1755 749 543 -1441 652 1045 -1457 364 1660 -1305 60 1239 -1264 -256
5868 -256 1460 -954 -676 1538 -821 -675 1406 -625 -1151 1669 -664 -1342 1459 -80 -1221 1321
5884 1321 358 -939 1317 717 -1335 839 584 -1622 708 747 -1456 213 806 -1551 317 1378
5900 1378 -1128 109 1658 -1274 -105 1562 -614 -762 1591 -562 -777 1533 -671 -912 1375 -427
5916 -427 -1342 1329 -166 -1208 1503 431 -1580 1166 468 -1389 686 652 -1629 651 873 -1367
5932 -1367 528 1286 -1325 529 1417 -1110 -170 1337 -1253 -323 1508 -1117 -499 1525 -794 -846 1537
5949A537j788o66K267j518q86K407j093j050K189j238j715K566m91k196K135J52
5965F12j967J643M46k377J964Q72k575J305J341k558J077J340k349Q89J843j995
5981d89j2J880j933j55K489k312m19K459j681j094K610j236j456K268q00j818
5997a699K222j04j918K155J85k189J964M59k251J638N08k156J003J092k082R66
6013b07J485k138M03J715k253M27J818j840k18K369k026n42K015j230o97K138
6029A219j236r31K184q53j953K500k80k009K189O1k377J659Q77k531J803Q58k493
6046a313J341J031k283Q08J857k451K38K308k443K55K321j980k17J897j495r62
6062a088K540j311j414K277r64j458K508q47j680K420n17j903K372j88k308J771
$$ plain form
5949 1537 -251 -917 1350 -168 -1054 1353 260 -790 1399 161 -1554 1012 521 -1675 460 612
5965 612 -1355 288 734 -1643 321 1193 -1382 -77 1264 -1294 -217 1123 -1226 -337 1506 -489
5981 -489 -501 1379 -554 -709 1780 -532 -951 1508 -173 -1267 1343 107 -1349 919 119 -1699
5997 -1699 523 419 -1499 656 841 -1348 616 1075 -1176 462 970 -1186 -183 909 -1173 -207
6013 -207 1278 -860 -457 1258 -995 -568 1250 -590 -808 1561 -465 -1007 1008 -222 -919 1219
6029 1219 -17 -948 1236 383 -1570 930 650 -1359 830 891 -1486 173 1050 -1481 322 1180 -1313
6046 -1313 28 1059 -1224 -416 1441 -1010 -772 1536 -907 -652 1669 -311 -528 1369 -126 -1088
6062 -1088 1452 141 -1273 1004 40 -1418 1090 243 -1437 983 466 -1437 935 747 -1561 210
6078B10J026k410J209J499k407O11J473k255P03J657k302N89J813k085R0J829
6094A250j817m97K186j400j110K675j265j103K541j052j357K355j115j663K201
6109H29N2k482J860L81j925J667N15k252J572J079k423R21J282k093O25J600k184
6126i76N46J722k094L65J809j609o78K213j624q89K820j617j311K401j114j313
6142a349K136l71j720K006k72k020K094J93j926J657P42k226J449J182k538R74
6158A1J169k372R72J687k224J81J871j905j58K001j851l92K215j527q83K310j075
6175C0j167K252o48j658K135m83j944K044j11j933K150J25k342J967N42k258J218
6192h1R98k055Q70J508k210N71J816k072P3J803j646l18J976j764m72K063j160
$$ plain form
6078 210 1236 -1174 35 1534 -873 -262 1211 -1044 -341 1316 -986 -397 1416 -669 -579 1250
6094 1250 -567 -1064 1122 -278 -1388 1287 22 -1081 1460 408 -949 1406 291 -1372 829
6109 829 881 -1601 259 640 -1285 382 897 -1355 217 1296 -1127 -206 1076 -1017 -392 1208 -976
6126 -976 -430 1292 -802 -437 1372 -237 -915 1298 -326 -1215 1605 -12 -1323 1078 -36 -1349
6142 -1349 787 416 -1304 702 430 -1590 504 697 -1229 428 1170 -1056 393 1575 -963 11
6158 11 1180 -1192 -220 1467 -757 -576 1295 -610 -768 1233 -618 -1010 1205 -322 -1205 1105 30
6175 30 -1137 1115 467 -1191 944 461 -1483 561 450 -1483 667 792 -1550 417 959 -1299 -81
6192 -81 917 -1138 -268 1240 -970 -399 1417 -655 -582 1221 -425 -743 1233 -531 -1003 1060 -100
6209a00p97K278j392j138J891l97j550J816m7k110K241J34k148J715M84k090J478
6226B68O69j954J147P41k055J248J440k296M36J791k436J89K151k109j8J753j216
6243b51q31K317j492o08J781p69j437K378p49j959K342k53j676J921K86k237J398
6260A61N92j615J183P51k231J002J299k055Q99J059k040N17J692k018M00J841
6276A437j863n19K550j527p30J999j537j106K385o90j615K090j99j959K056l32
6292D40j800J946M0j994J772K74j578R64P14j825J013J410k542R37J622k238O09
6309b36J707k134j4J880j645m74K237j584m89J890j275j249K399q08j301K212
6325A116o09j607J994j49k127K067J52k089J734M64k142J377R62k141R30J075
$$ plain form
6209 -100 -897 1381 -11 -1149 742 345 -1205 611 564 -1546 695 829 -1319 396 880 -1210 268
6226 268 937 -1017 130 871 -1184 64 1504 -792 -356 1435 -1001 -812 1339 -770 -788 965 -251
6243 -251 -1082 1235 -257 -865 916 147 -1290 1088 339 -1620 722 469 -1207 714 1000 -1237 161
6260 161 753 -862 321 1072 -1159 -157 1142 -913 -14 1045 -995 -478 1214 -804 -404 1437
6276 1437 -426 -945 1605 78 -652 1347 -190 -1296 1089 399 -1216 874 675 -1284 772 440
6292 440 -1360 586 626 -1368 404 678 -900 64 778 -1047 -34 1376 -1166 -229 1393 -845 -236
6309 -236 1471 -663 -677 1203 -442 -916 1321 -263 -752 1138 -137 -1386 1013 205 -1096 1116
6325 1116 507 -1100 894 745 -1382 685 837 -1252 482 946 -1196 181 1143 -998 -68 1007
6341A007j745N77J202j800L00J550j857M0J963j626k70J877j299q03J767r34j022
6358a073K026p23j399K087n66j474J628q2j798J953J18j712J427P36k152J031
6374B7Q87j889Q58J403k082O63J425j882J07J666j388n82J880j620k90J987j510
6391c40p18J978j183j016J815j79j587K163p72j196J498K45j580J601J15k018
6407a174J296Q19j882J122P84j932R35J144j919J79J777k182N02J684j849l0K043
6424A317j652k93J789j278q30J935j166p29J767n03j290J665N5j937J533k02j496
6441a315J861P5j735J340P66k329J421R30j643K66J340j675J67J834j889J36J874
6458A424j705o20J974j554n13J774o92j069K201j086j369K188n61j458J654k23
$$ plain form
6341 1007 -738 -161 1041 -759 -459 1091 -766 -726 1237 -389 -659 1218 -81 -884 883 -51 -1073
6358 -1073 953 230 -1169 918 352 -1122 506 424 -1374 579 697 -1015 412 1148 -1004 27
6374 27 914 -975 -117 1286 -796 -133 1292 -590 -483 1183 -205 -787 1093 -527 -817 1170 -340
6391 -340 -1058 920 -263 -1279 536 357 -1230 933 161 -1035 463 708 -872 729 844 -1174
6407 -1174 122 941 -941 181 965 -967 -32 1112 -807 -628 1149 -1033 -531 1153 -696 -726 1317
6424 1317 -335 -628 1161 -117 -947 988 -178 -907 860 357 -933 732 787 -1150 383 181 -1315
6441 -1315 546 621 -1114 226 992 -1337 84 1014 -629 -363 977 -698 -531 1303 -586 -450 1424
6458 1424 -281 -901 1073 -481 -994 780 88 -981 1220 134 -1235 953 392 -1066 588 365
6474C65j538J622L53j727J374N23j889J300L90j685R04J023j766O99Q61j472L24
6491c39J529j512O2J316j638k13K122j635l49J905j155o80J761q26j201J370j7
6508E00j710J749m9j466J266L01j577J066O74j877J129P57j475P49R74j842L91
6525d40J493j693K87J578j690R5J321r06n60J343j258n04J789r01r46J640n45
6542A03j328K022n64j204J423K2j625J481M41j675J535K77j982J536K64j663O75
6559b62J246k075Q17J348j576J47J349j568q8J490j315q2J674j057p38J666r13
6576F3p98J603p01j427J997l81j369J437kj468J536M03j865J248N72j943J071
6593b4P80j769R46J239j886N44R91j202J21J432j749r2J565j232m52J799j168
$$ plain form
6474 365 -1173 449 802 -925 449 972 -917 383 773 -912 -8 1015 -751 -52 809 -663 -339
6491 -339 1190 -322 -260 1056 -582 -795 1327 -308 -657 1248 93 -587 1174 348 -853 517 500
6508 500 -1210 539 490 -976 290 591 -986 80 754 -1123 6 763 -712 37 1011 -831 -440
6525 -440 1053 -640 -353 1225 -465 -370 951 45 -515 828 -430 -934 855 -46 -992 648 103
6542 103 -1225 797 233 -971 452 474 -1151 330 771 -904 631 908 -1074 462 726 -937 -262
6559 -262 984 -1091 -274 1074 -502 -355 994 -574 -662 828 -487 -569 1105 48 -690 976 63
6576 63 -735 868 167 -1260 737 356 -1013 424 422 -1046 490 893 -972 276 848 -1095 -24
6593 -24 756 -1013 -67 1172 -714 -170 821 -381 -260 1172 -577 -669 896 -336 -788 1011 -157
6610a57n07J479r62q58K044j317r22K094o96j628J963p7j365J321N2j456J226
6627B34P17j770J220N50j782N16J239j981O30J025j070J78J140j459K06J424j483
6644d66l91J702r53q75J763n30j156J939o54j053J474l27j490J696r1j700J311
6661A99M63j503P76J001j862R74J049k186Q90R60j698P42J087j214j25J572j438
6678c13l16J531r95m40J211p89p66J519m71j236J803n86j007J060k5j324J453
6695C09K2j358J683J90j581R42O54j707N28R66j206N39J159j660K86J061j455
6712f28P0J288j012kJ263j383m19J729p24p55J447p61j017J826m72j563J577j48
6730C16j293J414j8j258J241K04j450O79P39j652J004Q42j684N90J443j715L79
$$ plain form
6610 -157 -664 815 -147 -1005 1039 -278 -1200 894 198 -1430 533 456 -909 412 464 -992 234
6627 234 951 -819 401 951 -831 -315 924 -1057 -427 598 -472 -294 846 -613 -407 1017 -466
6644 -466 -857 845 -108 -983 780 250 -906 1033 379 -674 800 473 -1017 679 588 -1112 199
6661 199 662 -841 -65 936 -926 48 1097 -1089 -199 761 -937 -195 892 -322 -447 1125 -313
6678 -313 -629 902 -93 -533 678 -111 -877 642 171 -1065 738 152 -855 205 180 -1144 309
6695 309 331 -1027 656 846 -735 207 861 -846 -318 648 -558 -19 1140 -520 -234 827 -628
6712 -628 -558 730 -282 -284 979 -404 -823 906 182 -573 874 113 -904 922 450 -1113 464 316
6730 316 -977 437 419 -839 402 606 -844 -165 574 -1078 -74 768 -916 -326 1117 -598 -219
6747b19J386j489m80J744j207k00J414j198p25J574j075j98J458p59q85J668p17
6764I2j257J394n2j095J208L74j454J100M05j498Q88P72j675O45Q77j340L42J105
6782H31j137j18J474j453k32J358j230l75J814r31p08J339m69r61J369n84p27
6799g40J197%j454J670r3j520J490K50j483J043L27j769P89Q77j464M10J337j537
6817f70O28Q65j447P6J316j261P4J152p84n10J721j233n91J495q60r25J727n75
6835A98r64J431k52j441J141M18j377J133K66j468J027Q01j897J060O85j427N18
6852a48J011j440M00J027j385Q6J437j442l2J514j375l54J537n66r78J390o29
6869E3q88J449o65q03J536m88j260J327M75j760R98O06j195P27O19j511O48J104
$$ plain form
6747 -219 1167 -322 -802 942 -265 -465 949 -249 -974 600 -475 -673 785 26 -859 809 92
6764 92 -1165 229 177 -918 290 664 -790 310 715 -783 105 877 -798 -153 724 -616 -274 831
6782 831 -306 -424 1050 -403 -635 723 -507 -882 932 1 -707 632 163 -798 571 -13 -740
6799 -740 457 457 -997 673 580 -940 550 800 -683 360 687 -1082 -293 584 -880 -470 867 -670
6817 -670 -42 823 -624 -548 768 -493 -419 733 -51 -561 1160 -73 -664 831 -29 -954 773 198
6835 198 -766 665 413 -1028 113 531 -846 287 553 -915 112 913 -984 76 761 -666 -148
6852 -148 863 -577 -177 850 -535 -449 988 -454 -486 1028 -347 -701 836 270 -708 682 53
6869 53 -835 614 -51 -854 682 194 -1066 261 736 -1024 -26 580 -615 112 731 -780 -132 972
6887I72j687N13J156j773O81J085j339m33J727j065l72J658j126p51J620p14q38
6904f86J445o26r25J487o07q34J182N6j522J444J96j643J271K57j304J081N17
6921G89j463O09Q75j537N38Q85j334K11J166j222Q4J287j094k77J079j152R5J251
6939G90p21j002J755p93p84J341k50j077J224j86r84J384q9j493J405J14j587
6956i53J164O68j691O40R38j607L99J421j399J46J217j554R1J319r18n58J696
6973A019j098o15J805j051j102J658n91r42J703m42j249J206J56j278J201J26
6989E06j319J075L79j532Q53Q78j667P29Q42j293O19Q29j246L7J058j245J00J511
7007A114j582k06J177q15l78J759r07j002J312k04j165J726l34j174J143Q9j490
$$ plain form
6887 972 -715 -202 954 -819 -138 947 -392 -825 902 -163 -535 1123 -3 -754 866 152 -686
6904 -686 759 133 -792 695 88 -746 436 492 -1030 414 610 -1033 238 495 -809 272 789
6921 789 -674 -65 810 -727 -189 696 -638 -427 739 -483 -399 888 -206 -483 596 -556 -461 790
6939 790 69 -933 822 29 -755 586 336 -741 483 297 -687 697 608 -885 520 634 -953
6956 -953 211 879 -812 -172 766 -841 -442 979 -420 -274 943 -611 -520 799 -119 -677 1019
6973 1019 -79 -694 1111 60 -1042 616 25 -917 786 344 -905 301 457 -821 380 506
6989 506 -813 262 641 -891 -38 840 -827 -98 744 -549 70 899 -347 -310 748 -497 -397 1114
7007 1114 -468 -674 503 -312 -690 1069 162 -840 472 268 -897 829 495 -679 464 553 -937
7024i37J308L26j674J172N55j360M98P92j677J077Q96j652M11R31j114o0J525
7041A017j263j15J246j119p2J072p18m47J196q57n23J233l55j240J290M0j208
7058h23J349q7j135Q62Pj095J073M76j632J281O08j596O98Q51j568L28J117j084
7076c70L96Q61j200k30J376j056o30J711j117n06J603p93j057J536l85j003J387
7093E23q6j233J336p1j305J110N7j148Q06O02j343O72J182j692M97J123j557J41
7111c86J273j525K96J277j257k43J596j253l72J598j121o59J618o43j058J520
7127F61k86j373J654pj481J073J53j265R87K49j224J086N09j660Q14R04j426M27
7145b05J070j574P68P95j152P0J078j137m34J505r43o06J607r75o21J629q77o28
$$ plain form
7024 -937 371 697 -977 195 750 -610 -112 680 -997 80 976 -676 -265 666 -448 -508 1017
7041 1017 -246 -361 885 -234 -306 766 48 -399 797 -60 -583 650 295 -945 345 385 -823
7058 -823 526 439 -696 166 173 -922 151 627 -1005 276 884 -712 -14 837 -731 -403 714 -370
7076 -370 26 887 -313 -543 833 -223 -853 858 -259 -765 838 45 -1012 524 139 -864 523
7093 523 437 -796 540 469 -836 274 331 -817 -11 591 -752 -80 1102 -590 -93 1030 -527 -386
7111 -386 887 -638 -342 935 -322 -565 1031 -222 -594 1004 -117 -776 842 199 -859 661
7127 661 375 -998 656 649 -832 241 394 -871 116 365 -859 227 736 -924 -110 794 -632 -205
7145 -205 865 -709 59 854 -298 -228 850 -287 -721 784 -159 -765 842 -133 -754 875 -2 -630
7163f30J243n73j035J450j57q82O85N03j465J141M43j472Q84N75j376P94O04j405
7181f73M33J215j353KJ186j227k78J568j297j65J253r56l72J315l29j081J654
7198H95r11q19J436j87j280J183L19j479J114P5j207J067N37j572R29O03j259
7215e56M29P84j024M9J200j312J45J027j147j60J344j086K6J072p50o13J192n71
7233D9r83J759q25o45J194k25j071Q12M28j004R53J69j462R13O20j301P53L46
7251D80j070L53R83j350N53Q15j250R4J386j373j49J267q84m89J272o57o17J503
7269H67q59p56J573p10j024J413L2j409J166K2j112R64J91j138O20Q84j398M75
7287a99R63j440N06J044j453R5J203j198J35J105j074m0J178r04n80J377p93n30
$$ plain form
7163 -630 613 40 -995 455 298 -584 101 604 -861 280 723 -749 135 710 -666 128 732 -673
7181 -673 -240 975 -378 -376 810 -417 -695 873 -424 -589 664 -292 -664 651 322 -759 895
7198 895 -16 -835 601 414 -866 317 636 -843 271 346 -861 206 743 -829 100 703 -556
7215 -556 -127 657 -367 -318 882 -430 -285 742 -405 -565 779 -307 -281 791 41 -572 620 49
7233 49 -934 825 0 -645 549 324 -747 65 493 -511 442 611 -851 62 682 -619 134 480
7251 480 -590 -237 746 -604 -51 764 -486 -392 994 -379 -528 739 -145 -634 638 -19 -636 867
7269 867 8 -748 825 115 -909 504 536 -873 293 315 -797 167 358 -780 -160 724 -674 -199
7287 -199 764 -676 -170 874 -579 -484 719 -479 -344 761 -313 -353 825 -79 -659 718 -75 -605
7305f05J498p49q31J330l81q86J012j37p17M55M72j458J103N28j560R46R16j671
7323g35Q07O79j498P08Q36j508M52J005j380L25J068j215j85J417r03k55J388
7340A006j121p39J575p56o50J580o24r80J352o1j225R24R7j344J078L89j056P32
7358A77M00j127M81J019j590K32J357j479K57J070j475M39J114j083k41J159q85
7375a75j37R80p62n98J468q70o46J099k76p14J035k61q20R34j74j033J107J20
7393B77p62P09O10j219N74P09j587O40Q01j217J62J272j466J30J151j010l79J489
7411H84j088j33R93p57n48J187m91p75J389l29j127J341l17o43O34K69j299R87
7429A77J20r72Q79L05r96J04J229j499L27Q31j026O8R57j029R4J225j176j31J294
$$ plain form
7305 -605 893 144 -687 643 262 -624 388 251 -466 -11 461 -997 106 634 -926 20 936 -735
7323 -735 72 751 -747 -39 797 -711 -259 746 -634 -309 759 -456 -641 776 -127 -382 1006
7340 1006 -115 -854 721 -35 -685 895 271 -709 643 582 -643 281 378 -966 112 501 -555 177
7358 177 577 -550 -69 950 -640 -408 949 -530 -273 797 -678 -239 875 -208 -449 710 -175
7375 -175 -312 668 -94 -692 776 -94 -740 359 83 -631 404 143 -677 257 83 -950 157 277
7393 277 -485 224 834 -385 189 898 -689 -49 752 -465 -303 969 -497 -367 784 -226 -605 884
7411 884 -204 -337 656 -101 -649 538 47 -728 661 332 -795 546 229 -414 220 489 -810 177
7429 177 297 -675 204 509 -487 -383 846 -653 -326 505 -521 -453 504 -525 -431 794 -382 -513 781
7448G81r80m13J649j122n74J225q05j67J051m63p71J030j64j020R05M29j527Q59
7466g7Q67j454N77R20j753O81R08r03j14R51q29O2R64j122j74J081o03r04J721
7485G99r29p42J349l69q56J476n60r74J317l88p81J067O8j184R37L57j144O93
7503A36K27j051P08R17j719O06N72r32M35O73r53j3J037j048M1J223r31n14J136
7522E50o59n18J180l86r48J494n91p71J023O5j280R41L95j244Q95L57j283J147
7540C67K28j313O82O57j181K49J046j210J85J020j177j5J281r67j97J063j121
7557d03j66J038m41o43J402q11o30J178m34o59P75r3q07J203mj065J007J83j078
7576d48O01O20j477O83N67j059L15M96r01O26O77j321K49J180q45o05J389q92
$$ plain form
7448 781 -199 -612 1037 -85 -659 566 -239 -406 645 182 -589 441 277 -743 162 591 -936 -77
7466 -77 790 -664 -87 833 -920 -239 669 -234 -348 603 -226 -164 800 -322 -496 585 -18 -922 799
7485 799 -130 -872 477 108 -748 728 168 -806 511 123 -658 409 477 -707 230 587 -557 136
7503 136 363 -688 20 937 -782 -176 396 -536 -101 572 -381 -394 643 -405 -364 859 -72 -586 550
7522 550 -109 -627 553 167 -781 713 122 -649 374 439 -841 100 495 -749 146 503 -780 367
7540 367 595 -718 -36 621 -560 -311 735 -475 -290 730 -447 -462 819 -148 -345 718 -403
7557 -403 -569 469 28 -615 787 -24 -654 524 90 -569 206 113 -694 509 505 -560 447 630 -448
7576 -448 153 773 -704 -21 546 -513 -198 298 -603 23 700 -621 -372 808 -37 -642 747 -145
7594a45k04J010o16n77J156n74p06J338k03j369J274M6j083P93J29q18Q35J43
7612D29j239J159L2j010M45R14j365M97P38j240M91J090j374j93J342r30j49R84
7630F21o42m48J056o47r43J495n04n83J011k54p58J135j21j139J055k27m54N13
7648A66J60p21M31N20j156N00P33j181O01P32j273M2R64p94j34J207j020j44J046
7667F79p18m78J048n11m75Q39j54r15J131k28q87J006m6j152R69M3q60R05L41
7686E37j345Q10N00q75K16Q54j109OR43j063L76O91j001J90Q59p28l59R69n01
7705c0p18J199m40o17J155m54o93J063k66p16P34J6j064J268k94o66M82R88j273
7724c26N34K30q87K4R51q90nR93j057K32Q04r37l41J228r63k1J000n44n93R23
$$ plain form
7594 -145 -349 661 45 -532 624 50 -656 682 479 -890 384 430 -653 140 269 -549 286 429
7612 429 -810 349 381 -629 -184 730 -635 -138 600 -640 -149 941 -433 -626 716 -214 -363 621
7630 621 -21 -469 587 -60 -1003 492 -12 -595 416 162 -596 539 418 -721 334 107 -347 166
7648 166 326 -395 36 556 -600 -100 633 -548 53 785 -488 -446 518 -276 -410 797 -223 -367 679
7667 679 -39 -517 531 20 -455 384 230 -685 446 218 -669 337 291 -861 108 151 -709 196 537
7686 537 -808 2 502 -373 -157 697 -412 -406 537 -526 -150 541 -460 -270 589 -139 -498 471 -30
7705 -30 -748 451 11 -606 549 95 -598 465 199 -517 217 233 -831 437 143 -523 -41 947 -326
7724 -326 208 438 -449 -425 526 -364 -369 624 -433 -201 603 -334 -675 553 -410 -431 569 25 -568 355
7744C55n12m33J262k85r91Q07oj007J177j24r53Q81M34j245P95M18j195P65O96
7763H39j447O93L91r48L84Q56r57j74J006j013Q9J009q69l91R57m43m04J091k70
7782C99r21J008k47j036J086j98q93J144J14j078R61j44p78L96O88r19N56M31
7800E69j101L03P44j024K86N91o83p1Q88n99l19R96o46l20R51n02p10J270k06
7819D17p86O68p1r12J108j55j030J442l65p31N37M36j024N73L72j159P47M72j220
7838f81L90P07q53K54J114j387p8J188q49j30J056p34m23J004o31m90J117k10
7856C64r53J044j68r34J064k99p06R10n8o21P28R5p86K25N76r52M04O57j187O80
7876H3O03j057M25N73q84q7J011p62l27Q90n01n61J123o82l49R31n26k90Q03m82
$$ plain form
7744 355 -157 -590 672 387 -604 203 197 -810 367 243 -710 171 605 -640 155 573 -622 143 839
7763 839 -608 85 476 -472 -88 768 -189 -363 643 -370 -281 728 -141 -532 425 -18 -422 669 399
7782 399 -522 486 239 -797 289 91 -802 342 456 -622 339 195 -583 -187 501 -418 138 569
7800 569 -532 -229 515 -509 -223 368 -315 -386 502 -97 -416 580 -66 -386 565 63 -647 623 417
7819 417 -369 299 228 -684 424 269 -761 681 316 -415 122 558 -466 107 479 -680 67 539 -681
7838 -681 -291 416 -437 -183 931 -456 -534 654 -195 -325 731 -3 -426 578 -53 -543 574 364
7856 364 -589 455 287 -647 417 118 -588 322 264 -357 371 466 -320 -95 481 -471 -67 590 -597 83
7876 83 686 -371 54 627 -257 -344 667 -95 -422 468 -33 -594 529 -153 -502 429 -97 -387 416 -66
7896f6k89P65m07o66P05R7p13M54M55q81O34L71p98L31O15j048j2J284j191N0
7916c10Q19o55l06J026p61o1R83p50k95R35n44m05N05k86l92Q37q8r64R85M9q45
7937e23O86L4o02L14N80r85M89L93r04N44O55j144K90L87n12L27J16m82k9J054
7957F88p46j94R46q91l65R61m90O1K91k22n34Q60L3r11N85Q9q30J009N4q95Q27
7978C26P4q04J83P30r66K18N94p26J35P59r18J73Q48q57P4P33p06l86J027n09
7998Bl36R12n49m45J138o06m33O55M0q03N75K19q21O97K46p98J63L56p46N43L25
8019C34o51L36M35r57M60O41q21o1P33r35K23P21m17l77Q34k52r01J218m82l86
8039c05M50q8l41M53J54r48Q51M6o74Q82qj146O06M08r70N35K97m64N2J028j111
$$ plain form
7896 -66 -355 410 3 -663 42 139 -574 -120 335 -546 88 459 -339 -8 607 -441 -453 831 -360 -310
7916 -310 509 -146 -452 574 -187 -248 735 -15 -310 625 81 -324 181 -105 -497 340 252 -712 273 322 -523
7937 -523 163 197 -405 -91 489 -496 -7 386 -518 26 681 -463 -173 214 -298 29 145 -337 -366 688
7957 688 -58 -252 694 -197 -562 399 -91 -30 261 39 -495 365 398 -513 72 161 -669 340 394 -501 326
7978 326 400 -404 -221 509 -457 -239 355 -371 -236 523 -395 -222 626 -231 -157 576 -130 -516 511 2
7998 2 -334 578 29 -416 722 116 -317 338 378 -425 150 369 -452 245 491 -307 -144 212 -534 9 334
8019 334 -317 19 454 -503 -43 598 -223 -284 449 -486 -263 458 41 -336 498 246 -655 563 81 -305
8039 -305 145 57 -284 169 323 -625 226 272 -402 480 472 -674 -68 340 -630 -95 202 -262 -210 818 -293
8060b93K01O99q13j27Q40p30j06R20n93m92R53p00j68P56k13n83P89l98l59M04
8080a3J78q50R24P3p47M55L25o26L21M51o60j5O46j044L45P58o45m0O12o66O6
8101a52O42n53m00J066q54m27J050o79j61O00m7n89Q89k77p12Q95J02p73N68J53
8121C41o84M09J75q86P71L09r94M74M23q18K79O52o06j63O51m04m21Q67o97k35
8141e57J151o52r5L25n9n51Q79l29o34R25Mq77P19j4q40J024j57q55P93K21q57
8162d36J65Q26r75N64L15j003O24M59o96oQ64p71j64Q49p40j38N50n07k65J026
8182E41l71q50J111j72q45Q03j56n61P99
$$ plain form
8060 -293 -92 607 -206 -333 507 -223 -329 591 -2 -494 459 -241 -409 347 134 -449 340 -58 -417 -13
8080 -13 165 -685 239 312 -435 20 345 -281 40 491 -169 -184 462 -582 -237 521 -124 -164 448 -218 -152
8101 -152 490 -63 -463 603 -251 -678 372 -307 -468 132 85 -504 385 108 -604 291 393 -380 188 341
8121 341 -343 66 241 -645 126 435 -559 -85 338 -480 -201 451 -155 -318 333 -71 -492 375 -322 -557
8141 -557 594 -58 -153 172 113 -438 441 112 -522 403 407 -470 249 235 -605 419 262 -593 200 421 -436
8162 -436 -271 555 -420 144 459 -544 80 539 -157 -163 701 -70 -234 615 -125 -263 287 -220 -485 541
8182 541 170 -680 431 259 -586 217 61 -500 299
8191B99
$$ Imaginary data points
##PAGE= N=2
##DATA TABLE= (X++(I..I)), XYDATA
0@%%%%%%%%%%%qJ6j6J6k4L2l3M1n3O1p2Q8j04J20j42J67j93K24k57K93l33L77
33B00m27M82n43O10o84P66q53R49j055J170j296J434j583J747j927K121k336K574
51A349k837L129l453L815m224M690n224N846o580P462q544R907j1689J4127j7675
66i901K3336l3807N9545k40728m05280L11286K59437J97230P5682j73303j65346
77a01849J22033Q0559L7709J222k05730j54393J34890K2482l4966J91373J07666
88B00996j06437k3670r0171j73082M3901J17936K2676Q3234l4838j56302J14885
99h72K10192m1007o5856q7131k30574k3971K11109P9472J3689j5134j51715J4012
111h7786K10283J1424q0895q284j36774p9243J64864O6320m3670N9605k8643r4781
$$ plain form
0 0 0 0 0 0 0 0 0 0 0 0 0 -8 8 -8 8 -16 16 -17 24 -29 32 -40 48 -56 64 -78 89 -104 120 -137 156 -177 200
33 200 -227 255 -288 322 -362 404 -449 500 -555 615 -681 753 -830 917 -1010 1111 -1225 1349
51 1349 -1488 1641 -1812 2003 -2221 2469 -2755 3091 -3489 3973 -4571 5336 -6353 7774 -9901
66 -9901 13435 -20372 39173 -201555 -606835 -295549 -36112 161118 236800 63497 -101849
77 -101849 20184 100743 138452 139674 -66056 -220449 -85559 -63077 -98043 93330 200996
88 200996 94559 70889 -19282 -192364 -148463 -30527 -7851 75383 40545 -115757 -872
99 -872 209320 168313 102457 15326 -215248 -239219 -28110 51362 65051 49917 -101798 -87786
111 -87786 122497 133921 53026 44742 -92032 -171275 -6411 59909 16239 75844 47201 -47580
123d7580K6996n2453o4917J81413J13798j19397n5625m5507o9927J64449J72579
134B03829r5307j22666q8782p7468J63056J90157j01583j11889j9684r4352N9307
145i5382K04593j0220q5265K2854m1051o278Q4800o5674o7896Q4808l3196q2643
157i0550P4798Q99m5083J33100N1160j23995l6342j6190k3889J33312N5703j36179
169b3256l2139K4580k6986J19919R4898j56020j06513L1786m730Q0304J01355
180A03198q6170m5256P0625l6824m578Q3728p3498p7209P0736l1141o6842P6134
192a7097K3200p729Q7150l9080j14519M8792L0226k8608R2759k51j51962L855
204g3264P7686l49O4848R589j35847j1338O4342l1721M5025N4642j06064j1424
$$ plain form
123 -47580 -20584 -73037 -137954 43459 157257 37860 -17765 -63272 -133199 31250 203829
134 203829 108522 -14144 -102926 -180394 -17338 172819 71236 -40653 -60337 -154689 -95382
145 -95382 109211 98991 13726 36580 -4471 -10749 74051 8377 -59519 25289 -7907 -90550
157 -90550 -15752 -14853 -59936 73164 124324 329 -36013 -52203 -76092 57220 112923 -23256
169 -23256 -55395 -30815 -57801 62118 157016 996 -105517 -73731 -78461 1843 103198
180 103198 17028 -28228 42397 5573 995 84723 11225 -65984 4752 -26389 -93231 -17097
192 -17097 6103 -1626 85524 46444 -68075 -19283 10943 -17665 75094 74843 -77119 -73264
204 -73264 4422 4073 68921 78510 -57337 -68675 -4333 -36054 8971 63613 -42451 -53875
216e3875J07026k8568k3327N6151n6086l7408N7982n1545m4328P7039o444r824
228a3207R3018m1722r7785O8076L1550n0531L6099k5362q9682O5405O8044l1419
240A2484L4752j3565j07287L9499P0053o3239R240M3806o7288K0684Q8044l9710
252B7473r738M0734p6930k9103N8930n5317k3139R4218j0011k6628O8816l7134
264B2171o3160O4140o518o1710M1724j6286m9365R5208M4587o2098K8806m970
276C2529q8312L5322L8610o8800K3003M8420m5668M2300O2927p1712j2160M1241
288C7700p0035j6029N5404n2402p173R0182j7442k0789N7348m2850m2674O1673
300C2913l0911o0913N4505l287l2178Q1645J2751o5166L6085j677p0661L9730
$$ plain form
216 -53875 53151 24583 1256 57407 1321 -36087 21895 -29650 -73978 3061 -3383 -13207
228 -13207 79811 38089 -59696 8380 39930 -10601 25498 136 -89546 -24141 43903 12484
240 12484 47236 33671 -73616 -34117 35936 -27303 -18063 25743 -41545 -20861 67183 27473
252 27473 17735 58469 -18461 -47564 11366 -43951 -67090 27128 17117 -9511 59305 22171
264 22171 -40989 23151 16633 -45077 -3353 -19639 -69004 26204 70791 8693 37499 32529
276 32529 -55783 -20461 18149 -50651 -27648 20772 -24896 17404 80331 8619 -3541 37700
288 37700 -32335 -48364 7040 -45362 -52535 37647 20205 -584 56764 13914 -28760 32913
300 32913 2002 -58911 -4406 -7693 -39871 41774 54525 -10641 25444 23767 -46894 -7164
312g164J9087o8269L5163M2349m6881M0538M7239o8212N361M0768o7993n148N0236
325A7074n0981K798P3872l9022j7870O1042l8923k9692N8319l9164m7085N8175
337H543j7304l6640P2274o14n1960N2738M72o0793M4577P969o6272M0820K9094
350B2904n4203L7560L4764n9799K5320L9771o7163L490M3489n6497K209N6022
362B7867m5803n481O0215l9198j6232N8234l7939l3126N4081k8571l4230O3288
374B3105j3079m3440N8782K51m7342M6342j295n8721L9420J0509n7262M0703K7370
387B5343n5551L2515L4697n8599J9409L9565o0509K721M4957m8415K193N2252
399C0578m2255j787N8938m3061k2300N5433l7314l5300N5134k1591l4664N7773
$$ plain form
312 -7164 11923 -56346 -21183 21166 -25715 14823 62062 -6150 -789 39979 -28014 -33162 17074
325 17074 -33907 -31109 42763 3741 -14129 46913 7990 -21702 36617 -2547 -49632 8543
337 8543 -8761 -45401 26873 26259 -25701 27037 27509 -33284 11293 19262 -47010 -6190 22904
350 22904 -31299 6261 41025 -18774 6546 46317 -20846 -17356 26133 -30364 -28155 27867
362 27867 -17936 -23417 36798 -2400 -18632 39602 1663 -31463 22618 -5953 -40183 23105
374 23105 10026 -33414 25368 25619 -21723 24619 23324 -35397 4023 14532 -42730 -2027 25343
387 25343 -30208 2307 37004 -21595 -2186 37379 -23130 -20409 24548 -23867 -21674 30578
399 30578 -11677 -13464 45474 2413 -19887 35546 -1768 -37068 18066 -3525 -38189 19584
411A9584q865l7837N4157n148m9354M3569l681n7443M5589K0095n4694L6612L1577
424C4161n0382K3928K8524n5451J4743L1233n7000R970M8813m7420Q90N4422m1361
437d930j4483N1139l5103k3160M7505k9301k3958N4191k0624k9103N9945j3250
449A8868m8566M9631L137n1511L4503N870m4163L9482J4268m9696L4101K1401
461B7325n5126K8364L3929o0397Q005M2757m5520K786M4791l8014k37M3213l9738
474g862l823N1234m5755k7959N7341k2908l1561N2405j1109l4750M5672p302l6538
487b2915M1187j1681m8580M6537J1378m8251M1341K2747n3912K3119K9481m4337
499a3886J2461J9025m9136K1659M0957m8014P174M7099m5877j1432M8736l3195
$$ plain form
411 19584 10719 -27118 27039 21891 -27463 16106 12425 -45018 571 20666 -34028 2584 34161
424 34161 -16221 7707 36231 -19220 -4477 26756 -30244 -20274 28539 -18881 -17991 36431 -4930
437 -4930 -19413 31726 -3377 -26537 20968 -8333 -32291 21900 1276 -27827 32118 18868
449 18868 -29698 19933 23070 -28441 6062 11932 -32231 7251 21519 -28177 5924 27325
461 27325 -27801 563 34492 -25905 -17900 24857 -20663 -17877 26914 -11100 -11337 31876 -7862
474 -7862 -11685 39549 -6206 -34165 23176 268 -31293 21112 10003 -24747 20925 13623 -22915
487 -22915 18272 6591 -41989 4548 15926 -32325 9016 31763 -22149 970 30451 -13886
499 -13886 -1425 17600 -31536 -9877 31080 -16934 -9760 37339 -8538 -19970 28766 -4429
511d429k1117L8968k6645j2012N0556k2755k1471N0344k5422m0869N5378j879
523A8647n0439L5560R494l5462L5293R168l8650L1291J861n4016L8206K9622o0601
536c0026J4512M1724m3036O155M1584l6780o263K8161l4803R515M2237m8416j0550
549b5986N9417l0739k7860N5922j5538m2496L3664l315k2212L6501j5381l3379
561c1402M7864k602m3705M7581J0285o2625K4551L2785l8376J3703K1080l8107
573a8968J7886K5122l8937K0508L0315o0525k832N5728l1662j7535M0800k4749
585d849j4312M1105j9713j4595L5605l5015k5689N8629j0272m1240M7451N062
597B2167m3752L1872J2005l6777J9302l718l6595M4617J8834n0854K7991K9106
$$ plain form
511 -4429 -25546 13422 -13223 -25235 25321 2566 -18905 31439 6017 -34852 20526 18647
523 18647 -31792 3768 13262 -22200 13093 22261 -16389 14902 16763 -37253 953 30575 -30026
536 -30026 -15514 26210 -16826 -10671 30913 -5867 -12130 16031 -18772 -9257 32980 -15436 -25986
549 -25986 33431 2692 -25168 30754 15216 -27280 6384 3069 -19143 17358 1977 -31402
561 -31402 16462 13860 -29845 17736 28021 -34604 -10053 22732 -15644 -1941 19139 -18968
573 -18968 -1082 24040 -14897 5611 35926 -24599 -27431 28297 -3365 -20900 19900 -4849
585 -4849 -19161 21944 2231 -12364 23241 -11774 -37463 21166 10894 -30346 17105 22167
597 22167 -21585 10287 22292 -14485 4817 1099 -35496 9121 27955 -22899 5092 34198
609C4198n6223P886M1139m0573r147K9209k3756J3150L7502l8072j957L8391m5001
622a3254j6190N6992k6365l7729M7566L487k1097L3309j3450l1869K9086j7006
634f520l3545M9651L997m7713M1577K7632m3503J6438J7727m8021L153J8159k7561
647b8529K9554L1276m3282J4130M3215m6803j6001L4649l8732k0402M3557p528
659d896m00M1476k5477j9559M0336k9667m1244L9968r077l7202N0089K2892k6616
672F23K8080R91l9976K0676n300n0183L0878K3567m2202L2482M8147l8873l879
685E031K2092m3009p947K3041l2756Q429M3308k3794R256N4452l8066l8306L2986
698A4717k4099l4033L8348N50j4849M0943j786j9763L7886j8751n4501K9570O559
$$ plain form
609 34198 -22025 -14139 27000 -13573 -22720 6489 -17267 -4117 33385 -4687 -6644 31747 -13254
622 -13254 -29444 27548 1183 -36546 11020 14507 -6590 26719 13269 -18600 10486 -6520
634 -6520 -40065 9586 13583 -34130 7447 35079 -8424 8014 25741 -22280 -19127 -968 -28529
647 -28529 1025 32301 -10981 3149 46364 -439 -16440 18209 -20523 -40925 2632 -4896
659 -4896 -5296 36180 10703 -8856 31480 1813 -39431 537 -8540 -45742 4347 27239 623
672 623 28703 29694 -10282 10394 5094 -45089 -14211 9356 -32846 -364 47783 8910 5031
685 5031 27123 -15886 -23833 -792 -33548 -25119 18189 -5605 3651 58103 20037 -18269 14717
698 14717 -9382 -43415 -5067 -4517 -19366 21577 19791 28 37914 19163 -35338 -5768 791
711G91m3472L3699K9662l3265K0480K3992l4577Q322R602m5460J2574L1160l6772
724b3264J3245M8126l3930j1521L8415k7312k0293K6534k8097j3288M3511j5487
736c361j4522M6464j5153l3986L8595o188m0978L0018O000k9477L4056J0408l4179
749a2303K5785M939m8014K3743K4337m3106J5139L5304l2802N685K8234l5505
761h564k054K5784l6560j139M2254k6158p602M3892k4606k4644L8192j5111k8687
774b5003L2746o099j9289L9442n865l1531L4757k245m4401K6578R136m1680K3356
787a0098K1828l0238K3774K5224l4711J1048J8967m3948L853K7822l7444M485
799a9438M5078k4386o373L6619k8225j9407K9624k6825j8343M1590j1867j7685
$$ plain form
711 791 -42681 -8982 20680 -12585 7895 31887 -2690 5632 15234 -30226 -17652 13508 -23264
724 -23264 -10019 38107 4177 -7344 31071 3759 -16534 10000 -18097 -31385 12126 -3361
736 -3361 -17883 28581 13428 -20558 18037 11849 -29129 889 6889 -22588 11468 21876 -12303
749 -12303 13482 18421 -29593 -5850 18487 -24619 -9480 25824 -6978 -1293 26941 -8564
761 -8564 -10618 15166 -21394 -22533 19721 -6437 -14039 29853 5247 -19397 18795 3684 -25003
774 -25003 7743 1644 -17645 21797 15932 -15599 19158 16913 -27488 -910 8226 -33454 -10098
787 -10098 11730 -18508 5266 30490 -4221 6827 25794 -18154 -14301 13521 -23923 -19438
799 -19438 25640 1254 -5119 31500 3275 -16132 13492 -13333 -31676 9914 -1953 -19638
811a9638M6598n166l1049K9624j1473m1509K8806M449l2872L3115J6390l0498
823a3223K8780J6360m1699J4121J7860m3599P858K6498l3259Q328L3474l0048
835h549J751L4428l3704j1790L2878k6722j3704M0717j4529j3492M2310j2538
847A7056k8079L0590j3409l3942K9920m091l0527L7465J2101l1748K8079J1395
859B4810l9137J6814J2610l9904J7309K4326l5422J2555K9549l4109M254L0359
871B4014l4657l702L3734k9362r062L8482k0150j0764L9325j9802k1819L4057
883B0294j8399l1390L2066p537k7288L8158N526k6338L4459O361l9192K1398P536
896A5654l9994J8364J8404l4350K1393K8752l5050O133K3537l7697j714K7523
$$ plain form
811 -19638 26960 21794 -9255 20369 8896 -32613 -3807 642 -32230 885 17275 -13223
823 -13223 15557 31917 -9782 4339 22199 -21400 -13542 12956 -20303 -11975 21499 -8549
835 -8549 -6798 27630 -6074 -17864 15014 -11708 -25412 15305 776 -12716 29594 17056
847 17056 -11023 19567 6158 -27784 2136 -1955 -32482 4983 17084 -14664 13415 24810
859 24810 -14327 2487 15097 -24807 -7498 16828 -18594 -6039 23510 -10599 -6345 24014
871 24014 -10643 -14345 19389 -9973 -19035 19447 -703 -11467 27858 8056 -13763 20294
883 20294 1895 -29495 2571 -4966 -32254 5904 11430 -14908 19551 25912 -13280 8118 15654
896 15654 -24340 -5976 12428 -21922 -529 28223 -6827 -694 22843 -14854 -16568 10955
908A0955l0897K23L9488k2026n392L9206k2399j9178K9701k3326k6530L3128j0164
921g211k1493M0779J977k3086L5030k068l8336K3115J129m0880K2405J6814l0399
934b2224K4293K2609l3466J3565J8682m2166L291K5620l2904O566L8791k4249
946a592L73L6868k7625j7154K7511k7022j9396L3962j6086j6143M2556o410k4612
959a4770L5274m044l3415K6679j463l3941K7325Q431l1865K6430J4652l4021J9605
972D877J7749l8820J0400K3975l3906N680K8547k8146K756K9980k8957m117L2754
985B2772k8909j4109L4704j9503j8224L4729j1864j9793L5566n575k1980L2803
997B0617n429l0841K9317j436l9119K4415J0160l4186K3125K1503k7487J7429
$$ plain form
908 10955 -19942 -19719 19769 -2257 -7649 31557 9158 -10020 19681 -3645 -30175 2953 -7211
921 -7211 -28704 12075 14052 -9034 25996 23928 -14408 8707 9836 -31044 -8639 8175 -22224
934 -22224 2069 24678 -8788 4777 23459 -18707 -15416 10204 -22700 -16134 22657 -1592
946 -1592 -1219 35649 8024 -9130 18381 -8641 -28037 5925 -10161 -26304 16252 9842 -14770
959 -14770 20504 16460 -16955 9724 8261 -25680 1645 10076 -21789 4641 19293 -14728 4877
972 4877 22626 -16194 -5794 18181 -15725 -10045 18502 -9644 -6888 23092 -5865 -9982 22772
985 22772 -6137 -20246 14458 -5045 -23269 11460 -404 -20197 15369 9794 -12186 20617
997 20617 15188 -15653 13664 12228 -26891 -2476 7684 -26502 -3377 18126 -9361 8068
1009H068J5097l6893J0721J9434l9475N751L2423k8811L585L9309k3352j0043
1021d186K8196k6115j5954K7128k2560j3336L9736j1597j6531M3361n474l4046
1033a1378K4013m484l4568K1364K302k7177K9501J3648k4892L0188J4947m2177
1045h713R096J7151l9593L963K7372k5399O993L0919k0736M432K5023l7691j2207
1058a9390L1705k7009j5816L8775r476j4991L6864l989j8438K5078j7230l0495
1070b4412K8214n627k9428L5924R825l2693K7800K0277l2787Q696O718l4872J2324
1083a0041J5043l1052J9067K8834l3359Q617L6534l1293j3039K4934k5855j0514
1095b2124L1099j4641n659L2330j8975j1594L9515j8477l3991K9425n603l1307
$$ plain form
1009 8068 23165 -13728 -3007 16427 -23048 -17297 15126 -13685 -10100 29209 5857 -4186
1021 -4186 24010 -2105 -18059 9069 -13491 -26827 12909 1312 -15219 28142 22668 -11378
1033 -11378 12635 8151 -26417 -5053 -2751 -29928 -427 13221 -11671 18517 33464 -8713
1045 -8713 383 17534 -22059 -18096 9276 -16123 -9130 21789 1053 5485 30508 -7183 -19390
1058 -19390 12315 -14694 -30510 8265 -1211 -16202 20662 16673 -1765 23313 6083 -24412
1070 -24412 3802 -1825 -31253 4671 14496 -18197 9603 29880 -2907 5789 12507 -22365 -10041
1083 -10041 5002 -26050 -6983 21851 -11508 -2891 33643 2350 -10689 14245 -11610 -22124
1095 -22124 8975 -5666 -11325 21005 2030 -9564 29951 11474 -22517 6908 1305 -30002
1107c0002K8747R234k2315K3414L682k4183K6460L896m0265J7329J5395l5924
1119b4532J7107L0127l0100K630K5329k3256K259J9505l2726j743K8783k7178
1131a3795l577M0870k1057k1264L3213p860j8696K5548j3281k0790K9747o793
1143B265k1459L5599k483l5043K8803J2704l3948J5791J1392l1485J2615J4059
1155H810k4458J8624J5607l7360J3281L1744l4090n479K9415k5264q462L0825
1167A3193j3742o095K4984k1727p728L4197k1149k2445L3842j1065k8879L4712
1179H098O819k7516J8248K417k1851K2422l18l0975K4376R622l4384K3475K5428
1192B5861l4639M398K2989k6554J620K0769k5925J313K3310k3737N135L3723k9561
$$ plain form
1107 -30002 -1255 7979 -14336 9078 12760 -11423 15037 18933 -21332 -4003 11392 -24532
1119 -24532 -7425 22702 -7398 -4768 20561 -2695 -436 19069 -13657 -15400 13383 -13795
1131 -13795 -17372 23498 2441 -18823 14390 6530 -12166 13382 101 -20689 9058 2265
1143 2265 -19194 16405 13922 -21121 7682 20386 -13562 2229 13621 -17864 -5249 8810
1155 8810 -15648 2976 18583 -18777 -5496 26248 -7842 -13321 16094 -9170 -17632 13193
1167 13193 -549 -6644 18340 -3387 -11115 23082 1933 -20512 13330 2265 -26614 8098
1179 8098 14917 -12599 5649 8066 -13785 8637 8319 -22656 1720 11342 -23042 433 25861
1192 25861 -8778 -4380 18609 -7945 -6325 14444 -11481 -10168 13142 -10595 -5460 28263 -1298
1205a298j6530L3363j6643j9548K8817r302j7387K8748n204j5011L0963j0194
1217A0774l1804K7686K913l1982K4471J1878k9821J7737J6450k5351J2399Q529
1229A3879l3929J3108K1056l2366Q134L0710k8124l340L1378j8237r358K0382
1241A3293k2197p860K9792j6827j1043L4032j4570k1431L4806m436l0016K1273
1253D816K00k4500K1768L758k2050K3490L791k9110K4103J4137l6411R726K0189
1266A3907k8378P657K3434k3402L060K1086k4353L069K6002k9091p864K9451k2107
1279g529j2363L3897j1429j7920K6937p209j5396K6517j0689k4024K7757k933
1291E616k6388K7156O336k9318K0417J2170k6319J5097J1040k9828J0999J4430
$$ plain form
1205 -1298 -17828 15535 -1108 -20656 8161 -1141 -18528 10220 5016 -9995 20968 10774
1217 10774 -21030 6656 9569 -22413 2058 13936 -15885 1852 18302 -7049 5350 13879
1229 13879 -20050 -6942 14114 -18252 -10118 20592 -7532 -10872 20506 2269 -7089 13293
1241 13293 -8904 -16764 13028 -3799 -14842 19190 4620 -16811 17995 13559 -16457 4816
1253 4816 5016 -19484 2284 6042 -16008 7482 11273 -17837 6266 20403 -16008 -6282 13907
1266 13907 -14471 -6814 16620 -6782 -3722 17364 -6989 -3920 22082 -7009 -14873 14578 -7529
1279 -7529 -19892 14005 2576 -15344 11593 4384 -11012 15505 4816 -19208 8549 5616
1291 5616 -20772 6384 12720 -16598 3819 15989 -10330 4767 15807 -14021 -3022 11408
1303A1408k8341J1599K2118k8965L215K8425k2849m589K4274k2160q324K4338
1315A0149j7598p215L0817j4189j3763L2068r536k2632K4527p292k6835K2619
1327A120J440k1869K3665N897k2241K3108P979l2121J3960J1460l2457R187K0516
1340I644k3122R507K3931k2603L764K2034k7484o282K1359k4723o508L1901j3365
1353a947q368L1377j0879j7778K2959j4207k3331K3165n623j9924L0864O516k1535
1366h711K4124N304k9136J3394M292l1535J3751J5692k2820J5463K1713k4663
1378c132N301J8159l0109l794K0968k2675j697K8613j4264k427K8765j7521j4897
1391h710K3517j6565j9426K5844n696j5682K8687mk0626K2144j777k7672J7442
$$ plain form
1303 11408 -16933 -5334 16784 -12181 -8966 19459 -3390 -7979 16295 -5865 -14189 10149
1315 10149 -7449 -14664 16153 1964 -11799 20269 10733 -11899 12628 5336 -21499 1120
1327 1120 2560 -19309 4356 10253 -11988 11120 19099 -13022 938 12398 -20059 -10872 9644
1340 9644 -13478 -3971 19960 -2643 1121 23155 -4329 -10611 10748 -13975 -20483 11418 -1947
1353 -1947 -10315 21062 10183 -7595 15364 1157 -22174 991 -4632 -24556 6308 12824 -8711
1366 -8711 15413 20717 -8419 4975 9267 -22268 -8517 7175 -15645 -182 21531 -3132
1378 -3132 2169 20328 -9781 -13575 7393 -15282 -16979 11634 -2630 -5057 23708 6187 -8710
1391 -8710 14807 -1758 -21184 4660 -1036 -16718 11969 11965 -8661 13483 11706 -15966 1476
1404A476L247k5637K0006J2477k4688J5806J6054k7460O636J4913k7193N275K1245
1417A2157k1873M478K5408k1379m412K3136k1917r537K5089j5623j1409K8496
1429A2614q890j5113K4937r176k0860K3102m223k1780K4425M839k2257K0950O721
1442A5289k6353J4464P695k7590J2154J5675k3535J0457J9254k3871M081J8868
1454A6588k5496k513K2069j9978m169K5860j4733n848K5726j4901j4089K3824
1466A2340j1246j7779K4317m195j7260K4999p38k2070K0131J073k5229J6984N602
1479F929k4037J7368J2020k4320J2292J5280k5235N752J5771k3049M464K0955
1491A4190k1166L89K3337j9879n722K3786j7088r821K4803j3147j2389K4206r195
$$ plain form
1404 1476 4723 -20914 -908 11569 -13119 2687 18741 -8719 -2083 12830 -14363 -9088 12157
1417 12157 -9716 -5238 20170 -1209 -5621 17515 -4402 -13939 11150 -4473 -15882 12614
1429 12614 3724 -11389 13548 4372 -16488 6614 2391 -19389 5036 9875 -12382 8568 15289
1442 15289 -11064 3400 11095 -16495 -4341 11334 -12201 -1744 17510 -6361 -2280 16588
1454 16588 -8908 -11421 10648 -9330 -13499 12361 -2372 -8220 17506 2605 -11484 12340
1466 12340 1094 -16685 7632 3437 -13823 11176 10438 -11632 8499 9572 -15657 1327 6929
1479 6929 -17108 260 12280 -12040 252 15532 -9703 -3951 11820 -11229 -6765 14190
1491 14190 -6976 -6587 16750 -3129 -8851 14935 -2153 -11974 12829 -318 -12707 11499 2304
1504B304j6166K2709o748j8048K4268n74k1824K0559M025k3664J5644O929k3093
1517a3679J4514J0804k2455J2672J4638k4878N854J5742k4727K396K1069k0044
1529h094j072K2687j5604m271K0593j7069r448K2699j4277j2411K6982n867j6155
1542a1307K3407k528j8773J7985l365k1932J8114L213j9844K0128Q144k3770J4477
1555C949J1515k6726N594J3563k2068N625J8243j5946O799J9037k3221k447K0806
1568A4723k0591q914K3684j2164r106K5479o877j1966J8543j1251j6629K0220
1580E151n913j7066K3814K452k1337J9862P770k3310R437N889k0844J3130J0581
1593I616j9877J1829J4397k3540N713J8238k3550l239J8644j6821j502K2021j2723
$$ plain form
1504 2304 -13862 8847 2099 -15949 8319 7745 -14079 6480 10505 -13159 2485 9414 -13679
1517 -13679 835 11639 -10816 1856 16494 -8384 -2530 13212 -11515 -9119 11950 -8094
1529 -8094 -9166 13521 -2083 -6354 14239 -2830 -12278 10421 -3856 -16267 10715 4848 -11307
1542 -11307 12100 9572 -9201 8784 5419 -16513 1601 4814 -15030 5098 13242 -10528 3949
1555 3949 15464 -11262 -5668 7895 -14173 -8548 9695 -6251 548 19585 -3636 -6083 14723
1568 14723 -5868 -14782 8902 -3262 -12368 13111 6234 -5732 12811 1560 -15069 5151
1580 5151 -762 -17828 5986 8438 -12899 6963 14733 -8577 860 6749 -14095 -965 9616
1593 9616 -10261 1568 15965 -7575 -1862 16376 -7174 -10413 8231 -8590 -10092 11929 -794
1606g94m395J8849j6195q406K2744j3966j5945K4793k566j4354K1850n94j8214
1619g193J4240l238j8725J8118J926k1866J8912J1765k1393J1791J1763k5985
1631i885J265J2694j6322O550J5152j7556O604K0895k0755l291K0617j9950j3045
1644a7027K2460o830q426K0247p186r554J9589q829j5236J8486q145k1412K2963
1657A100P162j9394J5382Q600j8914J0495N836j9772Q854N258k2309J3301J9790
1670A5389k0563L590J9396j9293m037J6799j6261o295J5152j2799o26K3376j2881
1683I47r561K2559j0421j7160K1190k918j8555J5276J143j1348J9372o23j9079
1696i178J6544K524k3507J3902R935k4359O570J5282j4686O698J3102j7749L402
$$ plain form
1606 -794 -5189 13660 -2535 -10941 11803 -2163 -18108 6685 4119 -10235 11615 11021 -7193
1619 -7193 7047 3809 -14916 3202 5128 -16738 2174 13939 -7454 4337 16100 -9885
1631 -9885 -8620 4074 -12248 -5698 9454 -8102 -1498 19397 -1358 -4649 15968 -3982 -17027
1644 -17027 5433 -1397 -9823 10424 3238 -6316 13273 4444 -10792 7694 -451 -21863 1100
1657 1100 8262 -11132 4250 12850 -6064 4431 10267 -9505 -651 4607 -17702 -4401 15389
1670 15389 -5174 -1584 17812 -1481 -5518 11281 -4980 -11275 3877 -8922 -9548 13828 947
1683 947 -8614 13945 3524 -13636 7554 4636 -13919 1357 2500 -8848 10524 9901 -9178
1696 -9178 7366 9890 -13617 285 10220 -14139 -7569 7713 -6973 -275 12827 -4922 -1520
1709a520J2430j9612K905J8506k0882n878K5129q863q152J8408q887j1438J5243
1722G389p897r577J8363q569j5130K3411O70j9780J6607L637k1503J0541Q701
1735F863j5299R623M849j7758J3759J1744k1041O496J4644k1684O8J9515j4205
1748b426l861J4410j3718k137J8562j3548o021J9580j2933j0521K3812n549j7522
1761a1872J6789j574j3628J6145k53j4853J5986J33j8490J7283O361k3745Q762
1774b956J0880j8017P201J3748j6290L377J1749j7023M510J4842k0894j789K0890
1787A0228j3856n191K1891q952j0496J5283p984q790J6031r618j2362K0683k898
1800C969j4755J9744L33k1080J3112N472j7679R724O037j5209J1449Q788j6808
$$ plain form
1709 -1520 10910 -8702 -5797 12709 -8173 -14051 11078 2215 -5937 12471 3584 -7854 7389
1722 7389 -508 -10085 8278 -291 -15421 7990 8660 -11120 5487 9124 -12379 -1838 6863
1735 6863 -8436 1187 6036 -11722 2037 13781 -7260 -764 13880 -7804 -7736 11779 -2426
1748 -2426 -6287 8123 -5595 -7732 10830 -2718 -8739 10841 -2092 -12613 11199 5650 -11872
1761 -11872 4917 3343 -10285 5860 5607 -9246 6740 6873 -11617 5666 12027 -11718 -2956
1774 -2956 7924 -10093 -2892 10856 -5434 -2057 9692 -7331 -2821 12021 -8873 -10662 10228
1787 10228 -3628 -8819 13072 4120 -6376 8907 923 -7867 8164 -1454 -13816 6867 3969
1800 3969 -10786 8958 9291 -11789 1323 6795 -10884 -1160 4877 -10332 1117 9905 -6903
1813f903J0099J0749k2697K777J6437j6660j169J6651j2966j223J6840j2536m977
1826e578J5564j4490q335K0252q310j1194K0503m040j3869J7194j235j5608J3600
1839D454j801j5057J6677M068j8207J3341P723j9074Q191R396j8332M632J0931
1852F942j6375M944J4736j5861J767J6120j6432l228J8116j3080q101J7489p479
1865d42p167J7179p343r537J7572o674j4391J7085k402j7083J5472L327j5745
1878a0149J3183N498j6599R930O350j7631Q727Q586j8782P771J4435j7325K952
1891c054J5679j5032j693J4537j4170l951J6129j3239n143J8741q902q054J8257
1904A0105p474j2341J7210m898j4739J5345o02j3985J6200K915j5748J4315M679
$$ plain form
1813 -6903 3196 13945 -8752 -5975 10462 -6198 -7367 9284 -3682 -4905 11935 -601 -5578
1826 -5578 9986 -4504 -12839 7413 -897 -12091 8412 4372 -9497 7697 6462 -9146 4454
1839 4454 2653 -12404 4273 8341 -9866 3475 11198 -7876 315 9711 -8621 -3989 6942
1852 6942 -9433 -4489 10247 -5614 -3847 12273 -4159 -7387 10729 -2351 -10452 7037 -442
1865 -442 -7609 9570 2227 -7310 10262 3588 -10803 6282 3880 -13203 2269 5596 -10149
1878 -10149 3034 8532 -8067 1863 8213 -9418 -691 7895 -10887 -3116 11319 -6006 -3054
1891 -3054 12625 -2407 -4100 10437 -3733 -7684 8445 -4794 -9937 8804 -98 -8152 10105
1904 10105 2631 -9710 7500 2602 -12137 3208 2606 -11379 4821 7736 -8012 6303 10982
1917A0982j9069Q980P407j8777P035J0100j5687O914J3463j5894K403J3989j6470
1930d624k038J4293j4480l480J7819r779n093J8791p808q707J6257q575j2637
1943a0061J5208m472j4522J7288J993j3945J5512K675j6482J0482L007j9205Q460
1956d062P843j5826R423J3120j5000O520J3053j7669n42J2500j6388k557J5747
1969F162j1646j140J8704r648p199J6799j0249j1918J4511o893j2163J7835l80
1982B775j1332J7014J541j5250J1811L34j8637J0487N517j6610J0876J1304j4594
1995d764P588J0633j7447K123J0761j7903M1J4872j2790k67J7567j0947m045J6200
2009A1622j1150r265J6040q302r405J7121m204j0723J7130k033j4806J3846oj6445
$$ plain form
1917 10982 -8087 893 8300 -10477 -3442 6658 -9029 -2115 11348 -4546 -2143 11846 -4624
1930 -4624 -6662 7631 -6849 -10329 7490 -2289 -7382 11409 3601 -5106 11151 2576 -10061
1943 -10061 5147 675 -13847 3441 5434 -8511 7001 9676 -6806 3676 6683 -12522 -4062
1956 -4062 3781 -12045 -2622 10498 -4502 2018 15071 -2598 -3140 9360 -7028 -9585 6162
1969 6162 -5484 -6624 12080 2432 -4767 12032 1783 -10135 4376 -2517 -14680 3155 2775
1982 2775 -8557 8457 9998 -5252 6559 6893 -11744 -1257 4260 -12350 -1474 9830 -4764
1995 -4764 2824 13457 -3990 -1867 8894 -9009 -8968 5904 -6886 -7153 10414 -533 -4578 11622
2009 11622 472 -8793 7247 -1055 -10460 6661 2457 -8266 8864 6831 -7975 5871 5865 -10580
2023a0580J2001K839j5848J1988O315j5739R816R461j7123O336J0656j6850K988
2036c740J3629j5608l12J4419j2832j368J5557j1505l633J6748j0719q305J6249
2049H580q150j1316J5705m041j1554J6367o51j3310J4186M48j6091J2247K527
2062D947j6741J2273Q671j5706Q634J0374j6115L879R014j7363K317J1538j5399
2075i677J796J6779j1437j713J6506j1492p194J5292r789q966J5011o391p994
2088i269J7676l818j1999J5824k173j6812J3247K145j5480J1387M932j3423J1518
2101C755O357j7082P844P368j8441N349J2190j5852K068J5589j2093j5J4343j1766
2115c86k969J3694j2822n086J6503j0360r911J7715m179j1321J5217k518j3006
$$ plain form
2023 -10580 1421 4260 -11588 400 6715 -9024 792 10253 -6870 -534 10122 -6728 -3740
2036 -3740 9889 -5719 -6031 8388 -4444 -5812 9745 -1760 -5393 11355 636 -7669 8580
2049 8580 430 -10886 4819 778 -10776 5591 4940 -8370 5816 6264 -9827 2420 4947
2062 4947 -11794 479 9150 -6556 2078 12452 -3663 216 9230 -8133 -5816 5722 -9677
2075 -9677 -7881 8898 -2539 -4252 12254 762 -6432 8860 -929 -9895 5116 -1275 -9269
2088 -9269 8407 4589 -7410 8414 6241 -10571 2676 4821 -10659 728 5660 -7763 3755
2101 3755 10112 -6970 874 8242 -10199 -4850 7340 -8512 -6444 9145 -2948 -2963 11380 -386
2115 -386 -3355 10339 -2483 -7569 8934 -1426 -11337 6378 2199 -9122 6095 3577 -9429
2128i429J3133q43j2105J3205J013j4823J3932N755j6800R346P968j8294M276
2141c666R387j3546M727J0083j3847M802J4545j4977r80J4581j4773n905J6001
2154F432q765o747J5340o423o875J5734o457j0172J5172n559j3777J7110K311
2167G324j4847J2256M010j4614R192L083j6058P735N101j6248J0238J2782j5622
2180e668M493J3634j5078n53J2562j3452k939J2111j0178N48J7054j2441o973
2193f880J6995r406j1619J5726l628j2339J3961L88q484J4256j947j4859J1744
2206C908J86j6972J2180O125j6986Q934J2411j2139N086Q453j5066K360R155j5579
2220g944K746J4139j5283j849J8604r548o128J3459j0142q334J4400n916o330
$$ plain form
2128 -9429 3704 2861 -9244 3961 4974 -9849 4083 9838 -6962 2384 10352 -7942 -3666
2141 -3666 5721 -7825 -3098 6985 -6862 -2060 12485 -2492 -3472 11109 -3664 -9569 6432
2154 6432 -2333 -9080 6260 -163 -7038 8696 2239 -7933 7239 1680 -12097 5013 7324
2167 7324 -7523 4733 8743 -5871 3321 6404 -9654 -1919 3182 -13066 -2828 9954 -5668
2180 -5668 -1175 12459 -2619 -3172 9390 -4062 -7001 5110 -5068 -4520 12534 93 -6880
2193 -6880 10115 709 -10910 4816 1188 -11151 2810 3198 -5286 8970 7023 -7836 3908
2206 3908 4094 -12878 -698 5427 -11559 -2625 9786 -2353 2733 11186 -3880 -1520 7635 -7944
2220 -7944 -5198 8941 -6342 -8191 10413 865 -5263 8196 -1946 -10280 4120 -1796 -8126
2233h126J5956n495r856J8059k406j6012J2312K04j6289J0603N107j1807R742
2246A992M088j4219J1174Q087j8450N165J0425j6506K796J4505j2310j760J2166
2259G153j1119k81J3592j2323l816J5734j0662o731J8777n895j2965J3285j647
2272C102j0581J2546k845j1976J2800l73j3259J4851L388j8049R936Q380j5233
2285g313P240J0007j3857L475Q887j3579M042R661j7500P25J6445j1963k292J6811
2299A0789r756o966J3251p429p351J2456q045q073J7741k986j0400J5939k281
2312F889j6359J1706K809j4689R145M254j2178J1979O444j4924P942O958j8757
2325h781L009J2046j4570J060J3062j0230J849J4424j1234l119J1852j2934o073
$$ plain form
2233 -8126 7830 2335 -7521 10538 8132 -7880 4432 4636 -11653 -1050 4057 -7750 1992
2246 1992 6080 -8139 3035 11122 -7328 -2163 8262 -8244 -5448 9057 -3253 -5013 7153
2259 7153 -3966 -4247 9345 -2978 -6794 8940 -1722 -8453 10324 4429 -8536 4749 3102
2272 3102 -7479 5067 2222 -9754 3046 2673 -10586 4265 7653 -10396 -460 7920 -7313
2285 -7313 -73 9934 -3923 -448 8439 -5140 -1098 8563 -8937 -8212 8233 -3730 -6022 10789
2299 10789 1033 -5933 7318 -111 -7462 4994 -3051 -11124 6617 3631 -6769 9170 6889
2312 6889 -9470 2236 5045 -9644 -499 3755 -8423 3556 10000 -4924 3018 9976 -8781
2325 -8781 -5772 6274 -8296 -7236 5826 -4404 -2555 11869 635 -2484 9368 -3566 -9639
2338i639J6821q491q838J7140k903j0019J4079k745j2487J0316l808j2283J4617
2351A760K554j4232J3507O717j5659P768O508j6266L381Q174j2942O201J0939
2364H410j2766L593J2731j4684j401J4178j3609o448J4939p056m552J4122o994
2377D63o761J4382o872j0123J4445l684j2820J4894J345j2547J2223L082j4294
2390f267Q942L574j4469Q342N811j5431P786J1252j5025K855J1086j3155o4J1948
2404G185j1895n13J3580j1286k609J5018r372o749J4566p561r081J4734l647j0087
2418g717J3089j962j0820J2804j019j4120J2432K457j4675J0051O371j4198P112
2431a95P901j3704N464Q396j4071L585J0983j3295J825J3250j2902k404J3965
$$ plain form
2338 -9639 7182 -1309 -10147 6993 4090 -5929 8150 5405 -7082 3234 -574 -12857 1760
2351 1760 4314 -9918 3589 10306 -5353 2415 8923 -7343 -3962 4212 -8730 -2529 8410
2364 8410 -4356 -763 11968 -2716 -4117 10061 -3548 -9996 4943 -2113 -6665 7457 463
2377 463 -6298 8084 1212 -8911 5534 1850 -10970 3924 5269 -7278 4945 8027 -6267
2390 -6267 2675 6249 -8220 122 5933 -9498 -1712 9540 -5485 -2630 8456 -4699 -4763 7185
2404 7185 -4710 -5223 8357 -2929 -5538 9480 108 -6641 7925 364 -8717 6017 2370 -7717
2418 -7717 5372 3410 -7410 5394 4375 -9745 2687 5144 -9531 520 6891 -7307 -195
2431 -195 7706 -5998 -534 7862 -6209 -2624 8359 -4936 -3111 10139 -2763 -5167 8798
2444H798j0641n257J3703q470n947J4420o709p419J4482m640j0951J3817j657
2457C529j2402J2499R66j3045J1959L540j3523Q633M814j4422P275P277j4705
2470g605N438R979j3603K790J1399j2463j5J1858j2164j916J3858r772m361J4444
2484G867p692o212J4160o324r046J3484m248j0412J3178j521j1447J2455Q99j3512
2498h371J0818L249j4200Q284O174j3601P242Q135j3936N246R836j3693K146J0920
2512H249j2806o4J2677j1288k096J3775r329n376J3672p947p070J3840n900q856
2526h519J3699k939j0469J2743l03j1952J1551J563j3111J0027L984j3311P889
2539H52O312j3968O535Q073j3785L981R983j3045J217J1050j2024j91J2311j0534
$$ plain form
2444 8798 -1843 -7100 6603 -1867 -7814 6606 -103 -7522 6960 2320 -8631 5186 3529
2457 3529 -8873 3626 4592 -8453 3506 7046 -6477 2156 6970 -7452 -177 7100 -7605
2470 -7605 -2167 7812 -5791 -3001 8398 -4065 -4080 7778 -4386 -6302 7556 -2216 -6577 7867
2484 7867 175 -6037 8123 1799 -7247 6237 1989 -8423 4755 3234 -8213 4242 5141 -8371
2498 -8371 2447 5696 -8504 -220 5954 -7647 -405 7730 -6206 -960 8876 -4817 -2671 8249
2512 8249 -4557 -4621 8056 -3232 -5328 8447 -882 -6258 7414 -533 -7603 6237 337 -8519
2526 -8519 5180 2241 -8228 4515 4212 -7740 3811 5374 -7737 2290 6274 -7037 852
2539 852 7164 -6804 -269 7804 -5981 -2000 7983 -5062 -3845 7205 -4819 -5010 7301 -3233
2553c233k511J3888q857n445J3937p219p604J3513n319q992J3070k404j0247J2405
2567D982l29j2088J1128J258j3611R519M493j3503P805O921j2681O123P853j3686
2581e816L723R648j2892J631J1255j1262p62J3108r943l487J2884q547n958J2327
2595E909p108o281J3230n006q747J3188j637j1355J1555M48j1657J0101K286j2209
2609g283R057M594j2992P500O430j3214N532Q404j3489K470J0329j1801L24J0636
2623F497j0443q25J1976r454k903J3316q714o310J3106n701p869J2604l157r099
2637f976J2343j194r969J1084q73j2171J0146K069j3381Q703N827j2300O513P463
2651G284j2067M463O920j3108L352R904j1819J036J2108j0085j823J2934q744
$$ plain form
2553 -3233 -5744 8144 -713 -6158 7779 560 -7044 6469 1150 -7842 5228 2824 -7423 4982
2567 4982 4653 -7435 3693 4951 -8660 859 5352 -8151 -346 6575 -6106 17 7870 -5816
2581 -5816 -2093 7555 -5337 -3706 7549 -3713 -4475 8633 -1310 -4797 8087 -460 -6418 5909
2595 5909 -1199 -7480 5750 744 -8003 5185 3548 -7807 3748 4196 -7461 2640 4926 -7283
2609 -7283 1774 6368 -6624 876 7306 -5908 -376 8028 -5461 -2991 7338 -4463 -4139 6497
2623 6497 -3946 -4771 7205 -2249 -5152 8164 -550 -6860 6246 545 -7324 5280 2123 -6976
2637 -6976 5367 4173 -5796 5288 4415 -7756 2390 4459 -8922 -219 5608 -6692 -179 7284
2651 7284 -4783 -320 6600 -6508 -3156 6748 -5071 -4035 8073 -2012 -3835 9099 355
2664C55n734J1044p124n632J1788n582o254J3177l977r494J2981q74j2455R419
2678A638J789j1011Q911L284j1176Q293M793j2253P490O583j4069L495R059j2378
2692e552J435J0890r857o01J0442q909j058J0924j0249m998J3098o734o511J3173
2706E493l342q212J1946k204q599J0230k302j1048J0507J142j2102J0633L855
2719E997j2907P378O821j1653L732N390j1516L933Q364j0954L227J1067j1589
2732b710o86J2267r611m510J0332p415m312J1954m941m708J1437n977p176J2207
2746F151l492j1753J0792O38j0475R406L714r619P167K242j1089Q075M304j3240
2760g179N782P892j1697L612J0662j1069r32Q325q967l80R098r167j907J2021
$$ plain form
2664 355 -5379 5665 -1459 -7091 4697 -885 -7139 6038 2061 -7433 5548 4674 -7781 1638
2678 1638 3427 -7584 1327 4611 -6565 1728 6521 -5732 1758 8341 -5728 -2233 6826 -5552
2692 -5552 -4117 6773 -3084 -3685 6757 -2152 -3210 7714 -2535 -7533 5565 -1169 -7680 5493
2706 5493 2151 -6061 5885 3681 -4918 5312 3010 -8038 2469 3611 -8491 2142 5997
2719 5997 -6910 468 7289 -4364 -632 4758 -6758 -2825 5539 -5415 -2188 8879 -2710
2732 -2710 -3396 8871 -740 -5250 5082 -2333 -6645 5309 368 -4340 7097 1120 -6056 6151
2746 6151 2659 -9094 1698 2336 -8139 1267 4981 -4638 2529 4771 -6318 1757 6061 -7179
2760 -7179 -1397 6495 -5202 -1590 9072 -1997 -2929 5396 -3571 -3951 5147 -4020 -5927 6094
2774F094p490l949J3653o115r119J0727k502p615J0310k321q168J0817m92r742
2788e912J0372P53j3069P867N258j1012N413O532j0842M089O212j0247L675P029
2802F118j2453J455J1408r152k048J1608p377m030J1282n689m663R512o283o333
2816f645J2117m395q461J1497j338j0688J0066K746j0381O603J959r505Q069L535
2830E179j1069P436N603j2367M492Q768j1722j12Q715r417P05R492q172l80R883
2845G034q721k082J1861q088p600J1358l672p304J0880j558p423R323j773p788
2859e553J0211n16j1393Q835L730j1275P123N344j1417M305N603r790L221O123
2873D551j0887K924R589j0029M92J1211q906l033J0576o074l722Q850o488n250
$$ plain form
2774 6094 -1396 -5345 8308 2193 -6926 3801 1299 -6316 3994 1673 -6495 4322 3830 -5912
2788 -5912 4460 5213 -7856 11 5269 -5743 -330 6202 -4640 -551 5661 -4586 -911 6118
2802 6118 -6335 -4880 6528 -2624 -4672 6936 -441 -4471 6811 1122 -3541 5971 -312 -6645
2816 -6645 5472 1077 -7384 4113 2775 -7913 2153 4899 -5482 1121 3080 -6425 1644 5179
2830 5179 -5890 1546 7149 -5218 -726 8042 -3680 -3792 4923 -4494 -3789 5703 -2469 -2849 7034
2845 7034 -1687 -3769 8092 4 -7596 3762 90 -7214 3666 2108 -5315 4008 2235 -5553
2859 -5553 4658 4142 -7251 1584 5314 -5961 1162 6506 -4911 -606 4997 -4793 -1572 4551
2873 4551 -6336 -3412 6177 -3852 -3360 7851 -1055 -4088 6488 414 -3308 5542 -946 -6196
2887f196J0706m477p012J1201k414q792J1171J106r998P647J014j0069O880K070
2901B837r513P122M380j1129O504P889j1492J860P303j0397N82Q998p556N50R813
2916G751p619j519R510r432n528R231o323o063J2039p25n501J0684j231p421Q454
2931F307k958j1154P903J526r874R280N212r905N872M964j0876K601M856j1072
2945g318K889Q266q424L377J0347q973j594Q743q573n004P967o174l104J1482
2959C907l343l856J1749l547q438Q714k727r914P720O90q688Q553L579q609O724
2974B514K647j1135N684M468j0820M432Q249r181K343Q605q559j29P140r684j299
2989d725R063p642k541J0594n882l898J1210m346o302R474l178p025Q409j684
$$ plain form
2887 -6196 4510 33 -6979 4222 1808 -6984 4187 5293 -4705 2942 3956 -6113 767 2837
2901 2837 -6676 446 4826 -6303 201 8090 -3402 -1542 5761 -4636 -4054 4944 -2612 -2062 7751
2916 7751 132 -1387 8123 -1309 -6837 2394 -3929 -9992 2047 1322 -4179 6505 5274 -2147 6307
2931 6307 3349 -7805 98 1624 -8250 1030 6242 -3663 2209 7173 -3703 -1102 3754 -7318
2945 -7318 -4429 3837 -4587 -1210 9137 164 -1430 7313 -1260 -6264 1703 -4471 -7575 3907
2959 3907 564 -3292 8457 4910 -3528 5186 2459 -7455 265 955 -7733 820 4399 -4210 2514
2974 2514 5161 -5974 -290 4178 -6642 -2210 6039 -3142 -799 7806 -753 -882 6258 -3426 -4725
2989 -4725 4338 -3304 -5845 4749 -1133 -5031 6179 1833 -4469 5005 1827 -5198 3211 1527
3003A527p846R008M3r150Q098K963j0121O727M281j0042N266M526r556L221O599
3018E544r969K228P373r170N86Q967q353j623R353o809k936R753n106l501J0110
3033F447m424o019R500l188q260Q304j287q456Q727J092q257P749K869r328O215
3048A684L407j0419M862N149r582K975P537q996J674P581q892M01Q316q398j459
3063d160R368o687k645R878n073n014R792m400p064Q823k333p591R141m30p402
3078e797Q605J873r137P455K616r927N142L718r688M318N718r346L341O642q910
3093c377P84P804q805k89R209p670j937R923n600l610R367n401m827Q942m534
3108b1o324R193j093p160R127k08p691P440P98r598O379K391r249N820M564r136
$$ plain form
3003 1527 -6319 2689 2732 -6418 1680 4643 -5478 1249 5530 -4512 754 5280 -4276 -1055 5544
3018 5544 -4425 -2197 5176 -3994 -3408 5559 -2794 -4417 4936 -1873 -4809 4944 -162 -3663 6447
3033 6447 2023 -3996 5504 2316 -5944 2360 1073 -7383 1344 2436 -5821 1928 4797 -4531 1684
3048 1684 5091 -5328 -466 4683 -4899 -1924 5613 -3383 -1709 5872 -3020 -2619 5697 -2701 -4160
3063 -4160 5208 -1479 -4124 5754 681 -4333 5459 1059 -6005 2818 485 -7106 2035 1605 -5797
3078 -5797 2808 4681 -4456 2999 5615 -4312 830 4548 -5140 -822 4896 -4450 -1109 5533 -3377
3093 -3377 -2593 5211 -3594 -3883 5326 -2344 -4281 5642 42 -3568 5799 398 -4429 4513 -21
3108 -21 -6345 2848 1755 -5405 3722 3514 -4177 3263 4061 -5537 842 3233 -6016 -196 4368 -4768
3124d768M704O007r684J596P270q601P42P719p494K41R036p295k197R056p019
3139f87m806R049m789n059R686k475o132R299j466p169P816p72q587P602J595
3154C105q952P043L836q813M782M678r463L007N040r031K444P142q040J130Q141
3169F049p561j428Q589p140l416Q331n184l443R257l792m597R749k969o893Q808
3184D360j704q304P217P20q159P573K050q518O209K882r040M798M271j0119L600
3199b164O822q633K327P677p493j03P356p356r73Q035p996k816R627m729m200
3214d619R730l732n665Q299k188o872P395j531p117Q255R28q318P591K719r459
3229d584N217M175q912L302M746q318L588N996q353K071P173q855j91Q276p429
$$ plain form
3124 -4768 -64 5943 -3741 -2145 5125 -3476 -2734 4985 -2509 -2268 6768 -527 -2724 6332 -687
3139 -687 -5493 3556 -1233 -6292 3394 919 -5213 4086 2620 -4549 3267 2495 -6092 1510 3105
3154 3105 -5847 1196 5032 -3781 1001 5679 -3784 -777 4263 -4768 -2324 4818 -3222 -2092 6049
3169 6049 -1512 -2940 5649 -1491 -4907 3424 -1760 -5203 4054 262 -4335 5414 2445 -4448 4360
3184 4360 2656 -5648 1569 2289 -5870 1703 3753 -4765 1444 4326 -4714 84 4355 -5764 -2164
3199 -2164 4658 -3975 -1648 6029 -1464 -1567 5789 -1567 -2540 5495 -2501 -5317 4310 -419 -4619
3214 -4619 5111 1379 -4286 4013 1825 -5047 2348 817 -6300 1955 2883 -5435 2156 4875 -4584
3229 -4584 633 4808 -4104 -802 3944 -4374 -786 5210 -3143 -1072 6101 -2754 -2945 5331 -2098
3244b098k506Q470n378l221R150m166m026Q697m553n282R844k824q063Q677pp872
3260e158P312J540q070N910J715q021N641L457r594M178N387q994L117P070q142
3275b652L90P028o695J27O948p239j580Q762o703k750R897m574n469Q801k815
3290A476o009P313k127o482P776o09o741Q536P00r395P140L672r897M253M092
3305C698q230L881N084p420L306N832r482J267P658q264j535Q678o635k268Q637
3320D207m131l445P943m873m137R130m069o398R380j566p925Q814J265p991N641
3335A845J286p749O159J961q908N314M058r145M620O084q926J219O576p260L94
3350b472P069o958m59Q091p122j269R292n911n027R241l516n681P955k392o135
$$ plain form
3244 -2098 -4604 3866 -1512 -4733 4417 251 -3775 4922 369 -4913 4931 2107 -5956 2721 2714 -5158
3260 -5158 2154 3694 -4376 1534 3249 -4772 869 4326 -5268 -1090 4297 -4697 -1580 5490 -2652
3275 -2652 -2262 4766 -1929 -1802 5146 -2093 -3673 5089 -1614 -4364 5533 959 -4510 4291 1476
3290 1476 -4533 2780 653 -5829 1947 1338 -5403 3133 3833 -5562 1578 5250 -4647 -394 3698
3305 3698 -4532 -651 4433 -2987 319 6151 -3331 -2064 5594 -2670 -4205 4473 -2162 -4430 4207
3320 4207 76 -3369 4574 -299 -4436 4694 625 -5773 3607 2041 -5884 2930 4195 -3796 1845
3335 1845 3131 -4618 1541 3502 -5406 -92 3966 -5179 -559 5525 -3401 -2182 4394 -2866 -2472
3350 -2472 4597 -2361 -2820 5271 -1851 -3120 6172 261 -4766 4475 959 -4722 3233 841 -5294
3365e294P688j093o203Q129m19q375P670J594q892N492M165r130L802N375p316
3380b807L161M485q586K769O625q924L30Q100p198k071Q986n423k941P535m855
3395h14l250P998m145m821Q939l051o637R529k19q156O638J234p645N839J650
3410C089p761N809K577q899N277N177r170J987O052p567R03P250p111J7O956o676
3426b090n04Q506p235l060R313m614n051Q959k703n752P281j680n990P857j352
3441A885p558P706Q18q304O599K792q979N046M294p993L677M446q216L026N644
3456D883q208J575P931q767n84Q758o660k630P502m858l264Q383m429m014Q501
3471D119l671n547Q971k024p354Q083L22p888O531J981p421N553J780p865N167
$$ plain form
3365 -5294 2394 1301 -4902 3227 2808 -5567 2103 3697 -5195 297 4462 -4668 -866 4509 -2807
3380 -2807 354 4839 -3747 -978 5647 -3277 -2947 5153 -2045 -4116 4870 -553 -3494 4041 -814
3395 -814 -4064 3934 -211 -5032 3907 856 -5781 3748 3529 -4627 2011 3245 -4400 1439 3089
3410 3089 -4672 1137 3714 -5185 92 5269 -3901 -1914 4138 -3429 -2526 4724 -2387 -2370 4586 -2090
3426 -2090 -2594 5912 -1323 -4383 4930 316 -4735 4224 1521 -4231 3050 1370 -4620 3237 1885
3441 1885 -5673 2033 2851 -5453 1146 3938 -5041 5 4299 -3694 -17 4429 -3787 -761 4883
3456 4883 -3325 -1750 6181 -2586 -3170 5588 -1072 -3702 3800 -1058 -4322 4061 -368 -4382 4119
3471 4119 448 -5099 3872 1848 -5506 2577 2899 -4989 1542 3523 -3898 1655 3435 -4430 737
3486G37L893q980L493N593q704K114O588p224L68O535p289j44P774o646j599Q590
3502E099n416l536R166m216n553Q179l017n620Q228j962n814P606k43q122O875
3517A654J312q585N775L395q170M931M465q017L222M628q071J819O143q231J063
3532b667P986o923p98P879o189k631P273n247l389Q249m196m180Q865j897o244
3547d109P810j511p435O749N29p363O269K424p172N793K781q274M209L813r220
3562d707K517O104p814J726P135p331P74O990p344j355P559o316k425Q975m734
3577b46l212Q412l073n671P734k691o079P108j295o693P857J041p624O299K040
3592C907q287M814K782q085M134M571p698L332N563p838J858O301p689l05P478
$$ plain form
3486 737 4630 -4350 -857 4736 -3968 -1854 4734 -2490 -2122 4413 -2876 -3020 4754 -1892 -3491 5099
3502 5099 -317 -3853 5313 1097 -4456 3723 706 -4914 3314 1352 -4462 3144 2901 -5221 1654
3517 1654 2966 -5619 156 3551 -4619 312 4777 -3240 -18 4610 -3461 -1642 4501 -3730 -2667
3532 -2667 5319 -1604 -2402 5477 -712 -3343 3930 -1317 -4706 3543 -653 -4833 4032 2135 -4109
3547 -4109 3701 2190 -5245 1504 2033 -5330 939 3363 -3809 1984 4765 -3509 700 4513 -4707
3562 -4707 -2190 3914 -3900 -2174 4961 -2370 -1596 5394 -1950 -3305 4254 -2062 -4487 4488 -246
3577 -246 -3458 4954 1881 -3790 3944 1253 -4826 2282 987 -5706 2151 3192 -4432 1867 3907
3592 3907 -4380 434 3216 -4869 -735 3836 -3862 -530 5033 -2805 -947 5354 -2335 -2640 4838
3607D838o488j702Q149n716k327Q163n346m039Q160l728n327Q342j994n960P713
3622B738k81p031P072O02p402N872J941p893N169L478q331L883M634q580K556
3637a573N534p417J662O448o879j39P312o449j930Q083o048k946Q631m214m337
3652d262Q535k735n327P427j895o325O828j58p446P304J365p356N265K682q266
3667d364M306L397q210L476M989p430K884O022o872P26O655p349j019P142o266
3682a913j823P696m484k714P794m001m429P756l258n907P711j141o582P594M79
3697B778o814O581R26p515M853K282q014M815M113p965L680N627p667J356N934
3712D970p635L48O121o666m92P367n564j929P962m786l362P562l594n100Q203
$$ plain form
3607 4838 -1650 -3352 4797 -919 -3246 4917 -429 -4468 3692 -36 -5363 2979 985 -4975 2738
3622 2738 2457 -4574 2498 3100 -4302 1570 3511 -4382 787 4265 -4066 -183 4451 -4129 -1573
3637 -1573 3961 -3456 -1794 4654 -2225 -2364 4948 -1501 -3431 4652 -1396 -4342 4289 75 -4262
3652 -4262 4273 1538 -3789 3638 1743 -4582 2246 2088 -5358 1946 3311 -4045 1220 3902 -4364
3667 -4364 -58 3339 -4871 -1395 3594 -3836 -952 5070 -1802 -1076 5579 -1770 -2789 4353 -1913
3682 -1913 -3736 3960 -524 -3238 4556 555 -3874 3882 624 -5283 2428 1287 -5295 2299 2778
3697 2778 -4036 2545 3471 -4044 809 3091 -4923 -108 4005 -3960 -280 5347 -2320 -964 4970
3712 4970 -2665 -2317 3804 -2862 -3354 4013 -1551 -3480 4482 -304 -3666 3896 302 -4798 3405
3727C405j993n330P349j305n903O818k47p955O332J442p882N165L512p244L977
3742A41M135p576L083M766p683J577N797p318O59P417o322j558P472m981k581
3757b972O970m521l357P644l485m227P923k398o197P090n34o776O101N08o504
3772d735N628J959o524N309K610p630L954M030q203K317N505p449R40O171n885
3787b003J79O551o618j524P541n712k620P830l764l897P904k083n071O583j830
3802A466n989O788r57o207O845N33o889O162K704p478L522K907p206K792L966
3817B959p022K602N290o875J453O987p329l32O556n690k037P277m280k527O914
3832C946l895k879P325l832n446P177j471o287O519R29o245N653J392o207N214
$$ plain form
3727 3405 1412 -3918 3431 2126 -3777 3041 2794 -5161 1171 2613 -5269 -104 3408 -3836 141
3742 141 4276 -3300 -217 4549 -3134 -1557 4240 -3078 -2419 4998 -1324 -2882 4590 -391 -2972
3757 -2972 3998 -523 -3880 3764 279 -3948 3975 1577 -4620 2470 1936 -4840 1261 1769 -4735
3772 -4735 893 2852 -3672 1637 4247 -3383 571 4601 -3602 -1285 4220 -3229 -2289 3882 -2003
3787 -2003 -1824 4727 -1891 -3415 4126 -1586 -4206 3624 -140 -4037 3867 1784 -3287 3296 1466
3802 1466 -4523 2265 1308 -4899 1946 2479 -4410 1752 4456 -3022 500 3407 -3799 -1007 2959
3817 2959 -4063 -1461 3829 -3046 -1593 5394 -1935 -2267 4289 -1401 -3438 3839 -441 -2968 3946
3832 3946 51 -2828 4497 665 -4781 2396 925 -5362 1157 2086 -4159 1494 2886 -3321 1893
3847A893J618p279M198K872p472L614N120p736J696N845o226L99N541o056J89
3862a784N886o194j105P532n423l210Q173l026m405P014k253n131O491j402n130
3877c967O334k34o257O583J420p421M679K863q068L139L455o272K687L884o448
3892c623K660N955o618L41N947o622j083O456m355k482O538l192k406P060l635
3907I41l891O616l248n937O948j29n971O141J263n641N152J100p050M111J905
3922B310p520M606M229p035K803N579o141P56N432o378q98N170n882J11O399n011
3938a470j717Q003m174m138P154l312m831N860j054m096O301n39n318O471M23
3953C563o913M892J339p564L844L777o408L309L569n730K323M388p124J270N095
$$ plain form
3847 1893 3511 -3768 430 3302 -4170 -556 4564 -3172 -1476 4369 -1857 -1458 4083 -1973 -1784
3862 -1784 4102 -2092 -3197 4335 -1088 -4298 3875 849 -3556 3458 1205 -3926 2565 1163 -3967
3877 -3967 2367 2133 -4124 2459 3879 -3542 1137 4000 -4068 -929 2526 -3746 -1059 2825 -3623
3892 -3623 -963 4992 -1626 -1285 4662 -1960 -3043 3413 -942 -3424 3114 -78 -2484 4576 941
3907 941 -2950 3666 418 -5519 1429 1300 -4671 1470 2733 -2908 2244 3344 -3706 405 2310
3922 2310 -5210 -604 3625 -3410 -607 4972 -1169 -413 5019 -1359 -2257 2913 -2969 -2858 3541 -1470
3938 -1470 -3187 4816 642 -3496 3658 346 -4485 1375 321 -3775 2526 1987 -3331 3140 3563
3953 3563 -3350 1542 2881 -4683 -839 2938 -3470 -161 3408 -2322 1 4389 -2735 -1465 3630
3968C630o681j91O830n004j089O762m410k251O312l621l464O385l227m142P178
3983C017j507n439O397J20o052M662R82n885M454J504o402M808L170o851K979
3998d3M208o729J765M696n979R3N191n080K8N769n369p51O420m719l127P185l370
4015A88m241O257j902m034O199j172n065O225j13n893N277P35o317M497K293o322
4031c388L641L083o149K388L610o020J682M460o281Q37N604n142l85N819m425
4046f66j785O178m073k686O128l006l556O500k086m352O321j068n495N274L07
4061A935n929M499J249n347M323K221o539L997K855o498J998M145n698J331N145
4076C687n114K91N053n139o13N307m930j869O750l833l132O599k575l643N902
$$ plain form
3968 3630 -3051 -3242 3588 -1416 -2505 4257 -153 -2404 3908 287 -3177 3208 -19 -4161 3017
3983 3017 1510 -3929 2468 2588 -3464 1198 2180 -3705 749 2253 -4149 659 3829 -3022 -43
3998 -43 4165 -2564 -799 3897 -2082 -1989 3202 -1878 -1850 3919 -1450 -2201 4219 -500 -3627 3558 188
4015 188 -4053 2204 302 -3732 2467 1295 -3770 2455 2342 -3551 1726 2461 -3856 641 2934 -3388
4031 -3388 253 3336 -2813 -425 3185 -2835 -1153 3307 -2974 -2137 3467 -1675 -2060 3759 -666
4046 -666 -2451 3727 -346 -3032 3096 90 -3466 3034 948 -3404 2917 1849 -3646 1628 1935
4061 1935 -3994 505 1754 -3593 730 2951 -3588 409 3264 -3234 -1236 2909 -2789 -1458 3687
4076 3687 -1427 -1136 3917 -1222 -1835 3472 -1458 -3327 3423 -410 -3542 3057 482 -3161 2741
4091B741j801m593N764r17m876N611K52n435N020J130n998M052K185o509K750
4106f24L563n736K243L954n768J247N006n990K60N218m954j233N596l623j724
4121b565N963l461k601O322l247l544N526j614m326N404n55m575M869N76n645
4136c473M404J340n753L824K168n932L131L405n928K275M034n191P87M556m939
4151a292n29N173m906q82N484l835j860O040l366k854N460k376l707N271j544
4166B77m212N796m15m843N024J030n772M118J554n535L137K565n862K835L692
4181C389n620J802M072n766Q23M550n343m19N250m351r71N607l230j985N921l176
$$ plain form
4091 2741 940 -3653 2111 1194 -3682 1929 2181 -3254 1766 2896 -3102 950 3135 -3374 -624
4106 -624 2939 -2797 -554 3400 -2368 -1121 3885 -2105 -1845 3373 -1581 -2814 2782 -841 -2565
4121 -2565 3398 -63 -2664 3658 411 -3133 2393 779 -3547 1857 1302 -3273 1596 2172 -3473
4136 -3473 931 2271 -3482 342 2510 -3422 -291 3114 -2814 -539 3495 -1696 -909 3647 -1292
4151 -1292 -1821 3352 -1554 -2436 3048 -787 -2647 3393 27 -2827 2633 257 -3450 1821 277
4166 277 -3935 1861 1446 -3397 1627 2657 -3115 1003 2557 -2978 159 2724 -3138 -303 3389
4181 3389 -2231 -429 3643 -2123 -1300 3250 -2093 -2512 2738 -1613 -2584 3023 -207 -2192 3729 553
$$ [...]
8191B63
##END NTUPLES=NMR FID
##END=
