##TITLE=1H_Ser DNG-Co-Pip-HCl
 DMSO, 8 sc, 
 11.2.2019
##JCAMPDX= 6.0         $$ Bruker NMR JCAMP-DX V2.0
##DATA TYPE= NMR FID
##DATA CLASS= NTUPLES
##ORIGIN= UXNMR, Bruker Analytische Messtechnik GmbH
##OWNER= root
$$ XWIN-NMR		Version 3.5
$$ Mon Feb 11 15:40:31 2019 Russian Standard Time (UT+4h)  she@DPX200
##.OBSERVE FREQUENCY= 200.1313
##.OBSERVE NUCLEUS= ^1H
##.DELAY= (6, 6)
##.ACQUISITION MODE= SIMULTANEOUS
##.ACQUISITION SCHEME= undefined
##.AVERAGES= 8
##.DIGITISER RES= 18
##SPECTROMETER/DATA SYSTEM= spect
##.PULSE SEQUENCE= zg30
##.SOLVENT NAME= DMSO
##.SHIFT REFERENCE= (INTERNAL, DMSO, 0, 15.7039)
##AUDIT TRAIL= $$ (NUMBER, WHEN, WHO, WHERE, WHAT)
$$ ##TITLE= Audit trail, XWIN-NMR		Version 3.5
$$ ##JCAMPDX= 5.01
$$ ##ORIGIN= Bruker BioSpin GmbH
$$ ##OWNER= she
$$ F:/spectra/data/she/nmr/H-F/1/audita.txt
$$ ##AUDIT TRAIL=  $$ (NUMBER, WHEN, WHO, WHERE, WHAT)
(   1,<2019-02-11 15:39:18.51 +0400>,<she>,<DPX200>,
      <created by zg, POWCHK disabled, PULCHK disabled
       configuration hash MD5:
       00 E9 B6 7A A2 85 ED C7 34 08 36 98 17 FE 4E 26
       data hash MD5: 16K
       DC B7 C6 97 BE DA 0A E8 70 E7 0A 9E 47 AC A2 27>)
$$ ##END=
$$ 
$$ hash MD5
$$ 62 6C 3D 1A DE C3 1D 74 04 9B 42 45 45 7B 78 B3
##$RELAX= 
##$RELAX= 
##$RELAX= 
##$RELAX= 
##$RELAX= 
##$RELAX= 
$$ Bruker specific parameters
$$ --------------------------
##$DU= <F:/spectra>
##$EXPNO= 1
##$NAME= <H-F>
##$PROCNO= 1
##$TYPE= <nmr>
##$USER= <she>
##$AMP= (0..31)
100 100 100 100 100 100 100 100 100 100 100 100 100 100 100 100 100 100 
100 100 100 100 100 100 100 100 100 100 100 100 100 100 
##$AQSEQ= 0
##$AQ_mod= 1
##$AUNM= <au_zg>
##$AUTOPOS= <>
##$BF1= 200.13
##$BF2= 200.13
##$BF3= 200.13
##$BF4= 200.13
##$BF5= 200.13
##$BF6= 200.13
##$BF7= 200.13
##$BF8= 200.13
##$BYTORDA= 1
##$CFDGTYP= 0
##$CFRGTYP= 5
##$CHEMSTR= <none>
##$CNST= (0..31)
1 1 145 1 1 1 1 1 1 1 1 1 1 1 1 1 1 1 1 1 1 1 1 1 1 1 1 1 1 1 1 1 
##$CPDPRG= <>
##$CPDPRG1= <>
##$CPDPRG2= <>
##$CPDPRG3= <>
##$CPDPRG4= <mlev>
##$CPDPRG5= <mlev>
##$CPDPRG6= <mlev>
##$CPDPRG7= <mlev>
##$CPDPRG8= <mlev>
##$CPDPRGB= <>
##$CPDPRGT= <>
##$D= (0..31)
0 1.2 0 0 0 0 0 0 0 0 0 0.03 0 0 0 0 0 0 0 0 0 0 0 0 0 0 0 0 0 0 0 0 
##$DATE= 1549885157
##$DBL= (0..7)
120 120 120 120 120 120 120 120 
##$DBP= (0..7)
150 150 150 150 150 150 150 150 
##$DBP07= 0
##$DBPNAM0= <>
##$DBPNAM1= <>
##$DBPNAM2= <>
##$DBPNAM3= <>
##$DBPNAM4= <>
##$DBPNAM5= <>
##$DBPNAM6= <>
##$DBPNAM7= <>
##$DBPOAL= (0..7)
0.5 0.5 0.5 0.5 0.5 0.5 0.5 0.5 
##$DBPOFFS= (0..7)
0 0 0 0 0 0 0 0 
##$DE= 6
##$DECBNUC= <off>
##$DECIM= 32
##$DECNUC= <off>
##$DECSTAT= 4
##$DIGMOD= 1
##$DIGTYP= 9
##$DL= (0..7)
0 120 120 120 120 120 120 120 
##$DP= (0..7)
150 150 150 150 150 150 150 150 
##$DP07= 0
##$DPNAME0= <>
##$DPNAME1= <>
##$DPNAME2= <>
##$DPNAME3= <>
##$DPNAME4= <>
##$DPNAME5= <>
##$DPNAME6= <>
##$DPNAME7= <>
##$DPOAL= (0..7)
0.5 0.5 0.5 0.5 0.5 0.5 0.5 0.5 
##$DPOFFS= (0..7)
0 0 0 0 0 0 0 0 
##$DQDMODE= 0
##$DR= 18
##$DS= 0
##$DSLIST= <SSSSSSSSSSSSSSS>
$$ [...]
##$SUBNAM2= <"">
##$SUBNAM3= <"">
##$SUBNAM4= <"">
##$SUBNAM5= <"">
##$SUBNAM6= <"">
##$SUBNAM7= <"">
##$SUBNAM8= <"">
##$SUBNAM9= <"">
##$SW= 20.0189088683792
##$SWIBOX= (0..15)
0 0 2 0 0 0 0 0 0 0 0 0 0 0 0 0 
##$SW_h= 4006.41025641026
##$TD= 16384
##$TD0= 1
##$TE= 0
##$TE2= 300
##$TE3= 300
##$TEG= 300
##$TL= (0..7)
0 120 120 120 120 120 120 120 
##$TP= (0..7)
150 150 150 150 150 150 150 150 
##$TP07= 0
##$TPNAME0= <>
##$TPNAME1= <>
##$TPNAME2= <>
##$TPNAME3= <>
##$TPNAME4= <>
##$TPNAME5= <>
##$TPNAME6= <>
##$TPNAME7= <>
##$TPOAL= (0..7)
0.5 0.5 0.5 0.5 0.5 0.5 0.5 0.5 
##$TPOFFS= (0..7)
0 0 0 0 0 0 0 0 
##$TUNHIN= 0
##$TUNHOUT= 0
##$TUNXOUT= 0
##$USERA1= <user>
##$USERA2= <user>
##$USERA3= <user>
##$USERA4= <user>
##$USERA5= <user>
##$V9= 5
##$VALIST= <valist>
##$VCLIST= <CCCCCCCCCCCCCCC>
##$VD= 0
##$VDLIST= <DDDDDDDDDDDDDDD>
##$VPLIST= <PPPPPPPPPPPPPPP>
##$VTLIST= <TTTTTTTTTTTTTTT>
##$WBST= 1024
##$WBSW= 4
##$XGAIN= (0..3)
0 0 0 0 
##$XL= 0
##$YL= 0
##$YMAX_a= 725631
##$YMIN_a= -940543
##$ZGOPTNS= <>
##$ZL1= 120
##$ZL2= 120
##$ZL3= 120
##$ZL4= 120
##$ABSF1= 10
##$ABSF2= 0
##$ABSG= 5
##$ABSL= 3
##$ALPHA= 0
##$AQORDER= 0
##$ASSFAC= 0
##$ASSFACI= 0
##$ASSFACX= 0
##$ASSWID= 0
##$AUNMP= <proc_1d>
##$AZFE= 0.1
##$AZFW= 0.1
##$BCFW= 1
##$BC_mod= 2
##$BYTORDP= 1
##$COROFFS= 0
##$CY= 11.3945322036743
##$DATMOD= 1
##$DC= 2
##$DFILT= <>
##$DTYPP= 0
##$F1P= 18.9103706918063
##$F2P= -1.10871071338519
##$FCOR= 0.5
##$FTSIZE= 0
##$FT_mod= 4
##$GAMMA= 1
##$GB= 0.15
##$INTBC= 1
##$INTSCL= 1
##$ISEN= 128
##$LB= 0.24
##$LEV0= 0
##$LPBIN= 0
##$MAXI= 10000
##$MC2= 0
##$MEAN= 0
##$ME_mod= 0
##$MI= 1.114404
##$NCOEF= 0
##$NC_proc= 0
##$NLEV= 6
##$NOISF1= 3.799351
##$NOISF2= 2.8
##$NSP= 1
##$NTH_PI= 0
##$NZP= 0
##$OFFSET= 15.70392
##$PC= 1
##$PHC0= -8681.779
##$PHC1= 14.00018
##$PH_mod= 1
##$PKNL= yes
##$PPARMOD= 0
##$PSCAL= 0
##$PSIGN= 0
##$REVERSE= no
##$SF= 200.130013532006
##$SI= 16384
##$SIGF1= 3
##$SIGF2= 2
##$SINO= 400
##$SIOLD= 16384
##$SREGLST= <1H.CDCl3>
##$SSB= 0
##$STSI= 0
##$STSR= 0
##$SW_p= 3612.71676300578
##$SYMM= 0
##$S_DEV= 0
##$TDeff= 0
##$TDoff= 0
##$TI= <>
##$TILT= no
##$TM1= 0
##$TM2= 0
##$TOPLEV= 0
##$USERP1= <user>
##$USERP2= <user>
##$USERP3= <user>
##$USERP4= <user>
##$USERP5= <user>
##$WDW= 1
##$XDIM= 8192
##$YMAX_p= 0
##$YMIN_p= 0
$$ End of Bruker specific parameters
$$ ---------------------------------
##NTUPLES= NMR FID
##VAR_NAME=  TIME,          FID/REAL,        FID/IMAG
##SYMBOL=    X,             R,               I
##VAR_TYPE=  INDEPENDENT,   DEPENDENT,       DEPENDENT
##VAR_FORM=  AFFN,          ASDF,            ASDF
##VAR_DIM=   8192,          8192,            8192
##UNITS=     SECONDS,       ARBITRARY UNITS, ARBITRARY UNITS
##FACTOR=    0.0002496,     1,               1
##FIRST=     0,             0,               0
##LAST=      2.0444736,     0,               0
##MIN=       0,             -940543,         0
##MAX=       2.0444736,     725631,          0
$$ Real data points
##PAGE= N=1
##DATA TABLE= (X++(R..R)), XYDATA
0 0 0 0 0 0 0 0 0 0 0 8 -8 8 -16 16 -24 32 -32 40 -56 64 -76 88 -104 128 -148 171 -203 232 -267 310 -350
31 -350 402 -458 515 -584 657 -737 825 -923 1029 -1148 1274 -1413 1568 -1730 1914 -2114
47 -2114 2329 -2568 2828 -3114 3433 -3783 4174 -4613 5106 -5670 6314 -7061 7946 -9006
61 -9006 10303 -11943 14075 -16991 21234 -28002 40558 -71807 323427 260024 -610939 -818612
73 -818612 -541461 155873 636433 662568 126206 -460526 -686020 -338256 236296 657885
83 657885 584559 83091 -520293 -724926 -390383 232364 645185 593792 125668 -402701
93 -402701 -631720 -387481 120584 511031 498632 127244 -334189 -547095 -353413 125563
103 125563 523923 535686 147649 -340208 -573439 -389802 66111 459588 504342 179207
113 179207 -270336 -518380 -391204 22222 429014 532758 248626 -218294 -521184 -435417
123 -435417 -27063 391256 503618 231022 -210129 -488434 -402719 -17621 386682 511692
133 511692 255561 -197552 -509475 -442614 -41304 399099 546212 279079 -202351 -526429
143 -526429 -445571 -33910 386369 505238 244252 -197228 -487681 -406826 -14004 391889
153 391889 504987 242682 -199697 -492752 -415307 -22753 380114 480940 211036 -207754
163 -207754 -455637 -362638 -11687 339033 438339 218591 -151771 -395127 -338406 -36008
173 -36008 284775 387956 194001 -153197 -383223 -317593 -16040 285698 374042 198647
183 198647 -112884 -342384 -324693 -72317 228133 359080 233011 -57219 -307660 -333286
193 -333286 -106161 203641 352728 227384 -68477 -310172 -324776 -102223 201592 366842
203 366842 267755 -26226 -299283 -354698 -153696 159190 354111 279180 -15385 -298162
213 -298162 -345592 -125618 186286 354370 259067 -26961 -294615 -344650 -137244 173507
223 173507 354901 273000 -12537 -291268 -354083 -147830 172513 357036 263730 -29281
233 -29281 -291827 -328650 -119915 175290 340058 252451 -21794 -276665 -323595 -132737 151319
244 151319 318640 245163 -15191 -261929 -303651 -110586 161457 303818 218912 -20384
254 -20384 -236994 -278478 -120626 118679 266058 217846 13831 -196014 -259939 -131531 96018
265 96018 251151 214194 14354 -192663 -252654 -129182 85721 241255 228001 51582 -165444
276 -165444 -265338 -173715 42310 225273 241941 77561 -147566 -260806 -168542 57262 239194
287 239194 238255 59285 -164167 -271895 -182934 42274 238586 258394 87727 -144329 -266166
298 -266166 -189165 31893 229857 247432 69044 -161344 -262695 -163369 54792 231356
308 231356 240408 73457 -148979 -261193 -179940 31622 214558 235936 81565 -134434 -246738
319 -246738 -165966 44466 217351 220881 60671 -140299 -236782 -162090 29555 197408 217260
330 217260 77358 -114109 -215547 -156479 18854 179991 204395 71029 -116371 -212037
340 -212037 -147860 20048 167198 193578 83937 -83613 -188362 -155149 -10064 139265
350 139265 184999 95116 -67693 -184132 -163387 -15657 146120 198419 105097 -61139 -182339
361 -182339 -175263 -43570 120739 197111 126101 -39786 -174636 -176801 -43694 127859 205881
372 205881 124956 -57104 -198442 -188703 -38947 136951 210516 131742 -42180 -183294 -186261
383 -186261 -48515 122793 197296 122281 -45518 -179947 -178570 -38384 133240 201572 116106
394 116106 -52250 -175593 -168824 -41962 112474 183764 117479 -36428 -160857 -163559 -45186
405 -45186 106588 180927 120309 -31641 -159310 -163762 -46442 98254 165256 111472 -20820
416 -20820 -136854 -150950 -50184 89284 160432 111428 -18643 -136868 -156884 -61154 81363
427 81363 162715 120970 -7429 -122478 -144845 -64857 59621 140419 117049 4454 -112012
438 -112012 -144684 -70414 56898 146168 130252 15105 -114984 -158121 -81369 53556 145387
449 145387 130443 21413 -105084 -156477 -88673 47669 149920 138782 23952 -109189 -162717
460 -162717 -92892 48239 152201 136640 16229 -111930 -151514 -76979 54283 145705 128598
471 128598 12781 -113821 -154022 -80468 50281 141843 129142 22488 -99217 -143788 -77149
482 -77149 44296 125609 110313 14648 -89565 -127619 -71153 39798 123281 116211 24360 -84982
494 -84982 -132707 -84646 25470 116065 118948 31987 -75694 -123132 -78148 22556 106290 112360
506 112360 35782 -69623 -125209 -86697 15910 105374 116092 42122 -61975 -120558 -87957
517 -87957 12263 102061 112185 38456 -61315 -116705 -88940 4904 98552 121299 52795 -53527
529 -53527 -118084 -97059 -6670 89498 119701 56278 -51546 -116699 -89849 3526 92766 115779
541 115779 54037 -53475 -125209 -101324 -125 98435 123141 59712 -46472 -118995 -100674
552 -100674 -3524 92498 111351 45747 -49374 -106010 -85362 747 89684 109853 45307 -50800
564 -50800 -106288 -85856 -5841 78886 106779 54045 -37893 -96655 -81170 -9283 65718 92919
576 92919 52494 -28040 -88818 -82900 -14606 62934 95129 58876 -20715 -87662 -89854 -23130
588 -23130 60803 97382 60897 -19054 -84317 -88592 -27108 56040 98889 67156 -15019 -85070
600 -85070 -90945 -30151 51859 94471 65629 -12997 -80363 -84869 -24581 53139 90229 60612
612 60612 -15036 -81728 -89040 -30217 51647 95544 70109 -4671 -74364 -89594 -38889 40205
624 40205 86854 65062 -6257 -69962 -79051 -27187 45814 87522 63160 -11426 -81246 -90312
636 -90312 -32809 47373 92241 71474 448 -68860 -84424 -35548 35038 73002 53175 -4073
648 -4073 -56772 -66588 -23123 41605 75505 51111 -11362 -64809 -74927 -35534 30743 77404
660 77404 68182 10312 -49506 -69614 -41921 12259 57874 58910 12231 -45617 -66407 -34067
672 -34067 24284 66874 63847 11643 -54830 -83366 -48533 21111 72226 70355 20965 -42251
684 -42251 -74416 -49357 14124 64329 61181 10954 -45151 -67663 -39933 20112 67385 63523
696 63523 11174 -47600 -69523 -41616 14162 60278 62521 17034 -42237 -67762 -41552 14316
708 14316 58825 61459 20276 -38216 -69967 -48932 8935 57033 61142 21797 -31323 -60926
720 -60926 -44162 7557 53778 56602 15932 -36778 -62133 -42250 9085 56020 62066 21738
732 21738 -32986 -60978 -45011 719 43618 53685 24420 -22527 -51320 -38321 3781 41811
744 41811 47933 19172 -25767 -54413 -44308 488 46242 59245 29603 -19603 -55285 -53080
756 -53080 -12798 36779 58898 34899 -13644 -49412 -47005 -9956 35709 54986 31135 -19732
768 -19732 -55658 -47660 -3967 41191 57077 32027 -16912 -54026 -49242 -7178 37274 51121
780 51121 26592 -15615 -46336 -42396 -4555 38017 50653 25184 -17394 -46205 -44141 -11285
792 -11285 30770 50697 31862 -9716 -40733 -40625 -11651 25112 45164 30926 -9302 -43956
804 -43956 -45052 -12118 28548 49601 36519 -2781 -41095 -48712 -19846 21637 42789 31279
816 31279 -1912 -32294 -37380 -11290 25719 42411 25266 -12110 -40620 -41244 -13614 25355 48473
829 48473 37034 -1200 -36444 -43609 -20478 14108 37969 34234 3994 -29424 -38945 -16943 17834
842 17834 39187 32033 273 -34468 -45993 -21770 20014 45875 38131 4358 -31696 -45491
854 -45491 -25923 13464 41678 36318 2718 -29918 -37891 -17773 15444 37283 30328 -1394 -32440
867 -32440 -37030 -13276 19086 37882 30088 417 -31157 -40102 -19779 13776 35935 32647 8768
880 8768 -20917 -36248 -25411 4734 29497 30342 8396 -18042 -31186 -21484 6362 32062 33287
893 33287 7318 -25229 -39482 -25682 5928 34565 39738 15843 -19552 -38154 -26892 1834
905 1834 26213 29875 10416 -17905 -32342 -19664 10566 32434 29886 6052 -22263 -36368 -26393
918 -26393 3658 31417 35750 14080 -15109 -31384 -25823 -2550 23026 30986 14161 -13795 -30081
931 -30081 -23174 115 24417 31834 14934 -14511 -33902 -25686 1459 26071 31604 14364 -13897
944 -13897 -33248 -27366 302 26845 31110 13302 -11752 -27453 -23006 -1443 20834 25775 9358
957 9358 -13612 -24975 -17783 2217 22523 28308 13208 -12335 -28947 -25180 -5895 15986 27414
970 27414 20649 -1184 -21458 -23550 -7345 13846 23214 14719 -5990 -24107 -24994 -5042 20649
983 20649 30907 18548 -7203 -27141 -28497 -8955 17286 30016 18511 -6635 -25252 -23750
995 -23750 -5191 16756 26551 16576 -7087 -24624 -22051 -3233 16118 22646 13360 -5835 -22100
1008 -22100 -22223 -4505 17482 26066 16191 -3631 -21176 -25407 -11989 10701 23963 18370 284
1021 284 -15199 -18703 -8020 10527 21905 14900 -6509 -23835 -23146 -5679 15414 27387 21871
1034 21871 319 -21674 -26367 -11042 8944 19277 15534 960 -14449 -18777 -6409 11848
1046 11848 20353 13215 -2701 -17033 -21121 -10679 8718 22277 18508 2089 -13978 -19651 -13144
1059 -13144 3465 19295 20356 5058 -14754 -22261 -13203 3903 18658 20374 5643 -13885 -22177
1072 -22177 -11475 8376 21331 18556 1888 -17603 -25832 -14409 8007 23762 21202 5129
1084 5129 -12503 -20201 -12713 3896 16006 13460 -192 -13155 -14932 -5339 8300 18343 16339
1097 16339 2882 -14053 -21285 -14348 991 14295 17935 9876 -4230 -13760 -11902 322 11049
1110 11049 11708 3082 -9936 -17410 -12276 3286 18996 21395 8042 -9907 -20175 -16259 -2425
1123 -2425 12591 17613 8222 -7291 -14778 -9407 2708 11850 12975 4384 -9622 -17269 -11145 3716
1137 3716 14591 16085 7740 -5348 -16485 -15841 -3250 11081 15008 8068 -2544 -11900 -13728 -4157
1151 -4157 11056 16735 7855 -6735 -15230 -12156 -909 12700 18074 8188 -9904 -19626 -14029 365
1165 365 13193 17762 10758 -4878 -16089 -12921 337 10296 11212 4370 -4931 -11695 -9331 2244
1179 2244 12486 11445 2249 -6853 -12269 -11482 -2622 10119 16513 11127 -883 -10040 -13243 -8614
1193 -8614 1735 10388 9431 -208 -8174 -8455 -1554 7508 12687 8910 -3508 -15488 -16186 -4164 10228
1208 10228 17233 12469 -163 -12688 -15796 -7186 5855 12515 8663 -900 -8539 -9031 -1842 7911
1222 7911 12385 7120 -4242 -12839 -12856 -4916 5990 13146 11153 1260 -9254 -12311 -6347 4051
1236 4051 10907 10369 2804 -7667 -12460 -7136 3787 11363 8401 -1003 -9168 -11069 -4285 7177
1250 7177 14599 10253 -2095 -11639 -12182 -5565 4618 11791 10326 -22 -8809 -10024 -3758 3187
1264 3187 7217 6539 981 -5932 -8074 -2284 5120 8312 6678 1748 -5115 -10450 -8368 372 7978
1279 7978 9100 3769 -3154 -8784 -8116 -39 9475 11232 3937 -5489 -10290 -8251 -1072 7475 10034
1294 10034 2874 -8181 -11476 -4868 5093 11732 10996 3045 -8430 -13782 -8636 2051 9056 8986 4070
1309 4070 -2912 -7185 -5597 984 5925 4248 -1718 -6476 -7362 -3494 4199 11553 12039 4440 -5822
1324 -5822 -11591 -10682 -4587 3280 8285 6601 -486 -5078 -3079 2752 7145 6748 922 -7896 -12235
1339 -12235 -7834 2322 10411 10618 4598 -3425 -8366 -7751 -1676 5637 6557 2014 -3344 -4994 -3035
1354 -3035 1226 5862 7066 3328 -3613 -7850 -6717 -2042 3171 6437 5718 190 -6159 -6756 -538
1369 -538 5797 8936 6268 -997 -9483 -11560 -4938 4985 9717 6557 -506 -5922 -7106 -1957 6274
1384 6274 9189 3412 -5480 -9503 -6666 580 7612 10252 5354 -3704 -9702 -8062 -1899 4058 6152
1399 6152 4896 190 -4405 -4617 -228 3541 4175 1844 -1161 -4897 -5809 -2081 4138 7383 4537 -919
1415 -919 -5795 -7305 -4296 2984 9125 8290 1397 -5343 -7239 -4949 113 4370 4803 -89 -4846 -3939
1431 -3939 1024 5503 6362 3083 -2441 -7518 -8368 -2716 4265 7298 6062 2077 -2494 -5831 -5543 -1332
1447 -1332 3140 3800 1169 -1485 -2873 -1707 1833 5799 5213 109 -5606 -7727 -4465 1488 6998
1462 6998 8358 2943 -5110 -8704 -5247 2016 6324 6041 1705 -3922 -6342 -3430 2960 5814 3077
1477 3077 -2112 -4983 -4341 -771 4295 6706 4006 -1944 -5919 -5421 -2472 1247 4765 5605 2617 -1843
1493 -1843 -3985 -2815 -1169 484 2248 2239 -944 -3378 -1832 1901 4629 3970 704 -3355 -7039 -5752
1509 -5752 334 6441 7325 3231 -2081 -5192 -4923 -1141 3638 4695 908 -3532 -3999 -1104 1841 4240
1525 4240 4351 429 -4664 -6388 -2894 1552 4232 4594 3473 -659 -4514 -4653 -1336 2427 3448 2593
1541 2593 -394 -3144 -4346 -838 3968 5141 1814 -2205 -4913 -4615 -622 4682 6759 3060 -3285
1556 -3285 -6437 -4285 -21 4236 5856 3027 -2335 -5501 -3607 810 3281 2869 825 -2109 -3325
1571 -3325 -1937 1575 3869 3088 486 -1525 -3272 -3433 -1649 1881 3750 3063 718 -1411 -2454 -2553
1587 -2553 -265 2713 3212 47 -3696 -4070 -1019 2490 4936 4504 42 -4351 -5905 -2315 2750 4454
1603 4454 3418 -294 -3175 -4109 -1110 3083 4136 1468 -1778 -3244 -3041 -1274 2088 4554 2968
1618 2968 -1140 -3184 -2463 -866 664 2491 2909 428 -2669 -3396 -1241 1041 2564 3099 1608 -2118
1634 -2118 -4363 -2156 1897 3399 2214 -281 -2847 -4024 -1763 2671 5357 3253 -960 -3133 -3291
1649 -3291 -1955 789 3562 2519 -905 -2912 -1433 872 1772 2209 1151 -1518 -3199 -2505 -12 1462
1665 1462 1482 2419 2280 -380 -2652 -2354 -177 1333 1365 1429 -8 -2064 -2429 48 3141 3355 1138 -2217
1683 -2217 -3935 -3256 233 4303 5276 1300 -2687 -4528 -2684 826 3431 3425 708 -2420 -3188 -639
1699 -639 1941 2724 1296 -675 -2136 -3121 -1085 1592 3351 2613 307 -1651 -2482 -2094 -1115 942 2469
1716 2469 1640 -65 -1214 -1252 -321 1246 2413 1063 -2056 -4195 -2574 1229 3780 3944 2107 -1041
1732 -1041 -3828 -3689 -345 2137 2035 220 -645 -1057 -950 585 2323 1658 -851 -2510 -1810 -638 81
1749 81 1470 2804 1556 -467 -1501 -1843 -1583 -667 1657 3370 1369 -1670 -2493 -727 476 938 1461
1766 1461 119 -2074 -3009 82 3048 3591 1437 -1266 -3767 -4385 -1714 2913 4776 2243 -840 -1922
1782 -1922 -1801 -786 843 1519 -166 -2050 -1485 963 2050 1790 1213 384 -1619 -3419 -2399 21
1798 21 1509 2203 2025 1386 -266 -1864 -1533 -581 -130 73 695 283 -769 -560 1812 3002 1033 -1857
1816 -1857 -3763 -3028 -813 1677 3764 3326 494 -1925 -2550 -1037 172 623 907 245 -591 -922 594
1833 594 1985 1732 -220 -1310 -1846 -1511 -489 1262 1841 1185 522 -406 -1702 -2702 -1269 1349 2875
1850 2875 1104 -1081 -1510 -988 523 1512 1702 -60 -2159 -2756 -611 2103 2870 2713 451 -2931 -3988
1867 -3988 -1982 1989 3391 1732 -527 -1184 -1251 -339 824 1195 193 -1006 -951 162 380 460 826 1286
1885 1286 54 -1527 -1524 -344 186 316 1517 1562 163 -978 -1235 -467 428 1225 1589 -318 -2528 -2442
1903 -2442 492 3026 2365 292 -1697 -2580 -1971 28 2351 2539 917 -613 -1155 -1035 -584 549 1154
1920 1154 163 -1483 -1136 312 1195 964 777 518 -190 -1030 -1032 -778 -105 147 1434 1346 -195 -1457 -583
1939 -583 1481 1489 -68 -1697 -2083 -1432 -178 2334 3011 1654 -319 -2005 -2317 -1326 343 1918 1107
1956 1107 -969 -1260 -17 1742 1680 137 -934 -1098 -1064 -668 338 753 520 412 848 432 -634 -1140
1974 -1140 -224 -60 -71 -639 212 79 -18 283 1144 1097 -161 -1312 -1767 -1400 518 2021 2755 489 -2373
1993 -2373 -2204 -85 1447 1672 306 -402 -1196 -1100 208 1216 1296 317 -374 -818 -997 -310 1150 1608
2011 1608 195 -1133 -790 123 556 226 275 351 -246 -280 -90 -196 139 661 1479 720 -1270 -2447 -734
2030 -734 942 1635 1184 215 -890 -1300 -742 613 1395 1247 11 -1147 -1859 -1355 625 2000 1185 -961
2048 -961 -1234 -36 981 453 -178 -446 -384 -662 -18 320 214 -50 927 1064 -173 -1301 -1162 -259 777
2067 777 549 389 440 -346 -459 -239 889 1118 276 -809 -1910 -1753 -91 2445 2906 806 -1913 -2019
2085 -2019 -618 118 454 289 6 -115 94 408 903 105 -290 -519 -983 -1169 -190 1532 1692 370 -462
2104 -462 -155 -222 -596 -1159 -239 738 859 828 442 -369 -1077 109 932 421 -1041 -1619 -599 953 1355
2123 1355 1482 615 -914 -1363 -1590 25 530 947 1142 489 -830 -990 176 754 -104 -1409 -1020 603
2141 603 1250 772 403 -114 -580 -632 -509 -507 -476 255 1774 1792 294 -1190 -1198 -872 -475 -153 558 745 103
2162 103 -212 335 692 772 242 -862 -2172 -2050 66 2261 2527 834 -762 -1519 -565 4 188 -49
2180 -49 -32 -253 166 476 331 385 369 -53 -1039 -1182 -255 755 1030 181 26 336 21 -778 -1220 -336 758
2201 758 1359 1043 399 -1457 -1274 -386 1119 829 -590 -794 -198 815 810 1144 406 -434 -1796 -1402 -438
2220 -438 373 977 1531 636 -683 -732 206 547 -343 -1185 -637 601 521 121 171 243 23 73 37 -672 -1624
2241 -1624 -441 1157 1319 192 -365 -251 -518 -238 288 954 626 -462 -1021 -546 49 580 1067 526
2259 526 -1160 -1654 10 1630 976 120 -996 -590 -301 -13 682 197 77 41 506 277 -166 -478 -55
2278 -55 -137 -528 -271 524 563 122 -540 106 510 309 -209 -955 -970 -76 820 1163 233 -1113 -734 373 886
2299 886 365 -379 -650 -578 -445 249 785 416 -6 -647 -438 -120 101 696 758 -82 -923 -476 384 693 -103
2320 -103 -486 -10 296 287 -86 -417 -552 -45 626 304 -822 -933 226 986 1264 188 -277 -659 -479 -704
2340 -704 262 720 845 -285 -762 -293 3 536 937 -3 -1029 -1509 3 1093 618 156 -400 -101 279
2359 279 184 42 -35 -232 -31 152 -33 -108 -76 521 523 -192 -43 295 -25 -1098 -649 369 832 383 -246
2380 -246 -682 -591 56 1088 1231 89 -1676 -1072 92 456 741 268 179 -221 -692 24 327 267 39 -560
2400 -560 -256 -433 479 916 659 -249 -698 -80 155 -15 -595 -97 423 488 475 189 -252 -617 260 743 560
2421 560 -646 -887 -158 272 385 236 158 -5 -680 -899 149 821 394 220 -358 -525 -263 775 578
2440 578 125 -712 -445 64 307 301 -222 -310 -120 -237 290 222 -264 -230 285 699 46 -302 -177 -138 -121 -189 327
2463 327 541 -78 -756 -414 532 682 603 -265 -611 -917 98 946 919 -14 -893 -549 142 133 23 146 -249
2484 -249 -432 -374 516 768 262 -233 -431 -287 -463 -57 337 90 -396 -274 729 553 -237 -405 -259 -50
2504 -50 -56 312 23 -453 -184 569 749 186 -422 -618 -594 -351 -72 715 839 305 -420 -420 216 157 -182 -406
2526 -406 -512 -713 -224 819 1090 158 -679 -455 -175 -53 -264 116 160 43 108 424 75 -355 -683 -132
2546 -132 177 -11 146 256 337 226 79 255 101 -717 -984 -576 213 925 1094 211 -354 -939 -772 102
2566 102 148 -505 -410 264 639 757 273 50 -630 -1281 -944 -409 16 370 369 307 417 236 -150 -147 -452 -631
2588 -631 -141 733 580 -61 -367 -71 112 370 243 -123 -862 -506 231 800 582 101 -271 -385 -301 -340 530
2609 530 660 133 -238 -146 -37 135 -387 -310 -660 -429 481 1113 1049 -251 -482 -483 -663 -600 -333 3 263 353
2631 353 448 569 300 -502 -680 -239 87 -125 -142 478 -31 76 466 679 264 -568 -897 -682 -37 375 668
2652 668 273 137 -297 274 247 -140 -914 -935 -313 211 368 594 505 -205 -885 -530 45 238 15 338 465
2673 465 -41 88 268 -390 -438 -369 243 777 219 39 -222 -105 22 225 258 -413 -684 -439 242 667 625
2694 625 418 80 -192 -486 0 246 -75 -249 -413 192 630 625 218 -142 -715 -849 -249 371 589 253 110
2715 110 260 18 -246 -223 -484 -120 19 565 676 36 -501 -593 -169 151 117 148 -54 -421 -433 530 731 99
2737 99 -411 -365 -270 -177 398 525 235 -66 -403 144 472 -215 -470 -335 -299 88 779 905 422 -352 -320 -184
2759 -184 -42 -489 -299 63 193 522 435 228 -201 -956 -682 -75 143 589 542 38 -144 294 264 142 -327
2780 -327 -654 -685 -292 375 481 411 -87 -320 -211 -112 91 -181 -398 -289 270 518 358 390 -135 -640 -638 -105
2802 -105 -59 454 322 57 109 145 -93 -311 -520 -740 -243 383 543 411 68 -244 -277 -18 -130 -149 -273 -270
2824 -270 -20 758 401 72 -297 -407 -400 -431 164 553 -103 -364 -285 316 305 -113 -49 -216 -366 -218 196 189 92
2847 92 -53 168 199 207 -242 -473 -356 -309 -117 486 267 -74 -475 -266 -35 -81 267 -217 -192 -624 -13 600
2869 600 137 -15 -496 -262 277 211 139 40 -169 -428 -181 518 512 305 38 -110 -42 -136 10 114 39 -128 23
2892 23 411 290 -206 -354 -104 67 30 333 283 -130 -107 -14 207 399 283 -212 -167 -125 193 371 263 -297
2914 -297 -447 12 38 315 -126 -180 7 -247 -148 -47 285 -150 -305 -158 58 49 268 -3 54 58 68 194 -209
2937 -209 -524 -435 -18 294 532 252 11 -390 -193 -24 -32 191 -148 -314 98 418 282 301 101 -405 -540
2958 -540 -256 173 324 -142 -13 8 233 211 -45 -110 -441 -382 -181 344 281 38 178 -184 149 -355 297 -75
2980 -75 -312 -390 81 405 311 -74 -211 -99 -258 21 -209 140 52 6 184 602 3 -130 -355 -401 -57 -29
3002 -29 372 74 -198 -244 -114 1 -71 180 63 -63 -277 -88 180 158 -165 -199 -31 15 79 71 263 -84 -303
3025 -303 91 357 139 -442 -266 104 263 235 18 41 -221 -132 109 465 162 89 -281 182 -54 53 23 -19
3047 -19 -315 -327 302 95 425 231 -318 -7 -306 -144 275 106 -176 -91 201 223 199 -81 40 -212 -5 245
3069 245 125 65 -107 -227 201 164 210 -22 39 -236 104 12 357 -33 -15 -258 -150 505 89 170 124 -222 -249
3092 -249 81 325 159 -273 -256 -3 140 225 -115 93 90 -169 94 122 -47 -450 88 97 -18 86 37 242 -221
3115 -221 -177 -12 20 299 58 0 -20 81 380 241 84 -218 -294 77 207 286 87 -91 -71 254 108 78 109
3138 109 -226 -517 179 378 -37 -145 -447 -8 -200 -333 134 11 -300 -121 176 -16 202 -244 -118 -86
3158 -86 -442 84 234 130 -448 -210 250 240 -93 -81 -258 -214 -94 288 386 185 -176 -140 325 -94 172 15
3180 15 -28 90 133 67 125 -12 -129 -201 -304 331 97 -55 -164 -146 -68 -5 189 -159 -230 -349 -261 80 270 304
3204 304 -18 -169 -19 152 240 -172 -59 -112 -12 262 349 338 -35 -363 0 -78 547 5 146 -17 -28 -104
3226 -104 42 92 -70 -178 -44 152 338 544 138 -79 -284 -24 -69 -154 -227 -91 58 315 306 -2 61 -47
3248 -47 -108 61 239 241 -126 -101 -161 59 147 -161 58 -275 -398 -26 333 -51 174 -104 -290 -77 46 178
3270 178 239 -184 -233 67 219 159 6 -281 -280 -124 75 16 173 75 -297 83 287 313 3 -153 -52 -56 56
3293 56 90 -155 -212 -203 -31 133 -43 62 -20 -95 240 49 47 255 -168 -313 -138 299 -5 166 -160 25 47
3316 47 36 42 172 47 -312 33 -17 157 28 -149 -1 -166 -254 145 410 139 -84 -128 47 -22 -33 -19 -275
3339 -275 -324 -235 -224 202 -259 -213 -46 238 255 231 148 -113 -82 195 395 71 61 -152 -183 -112 124 -98 61 -52
3363 -52 -135 -55 -109 4 30 121 -127 -366 3 49 -30 -8 -234 -14 150 -99 275 -128 -52 30 54 41 10 -17 -205
3388 -205 25 134 258 -77 -31 -201 -35 137 77 6 197 -122 59 -63 271 -131 137 -139 -133 -1 -19 -65
3410 -65 -142 86 -20 -291 -222 221 33 -169 -176 146 281 157 31 -86 112 164 193 202 -63 -274 -210 -5 87 37
3434 37 -3 20 162 -16 85 5 200 -63 1 -218 -199 102 -56 -160 55 -62 107 74 141 -93 -229 37 57
3457 57 35 140 -142 110 -31 90 17 60 228 32 -21 218 179 184 262 -237 158 -57 168 -121 1 -229 -46
3480 -46 287 279 2 204 -322 -257 99 223 -2 -11 185 -4 240 77 -82 54 -48 -136 175 -91 -35 -70 -254
3503 -254 191 113 -203 -94 59 -122 -373 45 -41 212 216 286 22 34 -207 -2 119 -93 -53 270 224 85 52
3526 52 -13 -184 -355 -87 269 -28 -199 -225 -58 163 238 92 -152 -103 -122 36 68 -79 -240 68 -145 -89 174
3549 174 -368 -74 13 -33 -6 56 65 -32 -179 75 -272 -78 16 59 70 33 -25 4 -10 -16 -68 -26 -61 -11 135 -160 -97
3576 -97 125 109 -123 25 -214 -162 -345 20 -31 88 215 -9 -23 203 44 -208 110 82 9 -124 81 175 -149
3599 -149 -143 122 -278 -262 -72 -60 -161 244 342 134 -90 -132 -216 -287 -38 -291 110 -90 -79 54 -190 37 48
3622 48 -4 -345 -136 111 -148 -22 -125 -380 61 -226 116 218 -148 -416 56 -106 18 124 -25 58 -112
3643 -112 248 49 143 -126 -219 -22 178 57 146 212 79 -235 -124 -14 -16 200 -332 -52 -244 131 -32 23
3665 23 307 111 -50 68 211 -12 -39 -284 -78 -129 111 327 -139 -155 82 -52 101 -1 29 -106 261 72
3687 72 -138 37 304 -110 161 -45 -297 286 142 -32 166 -77 -161 149 62 -154 -274 -7 142 -105 129
3708 129 79 -189 -43 71 -85 156 -27 117 211 -20 -457 146 130 83 -238 -17 179 45 19 -269 -129 165
3730 165 141 129 77 -169 -43 -278 -106 -256 -151 -181 -82 -285 94 112 -188 -29 -208 192 104 10 -105 -94 73
3753 73 29 -23 -88 -22 121 -108 -55 -84 30 -109 133 -57 -159 171 5 -18 -71 6 71 24 -106 -145 -35 63 -86
3778 -86 93 -57 357 -97 -72 302 205 -292 -3 -23 -112 27 154 94 157 -87 -54 -35 -129 235 -61 -38 -98 22
3802 22 192 9 224 38 -168 189 -134 -22 52 -23 -47 72 78 -55 45 187 -89 -124 -61 270 187 -29 -195
3825 -195 186 -87 -116 -124 -110 36 -197 80 -123 134 -328 53 -62 -255 -18 87 97 49 204 83 -47 -65
3847 -65 218 -55 105 -161 -98 55 -33 197 -259 16 -32 120 -68 -245 166 52 89 -26 -53 0 89 -95 133
3870 133 -90 45 119 68 -126 -304 39 424 -129 -374 37 -91 137 -293 28 -148 48 115 -53 -188 -72
3891 -72 77 14 202 58 116 128 123 31 -166 -114 2 129 -64 7 108 183 215 17 -66 -205 -129 -65 -68 -249 -31
3916 -31 198 97 58 253 33 -64 -63 35 232 273 52 -51 9 -162 72 -7 125 4 -100 53 -234 8 -148
3939 -148 -288 -108 -68 94 163 -150 73 -194 20 162 -128 346 -165 -18 149 -103 36 387 37 18 265
3960 265 72 260 -21 162 111 -224 109 116 30 129 -120 -93 159 213 -36 -202 122 138 85 -85 136 -76 -183
3983 -183 -312 167 -55 269 115 -5 94 -66 68 52 128 243 -128 111 -98 -92 94 -115 45 -75 231 345
4005 345 -7 75 -7 39 163 153 -45 -344 -290 130 93 99 356 -1 -61 -38 18 2 -68 14 103 54 -11 133 192 -164
4031 -164 6 -99 -21 81 52 -130 55 80 154 112 43 330 -159 -33 -8 75 -52 64 -422 -105 41 -193 -150
4054 -150 -122 224 -187 69 45 198 57 21 -68 40 -2 285 -3 171 -112 -68 251 85 -221 30 180 -84
4076 -84 -138 83 16 -30 -118 -25 73 30 -5 96 -1 -71 191 -151 126 -22 -82 41 -16 49 -47 154 -21 -22 -16 -213
4102 -213 128 -49 71 48 27 71 -117 38 -8 -48 55 -164 181 6 65 -58 -296 95 -191 -11 186 -139
4124 -139 -307 148 -89 -19 -19 -41 144 -33 -156 -273 195 147 -34 53 210 408 -124 -17 -51 -21 -155 42 -9
4147 -9 128 -123 -133 -15 -251 3 -29 -283 -174 67 -295 -44 -40 -37 4 -180 104 -85 -64 -245 -72 42 310
4170 310 96 -123 18 352 69 -63 -234 -107 -101 255 -33 138 -123 -176 11 -175 153 60 -88 -103 -51 199
4192 199 137 165 -63 -296 -57 -204 -68 137 55 -252 87 -73 -89 125 -228 -80 -49 84 -55 -81 163 148
4214 148 -92 67 195 -94 -392 68 195 -53 89 -120 192 -108 -160 -170 69 120 -96 -186 194 204 -98 7
4236 7 10 -51 -114 -182 34 248 -23 56 -22 227 -243 61 -186 -9 -317 225 24 64 64 -131 47 -275 90 37
4260 37 56 9 -298 146 16 149 -3 106 152 -9 368 21 81 15 -32 -61 155 -64 -85 -140 119 113 -24 308
4284 308 441 -24 -186 -16 6 76 -101 -145 10 -242 -84 -33 -30 -4 -62 -169 67 -188 283 -166 -348 1 226
4307 226 -45 -164 -217 -283 50 -51 82 132 171 -225 -98 -32 191 -89 -286 152 -157 -120 31 8 -133 57
4329 57 -217 55 -88 -12 -297 -271 56 -5 96 130 -183 -207 96 154 95 232 -42 28 -39 -16 -174 186 -68 -80
4353 -80 -234 15 109 211 -102 -98 7 -166 -49 40 -9 -82 -120 -112 35 92 93 -72 109 247 205 77 28 -2 254
4378 254 -171 71 99 -40 -66 -13 -80 -114 -157 177 43 52 98 103 -31 228 29 -150 109 -156 390 109 -166 -258
4402 -258 28 78 -78 -99 6 -97 -58 97 128 51 -99 -254 1 -284 -75 412 -211 -52 -69 -8 211 38
4424 38 62 -267 -21 -41 -48 83 135 -169 -139 184 133 -50 -84 101 -179 -219 152 89 -71 -66 -50 -66 -157 368 -5
4449 -5 91 9 233 92 39 32 -27 -86 118 34 91 8 78 -57 -117 -103 104 -71 109 -15 105 -53 53 -50 134
4474 134 255 -430 59 -40 -12 -92 10 40 69 106 124 -159 -56 -68 193 -26 105 257 -50 -163 -115 113 -77
4497 -77 -64 -228 7 268 74 43 -64 37 49 -23 -30 247 116 -32 -268 -14 264 106 -5 -148 -169 -142 1
4520 1 58 -23 -181 -309 -147 -77 -21 88 -187 -102 189 84 -113 -92 -92 -184 -116 -11 150 291 -100 36 -90 318
4544 318 96 -23 -462 -77 -130 -101 80 93 -34 -134 187 -145 113 -209 -38 108 195 -87 -102 -62 59 -163
4566 -163 -18 44 216 155 -149 -124 135 -9 -203 -71 -113 -54 -23 179 1 51 -144 -210 -19 -333 -22 -73 -8
4589 -8 -160 -136 -51 -177 -85 -63 31 -147 52 -90 -71 -22 -86 -100 53 66 5 138 -37 -155 -148 195 217 63 -218
4614 -218 -88 46 74 99 -174 -230 73 -24 -39 -152 -107 -138 -363 56 139 -108 51 -49 -5 -7 -107 261 -147 50
4638 50 -122 13 -101 132 -9 -235 -42 135 32 73 115 95 -146 139 248 22 -21 50 -15 123 -18 173
4660 173 -92 -112 -213 -70 1 142 349 -60 -203 -45 138 -1 -46 10 -330 -210 21 -68 206 18 58 153
4682 153 -18 94 62 142 -337 168 106 354 377 -66 -159 20 -79 -33 196 -227 -117 -270 -160 167 127 -287 -171
4705 -171 -54 131 110 194 -27 48 -171 -84 347 -39 90 132 -93 72 200 197 -343 28 -40 -76 -16 -29 72 107
4729 107 208 268 20 266 -61 -25 141 114 180 87 143 -44 3 36 58 -88 -37 -87 4 -18 186 165 221 -21 -241
4754 -241 -1 120 -44 70 49 -110 -71 178 -314 160 -113 72 -129 24 276 32 -98 183 22 116 -140
4775 -140 -219 37 -372 -50 97 202 -113 -2 -251 56 151 127 -117 -272 -325 -36 252 -109 -61 -441 41 -7
4797 -7 9 18 21 271 -305 -253 110 75 195 38 98 -92 -8 -38 283 -91 -25 -207 -107 235 26 51 59 87 -123 164
4823 164 -75 408 161 30 -97 -30 32 93 -11 -135 -131 79 205 117 -151 -79 66 -14 292 89 -71 155 39
4846 39 287 308 54 -98 -78 109 -104 110 -96 123 38 -429 -73 -58 51 60 -251 14 25 66 132 4 -222
4869 -222 135 -78 337 154 2 12 -257 130 -52 -92 -214 -44 172 -103 94 178 -11 -150 -187 20 234
4890 234 -45 107 -54 89 -72 157 -126 -15 -4 90 72 -49 -48 47 -255 111 -21 -93 -25 -39 -127 -159 127 85
4914 85 378 -231 47 -46 -195 19 127 69 -196 325 -50 9 86 1 -323 47 115 -52 -98 170 -264 -180 -160
4937 -160 -27 146 11 -227 -426 -103 -126 -3 -149 -171 -95 -59 292 195 -71 13 13 24 128 -60 -99 156 -129
4960 -129 22 79 165 67 -112 -247 50 -199 212 63 -352 37 -94 15 62 119 -153 -126 23 -61 70 -2 45
4983 45 -297 20 -160 128 191 -48 205 -78 50 23 302 -129 -123 -54 62 20 4 -140 69 61 175 234 -16 8
5007 8 110 -30 44 38 70 -1 135 -275 147 147 -150 -13 -306 -177 199 -115 -55 64 15 -235 110 -74 31 -224
5031 -224 -49 1 -106 -46 52 177 -174 -366 -36 241 45 -133 14 -52 -388 105 34 231 -296 -253 167 132
5053 132 104 90 -38 45 -127 -173 -118 119 -93 22 25 50 -138 -92 -28 -274 -228 179 -82 198 -168 38 -266 -21
5077 -21 110 175 -97 -221 -16 -111 -77 274 -70 -130 -19 199 154 -89 -8 45 168 27 -60 155 1 -154 -25
5100 -25 -106 303 -91 -73 168 -32 -191 108 124 -40 -367 -152 57 259 178 -82 8 -115 -97 -56 -184 29 105
5123 105 -249 40 53 228 22 -287 -144 -165 55 -83 -40 48 -402 -89 32 72 139 -36 205 287 -73 220
5145 220 239 -223 -232 74 205 140 -153 141 -183 -38 263 92 14 -19 -196 59 -249 206 79 -126 -323 -91
5167 -91 -239 -17 23 63 2 -150 0 -89 -307 -132 -6 11 -124 -225 118 -150 187 -12 351 -18 13 -158
5189 -158 -91 32 -9 124 233 -44 -110 67 -133 -193 151 3 -156 30 -65 -64 42 -4 249 -4 -193 20 115
5212 115 110 -57 -196 38 121 40 -13 -194 -146 -49 -202 295 -4 -198 -424 -83 78 98 174 76 -148 -46 80
5235 80 -54 150 -131 -51 145 111 1 -10 272 -57 145 92 67 252 131 161 -13 106 202 -119 -46 -19 -160
5258 -160 360 71 106 -60 -12 -51 26 75 -95 -81 -1 172 -94 336 233 -204 -165 -169 89 247 140 -2 -26 24
5282 24 -39 174 102 -80 -130 -151 270 -29 182 -188 90 -68 -19 104 38 -54 -167 147 -1 257 105 217 -57
5305 -57 25 -368 78 259 -323 -136 -92 -6 27 -96 95 -102 26 -219 16 206 120 -124 -182 92 130 135 154 -139
5329 -139 -120 77 164 135 127 183 -92 216 82 -206 -106 -156 230 74 315 97 -198 -172 -417 -185 165 181 222
5352 222 -179 -99 -121 -191 -363 -204 -179 44 -169 -10 125 346 10 157 -238 -76 65 118 125 148 292 -65 46
5375 46 -13 -114 -156 -98 53 -7 114 191 -10 -68 -207 329 -26 -278 -331 -37 -13 80 80 57 -113 164 -67 374
5399 374 11 -184 -186 -76 -27 -70 311 -27 -124 -230 88 -28 91 -96 42 -95 3 73 -31 22 44 -57 -28
5422 -28 150 165 99 -252 -231 62 150 -132 86 -95 21 -149 323 339 168 -67 14 -39 -235 -143 -110 -65 -95 138
5446 138 67 -4 13 84 -288 -437 -1 111 58 -76 -93 106 416 107 71 -188 -228 -90 -150 159 231 -261 -70
5469 -70 -217 62 105 195 120 287 -213 -146 186 69 -21 157 -150 255 83 9 -6 -56 -85 14 65 -49 -195 -128
5493 -128 -65 22 308 17 244 15 -137 115 -232 141 -71 -94 105 37 -37 67 64 -176 -38 304 93 -156
5515 -156 142 312 247 -47 39 -62 143 -190 -36 40 -94 237 -22 172 122 -82 210 -23 -10 -104 -12 220
5537 220 100 203 148 -293 -121 -286 28 175 -167 -216 79 -157 -154 161 -133 122 -65 21 -61 -14 -34 -252 -185
5560 -185 -18 -45 16 202 59 -176 57 -56 99 7 -47 -150 -260 95 235 285 -381 -282 -253 107 191 37 177
5583 177 -236 -179 40 113 181 -32 -143 -50 -18 200 89 12 -167 228 -70 136 40 171 -102 48 35 -143 15
5606 15 -30 -23 -174 70 133 176 -28 -223 -156 162 149 53 -100 49 -3 128 227 -187 57 -146 -66 39 148 167
5630 167 114 18 -365 68 93 419 -61 -125 -156 94 327 234 118 -337 -71 171 129 79 -121 -84 -106 84 47 55
5654 55 174 9 -63 -14 172 10 137 -78 -33 -105 92 37 244 -52 20 -59 201 168 -26 -192 -29 -27 25 178
5678 178 112 -56 -102 177 -105 110 119 59 -145 36 -152 210 131 21 -69 6 -21 123 176 211 -120 -79 3 96 163
5703 163 -190 -173 19 176 94 27 -130 -364 154 42 114 150 191 -33 18 108 -112 180 160 126 89 256 154 7
5727 7 11 -96 -56 -126 -22 179 63 113 -130 -235 -173 -2 420 -73 168 74 177 231 295 -9 -18 -219 61 296
5751 296 -82 -59 -118 123 72 136 84 -124 7 -101 228 -3 -30 148 283 67 -165 332 -5 69 -223 -112
5773 -112 -76 -15 187 28 -60 -227 -59 -10 202 38 -268 11 94 66 -126 60 -82 -42 47 95 151 -11 40 -76
5797 -76 -86 -4 176 32 -118 -64 -81 158 0 118 46 74 123 115 157 95 -137 89 -247 140 65 -83 -52 -108 -80
5822 -80 -43 119 -166 -55 -67 -33 153 234 24 24 -22 -26 156 28 -116 -148 -23 -174 83 83 141 -12 -252 -57 32
5847 32 314 -23 -254 -48 54 -227 162 164 35 -30 -21 118 173 231 -5 -256 -150 233 259 224 -102 -28 54 231
5871 231 63 239 53 -246 30 -69 96 70 -169 -143 -79 26 57 47 53 -81 -159 -56 138 -14 75 -232 -30
5894 -30 24 -81 -52 -262 -192 -15 -264 364 231 -84 -32 -152 141 180 200 -65 -29 -83 231 277 109 -90 -161 -212
5918 -212 44 -63 -156 -163 248 -150 -211 74 42 241 -169 185 -73 -80 -215 -257 78 -230 174 111 121 -106 -210
5941 -210 -98 121 258 122 37 -112 -109 49 249 201 308 -82 30 -138 99 63 -49 -47 -234 34 112 236 50
5964 50 -135 100 19 94 101 -99 182 -313 58 287 -107 67 -136 -26 -62 202 -45 48 -1 -381 92 80 203
5987 203 -170 5 13 -24 23 193 -156 -9 -19 -86 128 -8 101 53 231 45 -34 121 -83 27 -70 22 156
6010 156 161 52 -86 -16 0 130 99 -181 281 -145 -122 32 10 162 -36 -42 -116 -197 91 278 13 244 49 -83
6034 -83 60 -117 -117 114 -87 102 -26 31 181 55 -52 -258 -98 -195 -98 -36 -144 -148 -14 -36 -49 44 -421 154
6058 154 -2 8 90 -257 -147 -46 133 -214 162 -108 -17 -111 61 39 96 270 -111 -7 -45 26 -22 -209 336
6081 336 17 167 88 160 -14 -82 -82 256 163 -109 132 -68 108 -115 191 225 141 -104 -327 124 -22 8 -159
6104 -159 -103 -232 -119 193 222 157 -162 -40 110 142 -50 -56 -13 -143 -131 86 -44 21 126 -12 15 4 -110 50
6128 50 -186 -51 25 -244 -19 14 -65 -175 -25 -107 79 -202 -9 -340 75 92 -34 66 -9 -141 -150 -26 -100
6151 -100 -165 -132 -159 -260 21 -6 -21 -49 -88 82 -204 53 8 -129 -143 171 -29 -23 -233 166 77 -94 -68 113
6175 113 8 -4 -333 22 -17 136 203 -78 -117 105 260 238 -113 -28 80 -62 39 31 159 -41 -115 -93 231
6198 231 146 100 -295 177 -50 -113 172 5 209 113 -36 192 101 -31 105 -107 -218 -7 69 114 -41 -241
6220 -241 -98 -184 121 350 173 -157 -67 -48 66 241 -57 -115 88 -24 65 73 32 -163 -49 11 -24 60 29 191
6244 191 21 -45 185 -29 217 -88 1 62 66 47 -154 -42 -57 -150 -1 117 -12 15 -219 -62 192 162 -122
6267 -122 27 38 -5 219 9 -31 161 217 212 50 242 -87 -192 -126 -408 -2 -69 -134 296 49 -60 30 43 -26
6291 -26 -113 -31 -89 -118 -2 216 -189 -239 -73 22 -133 -104 -10 141 9 -130 13 181 316 -254 -257 -122 50 -256
6315 -256 -5 265 114 91 12 -21 -194 41 -75 -233 201 -121 -142 157 -65 6 13 191 -156 -68 27 -89 -138
6338 -138 -94 -65 231 371 -234 53 245 24 -280 18 41 45 -12 211 51 37 5 108 102 32 267 -192 190 31
6362 31 44 182 0 -68 -152 -85 -85 9 127 -279 56 108 106 43 -142 19 -54 -166 397 242 14 -49 -119 -20 12 -92
6388 -92 -143 21 55 177 93 243 36 -187 -204 -9 -3 112 195 -36 -92 58 205 34 -172 -9 -27 118 -168
6411 -168 37 98 -292 98 66 98 30 88 119 -228 62 225 158 -304 -155 -75 -128 72 -132 101 -28 17 180
6434 180 -25 -53 141 18 -137 -218 137 32 -110 13 223 -43 42 -284 178 -174 72 42 -171 -66 -19 -51
6456 -51 -223 -344 72 110 110 38 -155 -108 42 -136 103 -114 -217 -59 -185 -45 49 53 -67 -210 195 184 -76
6479 -76 131 157 -29 101 479 31 -136 64 -65 -120 145 123 71 -282 -25 23 100 87 -111 -70 -103 32 -94
6502 -94 -4 -8 -60 10 82 -167 -69 171 -17 19 103 95 23 253 252 178 -20 -37 155 -18 -249 -10 -127 409 138 -22
6528 -22 -111 33 -116 118 240 328 -52 -109 -193 247 -83 -66 -125 -252 -42 1 143 157 153 32 74 167 63 88 12
6553 12 -262 34 273 187 216 -117 67 -193 -74 112 169 -138 -144 69 322 -2 -133 151 79 -150 2 -163
6575 -163 4 -58 4 -92 132 52 127 199 91 -140 233 89 10 138 -9 -39 -88 75 145 -43 94 -153 -514
6598 -514 228 -18 159 -188 74 16 112 178 44 -142 -210 -69 53 89 46 -152 -12 112 184 89 -144 -103 -73
6621 -73 -45 -25 106 80 93 -90 -103 67 54 -76 45 -176 79 101 146 32 -72 -203 -177 -78 25 -291 -51 -169
6645 -169 -296 80 133 -217 2 -17 21 -160 27 149 -74 -92 49 -101 44 -40 -115 75 168 -80 305 228 -122
6668 -122 -50 -97 325 237 63 149 -215 -95 170 71 10 171 -28 -26 -38 -80 -30 -199 219 -105 -29 -30 248 -124 -37
6693 -37 18 -92 258 271 210 125 20 159 155 137 67 178 -117 74 138 0 -19 -199 178 -143 51 80 101 112 -109
6718 -109 163 141 192 -2 -63 295 33 -32 -25 -309 145 112 -123 -169 143 152 -64 -119 -260 191 51 33 41 28 -36
6743 -36 32 138 258 138 -102 -303 203 197 55 -186 219 -127 -60 -84 -141 40 -116 -159 167 -415 107 -260 50
6766 50 -140 -262 -123 4 -125 -127 -153 -102 45 96 44 11 -163 119 -97 -109 -51 64 -197 309 30 0 -89 -151
6790 -151 274 8 121 43 53 -75 192 217 114 39 8 24 -365 12 -179 -11 -29 77 83 93 -126 -61 99 -298
6814 -298 -47 -57 170 88 -161 -71 114 -8 76 338 -29 -130 -236 -141 87 -5 2 -201 -235 -147 148 -6 70 -195
6838 -195 -88 -177 119 -12 231 -66 -80 -22 272 71 11 145 -43 -120 -103 142 -74 -195 1 -43 -164 126
6860 126 -74 71 71 -92 101 -88 -38 32 58 -174 -159 144 0 169 59 -95 -196 229 219 89 -152 89
6882 89 134 106 59 -73 -55 125 11 -53 73 91 221 -60 119 115 0 13 -262 147 -20 55 227 -99 -170 -56
6906 -56 -104 -88 -53 -100 -123 251 -5 -67 318 32 -172 -164 17 64 -4 30 -72 264 212 -111 309 6 -345 -123
6930 -123 137 26 22 14 -108 223 53 92 96 114 54 166 84 24 98 -117 181 117 -270 -73 252 180 90 -181 -19
6955 -19 194 15 77 113 181 88 -145 -147 72 -324 -106 -96 -156 -17 144 -26 -112 -64 -177 230 23 26 -264 -71
6979 -71 -185 191 -52 -178 -108 -114 -1 -43 -11 -183 -297 -140 43 -39 9 -39 -71 -247 -124 -80 -105 -109 145 -230 236
7004 236 -77 87 -45 -88 -240 139 213 -58 60 275 -270 58 163 -84 -88 -108 -54 158 -57 -205 -81 1
7026 1 -108 -258 250 269 53 -7 -25 31 -135 -185 203 -132 -163 168 261 350 28 -138 184 -21 155 184 -124 -21
7050 -21 -39 -289 -178 81 -11 141 38 -166 -112 -65 303 78 -259 -200 195 385 139 -87 -105 -25 163 123 -134
7073 -134 243 -241 -182 -46 40 100 9 1 120 209 181 -164 17 167 -127 41 171 235 -45 -255 68 -38 -47 155
7097 155 36 -108 -208 173 168 126 -96 33 -159 48 19 -27 223 -74 33 -48 -197 -54 201 -156 58 61 27
7120 27 81 -25 -15 -247 140 -150 240 -61 -170 61 115 -90 -42 180 -215 151 -155 10 -96 350 -253 -51
7142 -51 32 -62 -23 -122 223 146 96 -239 -20 -124 94 54 -213 121 -156 68 -28 -254 -38 8 66 9 22 22 -96
7167 -96 55 -34 117 -122 -124 -51 -154 -65 144 4 -164 -160 0 171 -237 43 -180 -20 142 -107 86 20 -108
7190 -108 -245 15 311 217 155 4 -31 -9 19 -148 -324 -80 -138 -65 88 186 -42 -141 -144 -412 -85 89 43 -30
7214 -30 -62 104 -56 88 40 -94 -3 21 -36 147 3 104 -42 -112 68 -177 -100 6 145 -211 -90 69 195
7237 195 3 149 -57 192 88 185 104 30 30 51 -19 120 0 -12 -61 24 208 109 54 -224 1 100 78 138 -150
7262 -150 4 -101 -11 121 158 144 -16 -45 -32 47 -266 -1 89 -57 -132 403 -43 -27 81 39 -168 -59 -355
7285 -355 -220 -164 137 50 25 270 -5 50 -237 -20 238 267 -145 -268 -48 -8 148 116 -304 -21 -103 25 -167
7308 -167 258 -20 -119 50 22 -49 -127 44 0 -313 77 62 94 0 -264 -78 -11 163 82 121 246 58 -50 67
7332 67 31 -105 -169 -281 64 339 -185 71 -121 212 -80 57 -171 28 72 -132 -72 64 116 -210 33 -185
7354 -185 31 99 73 -237 49 70 -142 83 288 -20 220 158 144 160 -15 -49 22 -126 -87 206 -186 284 25
7377 25 157 256 10 -64 49 -165 -30 26 65 122 -109 344 62 -323 33 221 162 43 173 97 -25 98 267
7400 267 145 63 -31 86 -91 -28 -297 -127 -194 -144 63 -15 -31 -119 82 134 -52 253 199 -59 -106 -50 -24 18 210
7425 210 -62 0 282 -104 180 18 -146 -301 53 105 -40 104 -13 28 56 72 172 -49 -229 53 77 -127
7447 -127 55 122 -62 166 37 43 10 92 -88 -117 -236 75 -190 -222 -69 -69 27 77 249 -83 -74 -215 -179 208 384
7472 384 -219 37 10 113 16 164 233 111 64 -118 162 160 110 161 -86 52 -22 182 274 58 -18 4 222 18
7496 18 76 -123 -64 30 -62 -71 -121 29 142 16 168 -101 53 -403 64 221 38 -47 -103 49 32 161 38 17
7520 17 184 80 -155 -112 94 119 377 -54 -136 -92 -49 104 63 47 103 -154 -95 45 214 -59 182 2 -97 -110
7544 -110 244 59 144 62 31 6 140 131 1 207 5 -17 170 5 -306 76 13 -27 6 -1 261 -137 109 11
7568 11 -57 72 132 84 -168 162 12 23 -95 51 -13 -126 37 -162 -57 -87 54 97 122 22 -118 -3 -90
7591 -90 133 192 -168 -105 70 -22 -239 -152 -122 188 4 -216 137 86 -56 55 -171 -316 -72 8 60 -62 -4
7614 -4 -12 81 179 66 295 -118 -14 168 -316 -208 198 72 -380 105 69 90 148 56 -187 -186 266 170 -290 15
7638 15 -101 319 26 -139 -16 33 23 -178 -136 90 -70 69 -298 -70 -15 63 287 19 22 -166 220 -73 -56
7661 -56 -212 304 -101 -50 6 111 104 -53 102 61 161 352 119 -71 229 -39 59 125 2 -5 -42 -62 -182 21
7685 21 -244 82 104 -334 19 -112 -18 -258 147 -112 70 -111 -58 50 149 33 -128 105 -373 -210 -96 -166
7707 -166 37 -31 70 258 336 73 31 119 50 -25 -13 182 -81 66 -197 -39 17 -65 -218 -67 80 -240 347
7730 347 220 9 -95 245 73 58 -169 -81 -117 -74 20 -97 61 -4 199 95 185 -33 150 -144 49 61 161
7753 161 31 42 -119 208 175 -53 -204 -124 7 -15 270 -123 12 117 27 40 12 -63 7 208 -116 164 86
7776 86 272 104 -11 233 46 179 47 -86 -139 -10 -171 -142 108 -17 -141 -47 199 225 78 -67 -91 -15
7798 -15 -7 31 71 35 -12 44 312 156 66 51 61 -305 -93 -5 130 138 -31 -82 322 -47 139 25 22 38 -230 290
7824 290 170 57 -79 73 83 -5 -2 -49 -34 -56 -73 118 119 -175 278 -129 175 101 221 6 -13 169 -206 25
7848 25 -92 -143 -79 -39 -213 65 114 -21 -59 184 -190 156 -145 -327 125 131 311 62 117 169 164 -95 -4 -33 0
7873 0 -46 -77 -18 59 34 168 163 -2 -37 -46 -92 124 65 61 -149 -123 201 -191 -56 -10 -4 -232 92 222 -86 27 12
7900 12 -127 52 -47 -46 83 -26 -46 -31 64 -112 -122 -175 33 53 224 170 5 155 -2 219 32 -25 -133 23
7924 23 -385 -22 -80 208 -66 -99 -130 242 75 10 88 -48 -13 207 -123 -7 -24 -23 192 41 146 -129 60
7947 60 -159 28 -182 -263 204 221 159 -129 -212 -106 43 101 -45 -25 -190 1 20 -193 9 -56 -28 -26 -105 183
7971 183 193 -30 -227 -73 21 -18 134 267 -131 167 179 -79 -173 177 178 -188 207 63 -40 6 90 43 -1 105
7995 105 -18 56 -85 57 -13 132 100 239 -105 245 -35 -7 262 -25 135 -293 85 189 -65 57 251
8016 251 200 6 5 -114 -29 213 -75 -57 -200 64 -153 -83 15 -26 186 -270 -86 297 -31 -50 15 71 -18 -125
8040 -125 -207 84 178 -154 -18 65 -216 -160 35 -129 -36 50 22 66 46 44 -65 97 -134 114 -1 -52 278 -86
8064 -86 142 229 299 89 53 -103 -34 -332 244 217 -93 -114 -71 252 -99 -181 -63 -140 -145 113 148 -19 -20 44 322
8089 322 267 64 246 69 -185 -100 147 79 254 164 89 153 246 210 -140 204 43 174 -135 -52 -191 59 91
8112 91 31 284 -99 -136 -125 145 20 -191 47 176 -101 -266 49 -467 -7 -56 -88 -105 91 19 -67 24 -135
8135 -135 41 -307 105 35 -25 180 -88 95 72 45 -204 46 -274 -172 183 -12 149 -64 -243 -202 -39 154
8157 154 186 -1 -120 2 -4 -136 -235 -178 -16 184 -30 272 109 -163 26 -33 -161 -128 -161 -56 -55 -308 51
8180 51 -33 -152 -12 62 -107 -94 340 -259 -166 -4 -129
8191a29
$$ Imaginary data points
##PAGE= N=2
##DATA TABLE= (X++(I..I)), XYDATA
0 0 0 0 0 0 0 0 0 0 0 -8 0 -8 8 -8 16 -16 23 -32 32 -40 48 -56 64 -80 88 -108 125 -141 165 -189 213 -245 277
33 277 -314 356 -398 448 -502 558 -625 696 -769 855 -945 1045 -1157 1274 -1404 1550 -1704
50 -1704 1878 -2071 2281 -2522 2786 -3086 3434 -3828 4292 -4843 5505 -6331 7384 -8773
64 -8773 10712 -13617 18428 -27897 53770 -283653 -940543 -646870 -4959 621113 725631
75 725631 338099 -307534 -667057 -496580 83826 565579 621536 203876 -368680 -703867
85 -703867 -508042 75960 607113 667218 251724 -321030 -639820 -504693 -11506 464843
95 464843 578219 257687 -227905 -525604 -427906 -9097 434964 561690 260818 -246693
105 -246693 -571587 -477251 -42297 408942 552726 291086 -173443 -496833 -448440 -73332
115 -73332 356938 535177 328711 -122526 -490460 -500926 -144616 311879 526302 340112
125 340112 -98415 -451643 -456781 -119224 305040 506842 336511 -88442 -456569 -488775
135 -488775 -153171 302142 537967 372729 -79646 -478551 -515751 -160122 308092 529346
145 529346 349231 -84180 -443076 -463749 -131411 303055 510055 331174 -96984 -453351
155 -453351 -473704 -141630 295546 504822 323786 -100980 -434016 -427416 -103493 283461
165 283461 454480 296173 -71879 -378150 -398859 -128648 222311 395933 270919 -57187
175 -57187 -343109 -365583 -103762 235316 389918 256254 -53605 -316538 -353716 -140081
185 -140081 173701 358523 281952 5408 -269812 -351122 -178874 127493 340949 292025
195 292025 16823 -266226 -341934 -161560 138663 343651 303495 39932 -257953 -370719
205 -370719 -216415 91023 329410 325559 77125 -232873 -363523 -207837 110010 338693
215 338693 306936 47017 -245307 -356600 -204474 101398 332610 315740 63228 -236597
225 -236597 -362195 -218741 91801 335185 322129 60916 -242380 -352426 -192263 108381
235 108381 322589 295396 49377 -232853 -341533 -196841 89822 303767 290273 61829
245 61829 -210388 -321141 -183643 94645 295466 266489 39952 -206893 -295371 -170464
255 -170464 71695 256337 252274 67158 -160679 -267061 -178127 39650 227502 244579 76062
266 76062 -150029 -259578 -171730 40772 220360 240925 91163 -126219 -258448 -206767 -5781
277 -5781 199408 259049 130012 -92858 -247162 -213438 -12745 200753 257380 112965 -117117
288 -117117 -259868 -213100 -9425 205206 273751 141016 -95938 -258737 -228815 -31178
298 -31178 188175 265411 136557 -100242 -256936 -209835 -1468 202874 253417 118588 -103430
309 -103430 -252577 -216992 -21450 187328 254623 133995 -82326 -234517 -207768 -20528
319 -20528 183305 241979 111925 -99794 -232637 -192773 -14829 172181 233693 123840 -74204
330 -74204 -211782 -189837 -30013 147847 213957 118157 -69292 -203691 -180689 -21263 148755
341 148755 205446 114942 -52653 -180010 -178403 -48967 113154 189654 126568 -27874 -162214
352 -162214 -177373 -58745 109668 198458 136981 -27337 -169689 -188967 -75380 90269 192514
363 192514 156267 4754 -150542 -191390 -86894 83889 193039 155767 -4907 -169221
373 -169221 -205632 -82823 103263 210890 162532 -1511 -162367 -203554 -94469 83766
383 83766 195452 156992 365 -153814 -191522 -83001 91397 198813 153186 -10138 -162192
394 -162192 -188905 -77697 84307 181180 146147 4143 -139899 -178117 -82269 73700 173647
405 173647 144537 8068 -136716 -179335 -86155 69936 167814 137941 11238 -118338 -159316
416 -159316 -83594 55384 153195 133952 13575 -115811 -160305 -88463 49714 154415 145027
427 145027 27166 -107613 -157178 -91422 34782 131342 132449 37038 -86844 -146451 -95171
438 -95171 27744 130823 139299 45501 -86082 -157776 -110990 21058 135609 146649 50686
449 50686 -79836 -151716 -113274 11531 131248 152792 57571 -80974 -159376 -119407 10294
460 10294 133736 155964 56906 -84969 -157338 -107111 21743 131135 142427 46943 -86077
471 -86077 -155413 -107743 20818 131516 144408 52404 -75530 -146798 -107493 11668 117453
482 117453 129612 43987 -69715 -127867 -91041 12220 108281 125101 48756 -64424 -130258
493 -130258 -101994 180 102096 129704 61156 -52533 -124344 -100303 -2899 93076 118489
504 118489 57755 -45500 -117513 -103310 -10656 90591 123889 64884 -40032 -114440 -104714
515 -104714 -16864 83999 120998 63982 -40012 -111578 -100336 -17248 79245 121836 74731
526 74731 -30060 -112811 -111136 -28784 71864 120513 81084 -20604 -107668 -109675 -25030 75484
538 75484 115829 71052 -26805 -109938 -113887 -29262 80875 129237 80620 -24071 -109271 -115238
550 -115238 -35463 71908 121983 74160 -27505 -101411 -96870 -22929 68813 111344 68852 -28737
562 -28737 -103482 -98944 -23612 65135 107720 73717 -15188 -91466 -97229 -29931 54221 94320
574 94320 66324 -8428 -77704 -90577 -34702 47932 94329 71227 -2841 -75548 -94757 -43883
586 -43883 41412 96168 77410 618 -74826 -93537 -44422 37472 93536 80815 6560 -73476
598 -73476 -97625 -49535 34440 91277 80526 9637 -67507 -92223 -45876 35329 87607 73073
610 73073 4050 -68449 -91269 -46687 34191 91410 81475 12076 -64689 -94250 -55969 21779
622 21779 82489 80691 17150 -57413 -84931 -45655 27416 79490 71927 8971 -64974 -92692
634 -92692 -49830 31950 89946 81854 16310 -59011 -91052 -56528 18115 74561 70214 13859
646 13859 -46902 -68771 -38658 21619 68106 61647 4497 -57393 -76075 -41539 20931 71171
658 71171 74586 25115 -42497 -76928 -54514 2127 51955 64512 29928 -27837 -64807 -48241
670 -48241 8416 58087 64033 23116 -38255 -77363 -60533 4780 67780 79449 33608 -32143
682 -32143 -72521 -61752 -5606 54978 71330 29751 -32853 -67017 -50022 4113 56766 68323
694 68323 27753 -36026 -71673 -52492 2748 53672 66110 31361 -27551 -66580 -54083 194
706 194 52757 65077 30449 -25601 -64965 -58225 -7017 50174 67933 34696 -21235 -58832 -53480
719 -53480 -8883 43039 61161 30982 -23841 -59567 -49174 -2943 46425 63540 33766 -21884
731 -21884 -61190 -54524 -9367 38977 57485 35471 -10863 -48329 -48264 -10521 34006 50083 27895
744 27895 -15031 -47519 -46583 -10237 36977 59018 37612 -11352 -52521 -56485 -22192 27196 58261
757 58261 46574 37 -44761 -53983 -21849 24877 52136 40203 -4050 -47741 -54325 -17194
769 -17194 33360 58097 39838 -5743 -47903 -55534 -21583 28553 55086 38207 -5797 -41693
781 -41693 -46025 -16542 26847 50903 34821 -8379 -44641 -47045 -17646 23140 49092 40212 1629
794 1629 -37729 -46600 -20606 17974 41882 36048 2743 -35070 -47471 -22308 20986 48352 40772
807 40772 5027 -34570 -50720 -30132 12393 44016 40355 8008 -26893 -39719 -22339 12999
819 12999 39043 32865 -1287 -35276 -42130 -18270 19084 44501 40510 7332 -32267 -48027 -29016
832 -29016 8873 37154 38700 13597 -20903 -39814 -27201 7751 35617 34973 8079 -25749 -42620
845 -42620 -28458 9576 42794 43805 12032 -27132 -45834 -32790 3286 37394 43178 14865
857 14865 -23948 -41404 -26217 7103 33667 34925 9076 -24311 -39327 -22289 12089 36211
869 36211 33028 6496 -24758 -39853 -26320 7124 35402 36864 13391 -17289 -35745 -29862 -3270
882 -3270 25797 35441 16778 -12416 -30282 -25168 -1570 23735 33334 15222 -16823 -37756 -29819
895 -29819 299 30331 40420 22356 -12060 -38080 -35157 -6397 23740 33501 18122 -9105
907 -9105 -29729 -25972 -220 27194 32504 11627 -17860 -34393 -27697 -2305 27119 38356 21284
920 21284 -10142 -32492 -30354 -8126 17977 31271 21134 -5538 -28074 -27839 -6012 19765 30752
933 30752 20025 -6542 -30144 -30925 -7312 22061 33281 19408 -7593 -29607 -30543 -8281 21298
946 21298 34437 20683 -7658 -27608 -26962 -8216 15823 27545 17427 -6589 -24327 -21269 -2442
959 -2442 18063 26397 16291 -7024 -27058 -27637 -8590 14753 27502 22788 3496 -18280 -26792
972 -26792 -14934 7859 22886 18654 443 -18580 -24151 -10928 13296 29359 22987 -1728 -24986
985 -24986 -29935 -14206 11361 29008 25053 1508 -22535 -27778 -11277 12333 25877 20248 -521
998 -521 -21286 -25872 -9822 13289 24372 16946 -1541 -18479 -22758 -9906 11979 25468 19765
1011 19765 -986 -19795 -25523 -14467 6102 23523 23432 6312 -13754 -21171 -12471 4364 17649
1024 17649 17613 1634 -18103 -24353 -9949 12393 25817 22163 3990 -18222 -28585 -17814 5417
1037 5417 22029 20376 5526 -10821 -18748 -11938 5039 18442 16360 650 -15167 -19874 -11990
1050 -11990 4633 20095 21546 6668 -12907 -21214 -14784 657 15279 20850 10487 -9502 -22349
1063 -22349 -17100 622 16739 20807 10209 -8434 -21491 -17066 1639 18665 20336 5875 -12947
1076 -12947 -23581 -17412 2855 22177 24856 9322 -11403 -22162 -17248 -1164 14021 17744 6509
1089 6509 -9377 -15915 -8628 5251 15498 15529 4186 -11461 -20434 -15916 -329 14946 19901 12750
1103 12750 -2163 -14189 -15768 -5686 7890 13058 6728 -5360 -13565 -11827 110 14727 20767
1116 20767 11579 -7633 -21046 -19238 -4852 10898 18554 13300 -1725 -14510 -13951 -1860 10298
1129 10298 12923 6131 -5311 -14563 -13096 -554 13647 17139 8262 -4808 -14588 -16343 -6998 8472
1143 8472 17281 11872 -1092 -11207 -12908 -6959 5513 15183 12541 -1994 -14570 -14549 -3380 9153
1157 9153 15677 11329 -3737 -17842 -17546 -2696 12635 18334 12157 -1382 -14587 -17204 -5860
1170 -5860 9102 14280 7062 -3296 -9916 -10031 -2006 9375 13550 5595 -6246 -12228 -10008 -2697
1184 -2697 7522 14816 12697 390 -11568 -14929 -9291 435 9580 12092 5126 -5295 -10170 -4490
1198 -4490 4416 9761 8236 -268 -11190 -15383 -7401 7828 16978 14001 1589 -11245 -16871 -10692
1212 -10692 2594 13730 12629 2659 -7188 -10112 -5074 4207 10294 8023 -1358 -11128 -13255 -5746
1226 -5746 5441 12935 12400 3808 -7165 -13079 -9422 1759 10747 10993 3902 -5957 -11616 -9688 3
1241 3 10127 11101 2792 -7563 -10960 -6050 3668 12055 11822 1610 -10473 -13831 -7232 3824 11094
1256 11094 11192 3323 -7328 -12214 -7188 2726 8227 7370 2621 -3379 -7649 -5238 2270 8479 6672
1271 6672 715 -5002 -8823 -8281 -1720 7292 10988 6245 -1817 -7708 -8140 -2860 5702 11226 7000
1286 7000 -3781 -10963 -9445 -2543 5497 10020 6380 -2987 -10426 -8063 2517 10742 10796 3466 -6281
1301 -6281 -12957 -11050 -584 10205 11666 5583 -2770 -7660 -7436 -2443 4287 6458 1910 -4128 -6071
1316 -6071 -2739 2948 8400 9890 4390 -5625 -13165 -11689 -4274 4358 9518 9604 3187 -4244 -6394
1331 -6394 -1265 4403 5836 1254 -5709 -10006 -8223 763 9979 12366 6134 -3449 -8960 -9079 -3682
1346 -3682 3906 7938 5111 -1540 -5717 -4106 483 4301 6133 3804 -2184 -7679 -7718 -2607 3665
1361 3665 6855 5786 2159 -4042 -6831 -3481 3529 7972 5673 -344 -7415 -10525 -6573 2750 10813
1376 10813 9853 1971 -5660 -7768 -4289 2538 7738 6219 -2103 -9190 -8100 -724 6976 9681 6388
1391 6388 -1585 -9017 -9793 -3091 4507 7919 5848 1313 -3450 -5973 -2926 2201 4756 2871 -1127
1406 -1127 -3724 -4336 -2721 1792 6496 5826 30 -5687 -6902 -4022 1770 7277 8585 3164 -5192
1421 -5192 -8998 -6481 -721 4074 5723 3295 -1943 -4929 -1810 4007 6182 2696 -1991 -6308 -7266
1436 -7266 -3880 3496 8681 7427 1765 -3314 -5802 -5600 -2411 2725 5092 3383 -617 -2786 -2138
1451 -2138 5 3072 4198 1411 -3991 -7298 -4774 1100 5985 7763 4296 -2712 -8586 -7401 -222
1466 -222 6671 7023 2909 -2918 -6185 -5666 -68 5420 5335 226 -4644 -4881 -1428 2988 5709 4675
1482 4675 -492 -5667 -6406 -3007 1882 4866 5249 3126 -1502 -4919 -4220 -954 1467 2555 2651 1341
1498 1341 -1665 -2718 -366 3035 3981 797 -3175 -5426 -5064 -1144 5083 8290 4718 -1648 -5957
1513 -5957 -5979 -2363 2398 5362 3824 -1164 -4594 -2658 977 3753 3459 803 -2699 -5896 -4596 988
1529 988 5066 5318 2647 -476 -3819 -5141 -2856 1648 4262 2869 234 -2292 -3812 -2170 1889
1544 1889 5068 3553 -1085 -4497 -4220 -1162 2825 5489 4418 -1298 -6382 -5840 -671 4025 5539
1559 5539 3616 -827 -5142 -5117 -1084 3502 4284 1533 -1530 -3348 -2523 -65 3082 3576 927 -2165
1575 -2165 -3264 -3006 -1066 1228 3616 3934 1375 -1811 -3287 -2462 -786 1715 3049 1783 -1595 -3649
1591 -3649 -2452 1712 4268 3686 1052 -3383 -5700 -3844 1122 5251 4451 758 -2764 -4265 -2326
1606 -2326 1556 4324 3253 -897 -3928 -3349 -1056 1660 3638 3534 479 -3049 -3705 -1083 1506 2208
1622 2208 2136 1152 -1325 -3535 -2295 574 2985 2696 1430 -758 -3240 -3139 68 3535 3122 -13
1638 -13 -2441 -3199 -2489 638 4586 4699 384 -3699 -4371 -1827 559 2933 3351 1202 -2515 -3285 -284
1655 -284 2112 1966 765 -591 -2333 -2751 -917 1962 2349 1617 828 -117 -1873 -3123 -1421 1529 2549
1672 2549 1248 247 -1062 -2333 -1125 1597 3332 1721 -1171 -3271 -2880 -308 2890 4967 3081
1687 3081 -1892 -5034 -3606 21 3270 3758 1589 -1525 -3802 -2378 1053 3065 1931 -248 -2502
1702 -2502 -2592 -1238 881 3065 3277 902 -1804 -3039 -2161 -642 1158 2325 2199 742 -1403 -1808
1718 -1808 -1227 275 1465 1443 -382 -2948 -3184 72 3501 4417 2123 -963 -3629 -4123 -1370 2076
1734 2076 3599 1745 -606 -1642 -820 -199 873 1606 364 -2291 -2695 -717 1406 1784 1702 1678 -427
1751 -427 -2144 -2607 -1068 -133 1051 2490 2841 -162 -2826 -2508 47 1403 1181 567 -732 -1996 -1563
1768 -1563 1310 3557 2243 -1115 -2854 -3407 -1991 1484 4763 4048 -289 -3141 -2933 -885 506 1373
1784 1373 1150 -476 -2089 -423 1919 2347 934 -606 -1400 -2303 -2488 -515 2115 2918 2040 441 -361
1801 -361 -1764 -2420 -1259 250 958 723 507 234 -547 149 1658 1468 -814 -3492 -3226 -985 1938
1818 1938 3269 3064 1300 -2217 -3843 -2288 247 1432 1506 621 11 -1040 -753 1203 1624 94 -1722
1835 -1722 -2073 -885 257 1114 1765 1743 374 -1089 -1684 -1930 -1408 394 2528 2503 80 -2028 -1550 232
1853 232 1260 1269 574 -1055 -2608 -1595 1207 3161 2799 496 -1867 -3766 -2803 575 3525 3054 78
1870 78 -1861 -1739 -804 642 1378 964 -37 -1330 -643 781 703 359 282 291 -829 -1597 -845 586 1329
1889 1329 939 1039 440 -997 -1900 -1164 424 1006 1424 711 -878 -2323 -975 1581 3207 1371 -1835
1906 -1835 -2853 -2038 42 1901 2828 1832 -467 -1932 -1471 -476 104 933 955 8 -1397 -394 966
1923 966 1705 728 -406 -406 -949 -1321 -877 85 742 926 1240 417 -878 -1748 -46 1365 868 -944 -2001
1942 -2001 -1144 277 1445 2276 1758 -69 -2464 -2684 -1159 346 1745 1787 756 -1177 -1319 616 1831
1959 1831 976 -879 -1738 -1013 -483 149 755 931 146 150 209 -312 -1246 -1095 11 702 81 -205 296 652
1979 652 58 219 464 319 -1136 -1583 -1312 235 1391 2242 1554 -1012 -2821 -2023 677 2179 1223 -537
1997 -537 -1212 -940 -380 1058 1606 454 -724 -1343 -911 -424 467 1494 1239 -445 -1083 -740 601 495
2015 495 -290 -319 28 -227 -551 -137 462 285 414 484 -116 -1530 -1789 416 2101 1735 106 -1104 -1404
2034 -1404 -1128 -113 1607 1469 175 -1094 -1595 -1136 -90 1583 1968 99 -1530 -1586 307 1322 430
2051 430 -367 -567 -200 126 472 579 437 -91 545 243 -839 -1387 -470 718 1255 557 564 -57 -550 -599
2071 -599 54 643 492 -550 -1405 -1288 -423 1436 2788 1844 -888 -2958 -2364 75 1230 960 239 63
2089 63 -166 -158 595 504 -303 -724 -930 -399 -148 538 1863 1343 -193 -1094 -776 20 -529 -540 471 1279 987
2110 987 103 -414 -1042 -732 470 1398 477 -1286 -1124 472 1827 1213 148 -720 -1386 -1413 -458 879
2128 879 1495 1338 308 -398 -1355 -1091 307 602 -207 -1020 -202 1204 1496 450 -617 -677 -833 -554 -3
2147 -3 -33 162 951 1678 992 -882 -1860 -1316 -190 -69 536 927 739 -210 -646 -41 575 176 -634 -1424
2167 -1424 -1639 -850 1634 2859 1836 -964 -1879 -1345 -160 573 377 65 3 179 486 422 90 -332 -675
2186 -675 -479 -1013 -317 412 1397 1016 -264 -390 -348 -192 -655 -597 609 1271 1183 577 -943 -1671 -1016 697
2206 697 1241 611 -748 -891 456 793 957 280 -143 -1457 -1472 -494 975 1404 1458 718 -302 -1381 -1053
2225 -1053 521 824 -368 -806 42 1032 801 301 -321 82 -291 -188 -281 -857 -719 396 1489 1313 -186
2244 -186 -1231 -276 -88 -32 354 934 260 -831 -1001 -278 724 873 752 -301 -1478 -1071 632 1428
2262 1428 737 -956 -1453 -551 375 367 231 366 -183 -130 164 -90 -674 -288 191 133 -125 39 662 407 21
2283 21 -435 73 223 -84 -646 -701 -354 597 1431 531 -290 -1515 -422 577 1452 -66 -785 -1069 -287 391
2303 391 362 851 -2 -246 -822 -274 227 579 518 204 -479 -978 30 794 647 -84 -598 -12 129 -76
2323 -76 -358 -742 -212 126 360 316 -525 -439 315 1184 354 -552 -819 -440 -312 -273 665 978 209 -452 -802
2344 -802 -10 457 488 570 -525 -1462 -770 445 1472 597 -581 -343 -101 -125 19 -81 -212 -511 -80 412
2364 412 245 -403 -166 316 505 -493 -353 -239 -295 -640 -284 646 700 166 -436 -522 84 563 890 661 -968
2385 -968 -1687 -634 983 1028 419 -356 -138 -395 -260 511 538 22 -512 -393 -31 262 484 893 262 -898
2405 -898 -933 -137 198 230 -738 -338 391 543 157 -439 -451 -497 494 821 1 -520 -647 29 454 116 167 -188
2427 -188 -402 -636 -193 815 965 141 -359 -689 -236 -263 547 518 -575 -983 -70 455 635 235 -254 -22
2447 -22 -302 12 206 36 -253 -338 22 224 -229 -623 -150 18 170 1 526 437 -193 -916 -116 1004 806
2468 806 57 -491 -766 -357 346 679 612 -625 -1134 -178 539 302 181 86 -128 -475 -96 439 553 74
2488 74 -561 -517 -245 -89 230 282 299 -200 -79 402 663 -103 -341 -135 -40 164 71 126 107 135 702 660 77
2511 77 -942 -1108 -250 487 417 721 652 -10 -403 -419 203 121 -240 -451 -251 -272 591 913 593 -366 -1046 -616
2533 -616 -63 306 96 198 399 212 176 -216 -484 -411 -497 63 561 277 -88 258 193 -109 -167 29 -489 -968
2555 -968 -731 315 1323 1291 723 -456 -1214 -806 -469 333 -38 -251 141 623 613 586 -16 -655 -1146 -910
2575 -910 -123 533 563 849 86 222 -36 -235 -323 -93 -331 -416 288 683 482 -255 -117 -245 231 187 -298
2596 -298 -173 -492 -65 587 953 395 -532 -501 -542 -29 277 854 502 -118 -536 -243 92 -135 -259 -318 -171
2617 -171 222 715 832 -211 -582 -771 -698 -176 -95 165 477 492 526 439 34 -219 -846 -539 116 390 223
2638 223 -12 48 -52 199 451 386 -234 -846 -801 -17 469 718 391 118 -441 -551 171 298 -352 -680 -388
2659 -388 343 465 615 409 119 -804 -954 -156 415 268 256 541 -47 -186 -275 -456 -540 -342 -73 538 629
2680 629 633 -343 -465 -36 102 -10 -95 -466 -814 -80 760 993 495 -97 -230 -566 -375 124 204 226 -134 -102
2702 -102 100 301 289 -65 -586 -631 -359 233 870 349 123 -334 -329 -56 -372 -422 32 331 297 725 597 -44
2724 -44 -573 -455 53 297 339 -68 -175 -302 -141 341 316 -180 -591 -479 42 249 388 743 120 -489 -345
2745 -345 374 21 -205 -307 34 365 328 362 529 63 -530 -648 -114 63 170 27 430 421 404 196 -156 -678
2767 -678 -1009 -381 517 739 530 37 -15 -181 -13 35 -10 -372 -404 -195 496 511 399 176 -493 -241 -259 179
2789 179 129 102 -404 -46 311 444 403 42 -514 -542 -195 151 290 369 98 328 91 -149 -265 -466 -108 66
2811 66 384 744 588 215 -333 -418 -86 -22 -37 155 153 261 427 536 331 -173 -457 -380 -175 429 371 297 154
2834 154 -417 -281 257 173 9 -458 -77 89 -147 210 334 99 -61 -33 126 40 -106 -61 134 271 282 265
2856 265 217 -564 -717 -168 345 358 81 -187 34 -145 172 353 396 -137 -372 -191 250 302 257 155 -190 -362
2878 -362 -79 210 368 111 46 -194 -98 -220 206 478 -76 -22 74 326 34 -426 -109 83 184 343 129
2899 129 -153 -324 -255 -133 222 228 -63 -189 -35 37 341 441 403 -92 -383 -21 263 385 37 13 -367 -124
2921 -124 -45 352 51 -234 -160 -105 213 490 199 5 51 -70 -232 -34 -145 -266 -158 284 562 342 -32
2942 -32 -289 -492 -394 180 133 174 -401 -75 87 538 13 -23 -253 -251 -161 365 319 458 -167 -126 -24 108 76 -77
2966 -77 -18 -263 32 356 574 386 51 -33 -150 -263 -200 111 353 -47 -28 67 430 123 -170 -197 -255 13 96
2989 96 340 124 -241 -161 -4 193 -150 -154 -283 -80 -32 560 457 12 -28 -166 62 229 332 -57 122 -150
3011 -150 -146 268 328 305 -215 -245 49 139 164 -104 150 51 -50 199 90 53 -94 -195 95 155 244 17 -146 -75
3035 -75 -152 258 204 13 -274 -306 32 158 74 163 -447 -407 -119 181 580 215 36 -122 -218 9 28 -113 254
3058 254 -190 176 274 62 -218 -144 -378 -362 -139 295 100 2 -175 -190 183 188 134 -440 -156 -48 -104 470 346
3081 346 -137 -260 -289 -2 137 67 -172 -92 -392 58 128 292 -11 -213 -120 -147 226 207 -146 -156 -19 -110 330
3104 330 318 -20 -199 -514 240 57 127 -142 -110 -9 78 -37 186 183 -66 -2 -4 222 -104 9 -189 -185 12 277
3128 277 164 -196 -338 -76 30 -94 165 -79 -4 -331 -236 326 530 114 99 -270 -39 -238 38 126 -82
3149 -82 -152 -14 231 291 48 -184 -156 -208 -68 216 250 -277 -163 15 18 364 -100 -350 -65 -98 -64 439 119
3172 119 -81 -352 238 216 344 -61 -132 -161 -153 -118 350 168 -81 -244 -185 219 180 233 -100 336 29 -170 -29
3195 -29 101 183 124 -23 330 223 182 140 -107 -256 -89 8 59 104 -45 -7 110 177 47 -36 -309 -230 -54 158
3219 158 301 -20 -86 -167 -3 -232 -34 59 251 129 213 156 4 301 28 -97 -346 56 161 22 -347 10
3241 10 105 215 156 47 -241 -294 -143 131 253 285 271 -104 49 180 10 41 -88 -231 130 123 281 152 84
3264 84 -110 -65 -229 55 -140 -112 51 -310 126 265 90 -91 -250 -31 -102 281 175 -42 -12 -218 127 328
3286 328 8 21 -94 -81 160 232 26 41 -312 -171 -185 -87 27 95 -118 -80 59 327 -97 -29 -68 110 -103
3309 -103 213 43 -213 -243 35 -176 -46 -104 -229 -394 -142 -271 112 274 144 -112 -19 55 2 216 16 -171
3331 -171 32 94 144 89 -35 95 -98 -352 139 202 389 -119 -53 72 175 198 -207 -182 -183 122 53 212 173 -128
3355 -128 -68 -252 -187 317 122 -41 94 -291 -293 -119 177 215 183 42 189 -112 290 -135 -15 8 117 156 232
3378 232 -75 165 169 -236 -63 -13 140 -17 -50 -122 131 -171 -1 -204 -216 -145 90 -98 293 -202 -203 10 156
3401 156 351 52 -70 -163 117 222 36 157 26 -26 98 -100 331 102 -78 -306 -6 101 183 148 108 119
3423 119 28 -125 137 157 108 -63 31 256 172 31 -208 96 96 155 -148 45 19 -32 -87 -14 115 158 -180 -83 -131
3448 -131 142 67 127 97 -66 -23 -210 55 336 37 -51 62 252 52 37 130 -18 -232 7 152 29 -64 -267
3471 -267 6 -637 80 172 -120 -184 -123 -166 102 295 44 13 -101 -211 -101 220 -65 -245 -193 -179 150 441
3493 441 146 -56 -195 -44 -88 -33 -40 -10 31 -109 82 -213 -247 100 -43 153 -21 -80 28 -275 -94 -74 8
3516 8 -123 -76 -136 -160 -12 -84 30 -124 -286 -447 1 -60 160 76 256 53 201 42 92 117 -30 45 76 -13
3540 -13 156 20 174 -111 307 45 106 -295 194 -26 187 188 -110 -102 17 -46 71 -11 97 48 32 303 -154
3563 -154 89 92 -192 90 -326 -337 208 46 -18 222 251 -40 78 280 -28 -272 175 -2 -314 -134 103 28
3585 28 141 -66 -39 52 -91 -96 -285 -206 -79 -250 102 187 -62 58 -316 -103 -13 124 22 -121 183 129 -62
3608 -62 -189 -93 53 -110 192 354 36 71 -34 98 416 -106 50 -72 -137 14 182 -178 -53 67 86 -198
3630 -198 118 31 27 -189 135 97 72 72 -17 199 -182 -148 170 305 168 128 78 154 11 -13 -85 -361 -6 -11 -151
3655 -151 115 -43 167 -3 -220 211 -148 43 -65 70 -15 -84 191 220 -110 -99 146 -170 175 136 -73 16
3677 16 -196 -139 -57 -166 -158 -90 108 -95 -78 93 98 130 137 247 96 82 226 -159 -189 -147 -174 120 -88 79 -4 -34
3703 -34 -75 334 113 -27 72 -150 89 -96 -83 -28 69 -258 285 -260 124 118 17 292 -61 -134 168 80 -204
3726 -204 -56 117 -58 134 200 -222 -71 -141 -34 -68 77 -290 292 28 173 336 270 34 -13 221 -66 45
3748 45 83 73 -138 91 41 116 -63 -49 161 0 78 156 8 -140 82 -173 57 55 74 -122 111 29 -104 166
3772 166 127 158 -11 16 -127 162 107 91 -55 -126 33 94 -126 123 -45 -230 -32 356 -126 -69 126 198 74
3795 74 11 58 -214 65 -53 -66 334 180 -86 8 241 -28 -319 111 52 -12 46 31 265 213 -444 -6 -170
3818 -170 104 -74 -375 -269 -222 46 70 144 -326 161 -161 385 166 -240 -10 60 123 -265 -88 86 135 -175
3840 -175 -185 -59 94 -17 31 86 -11 -274 -41 222 -82 -190 52 204 260 121 -17 -76 -185 -275 -92 -25 -21
3863 -21 22 -107 8 -434 -10 48 -4 -300 35 -36 147 155 265 -22 -141 -273 166 -180 113 65 99 207 -87
3886 -87 121 -157 -37 -72 154 -233 -36 -69 153 -90 19 -63 -51 21 158 -41 -137 46 315 267 167 -151 -225
3909 -225 78 -62 -117 89 -180 -168 -49 -138 56 187 -59 -216 -105 66 -85 -42 31 -237 123 -70 -96 240
3931 240 -89 -64 -342 92 321 77 116 -231 -366 0 145 -61 138 -115 -173 -54 289 182 29 -285 -60
3952 -60 -15 -66 194 60 302 -1 -70 -113 -116 89 260 354 -135 115 -181 53 -341 -51 -20 23 175 134 3 -7
3976 -7 -22 199 61 78 149 -119 -207 -6 -61 -29 229 -16 -40 -30 114 50 -81 53 29 -144 111 48 -37 -358 85
4001 85 151 9 121 -80 15 223 96 86 -13 381 -24 85 318 133 -106 -20 -144 -248 182 223 157 206 123
4024 123 -494 -241 -108 107 -28 -58 82 50 -29 159 260 65 -54 234 41 -75 7 109 60 89 -23 77
4046 77 110 -99 -94 -3 -193 238 -42 26 -28 -29 -223 -54 57 -73 -87 -24 131 118 -204 44 208 -127 151 -48
4070 -48 -9 -90 91 8 -195 -39 -147 -103 -175 67 75 -114 48 -142 -43 29 211 223 -50 273 -78 -53 194 -236
4094 -236 -70 -74 182 -82 63 61 27 -86 28 -2 -92 197 -97 0 -50 59 88 6 -61 -89 97 -92 -138 100 236
4119 236 -168 -70 -29 -264 16 170 242 -206 56 263 87 -33 5 22 -194 141 -162 21 -119 220 -124 -56
4141 -56 -26 69 -68 38 -50 17 -66 104 202 -199 -16 -20 62 -87 -41 -287 -97 -47 154 -19 -152 166 -125 -376
4165 -376 -86 278 235 92 -156 2 -119 116 -102 -185 14 -96 209 81 -9 237 -83 51 17 86 -46 272
4187 272 -192 -31 -380 112 -163 -15 -158 53 235 -207 129 -121 24 -258 76 -15 -267 279 165 -16
4207 -16 -170 154 2 -33 -92 -67 1 -2 190 -65 -154 33 85 203 33 70 -218 -27 -31 103 59 321 -194 -143 -6
4232 -6 106 -177 5 21 -78 104 101 445 158 80 -135 -179 -142 -18 -116 -11 116 -73 0 282 73 -126 62 -78
4256 -78 7 -100 31 61 -5 144 220 -150 102 -94 115 -19 -78 48 216 205 4 -412 219 85 -99 -12 -28
4279 -28 -317 -102 63 -47 29 1 -304 58 -33 -204 124 120 -102 -145 6 1 188 -102 -163 -196 69 47 -153 -71
4303 -71 80 -118 249 159 -166 50 132 -118 122 -37 385 6 182 -248 34 119 97 -3 -145 19 -114 88
4325 88 -253 -74 -198 -201 -137 185 -226 -46 -71 112 8 72 97 -104 -202 -83 22 192 32 -74 40 -45 23
4348 23 296 -143 102 -83 -175 190 74 31 35 -259 -5 -32 87 -80 66 -47 -49 164 236 159 -131 -161 -158 15
4372 15 60 75 -37 -235 32 -36 121 120 16 271 86 -136 -53 142 44 -71 -327 -202 -140 99 -191 27 -120
4395 -120 139 185 226 37 -13 -14 196 67 -93 -165 -166 -95 -17 66 101 405 -20 48 53 35 158 -39 -133 96 -202 76
4421 76 164 -199 -8 -48 -51 -159 -55 166 -161 -179 -41 -280 132 -13 -186 -154 193 -159 218 122 -101 -128 -76
4444 -76 320 -12 126 -27 -264 -105 36 199 106 69 -128 -127 419 -130 -31 -149 -68 -201 -59 -125 208 199 255 92
4468 92 -88 41 -3 -117 152 -137 -12 -5 286 129 -131 -204 122 37 245 12 -140 -156 50 281 250 135 -60
4491 -60 -62 -133 -163 -141 55 -202 -74 -249 -214 -11 188 -60 62 -5 24 -199 -85 106 -86 -4 266 -54 35 -207
4515 -207 -108 71 -25 -28 30 -220 -251 86 97 277 350 -245 -86 -40 -31 168 -154 67 -205 182 -50 58 228 163
4539 163 139 -22 194 129 441 -236 -114 214 3 -24 -91 141 91 -136 13 13 91 -80 -2 -29 -6 -83 -133 276
4563 276 73 0 -319 203 -18 45 86 26 91 -54 -159 212 182 -285 185 473 42 -131 -174 155 -49 88
4585 88 110 49 -97 -230 -72 67 77 20 -187 273 35 -36 -209 95 -298 -134 -16 -107 257 -129 -161 -92 121
4608 121 312 -211 -160 -24 -29 223 355 156 99 40 -81 23 88 10 -99 -87 -219 60 287 139 199 -180 -234
4631 -234 -290 95 0 -77 -146 -121 -165 195 -51 115 -53 -46 93 250 182 109 175 -109 -12 133 27 202 -260 -135
4655 -135 144 -50 311 123 -56 -225 55 -134 145 -65 -97 -241 -140 157 229 49 -113 -108 -209 157 61 -39
4677 -39 -14 -178 12 -78 146 -135 -191 18 -6 -13 82 87 -10 -40 -46 -80 248 -132 219 33 28 -106 -210 -74 -25 42
4703 42 -227 -25 85 178 126 251 -99 0 -169 44 125 -81 -293 -205 28 -42 110 23 -414 -19 139 87 59
4726 59 10 76 -72 85 132 -15 133 -166 -298 57 89 92 0 14 18 139 -36 131 57 -57 -89 -117 177 -52 -78
4751 -78 -7 79 -25 268 358 193 -279 46 142 255 -6 -105 211 -127 -3 -124 -2 -5 12 -93 24 176 32
4774 32 -180 282 -176 -174 206 160 -90 129 -46 -96 282 -71 162 -23 -270 104 -12 168 80 -168 72 -132
4796 -132 22 -31 131 17 -111 -99 198 -58 78 -28 144 -23 166 326 12 -187 -255 276 -93 6 -161
4817 -161 -152 -129 -47 19 52 205 -283 -35 -169 -113 76 -46 394 -37 -47 -162 108 245 2 -103 -15 326 260
4840 260 80 -223 -125 -151 20 0 210 -186 -416 -60 90 22 -97 60 -279 -45 -5 128 223 -362 35 -205
4862 -205 114 71 206 138 -30 21 101 0 180 165 2 -312 -11 144 -107 -87 -197 -18 65 -111 105 78 -151
4885 -151 -105 148 108 -213 96 97 61 -191 63 83 -102 0 -81 257 132 197 283 9 -338 -154 -121 67 37 -94
4909 -94 82 44 218 -42 219 -30 -145 77 -95 -21 36 8 8 -96 -149 39 -35 145 -62 25 -27 248 10 29
4933 29 -464 -193 -78 262 220 21 79 -92 -7 177 14 159 -126 -46 408 170 -81 -158 -436 139 266 227
4955 227 100 -78 46 2 15 141 -42 -161 -82 -76 -145 7 182 -105 -127 -206 -209 303 367 -44 -101 -39 -115 48 20
4980 20 140 -203 -142 74 -243 96 24 57 17 -147 69 35 -124 -182 -449 175 347 304 -44 1 -28 69 106 215
5004 215 -121 109 119 -39 106 -103 -47 -135 134 -214 248 174 134 -216 -196 -11 69 -46 -114 -45 -88 -149 -78 104
5028 104 -154 -295 25 -230 185 214 -34 48 -113 -68 102 230 53 -238 -41 -166 6 -1 218 73 -150 -134
5050 -134 -113 198 5 -195 -379 -126 122 171 294 49 -172 -219 71 122 112 136 1 -140 -4 108 -192 218
5072 218 -24 -8 20 104 77 236 -102 -162 -62 -52 143 -195 27 -79 -185 198 31 -36 176 -51 158 49
5094 49 -2 105 -183 -84 115 -90 -189 -112 -252 11 95 -113 94 75 -179 46 -94 -6 -24 16 -78 -126 56 284
5118 284 307 87 -115 -256 -36 -80 -19 -175 245 -182 38 158 -97 193 -337 -125 -71 -117 129 290 89 -152
5140 -152 -218 15 91 -128 -123 -150 115 -250 24 -54 131 -308 -220 87 0 -15 66 -1 157 180 53 99 -17 -186
5164 -186 -68 -166 154 118 68 -106 27 -21 -20 233 -183 -271 19 85 119 55 -20 161 -256 5 248 111 -84 128
5188 128 -144 -3 -48 -19 -17 -124 -89 65 323 -321 322 -113 -340 -73 -101 179 -141 4 -193 -16 198 68
5210 68 95 -213 -240 16 -106 -150 151 101 -167 -42 181 -23 84 134 -210 -118 75 138 86 126 -238 -341 -18
5233 -18 389 103 73 196 -206 194 49 -4 -73 -200 -309 26 -233 -128 -123 182 -104 -206 -44 41 -179 -304
5255 -304 -150 114 174 279 68 -33 -260 -50 218 282 92 34 102 71 -134 40 -177 -74 10 -6 34 77 -162
5278 -162 -349 156 68 -81 217 1 -201 -259 44 330 105 175 10 31 -47 50 -153 -16 -153 -44 133 41
5300 41 -28 221 -142 -119 -106 45 108 204 -166 -119 200 13 -79 105 -69 -167 -177 105 135 -24 -146 -252 -120 30
5324 30 208 285 -48 -22 -30 131 159 -91 -77 -234 -181 90 196 228 227 84 -170 32 -151 201 -93 -383 -135 116
5348 116 225 389 35 -229 -194 -38 35 123 88 -43 37 6 342 11 81 19 -284 33 -16 -31 27 -217 -51 -74
5372 -74 -42 -27 10 -230 -237 20 -55 238 -106 -193 -5 134 190 242 -105 139 -4 -160 110 45 -14 20 -105 -100 -100 95
5398 95 46 -196 -219 -8 -35 108 -117 -21 -183 -89 79 -26 272 -81 -85 -124 238 227 402 135 -116 -3 -52 -69
5422 -69 -65 68 -174 215 49 345 -18 52 -119 -145 140 -27 -19 47 -295 143 32 -87 -55 -45 -32 -59 49 114
5446 114 214 -211 -154 -122 51 -54 -146 -14 -127 -86 94 -69 76 -47 -132 -115 -66 -84 47 -216 13 121 -1
5469 -1 -52 22 74 -111 18 79 186 131 -9 -63 109 -240 115 -129 175 29 -324 -166 101 -6 -125 43 -64
5492 -64 -44 -9 182 -342 -23 -161 -196 -56 231 72 -17 -10 20 84 19 116 33 8 -248 465 44 19 -83 -22 -17 67
5518 67 -69 238 81 -168 78 -48 276 62 116 57 -186 13 139 185 72 3 -116 35 179 171 237 83 66
5541 66 133 153 113 4 -356 39 199 5 99 -44 14 103 61 76 146 288 11 -65 40 64 61 74 -142 -62 -16 55
5567 55 -24 12 -32 -74 -59 3 -9 -208 33 -120 116 -118 -117 82 -195 -171 -139 -280 132 -41 -421 -100 49 36
5591 36 55 -19 -102 16 -185 -25 61 94 -251 -546 -113 -63 256 284 -103 -76 -56 46 99 344 138 -315 118 -120
5615 -120 30 94 103 -16 -55 21 349 -60 -37 -239 -322 225 -117 -60 -99 -53 91 -16 -1 248 59 -448 -28 -24
5639 -24 -184 176 -67 -187 -29 142 223 26 68 61 -29 17 122 147 259 -22 261 75 137 292 -198 128 187
5662 187 -92 -112 193 12 -131 -250 -32 95 145 -179 -6 -38 -58 397 223 -26 -80 -330 17 202 109 39
5684 39 56 -65 -223 102 -53 21 -27 83 11 97 33 -224 -296 38 -78 -288 185 154 -248 -227 16 -221 179
5707 179 -189 12 -135 75 36 -5 126 -67 -230 -115 156 125 37 108 -71 -187 83 -5 140 -64 -170 123
5729 123 -41 185 68 -100 101 -146 20 -8 84 92 -113 -126 118 16 19 6 11 -284 -16 360 -271 154 -101
5752 -101 110 105 29 -9 63 -182 -338 85 21 -35 0 78 -167 -18 -77 117 102 25 -185 -137 106 -3 -68 147 -63
5777 -63 -135 -177 172 239 -251 -21 -233 116 -44 58 -99 -140 -101 10 -137 23 -267 -126 -96 196 117 -20 -118
5800 -118 -50 -41 220 306 27 -108 -333 -112 96 -124 68 -110 -137 -390 121 30 -76 -190 -82 108 -143 -119
5822 -119 63 21 61 -121 124 24 -138 -18 -70 -6 -290 181 66 -22 -222 -181 319 18 -144 74 -76 -187
5844 -187 -210 -25 -133 242 -205 -53 42 87 270 24 52 -314 -119 129 19 -33 -220 -55 208 -129 86 -198
5866 -198 -51 -134 -145 285 1 -66 -101 142 41 -113 284 67 -143 -28 78 89 -4 -13 -86 176 134 87 154 58
5890 58 -6 -170 -80 -46 -4 213 -24 58 53 -48 -46 203 -216 -88 -336 113 139 122 -33 77 195 -39 187 77
5914 77 -105 -150 -115 58 189 11 -175 -81 -294 -9 137 146 28 -327 -119 -93 127 101 127 -411 -89 -149 124
5937 124 159 -105 -339 -115 121 119 45 -78 -53 -14 -104 262 8 -83 -220 5 69 17 -105 31 -146 -99 -286 298
5961 298 132 66 -34 69 3 133 25 -64 -32 -133 116 357 -132 -285 78 -46 281 62 13 -10 79 -38
5983 -38 -143 139 340 43 -291 311 -261 -253 25 119 -40 -315 51 -38 224 284 65 -280 238 -96 232 240 -105
6006 -105 119 -221 323 55 -215 64 27 -72 -106 390 38 136 43 -76 183 -88 372 -292 31 145 212 311
6028 311 -13 -3 39 -112 51 -47 214 -54 -55 -26 127 189 29 -70 -79 -265 123 -310 91 -203 -176 21 170 82
6052 82 24 -55 -188 -161 -29 216 165 31 -41 -219 166 134 -236 64 -241 124 86 105 -31 -65 -176 -96 -76 64
6076 64 197 17 -54 -415 -111 40 -70 -140 -108 -320 -33 -86 57 136 133 165 -50 -150 -87 -7 -73 -37 -2 26 51
6101 51 77 70 4 178 -141 114 -29 -110 -390 63 106 39 126 22 -131 33 158 198 270 -87 37 -118 161 46
6125 46 203 -148 50 -43 179 92 201 -26 -254 -122 112 218 302 176 144 -28 39 262 -63 24 138 -44
6147 -44 85 -63 93 -89 -45 290 97 -61 3 -77 127 27 -22 42 136 89 -62 -229 -10 -28 -203 11 -6
6170 -6 -101 -238 123 200 -9 219 12 121 202 237 70 -45 -304 -76 254 156 33 74 -9 183 88 14 25 -136
6194 -136 -86 84 108 21 -60 -226 -21 -121 143 148 -212 -64 4 -113 164 -47 -179 -183 80 -137 -59 124 59 -66
6218 -66 -47 -108 122 119 -188 -25 -61 -99 -140 -209 89 7 0 125 180 314 -14 110 43 3 -19 147 -156 -117 150 -73
6244 -73 -64 18 -132 92 -32 -46 144 -21 305 93 -272 148 -120 99 360 131 -23 163 22 -11 -66 -128 -148
6267 -148 23 179 -396 103 50 -44 -81 37 69 -51 3 30 -34 27 63 154 94 246 253 -320 0 40 118 -72 98
6292 98 130 300 -29 391 -248 -53 2 65 172 115 149 -218 -127 -82 122 -25 134 -45 -131 39 131 -18 -83 -19
6316 -19 -42 231 -158 -82 -11 -159 68 -129 138 74 -171 167 -138 -324 199 264 385 -180 -295 -173 -148 -35
6338 -35 126 -23 -269 -333 47 270 -146 -21 271 -167 96 -21 166 -242 -143 210 432 183 -48 -77 -101 -113
6360 -113 -9 121 248 41 29 63 282 -33 36 -201 -247 -194 95 141 62 -174 -187 219 81 212 142 30 -276
6383 -276 42 -122 -196 -195 -357 -42 123 142 -89 -112 28 -301 -154 -120 60 138 3 -59 -169 139 15 274 -321
6406 -321 -138 15 94 -17 212 -212 -58 108 313 232 -96 227 -179 -14 188 -71 309 -67 -178 -64 18
6427 18 148 72 106 -123 -134 -101 -92 19 166 -81 63 -103 -2 -129 220 -115 -206 22 -145 -7 -57 163 -3
6450 -3 -202 -182 -193 -8 -54 -270 36 342 -84 43 109 59 -39 -41 92 -36 -210 43 5 126 152 -116 -63 26 -102
6475 -102 -205 84 285 94 -11 -63 -36 -41 -172 -265 -383 -157 -30 -21 26 -145 9 46 -4 217 -259 -272 -209 25
6499 25 5 107 -50 -150 -159 -13 394 169 -95 -54 -184 91 -145 221 117 109 -126 -111 316 28 -109 -36 -65
6522 -65 -246 -114 41 141 164 90 -153 -141 17 -130 -213 -75 60 60 57 -224 0 93 -102 -116 -280 265 55 -129
6546 -129 -222 3 187 103 -2 -39 -36 86 -7 116 316 116 -12 -42 71 -136 -3 -228 -64 168 166 104 56 -213
6570 -213 36 -50 201 295 32 -208 42 -169 -69 96 -201 39 -207 -160 82 -80 260 101 21 -24 13 33
6592 33 4 -65 -153 305 -59 -48 179 34 -380 18 294 -31 -216 -115 116 -13 -126 391 89 -201 -204 111
6614 111 31 -13 112 -107 -18 13 -130 -40 127 18 -121 -129 214 -60 -18 -58 9 -134 38 18 163 -169 39 37
6638 37 4 -21 -14 -1 141 216 -187 -49 -117 92 -136 188 -61 79 133 39 42 49 -82 177 99 -56 -172 114 43
6663 43 239 145 -202 159 62 2 -10 54 113 175 -155 29 -165 94 -49 -62 92 -96 -82 -50 -105 -242 136 -16
6687 -16 -64 246 100 38 173 29 30 -9 -153 51 -237 107 142 275 -221 152 5 -78 -186 55 73 -85 121
6710 121 -27 271 87 -51 -240 24 -1 -88 194 -119 207 -55 -215 60 163 99 -243 -128 -170 -52 85
6731 85 -13 5 42 -186 -23 -228 113 -97 -38 -182 28 158 -31 -102 150 61 -187 -63 112 5 31 -144 -172
6754 -172 18 -9 -84 -36 -15 35 -29 137 -108 151 193 104 35 64 -123 -27 -252 34 -130 -93 -327 173 -81 -27
6778 -27 56 69 -190 -62 28 -22 98 -263 -115 6 90 64 -27 -21 165 40 147 -34 305 82 27 266 204 32
6802 32 -95 0 259 44 1 -40 81 -11 132 9 33 -35 21 112 66 183 -58 53 -45 -149 71 6 -19 2 -56
6827 -56 208 -162 43 -30 38 292 25 79 -70 -106 -17 46 -29 19 -36 -61 -206 -232 122 234 -266 -335 2 98 406
6852 406 154 376 1 298 20 -277 -33 -23 56 -89 266 125 -113 80 -381 -170 -179 109 58 102 -114 122
6874 122 247 104 -27 -257 194 163 -17 68 192 83 -60 33 -100 -110 177 152 18 -60 64 118 151 -21 26
6897 26 -71 -78 -143 -68 163 -225 -28 -129 128 129 48 -110 168 -94 86 128 -77 26 -52 88 -10 35 -115 -31 -98
6922 -98 57 -47 -200 66 -123 -116 99 -231 275 -112 -34 104 54 79 203 -99 1 -219 -24 224 -39 71
6944 71 143 -342 -146 58 250 241 70 107 -222 114 -94 -50 214 20 -236 9 -159 113 188 -339 21 11 23
6967 23 132 -71 90 -149 -119 -101 0 -84 -270 -244 -163 -112 3 -84 -22 59 -135 51 25 242 -9 -16 68 33 -102
6992 -102 143 -256 -55 96 -73 73 34 -76 -1 -287 53 -185 264 90 69 -91 104 -107 -58 -34 -88 -71
7014 -71 37 -73 -26 128 -114 -212 48 223 29 -67 -43 82 -161 71 74 137 -118 48 336 3 -50 -117 102
7037 102 25 19 49 16 142 -210 -172 -93 4 14 175 180 179 -103 73 20 -52 60 -161 3 170 162 -18 186 95 0
7063 0 -75 -113 275 -170 -121 77 153 -69 112 147 -242 -91 -161 95 347 -45 -42 -315 -149 193 280 52 -445 -28
7087 -28 169 61 85 33 189 17 87 31 48 60 -28 64 -29 -18 -70 219 -169 -49 -81 -161 -302 -387 -28 -34 178 59
7113 59 -82 -42 -131 -187 -123 178 76 66 -271 -76 80 173 -37 -187 -65 -135 -24 20 62 42 56 320 56 114
7137 114 -38 -114 -96 -118 -99 -176 55 113 -224 181 -22 -125 38 164 96 -43 6 200 9 53 -296 20 -255
7160 -255 23 101 245 -10 -51 250 -18 83 73 -24 -213 -204 26 39 -91 60 99 98 260 124 -12 23 120 110
7184 110 59 43 -28 -66 -321 579 3 209 -77 -227 -360 -228 -171 178 171 -67 -189 -317 -76 -12 -85 -113 133
7207 133 -102 212 243 -84 -8 217 -230 -37 99 -193 46 -34 -60 19 111 209 12 65 184 -6 4 83 91 173
7231 173 111 -177 105 101 79 -199 117 -93 -11 245 -35 -81 8 -73 -118 -155 252 -190 -64 -189 143 65 -71 9
7255 9 -236 89 258 33 -45 142 -158 -152 -30 -74 47 -251 3 -182 -31 151 3 -3 164 114 -86 188 16
7278 16 92 -9 108 71 141 -45 175 -42 102 0 115 76 -36 51 50 33 56 -18 84 -83 370 -39 86 -100
7302 -100 12 72 -12 71 -115 25 -47 -45 24 -84 301 15 175 29 -5 -183 293 -63 -69 64 -203 157 174 173
7326 173 152 -274 20 71 49 90 121 -267 -143 -3 -16 -13 3 -167 83 32 -51 141 -122 -10 -41 -66 -155 -173 50
7351 50 -102 33 88 55 213 90 -350 -108 -67 79 76 -170 59 -38 -340 203 135 154 6 -163 49 9 11 -31
7375 -31 208 -25 26 -6 -29 -193 265 -247 -25 -445 208 171 -94 61 106 111 -97 -93 -118 -65 -99 268 -47 -13 145
7400 145 -280 32 50 68 287 -24 -99 -13 -212 -326 69 162 -17 -20 36 -278 -217 170 -377 190 212 66 333
7423 333 -236 -36 -136 270 184 191 18 -326 -96 47 160 -209 192 69 64 -42 -9 53 190 96 -349 98 -19
7446 -19 -77 -168 -188 -67 -133 44 42 -28 -30 2 22 145 244 -48 -12 -29 39 -24 94 119 -97 52 -193 110 171 130 95
7473 95 -137 209 338 -39 107 60 54 -123 187 -153 -175 -100 -224 -155 -88 127 -6 79 -141 -179 -168 -78 5 15 92
7498 92 -146 -113 184 -65 4 -238 -38 -16 178 184 115 158 -77 -252 186 -219 -73 -218 -62 10 -73 223 27
7521 27 -98 -137 342 84 -86 222 -183 60 42 87 -77 198 -73 -218 -222 -268 144 43 31 13 -30 17 16 -7 -99
7546 -99 -169 -22 248 72 -36 -59 129 79 282 94 202 69 -44 123 185 32 -63 157 -52 -75 -85 125 150
7569 150 51 -270 -156 -132 -51 127 -91 -160 -137 -92 89 -80 -15 -43 -255 -64 -27 186 48 -142 107 -122 -220
7592 -220 164 -150 -160 -204 -194 -271 -78 -254 -234 -229 67 -51 98 134 -15 -217 156 102 8 292 -149 88 129 99
7616 99 120 154 -168 221 -208 -270 370 168 -139 129 94 281 -328 -90 -1 -144 -90 -29 -59 77 288 -113 -3
7639 -3 161 -93 -166 8 -199 104 -32 293 127 -228 -7 -161 236 -31 1 272 -127 1 172 124 -77 -48
7661 -48 255 -114 42 87 -12 101 144 -140 -5 93 -84 1 -246 99 171 253 5 -229 -230 -142 164 -86 -286 193
7685 193 -39 -84 169 -172 -58 -159 -79 -103 8 -71 -175 33 62 -20 -157 240 13 -38 11 -173 318 -29 71
7708 71 -150 -372 140 -81 130 -338 73 22 3 168 -249 49 86 3 -16 -101 207 46 30 65 -148 160 168 190
7732 190 -174 5 149 -65 -88 46 125 -36 43 114 9 -17 124 91 69 -111 37 7 128 -9 -29 -64 55
7755 55 -217 -14 -3 30 187 -34 153 87 -229 -62 115 -27 115 221 266 219 91 173 -33 58 107 -77 -55
7778 -55 -106 -213 -113 41 -2 4 -37 54 116 -286 149 97 17 26 -29 -149 -78 -172 237 -175 120 208 -51 43 309 14
7804 14 94 116 -224 18 63 247 -33 166 15 -287 -35 196 273 -49 -96 -189 135 16 -3 -160 -67 43 -40
7827 -40 -94 2 175 -3 -198 200 -31 28 260 44 19 -173 -234 32 -30 223 -58 59 202 260 -233 153 78
7850 78 238 -204 203 -33 -123 -158 -67 246 7 -83 65 -36 -78 -193 403 86 65 -205 -66 -283 91 34 21
7873 21 -27 83 245 -193 81 -156 313 -24 -78 -131 -201 -43 -8 231 139 17 223 -200 -173 -79 76 -186 86
7896 86 -21 -258 -5 141 -14 114 -16 -199 144 -4 125 -87 -326 181 -16 88 -249 50 263 -144
7916 -144 -121 257 -144 19 75 -337 -134 -243 -75 86 207 -146 -41 -134 345 -97 -38 -115 -84 -78 49 -62 -117
7939 -117 -103 -245 126 -154 211 97 -340 40 329 -108 29 85 155 -70 76 224 107 107 110 182 50 -114 290
7962 290 -63 -151 -103 -291 -207 189 163 80 16 286 -50 132 33 -260 11 96 21 -57 -136 27 -4 58 62 38 379
7987 379 -54 -127 -59 -21 170 -35 -72 -82 -92 -53 132 25 131 105 218 145 20 219 -8 -121 0 -236 53
8010 53 -150 -160 45 41 70 21 -186 43 -73 -68 -28 -297 173 -73 174 -25 95 36 43 59 -91 -99 -224 276 12
8035 12 -19 -245 0 -164 -149 82 -116 -72 -109 -291 154 36 -32 -131 6 137 32 -173 -21 51 -261 -124 132
8058 132 64 32 -39 -95 -168 10 -105 30 -117 142 -42 -61 137 -84 -396 -126 105 -91 124 68 -127 67
8080 67 -20 15 62 86 111 -278 -49 3 163 -101 -51 2 -255 71 92 -96 -169 33 43 125 -115 -130 -251 256 -138
8105 -138 103 123 112 52 -207 241 -204 232 44 -146 -149 3 71 257 173 -96 -122 -130 -134 39 -212 4 -145 -93
8129 -93 -156 173 -107 209 36 96 -64 71 127 -72 -146 319 -24 -237 197 113 -72 128 10 -209 86 130
8151 130 -28 -174 -63 -92 69 -110 75 116 -267 109 -157 36 56 -147 -159 2 -188 -270 40 -141 -8 -90
8173 -90 29 -29 49 -96 -109 -4 62 -163 273 -63 80 273 189 202 -118 5 -53 -11
8191a1
##END NTUPLES=NMR FID
##END=
