##TITLE=1H_Ser DNG-Co-EA
 CDCl3, 8 sc, 
 8.2.2019
##JCAMPDX= 6.0         $$ Bruker NMR JCAMP-DX V2.0
##DATA TYPE= NMR FID
##DATA CLASS= NTUPLES
##ORIGIN= UXNMR, Bruker Analytische Messtechnik GmbH
##OWNER= root
$$ XWIN-NMR		Version 3.5
$$ Fri Feb  8 16:20:23 2019 Russian Standard Time (UT+4h)  she@DPX200
##.OBSERVE FREQUENCY= 200.1313
##.OBSERVE NUCLEUS= ^1H
##.DELAY= (6, 6)
##.ACQUISITION MODE= SIMULTANEOUS
##.ACQUISITION SCHEME= undefined
##.AVERAGES= 8
##.DIGITISER RES= 18
##SPECTROMETER/DATA SYSTEM= spect
##.PULSE SEQUENCE= zg30
##.SOLVENT NAME= CDCl3
##.SHIFT REFERENCE= (INTERNAL, CDCl3, 0, 15.7039)
##AUDIT TRAIL= $$ (NUMBER, WHEN, WHO, WHERE, WHAT)
$$ ##TITLE= Audit trail, XWIN-NMR		Version 3.5
$$ ##JCAMPDX= 5.01
$$ ##ORIGIN= Bruker BioSpin GmbH
$$ ##OWNER= she
$$ F:/spectra/data/she/nmr/H-F/1/audita.txt
$$ ##AUDIT TRAIL=  $$ (NUMBER, WHEN, WHO, WHERE, WHAT)
(   1,<2019-02-08 16:19:16.00 +0400>,<she>,<DPX200>,
      <created by zg, POWCHK disabled, PULCHK disabled
       configuration hash MD5:
       00 E9 B6 7A A2 85 ED C7 34 08 36 98 17 FE 4E 26
       data hash MD5: 16K
       47 F0 F2 F8 66 77 6E 59 BD 90 4F A4 86 5E 38 CA>)
$$ ##END=
$$ 
$$ hash MD5
$$ 40 E9 E2 EA 71 6F 24 16 B4 D7 6B 86 41 01 A7 07
##$RELAX= 
##$RELAX= 
##$RELAX= 
##$RELAX= 
##$RELAX= 
##$RELAX= 
$$ Bruker specific parameters
$$ --------------------------
##$DU= <F:/spectra>
##$EXPNO= 1
##$NAME= <H-F>
##$PROCNO= 1
##$TYPE= <nmr>
##$USER= <she>
##$AMP= (0..31)
100 100 100 100 100 100 100 100 100 100 100 100 100 100 100 100 100 100 
100 100 100 100 100 100 100 100 100 100 100 100 100 100 
##$AQSEQ= 0
##$AQ_mod= 1
##$AUNM= <au_zg>
##$AUTOPOS= <>
##$BF1= 200.13
##$BF2= 200.13
##$BF3= 200.13
##$BF4= 200.13
##$BF5= 200.13
##$BF6= 200.13
##$BF7= 200.13
##$BF8= 200.13
##$BYTORDA= 1
##$CFDGTYP= 0
##$CFRGTYP= 5
##$CHEMSTR= <none>
##$CNST= (0..31)
1 1 145 1 1 1 1 1 1 1 1 1 1 1 1 1 1 1 1 1 1 1 1 1 1 1 1 1 1 1 1 1 
##$CPDPRG= <>
##$CPDPRG1= <>
##$CPDPRG2= <>
##$CPDPRG3= <>
##$CPDPRG4= <mlev>
##$CPDPRG5= <mlev>
##$CPDPRG6= <mlev>
##$CPDPRG7= <mlev>
##$CPDPRG8= <mlev>
##$CPDPRGB= <>
##$CPDPRGT= <>
##$D= (0..31)
0 1.2 0 0 0 0 0 0 0 0 0 0.03 0 0 0 0 0 0 0 0 0 0 0 0 0 0 0 0 0 0 0 0 
##$DATE= 1549628355
##$DBL= (0..7)
120 120 120 120 120 120 120 120 
##$DBP= (0..7)
150 150 150 150 150 150 150 150 
##$DBP07= 0
##$DBPNAM0= <>
##$DBPNAM1= <>
##$DBPNAM2= <>
##$DBPNAM3= <>
##$DBPNAM4= <>
##$DBPNAM5= <>
##$DBPNAM6= <>
##$DBPNAM7= <>
##$DBPOAL= (0..7)
0.5 0.5 0.5 0.5 0.5 0.5 0.5 0.5 
##$DBPOFFS= (0..7)
0 0 0 0 0 0 0 0 
##$DE= 6
##$DECBNUC= <off>
##$DECIM= 32
##$DECNUC= <off>
##$DECSTAT= 4
##$DIGMOD= 1
##$DIGTYP= 9
##$DL= (0..7)
0 120 120 120 120 120 120 120 
##$DP= (0..7)
150 150 150 150 150 150 150 150 
##$DP07= 0
##$DPNAME0= <>
##$DPNAME1= <>
##$DPNAME2= <>
##$DPNAME3= <>
##$DPNAME4= <>
##$DPNAME5= <>
##$DPNAME6= <>
##$DPNAME7= <>
##$DPOAL= (0..7)
0.5 0.5 0.5 0.5 0.5 0.5 0.5 0.5 
##$DPOFFS= (0..7)
0 0 0 0 0 0 0 0 
##$DQDMODE= 0
##$DR= 18
##$DS= 0
##$DSLIST= <SSSSSSSSSSSSSSS>
##$DSPFIRM= 0
$$ [...]
##$SUBNAM2= <"">
##$SUBNAM3= <"">
##$SUBNAM4= <"">
##$SUBNAM5= <"">
##$SUBNAM6= <"">
##$SUBNAM7= <"">
##$SUBNAM8= <"">
##$SUBNAM9= <"">
##$SW= 20.0189088683792
##$SWIBOX= (0..15)
0 0 2 0 0 0 0 0 0 0 0 0 0 0 0 0 
##$SW_h= 4006.41025641026
##$TD= 16384
##$TD0= 1
##$TE= 0
##$TE2= 300
##$TE3= 300
##$TEG= 300
##$TL= (0..7)
0 120 120 120 120 120 120 120 
##$TP= (0..7)
150 150 150 150 150 150 150 150 
##$TP07= 0
##$TPNAME0= <>
##$TPNAME1= <>
##$TPNAME2= <>
##$TPNAME3= <>
##$TPNAME4= <>
##$TPNAME5= <>
##$TPNAME6= <>
##$TPNAME7= <>
##$TPOAL= (0..7)
0.5 0.5 0.5 0.5 0.5 0.5 0.5 0.5 
##$TPOFFS= (0..7)
0 0 0 0 0 0 0 0 
##$TUNHIN= 0
##$TUNHOUT= 0
##$TUNXOUT= 0
##$USERA1= <user>
##$USERA2= <user>
##$USERA3= <user>
##$USERA4= <user>
##$USERA5= <user>
##$V9= 5
##$VALIST= <valist>
##$VCLIST= <CCCCCCCCCCCCCCC>
##$VD= 0
##$VDLIST= <DDDDDDDDDDDDDDD>
##$VPLIST= <PPPPPPPPPPPPPPP>
##$VTLIST= <TTTTTTTTTTTTTTT>
##$WBST= 1024
##$WBSW= 4
##$XGAIN= (0..3)
0 0 0 0 
##$XL= 0
##$YL= 0
##$YMAX_a= 255792
##$YMIN_a= -388436
##$ZGOPTNS= <>
##$ZL1= 120
##$ZL2= 120
##$ZL3= 120
##$ZL4= 120
##$ABSF1= 10
##$ABSF2= 0
##$ABSG= 5
##$ABSL= 3
##$ALPHA= 0
##$AQORDER= 0
##$ASSFAC= 0
##$ASSFACI= 0
##$ASSFACX= 0
##$ASSWID= 0
##$AUNMP= <proc_1d>
##$AZFE= 0.1
##$AZFW= 0.1
##$BCFW= 1
##$BC_mod= 2
##$BYTORDP= 1
##$COROFFS= 0
##$CY= 11.3945322036743
##$DATMOD= 1
##$DC= 2
##$DFILT= <>
##$DTYPP= 0
##$F1P= 18.9103706918063
##$F2P= -1.10871071338519
##$FCOR= 0.5
##$FTSIZE= 0
##$FT_mod= 4
##$GAMMA= 1
##$GB= 0.15
##$INTBC= 1
##$INTSCL= 1
##$ISEN= 128
##$LB= 0.24
##$LEV0= 0
##$LPBIN= 0
##$MAXI= 10000
##$MC2= 0
##$MEAN= 0
##$ME_mod= 0
##$MI= 1.114404
##$NCOEF= 0
##$NC_proc= 0
##$NLEV= 6
##$NOISF1= 3.799351
##$NOISF2= 2.8
##$NSP= 1
##$NTH_PI= 0
##$NZP= 0
##$OFFSET= 15.70392
##$PC= 1
##$PHC0= -8678.653
##$PHC1= 10.80019
##$PH_mod= 1
##$PKNL= yes
##$PPARMOD= 0
##$PSCAL= 0
##$PSIGN= 0
##$REVERSE= no
##$SF= 200.130013532006
##$SI= 16384
##$SIGF1= 3
##$SIGF2= 2
##$SINO= 400
##$SIOLD= 16384
##$SREGLST= <1H.CDCl3>
##$SSB= 0
##$STSI= 0
##$STSR= 0
##$SW_p= 3612.71676300578
##$SYMM= 0
##$S_DEV= 0
##$TDeff= 0
##$TDoff= 0
##$TI= <>
##$TILT= no
##$TM1= 0
##$TM2= 0
##$TOPLEV= 0
##$USERP1= <user>
##$USERP2= <user>
##$USERP3= <user>
##$USERP4= <user>
##$USERP5= <user>
##$WDW= 1
##$XDIM= 8192
##$YMAX_p= 0
##$YMIN_p= 0
$$ End of Bruker specific parameters
$$ ---------------------------------
##NTUPLES= NMR FID
##VAR_NAME=  TIME,          FID/REAL,        FID/IMAG
##SYMBOL=    X,             R,               I
##VAR_TYPE=  INDEPENDENT,   DEPENDENT,       DEPENDENT
##VAR_FORM=  AFFN,          ASDF,            ASDF
##VAR_DIM=   8192,          8192,            8192
##UNITS=     SECONDS,       ARBITRARY UNITS, ARBITRARY UNITS
##FACTOR=    0.0002496,     1,               1
##FIRST=     0,             0,               0
##LAST=      2.0444736,     0,               0
##MIN=       0,             -388436,         0
##MAX=       2.0444736,     255792,          0
$$ Real data points
##PAGE= N=1
##DATA TABLE= (X++(R..R)), XYDATA
0@%%%%%%%%%Qj6J6j6J8k6L2m0N6p0Q6j04J20j37J61j92K25k63L08l56M07m66N31
32B82o03O88p79Q75r83J104j240J384j540J714j901K109k335K579k848L142l466
49a818L820m206M633n106N631o218O876p621Q473r458J0610j1980J3643j5709
63h430J8357k1895K6894l4552M7907p7926K71032l634l28539N2464j93283k5685
75b77290J67097J48487P6252O0139j19317jJ5605j83177n4264J86574o2490n8510
87a00895K23780O1695j84778k5311O294j4260Q2565j6917q0011R5958l5704j77304
99a64888Q8922J32480p5065P6933J34189j11573q6093J2138j00607k7028N9570
110f1022j8030J16553J58261j42836j24893Q0595p1965q3319J50848O3580l2149
$$ y = [0, 0, 0, 0, 0, 0, 0, 0, 0, 0, 8, -8, 8, -8, 10, -16, 16, -24, 32, -38, 48, -56, 64, -73, 88, -104, 121, -142, 166, -190, 217, -249, 282, -321, 367, -412, 463, -520, 584, -656, 728, -812, 902, -999, 1110, -1225, 1354, -1494, 1648, -1818, 2002, -2204, 2429, -2677, 2954, -3264, 3612, -4009, 4464, -4994, 5616, -6364, 7279, -8430, 9927, -11968, 14926, -19626, 28281, -49645, 221387, 217753, -110786, -58322, -251605, -277290, -110193, 38294, 114546, 174685, 55368, 55367, 70972, -112205, -166469, 20105, -42385, -100895, 122885, 184580, -198, -25509, -19215, -33475, 49090, 32173, -47838, 48120, 12416, -164888, -75966, 56514, -18551, 58382, 192571, 80998, -5095, 7043, -93564, -120592, -61022, -79052, 37501, 195762, 52926, -71967, 8628, -63337, -146656, 4192, 67772, 35623]
121C5623Q5140l7631j43476J0098j6116l9020J53761O6034j01440N0818Q803j90818
133a18224k3527J02405K547R3510R3098j06496l1301K9617j45143l4393J45043
144G136J670J2773J20417q1979j42473K6132k6992j9827J46492N5710j9673O4565
156A43951j00774j93375N1811P2007l6727J09060P9348j08463j4876J6376j05125
167h6787J5976Q2177m0194N0178Q6601j00687l4068P5955q7584n3156J17265J2450
179C8126j9289O5716p7728j06716N3558q686k4692J40713M3029p4115M7407l5901
191D1422j59638K8822Q2524k9503O7401O8585p1904N536P480j37858q173J04982
203c24k4625L0546J01585p1387o0277M9538p2997n0840J10802K2257j6261P2816
$$ y = [35623, 120763, 83132, -60344, -50246, -66362, -105382, 48379, 114413, 12973, 63791, 72594, -118224, -141751, -39346, -36799, 56711, 149809, 43313, 12012, 41629, -103514, -137907, 7136, 8806, 21579, 141996, 60017, -82456, -56324, -83316, -103143, 43349, 99059, 79386, 143951, 43177, -150198, -98387, -26380, -63107, 45953, 125301, 16838, 1962, 18338, -86787, -70811, 11366, -28828, 21350, 107951, 7264, -26804, 49151, -38433, -91589, 25676, 38126, 18837, 84553, 6825, -99891, -46333, -55019, -79711, 61002, 104031, 29916, 77323, 41422, -118216, -89394, -6870, -36373, 31028, 99613, 27709, 33245, 40725, -97133, -105306, -324, -24949, 5597, 107182, 35795, -24482, 25056, -47941, -98781, 12021, 34278, 18017, 90833]
215I0833o3615j15814N5227J0882m9304J07126O5484o7360P658l3961j18956M3665
227f8135Q0056l4736O2980P0184r6182l2275K5205j01006r391J25871J2371K148
239C7090N5049p5439o4185M2423n4799k8033J33987L0834n8239L7667m3333j05644
251i2622N0650L9460l7995P2851M5843o7510J0585j3286j03789M5792Q7783n5352
263a7590K3133Q5404o4504m9537K0726o5546n92J03363q328j1150O2435o1659
275A6155o8918N4043l1980m5676J11985L8225p0965J8622j2580p5156L9508K7999
287A262l9730P1694M7598q2236QJ5562q9663J8828R3169k6877P991O4602n9642
300B2566n3998J7210n3495K653J05822n396k8328O1149m5296q7750L9508L385
$$ y = [90833, 27218, -88596, -33369, -22487, -71791, 35335, 100819, 33459, 41117, 7156, -111800, -68135, 11921, -22815, 40165, 110349, 14167, -18108, 7097, -93909, -103300, 22571, 34942, 37090, 92139, 16700, -47485, -5062, -59861, -87894, 46093, 76927, 18688, 56355, 13022, -92622, -41972, -2512, -40507, 32344, 78187, 10677, 21262, 7976, -95813, -50021, 37762, -17590, 5543, 90947, 26443, -23094, -2368, -67914, -68506, 34857, 26529, 15379, 77814, 16155, -52763, 1280, -30700, -76376, 35609, 73834, 2869, 21491, 8911, -66245, -26737, 1262, -38468, 33226, 80824, -1412, -1404, 14158, -75505, -56677, 36492, 9615, 17606, 82208, 22566, -31432, -14222, -67717, -65064, 40758, 35362, 7034, 68183, 22887, -64863, -25355, -21970]
312b1970l2400Q6513L8160o1756R442j3934p0632M1434L9372m4991N7811O0670
324H7719q2907k9390K5773n9981Q669Q1467j8999M04N2458n8168m8471L6978l7952
337d2400j1275R9211j124n2866M4473k0026p3544L6582J9698k4324O6481K1584
349F2470o8943J1178j082p4130L4505O0001l7076L2238N9180o6973l8232K0888
361e976m4581P409P2637k0617n591N7776m7029n5269L9983j8378k2381Q0081Q889
374D6953n7469K5123r323n6913L3878J9276k6042O4217K8831p8249m352J6525
386B455n9456J6460O0628k2265K1636M9661o0023l7896K7646l6109Q05P0367k0048
399A3861k1997N4850l3246o3007L6217N780j6389O1785K635n6871K5355l577o1360
$$ y = [-21970, -54370, 32143, 70303, 8547, 17989, 4055, -66577, -25143, 14229, -30762, 27049, 87719, 4812, -24578, 1195, -58786, -50117, 31350, 12351, 12755, 65213, 7045, -41426, -4448, -42400, -53675, 45536, 44412, -8454, 36019, 15993, -57551, -20969, -1271, -25595, 40886, 62470, -6473, 4705, 3623, -70507, -36002, 23999, -13077, 19161, 78341, 11368, -26864, -5976, -50557, -43148, 29489, 8872, 3281, 61057, 14028, -41241, -1258, -19636, -42017, 38064, 46953, -10516, 14607, 5284, -51629, -17751, 1525, -24517, 39700, 68531, -9718, -14070, 2455, -57001, -40541, 20087, -2178, 19458, 69119, 9096, -28800, -1154, -37263, -36458, 33909, 13861, -8136, 46714, 13468, -49539, -13322, -7542, -23931, 37854, 40489, -16382, 8973, 5396, -55964]
412e5964L1894L5316k5569M6945L3579p1595j3903K3328m6085J0320N3927k2029
424A64J1728M5863n6283m0271L8313j9034j0128N9801r991k8347M0364k7208n7765
437e2794L7751J6891j7562N2288P842n7672J7607O553n8972J8143M2029j5474
449c370L1967K3885o6088r058L3865m2949l249N7692j3464m736L6748m4137l8398
462d1292L9093q351j0064N4187q683l4446L5834k1177o0301L9214L1417k5067
474i636L2762J5486m7183P887M111m9839K3265M4658k5634J8685L1497n8768j9425
487c2134M2557k7086j2048M9842l559r953K3855m0805l1664M4723n205k1253N1858
500B9128J967m4164K4269l553n3154K5159L4418j6711K2951R808m4385J0542J3406
$$ y = [-55964, -24070, 11246, -14323, 32622, 66201, -5394, -19297, 4031, -42054, -31734, 22193, 164, 11892, 57755, 1472, -38799, -486, -19520, -29648, 30153, 20162, -8185, 32179, 4971, -52794, -15043, 1848, -15714, 36574, 44416, -13256, 4351, 10904, -48068, -29925, 12104, -3370, 28597, 52482, -13606, -22664, 11201, -31748, -34997, 22695, 9231, 4495, 41243, -2894, -41292, -2199, -10550, -20614, 33573, 24890, -9556, 26278, 5101, -55200, -15986, 15431, -9636, 23126, 38612, -8571, -684, 3427, -46412, -23147, 21511, -4123, 14562, 46059, -12709, -32134, 10423, -16663, -28711, 21131, 17572, 7619, 31474, -9331, -40995, 3728, -1477, -22730, 29128, 31095, -13069, 11200, 7647, -45507, -20348, 14070, -2641, 20310, 30118, -14267, -3725, 9681]
513I681n0757J6565N5922k2345m639K8953l9152k1946L2602j9337p687M7642p422
526A8080j8509K6092l2753l8536M6398R435l0886L5894J4634l6042J1533n016
538C24m1272L1098L1533k7461J9871K1002m8634j873K6515l6846J482N0733j1862
551A4610j0129J8177l5657j4277L5918k1078j4431N4043j056l4665K0419j2074
563b00l5414L2313J4445k3342K8211J0851l4064J1532k050m3110L0896M3320l4142
576g54j718K8750k9902j4229J7243k3321Q312M4533j7181j2643K3474l1868k3996
589c3300M0126p800k2603M6565J0534l8153O055n005k3837K8378P843k5681L1720
602A4842J6127m4405M499J6251l4682J4178M0051k5244o030K5098k5483j1802
$$ y = [9681, -41076, -24511, 31411, 9066, 4427, 33380, -5772, -27718, 4884, -14453, -22140, 25502, 18080, -429, 25663, -7090, -45626, 772, 10207, -20679, 15215, 29849, -6193, 5340, 324, -40948, -9850, 21683, -5778, 14093, 35095, -13539, -15412, 11103, -25743, -24261, 26472, 14610, 4481, 22658, -12999, -27276, 8642, -12436, -26867, 27176, 26120, -8545, 11874, -200, -35614, -3301, 11144, -12198, 16013, 26864, -7200, 4332, 2282, -40828, -9932, 33388, -754, -2472, 26278, -3624, -17853, -610, -23931, -15619, 28914, 11733, -910, 22564, -9304, -33300, 6826, -974, -23577, 22988, 33522, -4631, 1424, -3581, -27418, 960, 8803, -16878, 14842, 30969, -13436, -8937, 7314, -27368, -13190, 26861, 1617, -4413, 20685, -4798, -16600]
614a6600K0160k1120O107M7066k0460k9321K5976j3631k6766K9729K410j7624
626a4074L5847M612l7195Q484m57k7886K7551J9835k7607K0316K2638l9796q102
639a5834J8078k1019J1773L0994k4894l595K9445k6385k1033K6335j0452o937
651a3524L6465r605k5864K1575q434k5687K5249L653j7678L4897O420m4303P193
664i643J5225k5355J4464K2802k0159J0484J5845l5492l725K1118k3236P712L8354
677B8394k2759j5721K7491j9353k5934K5090J745n276K9362j1004k5972K2373
689H436o259k9056K6967J2418k2826K2950J2846l8055J038J6424j9132J0339J9355
702A5445k0575R294J7959l7007r343L1044j1826l181L1355j4055j8729K0919j2921
$$ y = [-16600, 3560, -17560, -11453, 35613, 15153, -14168, 11808, -1823, -28589, 1140, 3550, -14074, 21773, 26385, -10810, -2326, -2783, -30669, -3118, 16717, -10890, 9426, 32064, -7732, -15834, 2244, -18775, -7002, 23992, -902, -4497, 24948, -1437, -22470, 3865, -6587, -13524, 22941, 13336, -12528, 9047, 613, -25074, 175, 3828, -13850, 21047, 27467, -16836, -9643, 5582, -19773, -5309, 17493, -2666, 7818, 23663, -11829, -15554, 5564, -17672, -9960, 28394, 5635, -10086, 17405, -1948, -27882, -2792, -1047, -6323, 23039, 12035, -13937, 8436, 2177, -26879, 88, 12506, -10320, 12630, 25476, -12579, -11541, 4883, -14249, -3910, 15445, -5130, 4164, 22123, -14884, -24227, 6817, -5009, -8190, 23165, 9110, -9619, 11300, -1621]
715a621k0781K3330Q20j0198K8334n033k9788K0317L154l0756J6912J7715k0033
728g628J3003J0954l0717M887K0038k1066N741K2989k1325j259K1798k6523j3508
741b2616K9232n914o103K6618j1551j8281K0398j3651k6273K5496R425j4282K3317
754A5815J237l0620J1890Q066k6263J2976J9178j6806J0645J2454l0953J456K2737
767A1812k0269j081K6884j4379p896J7766k0915j2840K8403l512j1736K2956p423
780G770k0142J8454o418k2969K4215J3260j8721J3710L573k7128R085J1240k1964
793a6035J2531K2571j8179K086J2548k8560l196K4675j4428m035K6439j0469j2838
806f890J7062j5001j3944K5001k454j4117K2553l030k0797J8083K23k4883J9282
$$ y = [-1621, -22402, 928, 1748, -8450, 19884, 14851, -14937, 5380, 8534, -22222, -5310, 12405, -7628, 5375, 16329, -14388, -9501, 10537, -10529, -4788, 18201, -3124, -4383, 17415, -9108, -22616, 6616, 702, -5401, 21217, 9666, -8615, 11783, -1868, -28141, -2645, 6780, -7502, 15815, 17052, -13568, -1678, 6388, -19875, -6899, 12279, -4527, 6118, 18572, -12381, -10925, 11812, -8457, -9538, 17346, 2967, -4929, 12837, -8078, -20918, 7485, 3973, -7763, 15193, 7770, -12372, 6082, -336, -23305, 910, 14170, -4551, 9159, 12732, -14396, -5311, 5929, -16035, -3504, 19067, 888, 2974, 15522, -13038, -16234, 8441, -5987, -10022, 16417, 5948, -6890, 10172, -4829, -18773, 6228, 3774, -10343, 12210, 9180, -11617, 6466, 6689, -18194, 1088]
819A088J4195k1563P557R071k2397P457J3000k1628Q443K2312j7625k537J5171
832A2544k2633o290K4893j0147p784K4743o888j4842J3897j1728j5081K4996J304
845F984j6030K0328J933k4907J1240M913k0792J4904J5478j7981N675Q751k2470
858a1974M034J5590j8505M925K5278j5843q942J5635j6019q962K2623o809r195
871h164K2138o010j6675J3870q189j6827K4318O266j9622J3887N847k1026Q875
884a312P082j8589J3575J5706k0993J648J2817j9691J327J9002j5268j294K2066
897A6076j3268j2347J4665j0204p069K1530o570j1895K1067k873k0507J1969o3
910E11j5921J8519Q017j8270J1219Q354j9987M695Q121j7303R880J8609j8632
$$ y = [1088, 15283, -6280, 1277, 10348, -12049, -4592, 8408, -13220, -4777, 17535, -90, -2627, 12544, -10089, -16379, 8514, -1633, -9417, 15326, 8438, -6404, 7493, -4235, -19316, 5680, 6984, -9046, 11282, 13215, -11692, -452, 4461, -16331, -1427, 14051, -3930, 1745, 10496, -11974, -7940, 7650, -10855, -5930, 19348, 3505, -5437, 10198, -5821, -14783, 7840, 1031, -8164, 13974, 7964, -8711, 5159, -3030, -19857, 4461, 10727, -8895, 4992, 10839, -10187, -1312, 5770, -12819, 756, 16462, -4531, -2883, 9934, -9757, -8430, 10572, -4696, -5990, 16076, 2808, -9539, 5126, -5078, -12147, 9383, 2813, -9082, 11985, 9112, -11395, 574, 511, -15410, 3109, 11126, -7144, 4075, 12429, -7558, -2863, 5258, -12045, -2165, 16444, -2188]
923b188k612J4978j5814m403J7001j1807k978K1382j0153j3194J5117o857j0527
936a2055J9709k270j4398J8786Q16k1187R133L798j3862J4888P971j9082Q924
949A171J0809k0811J371J2907j3538O385J7726j7688n849J5550j2423n844J6819
962F585p554m312K0211r891j6861J4599j923j2283J6956J033j3994J4784K513
975I863k1073Q100P331j4094J0294R341j7218N623J3103j7797r86J5126j1188
988c575J363J5507j5197o952J6726r543q582J6347m462o812J7156p172j7476J4208
1002A536Q99j3665J3514L439j3068J3579M564k0341N709J0261j3670O759J0559
1015A0075j5724L118J3255j6728k878J6645q460k529J4892j2763q368J6030q048
$$ y = [-2188, -4800, 10178, -5636, -10039, 6962, -4845, -7823, 13559, 3406, -9788, 5329, -1528, -12055, 7654, 5384, -9014, 9772, 10588, -10599, -1466, 2332, -11530, 3358, 11329, -7753, 1171, 11980, -8831, -7460, 5447, -8091, -1706, 16020, -1668, -7517, 8033, -4390, -10234, 6585, -969, -5281, 14930, 5039, -11822, 2777, 854, -11429, 5527, 6560, -7434, 7350, 9863, -11210, -3110, 4221, -9873, 421, 9762, -7456, -1833, 11270, -6527, -7513, 7613, -3575, -2212, 13295, -1902, -8854, 7872, -1671, -10253, 6094, 1632, -5180, 11976, 4804, -12672, 1536, 2435, -11230, 2284, 5723, -7345, 6234, 10798, -9543, -3834, 6427, -7243, -484, 10075, -5649, -2531, 10724, -6004, -8882, 7763, -697, -3226, 11666, -1097, -9465, 6565, -1483]
1028a483j1428J6651l07p889J4880m667j7001J2077L289j4280J1222O163j2625
1041e398R382O024j9062M101J3215j2106J526J1182j3267R0J2186j3739l690J6730
1055G174o374m246J4336j0377j0587J5266m114j2526J4650L229r770R982k051
1068D592j4886J2214M257j5624Q980R087j3707N193P655j6887K560J5034j0416
1081a948o88J0971j0592j343J1244j3389m725J8650n239q482J3362m597j1014
1094g790J2232k455j2422J2437L363r975Q911J29j4628J0600O798j5398O420J1492
1108I714j2577K21P880j2353K104J3537j0169j599J2630r342n005J1365r696p108
1122a0398J6316j183j0232J0279k181r678J0218j303j1374J2207N079j3334O128
$$ y = [-1483, -12911, 3740, 3433, -4456, 10424, 5757, -11244, 833, 4122, -10158, 1064, 7227, -5398, 3984, 10008, -9054, -4953, 8262, -3844, -2318, 8864, -4403, -4313, 7873, -5866, -9556, 7174, 800, -3446, 10890, 513, -10074, 5192, 1078, -11448, 3202, 6431, -3339, 6643, 4592, -10294, 1920, 6177, -9447, -467, 8620, -5087, 106, 7761, -9126, -6566, 8468, -1948, -2636, 8335, -2257, -3600, 7644, -5745, -10470, 8180, 2941, -5541, 7821, 3224, -7790, 4442, 1987, -10435, 2002, 5365, -4610, 4301, 4430, -10198, 402, 7200, -8198, -1778, 9714, -2863, -2642, 5238, -7115, -5011, 8526, -1643, -3242, 9388, 46, -4959, 6406, -3290, -10398, 5918, 4735, -5497, 4782, 2601, -7077, 3141, 1838, -9536, 2671, 7750, -5584, 544]
1135E44M814j3099O754Q236j2697L741J0925j0549j148P726j1762P65J3962r380
1149a168m543J3805o242q180R699m640o577J3311j875j0235J0985p5j1333R930
1163B862J516j2854R527P929j2583K320N689r928L906P485j1044L256J1413j1923
1177b429k867J0324q718k972J3349n405o670J1466l166p950Q083l808o232J2905
1191E910j231j1212R571K564j1873N554M628r940O622O880j1360J458O599r176
1205e006K736Q286j0153J041J2422r290o194J0056n474l819J1135m417o194J1127
1219F256l478r296Q325p16q105J0689J353j1191P036M158j0601M235N085q561
1233d811N030P436j1519P49Q482q349o68R118p289j055J0548p695o061R310l469
$$ y = [544, 5358, -7741, -987, 7249, -5448, -1707, 9218, -1331, -2479, 5247, -6515, -5750, 8212, -1168, -5711, 8094, 1852, -6328, 3371, -1269, -7846, 5465, 3590, -6645, 4340, 4265, -7068, 2862, 4378, -8476, 1051, 8980, -3603, -1283, 4406, -5522, -1616, 5869, -5175, -1919, 9494, -2429, -5296, 5028, -3690, -6662, 6687, 1282, -5388, 6078, 2912, -5038, 3045, -763, -6995, 5910, 4679, -6533, 3038, 5602, -6271, -717, 3911, -6029, 593, 7473, -3887, -2429, 4170, -5006, -2270, 6016, -4137, -3096, 9326, 36, -6158, 3898, -1576, -5395, 5740, 1323, -4871, 6256, 2778, -6518, 1807, 1091, -7014, 3675, 5028, -6163, 873, 5031, -5570, -1335, 3750, -4811, 219, 7655, -3864, -3115, 5367, -2982, -3650, 5468, -1821, -2876, 7672, -23, -6084, 3226, -243]
1248b43n156J0324l259p441J0092n87j0062O262K294o785P049K382j0117N877
1262F30M406j0524L617O845q445L028P836r780j681Q638o551k177Q125n008j853
1277b894R313o630o533J0058j875p185R146m70p662P776M79r135N696L340p276
1292c852O066K596r814M141O305r786R19P812o227K94P231p464k249P947n542
1307a623k714Q725m101l619R004m241p519Q324q7o635O563P67o650O186J113r142
1323e649N214M208p356L601M491q772K288O561p433m74P398m991k57O358o768
1338a581l037Q597m032n135Q640j583m882O883k252p161O794O59o632O263J168
1353B709p055N758K890r171L570N733o418J117M522o414R15N959o877l92P990
$$ y = [-243, -5399, 4925, 1666, -5775, 4317, 3730, -6332, -70, 2224, -4561, 2488, 4870, -5247, 630, 5036, -5488, -1871, 4974, -3471, -443, 7393, -2387, -4068, 4570, -1981, -4158, 3967, -1041, -2894, 6419, -211, -6744, 3314, 1439, -5746, 3400, 2930, -4732, 3044, 3523, -5612, 84, 3424, -3852, 2214, 4810, -5004, -863, 5442, -4344, -3425, 4387, -1840, -1546, 5685, -1779, -4028, 3919, -1623, -4337, 4388, 287, -3332, 5672, 1431, -6088, 2236, 2149, -4486, 2077, 2844, -3806, 2380, 3493, -5649, -435, 3773, -3583, 18, 4509, -4263, -1975, 4586, -2847, -3321, 4077, -914, -1171, 5187, -1581, -4618, 3979, -53, -5188, 3452, 1869, -3013, 3870, 1618, -5543, 1251, 1910, -4722, 1541, 2709, -4346, 1412, 4302, -4869, -1299, 4434, -1984, -867, 3655, -2759, -1844, 4115, -2762, -3154, 4836]
1368D836m491k493O580n339m102P947k185n314O415Q2m432N497j729o610O396
1383A058K333p210L995L571o548L166L365p500K324N601n716N82M350n523j26
1398b278O105o083k090Q202k856l822N621k631l855O469k058m847O485K51n338
1413b725M745j99o219N374K637p091K622M346n552J638K963o272J956N868n442
1428a351o82N387m406j239N487m390k432O813j724m008N051k076l592N676j438
1443A076n352O014J621o463L416J234m907L506K825n733K164M033n150K33L771
1458B288m664Q21N567m596j964N544k897k140M516l174k304O273j829m722M885
1473A604o40m171M205P85n540M506K336n336J915K291m727K414L480n665J629
$$ y = [4836, 345, -2148, 4432, -907, -5009, 2938, 753, -4561, 1854, 1936, -2496, 3001, 1272, -5338, 1058, 3391, -3819, 176, 3747, -2801, 365, 3730, -3770, -1446, 4155, -1561, -979, 3371, -2152, -2278, 3827, -2256, -4346, 3856, 1000, -2822, 2799, 168, -3687, 2782, 724, -4123, 2362, 2613, -2725, 2020, 1821, -4398, 976, 3613, -3478, -856, 3490, -2062, -424, 2539, -3733, -1777, 4091, -1351, -2033, 3354, -1052, -2291, 3196, -1194, -3626, 3187, 1463, -2545, 2506, 430, -3162, 2514, 1076, -4276, 1738, 3359, -3104, 312, 1546, -3361, 145, 2970, -2763, -599, 3434, -1716, -1483, 2288, -2376, -1555, 4012, -584, -2548, 2996, 99, -2041, 2475, -699, -3003, 3270, 1441, -3281, 1604, 964, -3207, 998, 1783, -3757, 749, 3085, -2251, -336, 1955, -2772, -358, 3122, -2543, -914]
1488i14M751m692q32L972l660j72N123l846k139M881k253k664M368j960l212N880
1504B631o51n072L530J175m311L421Q04m091L479K050m910J336K817m457J653
1519e96K926m350O06M772l728j585L626k346p73L987k944k170M891j383l575M180
1535A538n09l498M292j23m494L259J385l632K313J097m208L041K605n425O30M017
1551B288l607J30L327l170p6M053l197k001L861j942j431M320k409k936M991l57
1567A844m539L153P76l016K858L15l987K803J839m312J373K840l485J686K455
1582B603m195k94M121k321j074K991k402k56L541k872k684M529j033k802L566
1597A418n20l118L200O55l985K576P81k745K684N84m134K326K831m249M77L265
$$ y = [-914, 3837, -855, -1687, 2285, -1375, -1547, 3576, -270, -2409, 2472, 219, -2445, 1923, -37, -3249, 2631, 1980, -3092, 438, 1613, -2698, 723, 1527, -2564, 915, 2965, -1945, -609, 2208, -2249, -596, 2330, -2020, -1414, 3358, -370, -1955, 1671, -675, -1448, 2539, -405, -2575, 2316, 933, -2642, 1538, 1029, -2469, 1823, 1700, -2794, 465, 1850, -1782, 531, 1628, -2580, 461, 3066, -2359, -1729, 2288, -1319, -1189, 2138, -1032, -1108, 2945, -252, -2253, 1608, -334, -1765, 2555, 146, -2790, 2201, 1844, -2695, 458, 1234, -1782, 1076, 1391, -2596, 207, 2046, -2266, -893, 1947, -1538, 148, 2603, -1592, -1886, 2235, -86, -1160, 1831, -571, -827, 2714, -158, -2842, 1687, 654, -2148, 1418, 898, -2220, 980, 1635, -2350, 226, 1007, -1738, 946, 1530, -2604, -278, 2553, -1696, -1219, 2046]
1613B046k674K91K284l270j50L605k690r70L209j864j338L709k178k819L965J82
1629A338k679K100M4k360K944l67l447K849J319l123J394J906l409J211K534l217
1645i63o37L099k118q6K177k661l58L584k218k025L503o51k188K714q70k380L185
1662A107O0k461J913P98l245K545N61l648J768K462k826L13J935k604R11J894
1678A483k553n7K981j921j062K864k145j223K990n90k518K793k27j675J909q48
1694B01k127K732M08l206K165J166k739J314J339k580Q68K202k272r0K120k418
1710i17J86K440k615q11L206j078j616K021n82j703K800q43k234K755k27k113
1726a331J958M4k454K425Q20k905J014J824k103O45J221k158O80K176k461l52
$$ y = [2046, -628, -337, 1947, -1323, -1473, 2132, -558, -1528, 1681, -183, -1521, 2188, 10, -2809, 1156, 1338, -1341, 759, 803, -1557, 1387, 1020, -2427, 422, 1741, -1382, 12, 1918, -1491, -280, 2254, -963, -1600, 1499, -619, -705, 1472, -1189, -1547, 2037, -181, -2206, 1297, 646, -1542, 1172, 302, -2078, 1107, 1167, -1294, 619, 1417, -1828, 717, 1278, -2370, -602, 1860, -966, -653, 1282, -1322, -411, 1483, -1070, -1127, 1854, -67, -1129, 1735, -410, -1633, 1357, 767, -1751, 1042, 815, -860, 1049, 201, -1926, 806, 1214, -1992, 173, 1339, -1400, -86, 1253, -1327, -459, 1743, -529, -619, 1501, -917, -731, 1709, -906, -1717, 1489, 411, -1205, 816, 234, -1469, 1331, 488, -1746, 1009, 782, -1331, 627, 671, -1783, 642, 1462, -1443, -429, 1395, -708, -63, 1158, -1000, -320, 1856, -605, -957]
1742i57K304j728p16K343j654q49K510r03j757J850l88j119K099m39k106K078
1758E68P75k567J224J099k210J406R59k548R29J824k314N63J550k259K93J943
1774A235j564q74K426j289p98J693j132r45K505n52j954K209l35j903K008K50
1790I80k107J425P41j929P70P82j596R09J249k444Q22K138k128k55J579j122l74
1807e60J611j279n66J816r56j131J858n86j395K293k37k106J544P1j128Q96J70
1824C15j251J271P74j974O69J150j616L33J418j676l9K123j578q56J531o90n24
1841f20J491j193m48J667n28j433J530m79r26J635r6j607R95J096j867Q00Q80
1858H97j488R26R38j788R2J282j041m18J323j123j47J641j269p25J405n02n62
$$ y = [-957, 1347, -381, -1097, 1246, -408, -1257, 1253, 350, -1407, 443, 55, -1064, 1035, 596, -1510, 568, 1343, -1224, 0, 1099, -1111, 295, 1254, -1294, -365, 1459, -855, -292, 1258, -1001, -708, 1235, -329, -1203, 1223, -66, -864, 829, -303, -1248, 1257, 705, -1249, 960, 625, -1278, 730, 980, -1127, 298, 1039, -890, -120, 662, -934, -25, 1224, -1220, -398, 1740, -388, -643, 936, -186, -560, 1051, -228, -794, 1022, 66, -1065, 793, 207, -1188, 1105, 868, -1238, 306, 377, -751, 145, 315, -936, 335, 1109, -865, -196, 954, -662, -329, 1089, -587, -626, 1497, -81, -937, 594, -96, -620, 871, -322, -770, 897, 369, -1064, 466, -13, -939, 696, 600, -1007, -12, 1084, -783, 17, 897, -591, 335, 1273, -515, -423, 859, -182, -600, 723, -400, -547, 1094, -175, -900, 505, 3, -559]
1875e59J141n60r06J692k92j436J147M34j244J074j5j445Q94Q87j453O44P45j364
1893f16N92R04j710J18J234r15l6R85q54r8J072r50n82J426m05n88J002l57q00
1912e78J223r7j323R80M06j297R41L33j650J053J058j655n9J197j064J41P79p71
1930c83J28J038r51k29R28p76k95J017n99o62J168r8r60J032l08p37R76L54j375
1949g32O97P52j239N26O01j052M56O50j126J56J219r93JO35j008r5J432q65q00
1968g85J099j52o55J141n43r28J423k49j118Q75P8q51R25L60j225P24M86o78k20
1987b93O51n84J06L84p19O8J139q53m13J078q86k52J229q66m18J002k92m31Q13
2006D63m61n22Q24K03j337O88N09q67N13O32j035L71P15j035J23Q29q48j1O87
$$ y = [-559, 582, 22, -884, 808, 516, -920, 227, 661, -583, 491, 476, -969, -75, 812, -641, 3, 748, -616, -24, 880, -830, -712, 522, -393, -429, 556, -298, -396, 676, -274, -856, 570, 165, -423, 579, 222, -578, 645, 548, -775, 205, 611, -686, 255, 588, -1062, -9, 1049, -606, -665, 532, -532, -391, 388, -383, -255, 783, -168, -397, 531, -245, -540, 477, -122, -784, 384, 286, -674, 358, 50, -687, 289, 643, -732, -35, 717, -522, 4, 605, -447, 9, 659, -467, -311, 908, -85, -84, 551, -457, -552, 880, 15, -785, 314, 162, -493, 648, 105, -823, 600, 351, -767, 108, 186, -665, 260, 620, -605, 119, 605, -73, -293, 358, -226, -120, 264, -455, -387, 752, -101, -514, 564, -322, -574, 655, -211, -629, 373, 81, -350, 463, 2, -520, 304, 507, -830, -142, 367, -500, 13, 645, -390, -19, 696, -339, -216, 613, -235, -246, 441]
2025D41o40k32R98m40k52N69l55l88P94n37k98O42k40n22P32J85r10Q17j14p93
2045e43N03M11m32q9L12q07O29N26p66k08P74m86j51Q16m15k89O92m92n06O40
2065A19k0l05M87m41l05O22J33p88J08Q10r11N49K00o70M81N53q19J20L80o37
2085c34K2Q92n94m48R22k36m69N80m09k19R03p13m50O51j43j90L52J87q26O07
2105H5M21p07J48M65n43K79K11q97L87O79o10j37O47l85k44O37o46p2O70k79l90
2126b81L88k97k95O51q4n57M98K41o69L64K69o63N06K54n69K61l2l27J51N01n31
2147b21L99j0j53m29N35k68J03L33l26k62N49j31m71L83R5o16N74L57q39K56L77
2168B35m19K63K31m70L93L98r52K27K50m21J29J62mj07L61n09m0N21l79k98O73
$$ y = [441, -199, -431, 567, 127, -125, 444, 89, -299, 495, -42, -340, 302, 62, -460, 272, 457, -453, 364, 250, -543, -40, 371, -61, -150, 162, -645, -16, 510, -256, -464, 310, -176, -327, 489, 74, -215, 477, -15, -521, 119, 99, -206, 281, -160, -465, 157, 290, -498, -390, 420, -491, 58, 258, -412, 69, 622, -197, -77, 303, -334, -312, 580, -14, -462, 460, 224, -245, 335, -74, -293, 610, -103, -553, 98, -45, -235, 117, 304, -522, 85, 506, -201, -53, 412, -131, 148, 359, -538, -151, 528, -82, -219, 428, 43, -201, 436, -210, -282, 388, 109, -281, 107, -190, -485, 166, 82, -475, 23, 264, -405, -41, 228, -435, 71, 325, -244, 17, -15, -342, -191, 310, -221, 178, 168, 15, -414, 121, -147, -44, 289, -37, -299, 250, 119, -352, 31, 126, -490, 84, 441, -398, -142, 235, -184, 79, 310, -160, 233, 631, -321, -94, 156, -265, -136, 26, 22, -85, 276, -233, -273, 248, -131, -429, 244]
2189B44m04l75O74J02m17K36k8m89L59M24n67O6L03l38K08M24o24l7O31n08k60
2210c76P71m46j61M74q9k04r2p4L05N2j58l9M6L3n18R71l64m68L12j8j69m3J15
2233a40j40K70K17k89l8J90k08L8L22m54L6L37r2k05K29p1j59M63k76j55K20o0
2255C5j29M05k29l20L83k29k61J5O18n41J63M73m74k10L55l8j65L54j49M4K34
2276C34k62j85K2L10n46M23j02j47J45L6r3j00K10j50R4J10k31J17K54k19K2j20
2298g8L1j23J96O9l20N12l80r4M2K09K08k01j53k47M41j84k70M30J83k74m1O35
2320E91o70J66K17o37K21O7J9J41P3k57j79L46l00M9K94j09J30k06Q6k63J97K11
2342A87l77Q3J06l30P9J34OK19J49k56J04L41m27J33L09n36M0J29O7j62J23Kn66
$$ y = [244, -160, -535, 139, 241, -176, 60, 32, -457, -98, 326, -241, -175, 128, -210, -2, 422, -202, -239, 392, -116, -376, 395, -51, -212, 262, 173, -31, -123, -197, 108, 160, 2, -37, 9, 42, -476, 495, 131, -337, -25, -43, -212, -255, -140, -280, -10, 207, -82, -120, 70, -138, -100, 222, -232, -196, 141, 49, -156, 73, 2, -157, 306, 30, -125, 95, 35, -94, 311, 82, -238, 145, -84, -345, -330, 288, -253, -90, 383, -91, -301, 54, 16, -149, 205, 56, 100, 334, 72, -113, -91, 219, -327, 96, -6, -153, -8, 28, -65, -165, 45, -105, -11, 99, -132, -15, 239, 20, 42, -78, -47, -170, 26, 95, -225, 287, -93, -187, -145, 64, 272, 71, -82, -329, 112, -72, -342, 88, 271, -3, -44, 591, -79, 87, 304, -333, -112, -45, -26, 115, 188, -69, -248, 98, -202, -153, 141, 32, 162, -44, 42, -221, -24, 187, -190, -107, -1, -331, -252, -118, -112, 107, 256, 0, 104, 445, 18, 151, 460, -76, -36, 93, 160, -2, 121, 123, -443]
2365d43M60oo79P99j58rK17j6k69L2L35m03J46L14l47o1L00n45M19K7p9n1L11
2388B94m44L3Q9k03o0K82j25R9J02J52n73N06mm11L55M10o90L32J80o21K38L20
2410B61k00j70L43k39n4L8l0k21M98K9n31K63L8k36L58R2l38K41m4k46J84k13
2432a77J68o6Jr5j24M89l41J41P9l79K20L84m40j47L26m8K8L71n50n9L40j14j48
2455a41K78j65l79O21j82j22K66k13k02K32k6OQ2J38o28L09L89k36k33M88l14
2476c2q0O18q71J39L85j37k29N05l07k95M99K52n71K44j08l3P7R0l74K75L23m02
2498c2O2Q7k75j09M52k85J78P6l82K43l6j92J6M27k31l2K28r2k83L09k93j32L32
2521C6J51l71N3K81l04K12J55j87Q5J65l12J37m5l80K70M02l05l83P25l03m42
$$ y = [-443, 17, 11, -668, 131, -27, -36, 181, 165, -104, -72, 263, -140, 6, 320, -27, -88, 212, -333, 86, 113, 34, -17, 294, -150, -117, -28, -231, -291, -9, -134, -35, 67, 219, -354, 152, 148, -263, 92, 502, -188, 144, 324, -297, -59, 261, 61, -109, 234, -5, -59, -21, -51, -272, 226, 255, -276, -13, 25, -211, 147, 239, -99, 142, 98, -148, 36, -177, -9, -75, -74, -169, -293, 196, -145, -4, 75, -304, -84, 300, -140, -287, 39, -9, 19, 390, -160, -219, 121, 7, -141, 137, -28, -407, 214, 32, -90, 176, -37, -239, -7, -33, -27, 55, 193, -435, -126, 263, 27, -206, 282, -32, -112, 506, -365, -226, 159, 22, -207, 298, -9, -304, 195, 447, -124, 120, 12, -21, 56, 146, -228, 47, 370, -32, 30, 117, -158, -267, 185, -100, 78, 154, -228, 15, -21, -213, -197, 230, -1, -33, 195, 103, -180, 129, -164, -296, 36, 187, -184, -131, 150, -154, 58, 213, 26, 111, 276, -36, 101, 56, -324, -54, 348, 43, -340, 385, 82, -360]
2542c60Q29q70L73j0j45l8K91J5m25N95m5k18J87r4l32K12J03l19K68J56l11K55
2564A17j6m56L08J67p5j21N11n60l5L33j82k82N73m56j61M22j42k76J94J55j96
2585a78K80n4k63K91Q9n36O61k07o23M99K03m50J34L90l34j9K09j39n0J70j51
2606g8K4M79o76P4M01l79RQ1K47n67K95J82k39L99j60m55N41n3l50K67J60k33
2628c1j90M30n14L25J53q7j97M97o01m5N00j41k7M2p2l53J94J55k76K45J56k89
2650a26K90k32k52L00L29k38r4P9q3j5J28j60N7j46L4j69K96k05k74N96k11Q0
2672a6K98l45N3M21r7n54M14j67k32J09L57o32L54J94k53L20j27j85M3K18m44
2693b71K82K81o84L41J27l39J95K96k72m05P82m30j09M07k40l36M61k2m85P38
$$ y = [-360, 469, -401, -28, -38, -183, -221, 70, 85, -340, 255, 210, -8, 179, 85, -247, -35, 68, -251, 17, 173, -138, 117, 101, -355, -47, 120, 45, -76, 435, -125, -160, 173, -9, -291, 282, -174, -335, 87, -55, -331, -137, 18, -178, 102, 48, -215, 76, 165, -371, 290, 83, -540, -41, 162, -288, -154, 236, -98, -117, 92, -47, -97, 73, -78, -54, 425, -251, -177, 224, -155, -146, -65, 182, -385, -90, 92, -147, 252, 92, -363, 178, 125, -225, 42, 202, -31, -221, 209, -305, 20, 173, 86, -111, 386, -215, -260, 240, 99, 72, 114, 42, -311, -117, 38, -238, 7, 163, -126, 164, -68, -320, -20, 309, 71, -23, 56, -27, -42, 86, -74, -17, -163, -129, -298, -2, -207, -481, 115, -96, -16, 282, -63, -10, 411, 314, -240, 174, 7, -225, -116, 241, -391, -37, 157, -96, 224, 97, -88, -45, 173, -271, 11, 292, -392, -51, 76, -263, -68, 228, -44, -449, 333, -97, -206, 201, -39, -375, 86, 64, -421, 317]
2713C17j11l88M10k21m74O24Mo30J78M54k14j26M33l82K15K45n12J03K38j44m19
2734d00L39N9k74K83M5k82L87j35l35K62L7k91M00M17p74K80M89r68L56K07n90
2755d88O80P4m85J73J55o8o5K69l25j63L27J0l29K24j90ML63p3l30L88J46n22
2777b25K67K5k40nQ9m0nM40l85K14N9n01K47L42m58Q8L98n35J83L29n1q1L58l45
2801A68m24N69k38l25J05M01n95O19k82r3J31K18l71J35M45j033N23M69k51l89
2821b18K49nj75L90k42j53M5K9k40J01M10j99P1k93k3L91m2l37L35r7j71K99r1
2844C4l77L32K78o62L75K71n64K75L31l30m5k7N7j19M36m86m7L77Pl28L89j59
2866A8k29K96K58q67Q47j33m07L36Q5m40j18L92l65L33J55l73K48m5P2j51K28
$$ y = [317, 206, -182, 228, 7, -467, 157, 161, -469, -291, 163, -51, -177, 256, -126, 89, 334, -178, -75, 163, 19, -400, -61, -2, -276, 7, 52, -230, 157, 22, -313, -51, -14, -305, 95, 512, -262, 18, 507, -461, -105, 102, -488, 192, 266, -219, -46, 109, 41, -24, 245, -80, -243, 84, 94, -235, -11, -201, -197, 166, 93, -237, 151, 297, -225, 42, 67, -173, -178, -89, -129, -134, 306, -79, 135, 194, -307, -60, 282, -176, -88, 310, -225, -42, 287, 236, 155, 513, 168, -256, 313, 75, -250, -145, 256, -339, 280, -2, -95, 36, 254, -117, 18, 463, -570, -47, 422, 171, -218, 31, 26, -149, 241, -1, -154, -109, -80, -320, -219, 191, -8, 63, -230, -253, 138, 96, -241, 94, -3, -174, 125, 34, -343, -11, 267, -395, -20, 251, -313, -38, 293, -37, -82, -109, -52, -171, 265, -221, -268, 109, 116, -212, 177, 18, -211, 85, 343, -524, 323, 190, -217, 119, 204, -236, -354, 38, -327, 6, 161, -212, 36, -9, 63, -88, 140]
2887A40l07J30K14j80p8J46j15l45N53j65j21N05k49k57K25P6o42O74L9o53L31
2908g9L98m84M20K28n88N3K43l7k49L64j84k5J99l59o6M28k55J64J27j72l01L99
2930B24j27m04N35k11j85L84p6m40O05q7l90J02L77n00J24M02o30M02M50o44q2
2951a71K21j01K70J81n17L0L92k07j82j7P2m48Q35m2n95N53n1o61L42M01m45J46
2973FJ83m24J13M17m70K07j9m8KJ68j28j25M17k65j01J0p3m7L80j91k74N58k50
2996D6j04J87m9m03L83J91n13M63K6k10k27N78o28J81L61k62k93L24k36J99K54
3017B68m33R0L66l63j03J49o1k42N49om76M32k22l14P66j70m62J70Q8j95j50O64
3039C45n77m4L35l10J45K63m31M81j6l97Q9M01l89l11L41L14l53N27l11k83M75
$$ y = [140, -167, -37, 177, -3, -81, 65, -50, -395, 158, -7, -128, 377, 128, -129, 96, 172, -470, 204, 243, -410, -79, 319, -165, 255, 483, -105, -52, 191, 154, -95, 269, 85, 60, 259, -100, -166, 262, 7, 171, 298, 126, -175, 224, 97, -307, 228, 17, -168, 216, 140, -300, 305, 218, -172, -70, 307, -193, -69, 333, -297, 105, 555, -89, -171, 50, -51, 219, 400, -117, -87, 305, 98, -84, -101, -29, -477, 358, 316, -279, 274, 223, -438, -96, 305, -140, 6, 189, -235, -122, 295, -175, 32, 13, -35, -33, 135, 7, -118, 299, 34, -67, -57, -130, -177, 203, 12, -262, 296, 46, -58, 129, 80, -323, 60, 251, -262, 201, 227, 17, -210, 368, -260, -79, 282, 20, -273, 51, -185, 14, 268, -165, -75, 291, -72, -175, -26, -87, -329, 220, 214, -262, 170, -52, -366, 400, 230, -232, -62, 26, -169, -319, 345, -232, -276, 59, -251, -106, 157, -274, 207, 191, -206, -117, 284, -105, -416, -75, 239, -114, 413, 102, -181, 294]
3060B94oo48L24L12m35K65J5l97Q3L35m60J46K27m08J29M55k35k1K17l30j44M35
3082A53l69J19Q7k39L2L50J77m96K80R5l77L68j87n7M7J84j34J11P2n09N36M4
3104B87l08q3O06o71JM04o04J91M50k78k39L21k40m6M89m70j7L40Q2m75L67J69
3126B76n29O05j97l97M68n65J11J85J35j73J74R6m54J55Q2l21K64M43l90l9L42
3147B71l67l10M83j65j48L35J1k76K40P9o46O45j99o0K25j02o7L4K40o78L75P28
3169F48j037L93J56k18NM87l28j26L21j70k67L46l84q1N96l17n41P13j33n17O24
3190A70j80l47L40K02l58L84R2l78J10J26n72L71J49k37j10K63j93p0P08m87j61
3211a78K03K12o34M91q9o1K20j76j31L83n9n77O54j70k06K04J84m08J23L35o28
$$ y = [294, 288, -360, -36, 276, -159, 106, 121, -276, -193, 142, -318, -172, 55, -353, -224, 231, -4, -25, 192, -138, -282, 153, -216, -97, -10, -249, -217, 133, 310, -186, 94, 189, -188, 180, -7, -64, -17, 167, 33, 144, 216, -293, 243, 287, -21, -104, 502, -169, -168, 236, -368, -177, 273, -5, -244, 77, -163, -209, 280, -190, -207, 133, 215, -260, 107, 276, -253, 352, 155, -242, 226, -339, -228, -43, 92, -81, 93, 189, -265, -110, -28, -349, -85, 358, -32, -71, 271, -96, -406, 77, -88, -236, 99, 110, -166, 74, 153, -493, 152, -47, -107, 118, 16, -51, -17, 223, -455, -80, 648, -389, 4, 160, -58, -53, 434, 106, -20, 301, 131, -136, 210, -174, -255, 341, 24, -517, 196, 63, -454, 170, -10, -357, -17, 185, -173, 211, 303, -75, 35, 161, -411, -40, 109, -128, -238, 25, -168, -238, 470, -17, -178, 25, 237, -397, 94, 5, -56, 164, -12, -143, 240, 181, -396, 258, 88, -118, 86, 270, -138, -15, 320, -308]
3232c08J55N95n68OJ67rk32M71k72n9Q9K7m76P57m53j40M34L09p20M70r4l97N82
3255C34l17j93K05J06k10Q9L66m59J08J10m37K59L78m61j66N92m32l59R33k28
3275B18k70K69m12p1M02J44n97J17J52j68M24j01l53M3M73m16J24M1k91L87O2
3296A77n46K99J36k48k3K99j47R1K56k54o24R66l37j91K16O8k24K54L89r64N94
3317A87m1n58O88l01j73O7O47o95pN39m96l0L04l73K1N68l70q9K27m84K82M28
3339C41l23k12M13k99o0Q8R1k83M21J89q76O02J07n62N37K30l59m8K9j67J65L2
3361E6k02K91m5l91J9M64k22j59L83k19l72O39l76j72M02L43n61N7O7j93K14L55
3383C78n78R6L22k76J18Q4n78M28M31m58m05N66p8K46Jm54n9N82k09k49K16k03
$$ y = [-308, -153, 442, -126, -120, 47, 38, -194, 277, 5, -54, 35, 62, -414, 343, -110, -250, 184, 493, -227, 243, 149, -248, 334, 17, -176, 29, 135, -75, 14, 380, -79, 29, 139, -298, -39, 339, -122, -288, 304, -128, -487, 446, 218, -52, 217, -195, -266, 136, 280, -317, -200, -48, -216, 208, 107, -246, -203, 270, -146, -22, 19, -272, 115, 177, -369, -70, 66, -182, -205, 94, -53, 38, 294, 40, -584, 382, 45, -146, 70, 138, -86, 168, 557, -407, 187, 146, -412, 276, -25, -198, -131, 516, -179, -186, 353, -143, -173, 131, -242, -221, 347, -23, -112, 115, -369, -87, 341, 18, -194, 219, -80, -140, -52, 39, -244, 177, 366, -510, 92, 199, -363, 174, 404, 45, -3, 26, -141, 24, 56, -146, 145, 100, -291, -272, 192, -30, -189, 194, -25, -397, 242, -134, -306, 96, 439, -122, -65, 2, -191, 23, 378, -200, -104, 218, -58, 60, 144, -434, -6, 425, -33, -438, 128, 50, 296, 297, -157, -216, 366, 157, -92, 124, -79]
3405g9N8J53n0p4L02j06l82K16J44l28L20J91o44K95K38n76K14K68k50J30L29
3426C69n69J1M31l34j91L49j17k23O80k71m13L61j26j65K58J81n47M65j34j57
3446a42R8J32l03K88j02l1k34M30m98K15M48n60K47L8j10l07O79m60L4O28m92
3467bm47O21p3m29N00j61k66K76l0j93L7L68q15P10K43n56M57l22k64M02K58m82
3489a68J20J59j30k28L95k01k14N20j92l66N32l33M4L54k13o94Q27k26j5pj33
3510a69j91L00J88n18N07N7k48J27M42m60J89j5q9k59L32l39N4L59j97l77L81
3531G4J4m99O20k16q9K35m5n27N91j3m43M99Lk76J34L51n02K1J0J04OL65l47L1
3555A01J99k75k39M18k26l11O09n17K1J54K24k37L95n41j99N42j62k53M63l96
$$ y = [-79, -21, 132, 82, 8, 310, 204, -178, 38, 182, -146, 174, 365, -279, 16, 254, -322, -108, 160, -90, 40, 369, -200, -189, 242, -92, -283, 66, -51, -274, 406, 135, -278, 83, -43, -208, 50, 231, -316, 149, 15, -142, -44, 88, -215, 73, -29, -60, -294, 136, -362, -147, 301, -259, -12, 26, -84, -391, 288, -172, -138, 490, -2, -449, 172, 99, -330, 170, 9, -257, 19, -11, -204, -167, 201, -614, 96, 339, -217, 240, -82, -346, 56, 314, -168, -48, 111, -19, -247, 148, -53, -267, 253, 61, -305, 227, -106, -62, 292, 79, -615, 212, -14, -29, -36, -169, -360, -60, 128, -390, 117, 174, -74, 53, 495, 35, 224, 209, 120, -139, 193, -146, -92, 267, 70, -307, 74, 88, -411, 209, -7, -96, 139, 94, -433, 158, 145, -298, 201, 204, -72, 62, 413, -89, -68, -58, 46, 52, 417, 70, 101, 300, 25, -214, 204, -22, -333, 276, -241, -220, -66, 158, -79, 316, -225, -424, 118, -44, -297, 166, -230]
3575b30P9K43k97R8J09K94m21m0M26n29J24N18n01J75K40m65j39N17l86m8Q34
3596F01o82l40O61l2l09p4K40j38K77P0m25N4K92m91M33l1l47K99j09j02k25O83
3618C05m31k35L76j24J06L50l82j43M22k75k87N04j22n2LK7l06L78J3l16K97J53
3640B61n46M85J08k96p7m6J99m28P73m75J87J64m26j56O31k07k49L36l96pL67
3661B02k60r9J00J66k95K98k52q2K77Q1j84oK39j11j61K04k8p9L04m70n1M23j39
3684G7%p4j02p8K35J0l38N05j15j48K20q0n57N07M5k32n6N30m58O8j26j29L38
3707D2N3l42J32L73m12o5O27m30r0K44k54m1L05r8q4M27n18J41N26m48j31J43
3729A00j6m71M81J09n86M97M3l43K61P3l07J4M17l42j07J52j07J0N22l84M3l5
$$ y = [-230, -151, 92, -205, -107, 2, 296, -125, -165, 261, -268, -144, 374, -127, 48, 288, -177, -316, 201, -185, -233, 601, -81, -421, 240, 208, -101, -175, 65, -73, 204, 274, -151, -97, 195, -296, 137, 106, -241, 58, -51, -153, -378, 305, -126, -361, 15, -109, -3, 347, -35, -178, 244, -31, -318, 186, 64, 12, 15, 42, -264, 114, 127, -189, 108, 261, -285, 200, 308, 12, -65, -111, 88, -340, 433, -42, 145, 309, -117, -273, 358, 151, -98, 238, -158, -165, 202, -58, -157, -57, 109, -186, 112, -140, -222, 55, 136, -48, -54, 185, 74, -87, 117, 89, 10, 314, -156, -207, 216, 77, 77, 3, -99, -177, 58, 68, -270, 235, 120, -28, 192, 112, -445, 62, 107, -125, -181, 349, -109, -41, -167, -296, 42, 95, -247, -115, 258, -154, -219, 408, -22, -112, 132, -122, -163, 142, 44, -40, 387, -131, 10, 536, 88, -43, 100, 84, -387, 94, 203, -383, 114, 157, -186, 75, 148, -159, -145, 272, -70, -177, -25, -132, -122, 400, 16, 59, 24]
3751B4P5l40L23M2j57Q6p2n2N8M7k51N99l07k80K79j84m3n9M42l00R6L16q52O89
3775A79M7l29K58l8j38k00M62l38j02K68mk00L75n80K85K71O6l07K05N8k11K01
3797B28k58j0q0K18m23K25K76l53J31L40l71j3J69J91k75K24j47l45K77M1j08
3818f3L84j65m65N10l4l26L65j9m08K81L5k87p8J80r7L29L6o01J41L59k87P0K22
3841H2o7k15N99m62k2J83kn8R8n1j68K38j35j93K65p5l41N42j67m01L90Q2k42
3864a20L00o1k82J56K64l16j43L74k37l16O07k64j7K95j95l64M68j73k0N8n7J57
3886A14M8k6n53M69J28n33M67r5j04Q7L10l05P8j16n8J77K35k76p5L93l39k13
3908a87K71j79j01M45q8k57M04j99j56L1qj54K77k79MK84j49j19L74j55j73J87
$$ y = [24, 99, -241, 82, 124, -33, 53, -19, -71, -13, 34, -217, 382, 75, -205, 74, -110, -153, -212, 230, -70, 26, 342, -510, 179, 226, -103, 155, 117, -21, -221, 241, -97, -199, 69, 65, -135, 240, -340, -55, 216, 282, -25, 180, 238, 27, 228, -30, -40, -120, 98, -325, -100, 176, -177, -46, 294, -77, -90, 79, 270, -5, 219, 72, -273, 4, 45, -63, 321, 156, -309, 201, 167, -159, 206, 187, -221, 60, 95, -192, -270, -90, -187, 142, 178, -423, -282, 77, -210, -140, 82, 15, -200, 399, -63, -85, 98, 96, 38, 136, 85, -83, 155, 20, -173, 92, 17, -324, 218, 51, -350, 40, 122, -120, 180, 119, -163, -7, 257, -59, -202, 172, -65, -381, 226, -38, -55, 240, 45, -319, 149, -24, -44, 14, -43, 114, 162, 136, -417, 52, 180, -353, 114, 19, -85, 2, 312, 7, 85, -31, -89, 88, 323, 47, -28, 365, 26, -187, 84, -95, -196, 249, 161, -96, 308, 109, -47, -16, -24, -178, 99, -180, -176, 108, -41, -160, 214, 59, -114, 73]
3930G3K8k20J94K4j36J68R4k41j87N10n83Q6J90J74m97N10j80k79N31j00k68L47
3952B38n6m15Q4M24m33N1L69k21N0K10l94J26M1l91J11K84K2k98L47k55j00L64
3974A58n5k30J71k46N5O7r5R3J93m5l52L75j20j00O1M29m41K88m2k87P2K27k74
3997i8J76J33k88J93q6Rj54K0k2K42n4K13l19J90l15N5J43J30k93L97m6m78L23
4020G1L82l98k62L22l62J93L63m27N2L84j27r9QK2k29L12l53QL03k96JM79l63
4043a6j20K24p4k52P3K33k2p4P0l00M01q5j12j83M58k81n2K42m48M46J38k63k72
4066b69L99k20j09L59l51L0L68l31O4J30l88P7R2L05ml1m9L3j08R7l01R3L53l05
4090f6j27K36n1j80m2L78m18M23k81K62j29J62j07O3j13j22J35k06L8K51J50l11
$$ y = [73, 101, -119, 75, 99, -37, 131, 225, -16, -203, 307, -276, -190, 0, 174, -323, 187, 7, -272, 259, 159, -109, 238, 182, -233, -149, 275, -158, -107, 262, 41, 91, 301, -93, 33, 74, -317, -206, 78, 100, -198, 149, -106, -206, 158, 103, -127, 44, -202, -147, -80, -175, -82, 111, 66, -286, 89, -31, -131, -70, 359, -82, 206, 164, -123, -51, 176, -98, 78, 211, -77, 116, 30, 39, -115, -95, -117, 125, 71, 284, -35, 155, -160, -105, 38, 168, -125, 272, 226, -252, 71, 453, 55, -207, 115, -247, -54, 309, -118, -66, 318, 191, 92, 100, 122, -107, 205, -148, -140, 163, -133, -132, 347, -16, -136, 88, 14, -238, -165, 68, 46, -28, 42, -258, 143, 58, -54, -237, 221, -60, -112, 130, -318, 128, 266, 3, -269, 130, -90, -199, 160, -191, -161, 207, -124, -60, 70, -318, -241, -149, 156, 152, 121, 72, 105, -3, 94, -207, -114, 239, -66, -193, 43, -8, -188, -230, 148, -270, 153, -128, 134, 5, 167, 60, 123, 10, -112, 23, -183, -145, 106, 256, -55]
4112e5%J24j78J24Nj32P5j1k07K08M15n42R6q0J89k00M59l62p5J81l5k44L94l1
4136A18k08J31q2j33K83Q9m46K12P8l2K17o1m89M93p5j97J45Q1P8j76J18j54j77
4159a87L99j61L2n0L6k57M53k94k77N32r6j62q7Q9k7J48K0k78Q0O4j8J30NO8j67
4184eQ0j21J75k5j67M0J59l77j03L81p2P9q6J15j94N14k94j25P4l49L50o6k8N7
4208A2j18K60l65L32k27Q1J91Q5l26L9k9pp5M39n24Q1K61j5j0l27L1K57q0K6r9
4233a07K83Rl88K28p0l10J79L75l20J86P7P6j40k07n2J6K1k7J68K19k41j82O0
4256a47L55l03Q8J24k10M72k21o10P80j19n26J03K10M9l15O33k64J6r1j91L27
4277A60m18J99l59N30j4oRj76j86J85K91l37K93n05L32l4j32K3L19r8l21K28n2
$$ y = [-55, -55, 69, -109, 15, 20, -112, -37, -48, -255, -47, 368, -174, -78, -158, 31, -169, 290, -72, -147, 34, -1, -245, 149, 118, -90, 41, -41, -174, 109, 198, -248, -36, 42, 10, 227, 166, -323, 170, 95, -102, 43, 124, 202, 26, 144, -10, -187, 212, 51, 83, 33, 69, -188, 265, -29, -306, 226, 130, -32, -119, -30, -57, 91, 111, -167, -87, -23, -41, 89, 94, 162, -5, 75, -46, 129, 104, -63, -23, 136, -241, -344, 37, -35, 44, -42, 73, -121, 393, 99, -26, 48, -301, 49, -17, -45, 12, -106, 154, -211, 121, -106, -25, 166, 251, -75, -36, -65, -72, -147, 292, -232, -151, 110, 95, 85, -242, -211, 46, -34, -8, -107, 176, 185, -203, 25, -45, -355, -176, 199, -121, 65, 142, 218, 78, -129, -181, -165, -144, -171, -3, 216, -25, -207, -147, 208, -95, -7, 117, -93, 379, 158, -452, 328, 209, -317, -214, -4, 45, -270, 363, 99, 115, 24, -167, 160, -258, -59, -418, 112, 98, 92, 101, -75, -261, -76, 215, -122, 171, -334, -2, -36, -168, -145, 174, 76, -245, -17, -69]
4300f9j5J13j76L8J39P5k23K11M8k47K91m1o1k99M02j96J7M5J08m9qL0J18j74
4324G7p4oO9pn6L9J22m33K10J20j97J55R4l12Q5L89l61k4M1K4R9o5J92k35J19
4349F5N2r5j70L71k53K72j47l12M22k51rK95j11r5j0J50l78L62k71j8L36p7k79
4372a51J98K60n44K07j4j6m1J32j69M5K21p3n9j59K52l05J19J44k01J31J02j22
4394d3K70j82M1j57K01k75J28k2j53K53J62l03K42j4j68o0K56k95L97L5l40k4
4416e1J63j7m89L19N6j92K20q4L3p7j9N4q2K04r3J33j46J75p1N2j34R9P4j63J27
4441I1j17J43l20L56j49j73P1J45k86M95j44m00M57M5l40L07l2j94L56l68R2K93
4463C28k6n15N0J94M2j50r4k9N3K33j15q8J11j86K09K55l08j87L83n5k80K0M8
$$ y = [-69, -84, 29, -147, -109, 30, 105, -118, 93, 141, -106, 185, 144, 83, -216, 186, -10, 7, 52, 160, 111, 103, 133, 251, 77, 3, -3, 66, 59, 3, 42, 164, -269, -59, 61, -136, 19, 113, -199, -114, 275, -86, -110, -69, -45, 54, -11, 181, -54, 65, 117, 22, -148, 223, -30, 242, 95, -217, 205, -46, -55, 240, 129, 34, 24, 174, -204, 158, -113, -131, 205, 128, -151, 47, 307, -237, -30, -44, -60, -101, 31, -138, -93, 128, 55, -4, -163, 89, -216, -97, 47, -154, -23, 79, -43, 227, 45, 86, -71, 130, -145, -17, -39, -192, 61, 223, -80, 162, 148, -20, -80, 176, -119, 278, 313, -27, -51, 112, 95, -394, -75, -19, -211, 9, -75, -42, -119, -138, -84, -166, 38, -55, 78, -68, 107, 36, 88, -46, 53, 127, -36, 91, -26, 117, -203, 153, 4, -169, -98, 47, -239, 256, 112, -288, 169, 214, -126, 181, 149, -45, 311, -57, 35, 328, 302, -213, -163, 31, 73, -77, -171, -200, -147, 86, -29, -117, -6, -192, 17, 272, -36, -223, 160, 105, -175, -155, -107]
4486a07J7R4KM3j04K01l35L48J18k00Q4K6k61L99j72k11j36M49l74j00J28O4K04
4509A77j7k94j29N74j22k76M2rJ5R4k25K03K55q9m43L2Q0r4L34j39k2M1R7k75
4533a90M7K87k70K22M6k50j55K60K7J13M5j06j53m6K87j21j87m2J60K74j77j42
4555g1lO7p3P4J03k23q8L87k24o0Q7k11J25p1K06K38j9m08J13R6j03k61M98k70
4579i1l5Q0L57m01K35k18J90j64M05n78O1J53k30J67K82l02K25j04m9J96K06k23
4601A62k70L32j80j45J22j69Q9M5J8L6L9O5n21L75mk51K75P1j59l8j16K35J43
4624A54j97j17L51j52q4J80J6k68J23J87k81L6K55q4j86J80Pm5K3k02NJ48K19
4647B68m07K79j37k21J79J00j22j2J99p3P6j9j69K20P2k68j58K37l9L0p6j12J98
$$ y = [-107, -90, 4, 6, 49, -55, 146, -189, 159, 277, 77, 161, 187, -74, 325, 153, -58, -194, 255, -119, -219, -91, -27, 177, 160, -134, -263, 311, 189, -87, -45, -54, -39, 55, -170, 33, 288, 199, -244, -212, -132, -226, 108, -31, -53, -12, 85, -190, -143, 144, -126, 96, 142, -108, -263, -3, 24, 137, 182, 76, -77, -123, 164, 43, -144, -186, -26, 248, 71, -71, -74, -7, -80, -6, 97, -126, -214, 173, -51, -111, -24, -235, -110, -181, 25, 263, 244, -164, -51, 45, -58, -319, 179, -91, -126, -46, 311, -90, 145, -73, 117, -47, 358, -220, -159, -6, -236, -69, 213, -89, 136, 32, -17, 179, 385, 162, -108, 224, 44, -101, 21, -148, -59, -14, 4, 40, 79, 144, -377, -2, -6, -257, 18, 89, -70, -108, -224, 11, 154, -43, -160, 191, 39, -45, 135, 151, -117, 6, 193, -88, -52, 203, 119, -67, 113, 120, 75, 98, -104, -99, 49, 268, -139, 140, 3, -218, -39, 61, -61, -73, 126, 53, 129, 110, -59, 161, 233, -35, -193, 44, 5, 35, -41, -153, 45]
4670D5P7m2k51K72Q2k08O2k46K1L2j26j01L60m1q8P1L5j20PL74k09j73L95j80
4694D8n0L93k21m99K40p8M0J67m38K21K45J54m56K69J50l26K66j64J6n0P3l49
4716c49M29Q6l22K16j43R4L1Q0k14L13J2k59K85k97j20J98K78l24J7K20l64J56
4738B3K2l4j10M44k47k99P4J10J83K7l25K33j98K59j59mJ65m43L12k74N32j72
4760A19k01j49J55N43n37J9qQ6n6R4K2l37M39r7j62M9J42j88k0J25k45K71L3j88
4784i1L45m37K78j63j30M51m59J44k0J1J71j06k7O5j92K13J7j26J83o3kj66k00
4807c04L07j22j59L84l31l1L97l70J26N4K10j06n8Rj96L70p7j45J58j91K10k65
4829a30L26j69J53J38m96J89K23n52K58J1P3L0j2%Q6O8k23k4K1j73J93o6J10j4
$$ y = [45, 122, 80, -171, 101, 183, -25, 37, -209, -188, -156, -282, -383, -23, -64, -152, -81, -46, -166, -159, 215, 6, -167, 228, 48, -2, 391, 170, -329, -89, -167, -127, 40, -398, -177, 68, 222, -234, 35, 185, -141, 125, -39, -23, -73, 0, -349, 80, 166, -156, 60, -83, 11, 42, 122, -92, 221, 233, -26, 259, -38, -158, 40, 318, -6, 11, 231, -133, 23, 45, 11, -99, 345, 98, -201, -127, -17, 166, 193, -132, 101, -97, 162, 3, -1, 164, -279, 33, -241, 291, 119, -82, -231, -76, 467, -70, -51, -59, 27, -29, 65, 87, -250, 189, 92, -70, -21, 121, -67, -87, 38, -207, 64, 97, -91, 254, -183, 95, -68, -198, 253, -206, -62, -82, -71, 100, -6, -33, 32, -160, 53, 70, -56, 127, 64, 62, -104, -304, 3, -119, -278, 106, -225, -256, 141, -229, -103, -49, 161, 55, -3, 6, -190, 180, 103, -42, 116, -75, 135, -130, 196, 27, 180, 318, -178, 11, 234, -318, -60, -49, 24, 54, 42, 42, 128, 196, -27, -51, -30, -203, -10, -76, 34, 20]
4853B0j7k76K37m0P4J06l6K26l85K38o1l08L95l7m22L07K0j74O2M1k06L42j16
4876a0m5J25M8k78O6n8K5oQ6n4m7L02k00K9K00o9J4j8j17Oj30J20j92L24k16j19
4902b14K15Q6l59L04K1k10M10j46j01J30l67M44j66rl8k65L93j64j98K73K0o2
4924cJ74j63j49J30L2k20L76K0j06k45n4J98O3k6k1p6Q4j78J81Q7k63K10j89J00
4948c8j35O7L17l30KK65j16J8r0J23n1K52k04q1M0k36J70j04R0J15oj95K74M6
4972A93l14K14j12j06J07M4m3J26R8j58L6M8O1l16L93J19n69O5L81k15J30l7m6
4995I9Q3j63o9P6l4j60J99K60k81j90J04N3N4P5j23j01K13p6j25N8p6P7J50k57
5019a54K02K9J1J3qk80J54k35K40J5J32M1j90n7OJ7PR1j68p1K55j25P7j17R9j18
$$ y = [20, 3, -273, -36, -76, -2, 104, 68, 294, -91, 147, 86, -222, 173, 136, -286, 21, 41, -133, -71, -30, -236, 106, -10, -55, 70, 118, -160, -94, -152, -127, -133, -47, -101, -148, 154, -46, -17, 183, 114, 128, 110, -7, -1, -131, -11, -203, 121, -95, -214, 1, 87, -272, 32, 53, -157, 253, 107, 6, 136, -231, 213, 47, 38, 0, -265, 128, -36, -234, 39, 59, -3, 171, 8, -141, -11, 21, -199, 177, 197, 91, -154, -208, -10, 53, 27, 6, -70, 14, -164, 17, 104, -159, 51, -138, -38, -173, -106, 211, -119, -117, 148, 32, 50, -40, 83, 32, 284, 80, -1, 39, -197, -27, -131, -41, 74, 68, -127, 147, 193, -121, 93, -19, -125, -18, 26, -17, 109, 207, 49, 85, 133, 194, -122, 271, 390, -179, -114, 267, 52, 182, 145, 99, 182, 19, -50, 26, -8, -168, 31, 291, 10, -180, -76, -23, 31, 106, -17, -118, 95, 19, -106, -48, -124, -47, 103, -154, 48, 77, 88, 101, 93, -187, -33, -268, -28, -13, 119, 160, -30, -87, -81, -64, -57, 34, -134, -205, 50, -75, 2, -115, -16, -134]
5045a34L66j81j69J22L4k98M30j09l53J89j33L26k46L66j69k24K83j74L24k00
5065E0n9N0L0n7R0qJ8n5q1P8j49R1j23mJ69J14k55M03kl18L20m11q4J43j30l1
5091b11M60j66q7nN2j72j24L65j69j02L16j57j82K70nj30J9l08M81pj72jj04K20
5115H1jl32L32k15R4J39L1j24K30p0k48J92k55Q2K18m22J58J65N0j47J63M7k05
5138c7J34k03O8K06rl49N29K6m74p5L73l07J14J27j73Q0J34l39K36j15Mq3L80
5161B47n40K84%J85j27M5R2k19Q1k9k56J46J71k17J87j30nJ33j36K76j04Q1q4
5184H1j36M63m10J30R8o69L76N1N4Q8L0l0l39J55q8K73J22m28K31J22j07o2nk2
5208b2j34M30k46m48M21p8J81L4j88k17K67J36j92M2J34j28pP8K8k94J83J39J06
$$ y = [-134, 232, 51, -118, 4, 38, -260, 170, 61, -292, -103, -236, 90, -156, 210, 41, -183, 100, -74, 250, 50, -9, 41, 71, 14, 104, 96, 114, 59, -22, 56, -93, -2, -125, -129, 40, 154, -101, 302, 300, -18, 302, -109, -193, -50, -180, -211, 249, 83, -4, -9, 43, -129, -253, 112, -57, -159, 157, 0, -182, 88, 83, -47, -28, -336, 145, 138, -34, -35, -139, 81, 80, -252, 80, -135, -41, 98, 129, 5, 235, 165, -83, 109, -146, -64, 154, -268, -110, 55, 105, -42, 121, 168, -37, 97, -106, -38, 168, 159, -190, 339, 365, -109, -184, 189, -118, -4, 123, -50, 30, 164, -175, 61, -54, -50, -133, 247, -293, -9, -9, 176, 49, 94, 186, -33, 48, 19, -237, -91, 80, -137, 50, -80, -85, 48, -88, 188, 84, 165, 81, -55, 408, -2, 128, 226, -443, -67, -16, 38, 126, 156, 126, -213, -58, -146, 127, 249, -179, 52, 174, 67, 5, 0, -22, -156, 274, 28, -420, 1, -77, 104, 138, -50, -267, 0, 136, -56, -14, 120, -8, -15, 63, 91, -203, -20, 119, 225]
5231B25k40j44j00K27K9k08K09J94l44K73j73l1Q9k77J80J32k34R4O4L2j04j0
5253a17n9L54l46J01Kj26M1J84q2K20j28j14J88Q3k71j41K58q3r9r0J25j13L95
5276A82n4m7j43m2j08M37l63J91M0k36P7j4J98J17o5k80k3L7K62R1j40l2j97q2
5300a94K24j6L14k23j76K35j08k34K69K4J0j52N6J42m3J00l20K26m3k28J95r6
5322c8j96L74l2n2l90L99p5j7QP2l1j28j17j4j14K41J3K71J13m50R2R1K70j99
5346I1Pk25J22M2j56R2J71k37m4L04m99L32o5J61J39j16l06L25q9p1J09M4j73
5369d2J68l94L31j26m9N5Nj60L64l13J24J10j61K02l5l53J84J32j35K52k80J21
5391@n1J93k93K64j9K11m37M6J87l7K01k93P1n2L19m50K54K13j85Q1l8qj35j02
$$ y = [225, -15, -159, -259, -32, -3, -211, -2, 192, -152, 121, -52, -83, 6, -271, -91, 41, -193, -99, -35, -3, -107, -117, -176, 178, -168, -67, -65, -191, -150, 34, -48, 172, 44, -70, 118, 201, -70, -211, 47, -36, -135, -225, -100, -213, 182, 128, 81, -62, -104, -212, 225, -138, 53, 93, -143, -66, -80, 118, 235, 170, -110, -133, -96, 166, 257, 117, 85, -112, -194, 30, 14, 328, 105, -71, 164, 56, -178, 91, 115, 125, -27, 29, 171, 128, 228, -92, 134, 91, -137, 58, -38, -234, 140, 108, 56, -334, 65, -10, -27, -19, 53, 22, -106, -223, -237, -351, -110, -97, 174, 287, -163, -71, 20, 290, 91, 98, -127, -5, 37, -119, -27, 144, -93, -137, 167, -332, 0, -65, 96, 235, 119, -187, 138, 49, -22, 87, 131, -42, 126, -268, 63, -63, -112, -57, -52, -212, 152, -161, -37, 73, -88, 114, 79, -274, -90, 42, -93, 159, -121, 0, -51, 142, -151, 113, 94, 305, -132, -86, 101, 64, 265, -28, 43, -9, 310, -140, 114, 327, 142, 223, 185, 177, 42, -60]
5415f0kP2K5r9mJ84l22J76j22J3j02L89K34o46K00J51q9O4L09m27o0R8J96k00
5439b2N8j43J37J80k65l32L05M8J54j78J24j94K17m2j62J26R0l82J25L57l77O8
5461a08N5j43K90J22k73j83Q5J6N1j69L98j63J34k69K57r6k10M55Q0j50l24J25
5483b0J01o3k3M3j35K92m81J55J46R6j64K41J5j78p9N8P0j80J22j34K1j8N57n46
5507a04J98n6k04K61j34j00L03n39N9N39l59K35m40N44l20j25K82k04K47Kk00
5528a15J59j7n1j49Q4J29m9j18N1kR1P8k5j27J41j03J08k0p7R3N6j97m2J23N8
5553G9k38L53k12J24o7k62J48NP9k9K4j53J87JK97m85L6K44m54O5M05l04K74R1
5577B08l16J14N8l50K80J05l96M07J70k56J11J49k94m8K54l07r7J25j33L12N2
$$ y = [-60, -62, 10, 35, -64, -68, 116, -206, -30, -152, -139, -241, 148, 382, -264, -64, 87, -2, 62, 371, -56, -116, -18, 178, -22, 36, -107, 30, 210, -55, -387, -82, -34, 120, -58, 66, -128, 89, 47, -115, 11, 101, -281, -156, 201, -176, -108, -53, -196, 94, 216, -57, -240, -155, -139, -88, -257, 141, -22, 112, -157, 100, 4, -206, 249, 329, 179, -145, -20, 81, 18, -5, 38, -97, 195, -286, -131, 15, 111, -53, 188, 203, 25, -54, 4, 74, -106, 16, -118, -97, -115, 442, -104, 94, 38, -166, 95, -39, -139, 164, -375, -316, 223, -136, 99, -341, 203, -117, -242, 40, -164, 83, 85, -115, 44, 27, -24, -173, -89, 40, -9, -127, -76, -78, 13, 91, 66, -61, 80, -23, 85, 65, -12, 81, 137, -60, -102, 21, 79, -159, 194, -18, 106, 39, -223, -75, -70, 9, -20, 4, -149, 38, 39, 336, -149, -113, 131, -323, -258, 147, -157, 117, 208, -108, 6, 64, -286, -6, 99, -297, 110, 280, 24, 135, 284, -10, -58, 196, -111, -208, -83, -216, 96, 148]
5598A48p2j3K48n20O7P6j5J36j21J05m1l2K68k86j5n7qN5j19K16O2o4q7J88M6
5623A65l99L44K63k62k79N08m22J07O3j43k35J72K07j74L86l76J02L3Mk55K53
5644F2j04J89k18O3j61P6R2j06m7R8j14Np5L61M1j94L3J32qj20P5j69K15j60k32
5669b66J58J8j99L41k07J65K35k69r1K29k88K46j82J84J63l16K99l32k8M14l75
5690a01q6M1P7J90N9k12j44J44L10k34k50L53k30J94k9ll9j98K46n8p2K1L1J8
5714B8J05j02J20k5K73l94n6kJ28j51m1L41j51J28K9j60j74K18j93J59l74L33
5736C9j98L31k06Q0n0J56l87Q0KL95l13K29l16J64j38j0J10O2n2M6Ro7J10l2k07
5761a63k2K39q0J64J39n04K13O8k7M8N8Ml46J59J83o8k57K29k16P1K08j52K14
$$ y = [148, 76, 63, 311, -209, -142, -66, -81, 55, -66, 39, -2, -34, 234, -52, -67, -124, -132, -77, -196, 20, 82, 18, -69, 119, 165, -234, 110, 373, 111, -168, 340, -82, 25, 88, -55, -290, -118, 89, -85, 301, -75, 27, 60, 64, -191, 62, -42, 147, -71, -8, -169, -93, -1, -107, -154, -56, -170, -165, -240, 121, 162, -32, 1, 133, 125, 5, 80, -89, 126, -34, -266, -108, -90, -289, 52, -155, 10, 245, -24, -115, 114, -174, 72, -110, 74, 237, -79, 220, -112, -140, 274, -101, -187, -146, -69, 121, 180, -32, -176, -32, 278, 44, -206, 147, -83, 111, 82, 79, 40, -158, 88, 30, -42, -21, 10, 28, 133, 31, 151, 126, 399, 5, -51, -53, 75, -76, -117, 224, 73, 201, 230, 70, -104, 114, -79, 80, -294, 39, -159, 172, -34, 46, -4, 152, -235, -155, -153, 242, -71, 158, -158, 6, -132, -142, -32, 30, -22, 24, 33, -34, 76, 44, -163, -185, 54, -26, 138, 277, -227, -14, 54, 27, 75, 133, 137, -209, -50, 133, 65, -192, 37, -179, -108, 100, -52, 162]
5784A62l43q6L72j03j97M70j04j57j63M0q3J58j18m8j2L68l15K56j00M4j40N3
5806d6q5j2K05l62N01j51k14J55q1J03j55M14l87K30k54O8j6L49l64j60J85K55
5828A78j28R3j03K1J2p2R0r6j72Q1L45l30J09P3r2j03L5qP8j33j2P9p0L57k75
5853d3r3K37Q0l62MMJ38P6K1O4N5k10J64l79N26m53o9K91L6m1k8J16k36M0J71
5878A09NJ2k13Q8L08j85k25j35L13l11L32K98n36j02L71l18O5K80l04L85m19J0
5900a72J42J97l32L30K8j97K43j79Q8k59J86k17J86o6J67l15J54j96j04L82K5
5921I1Q7p0k21K57p3L5Lk28J82j18j9J30J49l37J67k9o8Q4K00l71o8L43n1L0q0
5946B5n2K75k19k46L77j91K77K5j21k58J57j38P8K58l01p8R7J0J57j0j9q2j10
$$ y = [162, -181, -267, 105, 2, -195, 275, 171, 14, -149, -109, -192, -34, -152, -200, -212, 156, -159, 97, -3, 41, -99, -46, -131, -143, 62, -300, 201, 50, -164, -9, -90, 13, -142, 272, -115, 115, -139, -71, -87, 262, -102, -262, -77, 178, 50, 143, 40, 61, 73, 1, 91, -5, -177, -96, 249, -81, 28, 101, 9, -94, -59, -67, 11, -122, -134, -55, -125, 232, -43, -136, 101, 181, -181, -177, -173, -35, 41, 62, 126, 181, -29, 135, -244, 282, -171, -240, 51, 87, 46, 18, 134, -102, -62, 109, 114, 126, -87, 1, 309, 124, -101, -236, 77, -234, 98, 396, -140, -242, 129, -189, -124, 156, -148, 237, -182, -172, -30, 167, -165, 165, 193, -4, 239, 60, 148, -111, 75, -142, 44, -22, 145, -170, -16, -212, -316, 66, 91, 178, 108, -113, 144, 71, 106, 109, -119, 63, -55, -74, 56, 205, -132, 35, 6, -62, 22, 222, -149, -217, 126, 75, 105, 25, -27, 248, 29, -217, 160, -31, 246, 271, 150, -108, 49, -89, -11, 247, -54, -132, -35, -25, 132, 122, 103, 21, -89]
5969h9J41O7l4j54J96k21M8J82k60J83P5J07k57K09k87k08N29k96P2o9j5J52N1
5992A22J54m98K33J54L8n9l17J19J28j55K07k20p5J81J34j57L13l05J17r8Q2l82
6014b84L90j57N3K4j08J91k44O2J94J55p1l61Q1K02k27N2K1m0J37o5Q8p3k97J14
6038a63L35l3J7J66l11L8r4K40j51k99L53L8l91K01J49k25J5J12j97K45j15L8
6060c2j24K08l24K60Jo3J30k2J1j42l6M5K28k71J74K1K19k09j43Qn1J5q7P2P7
6085c5R8o4J55j59M0J30l29K25K09j15k49J87n2l64J38J15J19k38L62J53k68J13
6107A71j75lJ09j17J35j87J31j48kj90J76L87l09J53n8Oj03q6j85L45j48R1J13
6130A06j77M87l43p2R9j48M00k38k99J33L13k84n8p5K11o5j0m7Q0N2L07n20L66
$$ y = [-89, 52, 119, 85, -69, 127, -94, -46, 136, -124, 59, 134, 241, -16, 193, -94, -302, 227, -69, 3, -66, -81, 71, 122, 276, -222, 11, 165, 203, 144, -173, -54, 74, -81, 126, -94, -169, 12, 146, -11, 302, -3, 114, 16, 98, -284, 106, -51, 2, 26, -82, 109, -135, -73, 121, 276, 205, -156, -75, 127, -100, -48, -27, -67, 70, 5, 93, 20, -277, -163, 172, 139, 156, 322, 11, 49, -45, 195, 44, -255, 98, 136, -255, -54, 95, -130, -115, -3, -200, 45, -70, -32, -156, 52, -272, -12, -11, -74, 56, 34, 45, -97, -133, -88, 140, -131, 43, 64, 283, 74, -69, -61, -112, -97, -184, -112, -35, 63, -1, 154, -5, 35, 165, -164, 61, 270, 155, -94, 93, 41, -323, -185, -70, 49, -189, 173, 326, 58, 171, -4, -7, 102, -15, 120, -67, 64, -84, -86, -276, -100, 287, -22, 131, 73, 79, -24, -110, -295, 50, -98, -7, 106, -71, 416, 73, 1, 100, -48, 352, 114, -185, -52, 261, -23, -81, -156, 55, -10, -20, -67, 13, 65, 372, -148, 218]
6153B18m9m12M01k50Kj85L12Pqq3l01M23j25Q0J72j96m1o9K12l51J67j08L48k35
6177g1P8j41p1K39lj58L63m2k85J03J14r0k68K63K07k05m7N6P0r6J32j16J25j10
6201D7k74Q5K20J2l61N41l59J78q4K4M9j63Q6m5j32K07OJ67j55j43J07o2Q9L8
6225G8o9k18J77J79j14j54K7L46m25r8J78J86%j28K88j99k55K21p6J02k97L82
6247A31L1j2j6k58K02o6k75K66l9J9J89r3p6j74L62p1L7p3J34j49J3j65RL51k50
6272B7l8K3J47n3k00q0K10j31J83M4j69J05k18K18j04j52J23L8K1K9oj36K18k78
6296a79J95j7j5k15M34j28r3p4l3J73k16K65j30k7P5k59K13M6nJ34r4J89l93J89
6320C5k4k4L23l60J06j31K46j28j12M1p0j38J56N0k9K02l27PL03Rl25L95j41O9
$$ y = [218, 169, -243, 158, -92, -90, -275, 37, 44, 36, -47, -348, 75, -50, 30, 202, 6, -35, -104, 108, -243, -76, -184, 164, -71, 7, -134, -205, 34, 31, -127, 236, 194, -91, 12, 126, 36, -232, 31, 238, 33, -14, 42, 112, 16, 148, 32, 157, 47, -227, -142, 78, 90, -271, 270, -89, 89, 5, 29, 78, -85, 1, -44, -176, 31, 37, 204, 49, -94, 13, -49, 40, 78, 9, -209, -32, 147, 33, -121, -94, 252, -173, -271, -93, 93, 93, -35, 253, 54, -201, 20, -56, 46, -251, 131, 162, 150, 134, -124, 78, 12, -263, 3, -36, -17, 172, 79, 3, -171, 191, 120, 157, 84, 218, 69, 82, -83, -74, 277, 27, -11, 12, 159, 106, -94, -174, 36, -95, 88, 132, -37, 68, -150, 68, -36, -188, -65, -27, -6, 23, 17, -119, 99, -179, 16, -1, -16, -231, 203, 75, -18, -92, -125, 48, -168, 97, -33, -60, 15, -244, -31, 15, 10, 144, 50, 239, -154, 35, 11, -13, 310, -50, 56, -75, 171, 43, -69, -28, -98, -236, -80, -30, -59, 143, -184, -177, 126, 135, -190, 205, 64, 133]
6344A33j80J31Q7l33L05l16J20j22J82J44k48K27J69j79j55P4M2k44J34jJ53j60
6366c7k5q7J87N1kp8r8n1J71k36K83j10L8j78K01j99J00N0j74m8J00L78k08n6
6390b8K38j0m51K37L23j36K7j57N1j26j64K11k29L02j23J2P4J39l19M33n10J14
6412i2M1O8Q5r6J55j23r3Q6k22j96L22Q9k61J25K51l19o8M17l05K6K65Nj55J69
6436A74p9j6j25k35K71j54k1L07r6O3RJ29l44L89l57K16k10k6K8O9j05L31k64
6459d6N7p3L3j5O7j71N5J43j66K6M6L08l89K26k70K33J46k43K3m9Q3o8P8l7N4
6484E1L0l5j26Q8j07K5j21L42m77L58N9k7J22N5k40J4j36MKJ53QJ4K01n05N0K16
6510A8k36J52j79M52k60J36j2Pk22J71l08M2L5P4M08l36J25j46J15k79J42K51
$$ y = [133, -47, 84, 171, -162, 143, -173, -53, -175, 7, 151, -97, 130, 299, 120, -35, 39, 81, -163, -29, -30, 123, -37, -62, -149, 38, 89, 87, 9, -89, -140, 31, -205, 78, -32, 6, -172, 29, -170, -70, -20, -194, -242, -142, 236, 28, -28, 210, 200, -251, -14, 309, 173, 200, 43, 94, -32, -196, 15, -214, 88, -35, -23, 51, 190, -129, 304, -206, -92, -51, 17, 102, 6, 161, 38, -55, 31, -191, -387, -65, 24, -237, -112, 139, -180, -248, 169, -136, -110, 155, 160, 5, 174, 95, 79, -46, -281, -10, -164, -185, 122, 26, 89, 98, 227, -117, 272, -85, 131, -79, -105, -77, -8, -113, 218, -46, 11, -62, -29, -44, 23, -148, -93, 50, -116, -90, -44, 264, -125, 101, -169, 64, 210, -33, -10, -59, 24, -44, 34, -3, 51, 81, 46, -80, 8, -99, -74, -195, 147, -330, 28, 87, 60, 182, 237, -3, 11, -125, -121, -119, 34, 42, 56, 257, -248, -198, 18, -218, -66, -245, 207, -53, 83, 71, 78, -144, 27, -281, -239, -204, -130, 278, -58, 67, -79, 36, -243, -101, 150]
6532A50m3k45l09L94K75k0j78O6k14M50k31j11q5j8J4J26j39K33j74l2J94o2o5
6555b4k1Q7J56j98K20j57J12k21J37j96K43j79j92M39l62J84k11K50k0M6j81N
6577h3J44m9o2q2J06R4L9J18l01J84l12J10J27j35l0K55j37m4%R2M3r7Q2l12K50
6602@m0j9R9j14p8J84J40Rk92R8qq8K03p1J46k16j2j3N5K66j22m47nK71j67K02
6628a9k14R9J30j73K02m3m5J93jj16k26K15K12m42J85j13K55J8k8q7J65j59R2
6651A00K7j03R3j00j38J3n2K23j84J13K3j32K4j11k3K02J40k06J50K4N8j55O4
6674E0j08pK8l7K04K9k44m9K72j31K16k59Qm2M26k24m98L79k06n6J93L2p7k8J91
6699F2q6j10M1K47l55K33j40N3K07k40M7N2J5k9k29L51K5J3l29J98k98J32J62
$$ y = [150, 107, -138, -447, -53, 222, 202, 24, 90, -124, 326, 95, -16, -101, -119, -105, 21, -118, 115, -59, -91, 103, 41, -24, -45, 42, 198, 0, 220, 63, 175, -46, 91, -105, 138, -41, -233, 206, -156, 28, -183, 67, 47, 93, -88, -83, 61, 12, -50, -132, -26, 68, 107, 225, -76, 108, -204, -94, 33, -102, -132, 123, -14, -58, -58, 34, 77, -20, 62, -250, 0, -40, -59, 40, -74, -152, 32, 172, 181, -111, -13, -21, -109, 94, 23, 169, -47, -59, -72, -17, 249, 127, -320, -325, -54, -221, -19, -233, -134, -4, -177, 25, -18, -63, 130, 129, 13, -213, 2, 214, -228, -43, -156, 99, 117, 89, 2, 167, 8, 100, 127, 24, 117, 17, -121, -108, -160, 63, -121, -8, 15, -117, -93, -204, -227, -25, 115, -91, 59, 83, 141, -14, 50, -58, -65, -37, -74, 130, 159, -85, -134, 138, 7, 223, -36, -28, -70, 356, 132, -366, 13, -193, -249, -56, -24, -101, -129, 62, -24, -134, -93, 154, -201, 32, -108, -55, 152, -88, -41, 11, 26, -3, -232, 119, 144, 157, -172, 26, -272, -140, 22]
6722B2R1p2on7M5K56l58m4N8O4o5J11k49K37n0M6L2L0k82L38j45mJ39j28j3J85
6748A81n7M9j72K98n63L12J01l53J52J66j1jl6O4k08p9K26J41l54o5J79j07J82
6771D5j0r4j3l7J75J83k47K88m58J48j32J69j26P6J46j14J8j55J10p7K93p8j99
6794h9K33l06L48l35Q2j29K42K18j98j48j12L43k49J80J39l26J1L09k52J01P7
6815A39L0k55K80l13M1Ro3J88P9r3j82J26q2kN2oM7j08j1R7j3J69j54L2l1M6P3
6842I5j19J03K3q2O5k10J79J41J42n01J4N11o82K40m6J36o9K90j19j55N3J6N3
6865G8K46k87l2R4L5o3j18j33R7L19q6k19j35K05l16K80J06n1j70M33k31Or2j29
6889a63j13K77l29J79K07j90K37m9J7l00K31m3P4k6j4J36o9k22J24j79k2K25P2
$$ y = [22, 113, 41, 35, -22, 23, 279, -79, -123, -65, -1, -66, 45, -204, 33, -17, 29, 61, 91, -191, 147, 2, -2, 137, 9, -4, 181, 124, 173, 1, 299, -264, 48, 149, -204, -52, 114, 103, 102, 66, 130, -78, -157, 69, 210, -144, -209, -30, -137, 45, 35, -59, -72, -109, 66, 249, 2, 290, -168, -20, -152, 17, -109, -33, 113, -1, 17, -138, -28, -105, 188, 110, -89, 144, -162, 186, -149, -67, -196, 46, 264, 66, -82, -194, 149, -100, 80, 219, -107, -96, 213, -39, 62, 139, 169, -86, 194, -119, -78, -69, -132, 56, 135, 42, -140, -14, -96, -98, -46, -52, -5, -113, -124, -27, -40, 129, -25, 7, -24, 22, 95, -24, 79, 102, 20, 85, -125, 54, 195, 337, -164, -150, 361, -321, -81, -127, 9, -60, 230, 111, -44, 9, 25, 78, 324, 37, 5, 99, 134, 71, -47, -180, -83, 236, 150, -69, -204, 1, -315, -35, 71, 20, -150, 283, 52, 58, -34, -163, -276, 1, -328, -149, 58, -132, 105, 56, 73, -227, 4, -39, 35, 9, -5, 131, 62, -160, -36, -215, -237, -12, 60]
6912F0J34k53J20N1K7N5j63M5m3p5L21m31rK80k97K28K38n94J69J36N7k0P6j04
6936Hk30K30J3K5O5j94j03J5J53J55n06M95j63J07j22j70J54J58j77j66K31r3
6958a15L0j8J43j1N1k62L76j41J2r7%R8l06L04n0k14J23N2k20L96M1k04P1p3k20
6983b34M16q3j38m8KJ31m2k7j37J63K55l24PJ22j96k13L44k16J35k26L50nM2j43
7007f5P8K78k16nl7r9J25q2j58K84r8m5R9L4j53K1J01k15K28qo5j26j1L6J85j16
7033c0K09k73J64j05j77J71K6L01rm18K7J70p3q9Q2o0R7m1m6J55k63J98J02n8
7057F0p2n3M7j07J08R0J05J14l19P6NJ38j24lk97K90j63K76k17m5R9j44J9M6M
7082f7k11J57J13k00M03k69L65k95R1l9j54l0k51M44L6n2n5K19k26j49Pk1L55
$$ y = [60, 194, -59, 61, 112, 139, 194, 31, 76, 33, -42, 279, -152, -161, 119, -178, 50, 288, -306, -137, -1, 56, 36, 112, 8, -222, 8, 21, 46, 111, -83, -186, -171, -18, 137, -369, 126, -37, 70, -52, -222, -68, 90, -87, -253, -22, -115, -85, -103, 40, 29, 80, -182, 194, 53, 65, -32, -32, 66, -240, 64, 14, -200, -77, -25, -245, 151, 192, -12, 59, -14, -234, 182, 99, -39, -87, -85, 46, 4, -23, -160, 3, 258, -66, -59, 63, -133, -346, -2, -218, -83, -309, 41, 36, 78, -65, 13, 291, 75, 70, 33, -66, 59, -23, -181, 103, 5, -40, 59, 93, -60, -39, 62, -153, 75, 67, 2, -124, -135, -99, 86, -30, 179, -94, 70, -35, -212, -41, -15, 286, 277, -141, -114, 56, -17, -106, -24, -84, 13, -28, -74, 81, -182, 16, 118, 60, -12, -65, -18, -125, -17, 73, 178, 292, -27, 49, 54, 192, 68, 65, -232, 58, -105, 171, -46, -91, 8, -136, -117, -71, -67, -278, -121, -8, -208, 195, -74, 291, -4, 87, 48, -106, -136, -387, 57, 93, 41, -14, 205, -21, -170, -163, -184, 171]
7105A71j56l01J92J12o1j85K18k56K51J12j21J98j91j08L66k46Q7Q4J19j05k48
7126f8j6j14K68K3q2j01J51j43r5M09k61j47L69k71k5K69j41J96j32k57J62j13
7148a19K88k76O9K64k77Mk8J23J20q5k03L14o28J92J51J22k07L62K76m95l6J60
7170I1k06P0j2j09J01J53k31L1J11lj61J14n6J32l3L9j35q1L22m03L95L7k99J05
7194b8K9r0K19m18L84l44K70J08j59q1K75k51L1K29r0L9O4q1j22OJ0p4R9j5l4
7219b4J03J22m57K43M0n3K69j81J9j82L1J82Nj71RK59j01r9N0n2j40o6N50n31
7243a75J71J73k56K22j38jQ7o7o1k41M18k38J05k84N39k86P6p1o6K35j60j32J87
7266C7m50L13j95L22K34k75K39m17K50J34l72L08J05l67J17J04N1l38K22lj65
$$ y = [171, 15, -286, -94, 18, -43, -228, -10, -266, -15, 97, -24, 174, -17, -125, 241, -5, 82, 166, 285, 180, -68, -84, -198, 70, 93, 11, -90, 61, -82, -177, 232, -29, -176, 193, -78, -103, 166, 25, 221, 89, -168, -6, -119, 169, -107, -38, 226, -51, -47, -75, 48, 168, 83, -120, 194, -434, -242, -91, 31, -176, 186, 462, -33, -69, 91, -115, -45, -57, -166, -65, 88, -143, -112, -1, -4, -165, -51, -107, 25, -8, 31, -104, -185, 137, -266, 129, 166, -133, -28, 1, -89, 130, -288, 96, -248, 22, 130, -29, -110, 165, -86, -55, 174, 84, 123, 187, 106, -16, -10, 0, -74, 25, 10, -24, 79, 201, -256, -13, 27, -26, 243, 62, 81, -101, -70, 112, 117, -54, -45, 214, 113, 14, 64, 12, -128, -194, 356, -175, -4, 169, -87, 135, -3, -4, 83, 16, -45, -286, 132, -106, -1, -285, 254, -32, 44, -27, -93, 142, -18, -150, 37, -413, -100, -295, 27, 261, -14, 225, -192, 58, 192, -180, 128, 233, -134, -17, 87, 138, -200, 22, 19, -146]
7287a46LL66m56l1L39k27K13o5K16l31L10l38R0J58o9R4j05m0K70o10O03k22j96
7310a74K02k14J94J24K02n17J38L5j00M6J37l02L46l89L01j10P5K73k89J69q6
7331F1j15J71n8R9l38K01j6r9r3N4J60Np0j32J04M35m63J16K35m20J60L10k57
7354E0k0j58KJ63J4p2r6J15P6M2j66k6j67K37K76j42k46J3p2L09j45j4j35J95
7378C3Rj63K21k34n4n0L54k94K29j51m6P0k89L38J12j46N4J43k62J31qk32J97
7401c8j3M1Q3MJL8r7J52j65L4j61j11NM29Q8l09J15k2j66K21j87p4P3Jk36M36
7427A42k44j47l5K72J19k50J58J1r2N0p4j21L59l45J65L1o2J11l3k73K77j46L64
7450B37k16k3j93M19k50j27l8J97m2m4O0k72L07K11l06J67K8j7m0Jn5N8J48l4
$$ y = [-146, -143, 223, -233, -264, 75, -152, 61, -4, 212, -119, 191, -147, -57, 101, 32, 126, 21, -19, 251, -359, 244, 22, -174, 28, -186, 8, 132, 334, -183, -45, -10, -110, -64, 73, -229, 117, -272, 29, -81, -6, 267, -22, 147, 61, -54, 117, 59, 158, -180, 21, 5, -94, -187, -133, 27, 32, -38, -170, -66, 369, -94, 22, 257, -163, -3, 307, 50, 30, -128, -126, 37, 51, -21, -117, -2, 74, 116, -50, -76, -243, -6, 270, 128, -118, -105, -177, 132, -13, -27, -162, 33, 42, -121, 100, -134, -188, -238, 116, -178, 51, -100, -146, -76, -365, -27, 85, -61, -7, 136, -126, 5, -3, -235, -38, -51, -10, 73, 77, 78, 116, 19, 171, 6, 40, -121, -232, -227, 202, 290, -19, 96, 74, -92, 129, -58, -132, -59, -58, -294, 142, -102, -249, -284, -12, 107, -143, 15, 26, -66, -16, -90, -211, 148, -197, -32, -1, -63, 48, 15, -258, 19, -127, 237, 21, -2, -195, 224, -26, -153, -191, 6, -36, -80, -20, -292, 15, 226, -80, 87, 115, 98, 58, 59, 4, 62, 210, 176]
7474A76m14J67j1m2J3m4L6p5L71k80J61M9n8Q2k40J8o5K84k21J48k20J28M5M2
7498E0m9o5j26K50j85Oj18M7K91j22P2R8j42J70o9l01L36k88J70l5j51K72J06
7521B17l29J88K0j31m5k6K16p4J8j80J05p4J49l7j60M50r9l03Q4j03m9P6L0k9
7545h6OK25r7q7j0K46m04J70K40k63J84k0Oj39K14l82J22K7J47k6j00l1K41l7
7569A46j37q6J40jk02J47N8J73ok62M1L3r3j85J99J23Q1j86J53j76n9L05o4k00
7593e8L02j70P0m68K24J33J53j92n3J11Q3j6k00J27j74L43m7k80m9J87J08r2j09
7616f7J48n9kj02J10L95m57J55m9L1Q2k42Q4j66J42k11K76P0k18M3j69K63l46
7639b89M27k0m0J38p8j60J45P7k43J32RQ0j33O5l71J50p2J89o7O9J79k05k16J20
$$ y = [176, -238, -71, -82, -124, -111, -155, -119, -194, 177, -103, 58, 107, 49, 131, -109, -91, -156, 128, -93, 55, -165, -37, 8, 50, 1, -64, -190, 60, -125, -119, -237, -190, 101, -21, 51, 149, 7, 177, 108, -193, 143, -145, 25, -10, -161, 111, 217, -112, 76, 96, -35, -80, -106, 110, 36, 54, -126, -21, -95, 54, 17, -143, 307, 208, -95, -11, -114, -163, -87, -57, -86, -80, 145, 48, -39, -49, 197, -207, -37, 203, -60, 124, 104, 110, -29, 185, -197, -75, -48, 99, 73, -27, -58, 183, 146, 9, -77, 63, 62, -140, 7, 65, 238, 232, -30, 11, 44, -49, -234, -35, 88, 169, -17, 136, -40, -99, 206, 142, -58, 244, 74, 144, -324, -100, 33, 186, -6, -59, 52, 135, 119, -81, 46, -128, 215, 168, -112, -161, 26, 134, 42, -67, 81, 22, 20, -82, 28, 423, -34, 121, 72, 103, 185, -57, 27, -139, 3, -208, 68, 138, -80, -37, -206, 57, -289, 138, 118, 78, 216, 138, -22, 123, 200, -43, 89, 98, 178, 45, 110, -261, -111, -183, 6, -61, 8, 187, -18, -234, -114]
7663a14j0P7O3j22J41J37J39j92j16p9J95r9j51K36lk61L65l42K17K5j40J43k94
7686a85j66M80o8q7k5R9n4j80R1K21j93J60j37J89k40K31k97J11J04j75J50l16
7708b87M21k77R1K59m10K32LL2R9j85J50j80L5Lo4n3k10N06m84L63K3J23M4r7
7732A37k87QQ1M4J33k3J22j31j30p9J23r4K6l7K08L6j85M1J35j33J7J1r2r2K02
7757D1k17p6L01r7N9k70J89j01K27o8R6o5p7nk02J11J38L9O4o0J80l98L00j15
7781fk72K74K23j48j63J76j30M7n4Mk97K52q0Q5K31k00K12J65l24Pk26K12J14
7804A02q1r2p2K31p6j06J15j9K45j77j92K05J64k80j73J80Ok33L25k13J99p6M1
7827B3j13l9j9K74p5j61J69l66J65L38l16J90J86j00j11k08J25R2j55J33J62j2
$$ y = [-114, -124, -47, 16, -106, 35, 172, 311, 119, 3, -76, 119, 20, -131, 105, 102, -159, 206, -136, 81, 106, -34, 109, -185, -351, 129, 61, -26, -51, 48, -6, -186, -95, 126, -67, 93, -44, 145, -95, 136, -161, -50, 54, -121, 29, -287, 134, -143, -52, 207, -203, 29, 32, 64, 163, -22, 128, -52, -17, -14, -78, -131, -341, 165, -319, 44, 67, 190, 234, 137, -150, -142, -61, -17, 116, 93, 215, 84, -46, -125, -2, -96, -70, -107, 101, 137, -48, -7, 128, -5, 12, 23, -69, -161, 41, -176, -252, 49, -48, 11, -259, -70, -171, 56, -12, 84, 19, -58, -63, -265, -154, -16, 23, 87, 27, 207, -191, 109, -6, -278, -4, 219, 71, -92, 84, -46, 1, -53, -49, -346, -94, -174, -89, 142, -58, 154, 319, -5, 2, -224, -12, 102, 21, -71, -143, 88, 12, -94, 21, 2, 247, 70, -122, 83, 247, -33, -206, -26, -20, -253, 72, -141, 58, -18, 23, -90, -129, -148, 126, 51, -110, 59, -307, -142, 196, -120, 70, 256, 156, 45, -163, -38, 54, -101, 32, 194, 182]
7849A82j4j40q5J85k73O6j54J06J29P9l13M79k41j52J02R0q6R3Q6k25N6J88n5
7872A03m3J93m05N43k92j55q6J45j82J7J90%N0K1n0l25K26J29Np1p8J45j75J60
7896F5j72K81j34K5k87J07j40K67q8n4J83J70k35J64r7l67L27pM4l53J0K60k02
7919b33J57m8K40o2j37J03j31J87q2OM1l48J84J89m8L1J37n21M41Jj23K02j17
7942F9m74J12M97l91J72j71J44K9r4L5j47JL51l65K77l0%j59J17p1P5o8M7p4N41
7967D23l88j5M9M6o1J88l85K38O7k65K22k2j53j76J96J49r3j5J08L0J35l04q6
7990a12J7o4r9K95k15J18L81j91l06K4J37K47l43J42r9k55M48j04j17K50j22n3
8012b1J21k67K00j5o3K68l34L29k92L32k15m4K51j56k17J20l47K32J05M6N5J33
$$ y = [182, 168, 28, -57, 128, -145, -79, -233, -127, 2, 81, -232, 247, 6, -146, -44, 46, -40, 53, 139, -86, -30, 158, 103, 60, 253, -152, 391, 99, -56, -142, 3, -179, -162, 28, 28, 78, 99, 49, -276, -50, 79, 84, 13, -65, 80, -95, 65, -107, 174, 40, 65, -222, -115, -255, 12, -76, -130, 53, 223, -12, 152, 55, -312, 15, 8, 52, -301, -291, -31, -233, -76, -124, 116, 54, -83, 20, -111, 76, -6, 0, 41, -307, -123, 66, 18, 49, 186, -335, 106, 107, -16, 186, 69, -405, -293, 204, -187, -15, -186, -42, -13, -107, -72, -219, -218, 133, -232, 45, 15, 15, -144, -27, -98, -23, -91, -44, -118, 423, 35, 20, 69, 115, 54, 242, -143, 95, 162, -103, 119, 97, -56, -232, -36, 113, 20, 5, 113, 143, 278, -26, -112, -95, -159, -258, 37, -178, -60, 321, 130, -176, -152, -15, 232, -111, 31, -68, -323, 125, 21, -96, 154, 32, -21, 100, -167, 33, 18, -45, 223, -111, 218, -74, 258, 43, -1, 250, 94, -123, -3, -350, -118, -13, 33, 88, 221]
8034B21m56M95j87k41L91k54k5K51k01m8n9J6J28q7K52o2Q1k78q7J32k6K37l59
8057a66L17k93L32j21j98K44n37M40j04K82q6J9j78K42j01k12K38j38j4J89k73
8078a18J14k53M8M5Q7oJ52k42Q0jJ21J38j90k67L70j24j64K50m3k14L50N2k54
8101f9J78j69j0J07k51L72l7q9L5L0j05L4k30j6K60n9q7j29L98k12J13k86J73
8124d9QJ98l50L34l22N4L32l64j08K64L9q5m4J99J3j55Q7M9n8j39J39k07L22l88
8148b31K61m0n3m2K89j86M8k56Q5J90j11j6R1k17L76J12l13j6P1Q0q2J80l15J98
8172A03k44j28J35K28k49N1nR3K56l02R4k30Q4J81o5n7K92l94K58
$$ y = [221, -235, 260, 73, -168, 223, -31, -56, 195, -6, -54, -113, -97, 31, -56, 196, 134, 215, -63, -150, -18, -44, 193, -166, 151, -142, 190, 69, -129, 115, -422, 18, -86, 196, 110, 129, -49, 193, 92, -120, 118, -20, -34, 155, -118, -4, -257, -209, -164, -77, -83, 69, -173, -93, -94, 27, 165, -25, -292, 78, -46, -210, 40, -3, -217, 133, 185, -69, 109, -60, -70, 37, -214, 158, 121, 32, 67, 97, -8, 26, -204, -220, 40, -19, -106, -235, 163, -49, 64, -222, -49, -41, 157, -193, 141, -181, -127, 205, -159, -267, -3, 36, -49, -93, 106, 119, -36, 51, 100, 42, -97, 42, -165, 157, -231, 30, -10, -63, -105, 184, -2, 46, -210, -125, 65, -46, -62, 29, -188, 188, 300, -13, -29, 42, 122, 40, 220, -95, 103, -141, -269, -134, 94, -155, -104, -109, -16, 240, -62, 32, -198, -114, 67, 2, -55, 237, -157, 101]
8191A01
$$ Imaginary data points
##PAGE= N=2
##DATA TABLE= (X++(I..I)), XYDATA
0@%%%%%%%%%%%qJ6j6J6k4L2l2M0m8N6p2Q8j04J20j36J60j88K15k47K82l21L65
33A94m14M66n24N90o61P39q24R18j022J133j253J386j532J691j864K053k263K495
51A308k750L032l344L694m088M536n053N652o356P202q238R540j1235J3545j6883
66i438K2158l1777N4820k11142k13057L90981P4883o7266L5679l0278j02750N5093
78c2094L3970J00669J12250j58498j91293O6854o3843p9838K71064J96551j43333
89A12459m5698N445j30868o3258l0063m4598J75757J56655o5439N6941P7377k18532
101a3822j26594R5105l1151P340J75506R448r5356l5671j09059q862J65206m397
113B7693k9736J67975k4899k12698k954J6948o4841J27141J22201n7738R050k3301
$$ y = [0, 0, 0, 0, 0, 0, 0, 0, 0, 0, 0, 0, -8, 8, -8, 8, -16, 16, -16, 24, -24, 32, -40, 48, -56, 64, -72, 88, -100, 115, -132, 150, -171, 194, -220, 246, -278, 312, -349, 390, -434, 484, -538, 595, -658, 728, -804, 887, -977, 1076, -1187, 1308, -1442, 1590, -1754, 1940, -2148, 2388, -2665, 2987, -3369, 3833, -4405, 5135, -6100, 7445, -9438, 12720, -19057, 35763, -175379, -388436, 2545, 77428, 10162, 45841, 15563, -87187, -32094, 1876, 102545, 214795, 56297, -134996, -68142, -131985, -211823, 59241, 255792, 112459, 66761, 72206, -58662, -121920, -151983, -196581, -20824, 135831, 70392, 127333, 204710, -13822, -140416, -45311, -76462, -69122, 106384, 115832, 20476, -15195, -124254, -133116, 32090, 27693, -2043, 165932, 141033, -71665, -74619, -57671, -122512, 4629, 126830, 69092, 78142, 54841]
125E4841j51264R649N7169o5934J01402J49849j06578o5233O1885q6695n0182
136i1091Q1747k3765K9432J38297p2468j14579N1842o0038q1437J34193N8511
147E0644m7786R3730J2581j30834l759l055o0996R8525O0045q7842N8564N5252
159I5069j55443m4529P3147m0725N7020J46744m4961o6353K396j15703l9943J24767
171h514J6807K3875J33416o4629j58805J7011k1178o2994J05301O3790k8168Q1065
183I6977o24j34331O032J5635p7389Q4883J01292q0205M259N1424j19463n0135
195a01645P7715l104N3616J00571q8016p7608M4079p1979m1867J31025L2946j9412
207C6321Q1971n6568j42998K3162Q483l9627J05812N7119o0896M9403M197j38263
$$ y = [54841, -96423, -86774, -29605, -95539, 5863, 155712, 49134, -16099, 45786, -40909, -91091, -9344, -33109, -3677, 134620, 62152, -52427, -585, -60623, -142060, -7867, 50644, 2858, 96588, 109169, -21665, -25424, -28479, -89475, 9050, 69095, -18747, 39817, 95069, -60374, -104903, -31756, -72481, -15461, 131283, 86322, 19969, 22365, -93338, -133281, -8514, 8293, 32168, 165584, 100955, -57850, -40839, -62017, -125011, -19710, 44080, 15912, 96977, 96353, -37978, -31946, -16311, -93700, -8817, 92475, 12270, 16529, 67953, -51510, -101645, -23930, -27034, 26582, 127153, 39137, -38471, 5608, -66371, -108238, 22787, 55733, 36321, 118292, 61724, -81274, -58112, -49629, -89256, 16556, 73675, 12779, 62182, 66379, -71884]
219g1884J11O3684m3194M8354Q2959n7531k82L5331j12106l5611Q9083j7834J5003
232c917J02481n7259q2010N0524l4923n9378Q2028L0638j5851O8830m1244j12155
244g2236M4392J7864o8530P5017P3309n2858K7439J6604j17324j7507O0623k3519
256c6726M9048P7362o5333j8664L6043j07838m4275J16083J6102j5276O9386l9460
268C6452p4407L3009l1982m3701R7417L7662l6288N4169l0427j21096L3043M3461
280b688n7132N5583Q3675m1664m512l967j02172J419P2744k7857L2340Q4357o1875
293B8251m7666M1487o2527m2183R3177J8981k2814M9207l4231o4679M1439j7160
305a8718m7266Q8956M0957o1329K7589L49r4138J6378M8447l8499M0913O4748
$$ y = [-71884, -71773, -8089, -51283, -2929, 80030, 22499, 22217, 57548, -54558, -90169, -1086, -18920, -3917, 98564, 41305, -40705, 9819, -25104, -84482, -2454, 28184, 12333, 81163, 39919, -72236, -27844, -9980, -78510, -3493, 69816, 16958, 44397, 61001, -56323, -73830, -13207, -36726, 12322, 89684, 24351, 5687, 41730, -66108, -110383, 5700, 21802, 6526, 75912, 36452, -37955, -4946, -36928, -80629, 16788, 54450, 18162, 72331, 41904, -79192, -46149, -2688, -59820, -4237, 79438, 37774, 33262, 29295, -72877, -71458, 1286, -26571, 5769, 90126, 28251, -19415, 22072, -40455, -82638, 10539, 29520, 6706, 55913, 21682, -42997, -1558, -18718, -65984, 22972, 63929, 2600, 30189, 30538, -63600, -47222, 1225, -37274, 3639, 68387]
317F8387m5875o438P780r0057R09Q7375k5164j971P7370l9241n7282L0177m0246
330c4276l2140Q3209J6843k6737M8040l2212p8225L8917L097n1844P5408N8870
342F8950n3574R073N116q0004O437M2292l3128M0716O4586n4778j7178K7980p0714
355d4226j4638Q3611j0670j9073N4811l1387n2478K7708k7167k2977Q5944J9446
367D8904m3624L4584j9182p8720K9190K3066m1145N4836N7798m3630k499J08o9294
380d9608J3712N0562l9629J7968O7094m5267l5275K9780m1767j2994P2288o841
392B0023k3572M6149k8252n4919L0542j3854k6262Q0691K7201n4415K0932J08
404B4372o7173J4456K2166l3526M9470N1436n2718q545J7343n7893M750N6736
$$ y = [68387, 22512, 16074, 23854, -66203, -65294, 22081, -3083, -5054, 72316, 33075, -24207, 5970, -34276, -66416, 16793, 33636, 6899, 54939, 22727, -55498, -16581, -13484, -65328, 10080, 68950, 15376, 24449, 29565, -50439, -44002, -1710, -34838, 5878, 70464, 15686, -1492, 26488, -44226, -58864, 24747, 14077, -4996, 49815, 18428, -34050, -6342, -33509, -56486, 29458, 48904, 5280, 39864, 20682, -58038, -28848, -5782, -46927, 7909, 65707, 22077, 19578, 19686, -49608, -35896, 14666, -24963, -6995, 60099, 14832, -20443, 9337, -32430, -45424, 26864, 20023, -3549, 42600, 14348, -40571, -10029, -23883, -50145, 30546, 57747, 3332, 24264, 24372, -42801, -28345, -6179, -39705, 9765, 61201, 8483, -62, 17281, -40612, -35862, 20874]
416B0874k9918K178N8553l7114m0808K6389k8798r513P0383m728l1437M3738j8942
429B0857o1930K2741K661k4144O2424K6218n1000J5633P738n9433J0839K9509
441B113l0244L5724M8502n1822k0443K5860l6571n7M7778k2691J175N4084m0313
454A3095n1520L1243j0423j6930N8107N238l2632L3273j1864n6930K1237R018
466i088k4501N3781K6169n4662J2113K1305n6549l52M0443j7167J8793L5824m6601
479d92j6454K7399l7534n263N6507j6228j4419M9789k7373n6512K5806M812j4847
492b4809M4008M799k7923L1791j0665n9265K3721K4601k8763L6649L3405n0343
504b794n692K2984l8901k821L4858j3606J6879L2686m9043k3178L8749k5832j9844
$$ y = [20874, -9044, -6866, 51687, 14573, -26235, 154, -28644, -38157, 32226, 27498, -3939, 39799, 20857, -41073, -18332, -15671, -39815, 22609, 48827, -2173, 13460, 21198, -38235, -27396, 2113, -28131, 7593, 56095, 4273, -16170, 9690, -26881, -26938, 20840, -1851, -676, 53408, 13095, -38425, -7182, -17605, -34535, 23572, 28810, -3822, 29451, 17587, -39343, -18106, -9088, -33589, 20192, 46361, -8301, 3812, 25117, -31432, -31784, 8659, -8508, 10285, 46109, -492, -16946, 10453, -27081, -32344, 24163, 7935, -6484, 43305, 15932, -40580, -14774, -9962, -24809, 19199, 23998, -3925, 27866, 17201, -42064, -18343, 6258, -22505, 14144, 47549, -2794, -8486, 14498, -24403, -27224, 7634, -5972, 10907, 43593, -5450, -28628, 10121, -15711, -35555]
517c5555N2455J753j9860L1244k0313m5248K6571N425j7573M2196P574l8223K6150
530A6596K351n9604J3162L8338j7987J7857K3277m0020k081K0229m1108O50M6724
543A8384j6471k45L8257l6421l4885L4448q549j9048L9197J921j6015K7854k3352
556E075m6715L4678J5653k9720L1506K1482l6945P630P563m2817J0525L4473j4626
569b238J4241K0351m2334k418L1323l9834j4094N2988L63j6127K0297k2861k3971
582b4314K7918j0274j7217M0982J246k7429K6655q800m7678K8406K7785k9021
594a1741J4497K3177k5917J967K396l7372J7946L8589k4695L522L0597l5920j8826
607b1780K8970k2241j3845M5025K334j7589J7402k1156k3262L1244p296k6756
$$ y = [-35555, 16900, 18653, -1207, 30037, 9724, -35524, -8953, -3528, -21101, 21095, 28669, -9554, 16596, 18947, -40657, -27495, 10843, -7144, 10713, 33990, -6030, -8111, 12118, -28990, -28340, 18384, 1913, 1668, 39925, 3504, -31381, 3067, -5482, -24530, 14667, 16588, 573, 28427, 5075, -41640, -6962, 8691, -21029, 10477, 31959, -4986, 2644, 10207, -32610, -22085, 12388, -2238, 12003, 32354, -9980, -12398, 18925, -20909, -35003, 17985, 18348, 2221, 22518, -343, -24314, 3604, -6670, -23887, 17095, 18341, -9088, 17567, 8767, -38911, -10505, 17280, -11741, 2756, 25933, 16, 1983, 4379, -32993, -15047, 23542, -1153, 2369, 32966, -2954, -21780, 7190, -15051, -28896, 16129, 18463, 874, 18276, -2880, -26142, 5102, -2194, -28950]
619b8950M1287J6445l2480J1688M77l6856J9817K3687k5182J3766K1419l0192
631e074j80J4088l3846P093M2075j9493j1066K6899k1106j8180K1835j6865p293
644b1113M5679k539k8215J8837r794k9932K4447P169k0747L0285J3505l2802N499
657B79K867l0863K0707K5362k9882Q901L0612k8199j3269J7532k0406J978L3802
670A9421j4307q122K4816k3404j9355K8900j1976j8278L9751M089l1957J4466
682D044J984k5407J6276O049j8509K7545J2927l5617N934J2394l0555J1676L1669
695B0410k2135q71K6387k2553j4992J4787j5561K828L3475j7035j4856K9441j2820
708F505k8432K1836n33j7209L0066O467k7194J0494J403k3889J8383J2955k1007
$$ y = [-28950, 12337, 28782, -3698, 7990, 8467, -28389, -8572, 15115, -10067, 3699, 25118, -5074, -5254, 8834, -25012, -17919, 24156, 4663, -6403, 20496, -610, -18790, 3045, -13820, -21113, 24566, 22027, -6188, 12649, 2855, -27077, -2630, 4539, -16208, 14077, 27582, -5220, 279, 3146, -27717, -7010, 18352, -11530, -2629, 27983, -216, -13485, 4047, -16359, -14381, 19421, 5114, -3008, 21808, -1596, -20951, 7949, -4027, -22305, 17446, 21535, -10422, 4044, 6028, -19379, -3103, 2946, -15563, 11982, 24909, -10708, -4774, 7620, -22935, -11259, 20410, -1725, -2596, 23791, 1238, -13754, 1033, -14528, -11700, 21775, 4740, -10116, 19325, 6505, -21927, -91, -624, -17833, 12233, 18700, -8494, 2000, 3403, -20486, -2103, 10852, -10155]
721a0155K0390J6933l6940l317J8768k1731M639K8565j4819j015K2634k5564j8740
734b0352K0229j1762m199L5007p706k0810K3020o545k6398J8639L705j5635K5490
747A2683M246l1402J2813J1248k4601J2281J7486k1591R515J7840l0179o050K0134
760D423j5314K896K6293j6139o461K3213k1548k0761K4784k392j0224K6982l797
773A1955k0535J9127l656k7074J6517R361j5425K0086P207k9554Q081J3554k4874
786a5230N493K0831j5681N340J8128k4850o778K1536j4907l833K5269j2861j0299
799g842K3264j4355k1479K3149J338j3718K1695j75k2270J4016m33k4453J7867
812c396J4034j6607J5394R667l0507K207J6704k1961L022K5168j0936j1J5210
$$ y = [-10155, 10235, 27168, -9772, -13089, 5679, -16052, -11413, 17152, 2333, 1318, 23952, -1612, -20352, -123, -11885, -16084, 18923, 11217, -9593, 13427, 6882, -19516, -877, 2828, -12807, 12683, 16929, -14473, -1660, 9588, -15013, -2732, 14754, -6837, 2678, 20518, -9661, -15711, 4423, -10891, -7995, 18298, 2159, -4302, 18911, -2637, -23398, 1386, -1006, -11230, 15752, 11955, -8580, 10547, 6891, -20183, -3666, 5695, -9730, 10356, 17563, -11991, -3910, 9644, -15230, -9737, 11094, -4587, 753, 18881, -5969, -12747, 8789, -6118, -9951, 15318, 2457, -7842, 15422, 1067, -20412, 2737, 4075, -9643, 12052, 11877, -10393, 3623, 3190, -21263, -3396, 10638, -5969, 9425, 19092, -11415, -9208, 7496, -14465, -11443, 13725, 2789, 2778, 17988]
825A7988k3783r265K2263j1070p019K4918q418j5223K0196q654k1784K0855N833
838F837j5184J6415J512k0945J3544M684k3110J4171J6755j9264O783J3520k3910
851h192j376J6880j6306o8K2058j2278l722J6571j8863j0545K3944p511j2518
864a1926K2637k795j6516J5769m230k0077J8410P222j5548J3989L892k2516J1616
877g3R224k3599Q476K0145j5157J647J2339k1086k391J7447j5995k021K4089r149
891C896p887J7176j4980j4823K1577k568j3077J9925J288j6054J1881m048j9858
904a7552J7905R554j7775J0422Q685k0474N410J1039j9022O614K0004j4206k339
917a735J1627j7872k731J9981j2226o568K2980o770j3256J3418r259j3127K0525
$$ y = [17988, -5795, -15060, 7203, -3867, -10886, 14032, 5614, -9609, 10587, 1933, -19851, 1004, 6837, -8347, 8068, 9580, -11365, 2179, 6863, -16247, -2076, 14679, -4585, 2198, 15718, -8192, -9568, 7312, -8994, -9062, 12996, 718, -3004, 13567, -5296, -15841, 8103, 592, -11926, 10711, 7916, -8600, 7169, 2939, -17138, 1272, 8494, -7054, 6935, 10827, -11689, -73, 9151, -14448, -5972, 14173, -984, 663, 13002, -8084, -10475, 6972, -9023, -11044, 13045, 3896, -3991, 13185, -1795, -16618, 4959, 2391, -10686, 9239, 10527, -5527, 6354, 2306, -17552, 353, 9907, -7868, 2554, 11239, -9235, -3825, 7214, -11808, -5194, 14810, 604, -1735, 9892, -7980, -10711, 9270, -2956, -9524, 13456, 6686, -6570, 6848, -2411, -15538, 4987]
930D987J56j4347J6943K453j8308R932J216j8919J5389J3055j8595N768J1494
943A1224j7860K197J1420j6904M905K0824j4447o598J4625j3069o433J8162j0344
956b298q492K1676l973j4953J2101m279j2964J7899J496j7089J5702O403j8168
969f939O868N397j6405J0793J2750j7023L013J2466j6854j697J2965j2996J926
982e736K0767j2175r436J4085r686r582J6248n750p979K0118j792j7088J0543
995B537j42j3236J4370L693j6320J2191Q300j9249M334Q401j3639Q690J3338j7485
1009d217k69J3831j4780l774J4287r877k14J8851j0459j0966J4969o546j1260
1022a0424J4344k629r996J7646r85j7881J0757M372j3568J0303N330j5312Q745
$$ y = [4987, 5143, -9204, 7739, 10192, -8116, 1816, 3032, -15887, -498, 12557, -6038, -270, 11224, -6636, -4439, 6981, -9923, -5018, 15806, 1359, -5239, 9386, -3683, -10116, 8046, -2298, -10790, 10886, 6913, -8040, 4061, -218, -13182, 4717, 6213, -10876, 4826, 11229, -6939, -71, 5326, -11079, -286, 12464, -4559, -1546, 10920, -5934, -7631, 5334, -7662, -5736, 15031, 2856, -6580, 7505, -2181, -11763, 4485, -1265, -9244, 10874, 9082, -8006, 2537, 2395, -10841, 3529, 7222, -9098, 3093, 11393, -7856, -3522, 4879, -8760, -70, 13268, -4217, -4486, 9345, -5435, -9209, 5078, -4799, -5013, 13838, 3379, -7587, 7382, 836, -10424, 3920, 1291, -8705, 8941, 7956, -9925, 832, 5204, -8364, 1939, 7269, -8043, 702]
1035G02Q858j8078K666J1449j1918N408J3317j4924k102J4710j2451p959J3739
1048C417n528k914J6281p799j1337J4025l987j2292J3074n28j1276J4723K181
1061H040j7846Q290P313j2524O884P263j2592P157Q143j8037Q56J3794j0558J004
1075b813J3722j2151m399J4998r929r316J2767l379m434J3738p016j1412J4967
1088E343j200j4929J2312N118j1932R485L072j6308O333Q507j1483N405Q419j1991
1102c849M257R553j6769j852J5176q719l199J3000p130m873J1903q398q830J3879
1116D149j564p742J2247l790j2469J2477K351j4282Q631O486r863O441K933j4699
1130h694O147Q852j2763K777J2162j0261K11R809j2798l557J4029o363m068J1488
$$ y = [702, 9560, -8518, -5852, 5597, -6321, -913, 12404, -2520, -4622, 10088, -2363, -10322, 3417, -2111, -5025, 11256, 3457, -7880, 6145, 2158, -10134, 2940, 2412, -8864, 5859, 8040, -9806, -1516, 5797, -6727, 157, 7420, -5172, 1985, 10128, -7909, -7053, 6741, -3817, -2813, 10909, -1242, -5641, 9357, -572, -9888, 2879, -500, -4934, 8804, 1788, -9624, 5343, 4143, -10786, 1526, 6644, -5288, 4197, 7269, -9039, -2706, 5801, -5682, -277, 8142, -3849, 408, 9961, -6808, -8660, 6516, -2203, -5402, 7598, 468, -4405, 7498, -900, -9730, 4149, 2585, -5157, 7090, 3300, -9169, 3308, 5659, -8623, 8, 6494, -3369, 3072, 6005, -8694, -2547, 6305, -6458, -3681, 8481, -1780, -1569, 8240, -4558, -8115, 5914, -449, -4517, 6971]
1144F971o443n728J2182o691j0156J4328J028j0883Q673N25j0941Q662J849j1987
1158h611R395P119j1589M789N058j4129L403J1535j0578n97J1567o740k483P923
1172F062r880k751J3200o573o134J2586m168q864J0554k166j0835J0773L696r843
1186d343O273J459j0015P798L245j1820P267R213j1755O58Q012j0607L15J0629
1200F329r116j411J1299o677l563Q200q289m281J3698m167q681J0673n37q912
1214e435P898p39q983R853L168j0537O457L340j0652N413N355j1166M503R922
1228H397j0460n61P419q728m90R810p719k180J1432n533o109Q375m521n290J0946
1243D788j935q459R752J67r488O606R86r000Q242N070j0819L118N661r049K782
$$ y = [6971, 528, -5200, 6982, 291, -9865, 4463, 5491, -5392, 3281, 3806, -7135, 1527, 3376, -8611, 784, 7903, -3686, 1103, 6161, -7968, -4565, 6970, -3608, -4205, 7362, 622, -1861, 6062, -3818, -6569, 6631, 58, -6076, 6510, 2342, -6522, 4032, 1866, -8969, 1804, 5500, -4343, 1930, 3389, -6626, 1172, 4417, -7403, -136, 9077, -2678, -2020, 5992, -4615, -4300, 6329, -2787, -4198, 7101, 424, -3139, 5061, -3228, -7509, 6189, 2022, -6659, 4014, 3477, -5435, 2463, 1724, -7259, 2594, 5762, -4775, 1682, 5022, -5630, -217, 5138, -6028, -1525, 8397, -2063, -2624, 4795, -3933, -4423, 5387, -2332, -4512, 6920, 1387, -4722, 3653, -868, -6158, 4788, 2853, -5606, 4146, 4313, -5175, 1431, 2417, -6583, 1659, 6729, -4090, -972, 4689, -4360, -1578]
1258a578N468q757L089R126r170j642Q467p161k322R972n585m379J0033l296p117
1273d852P264k022n331R178j587q261Q547J540j0607N806L417q358N697N411r048
1288c206J630O551q724J643O444p916J460R704q187l526Q620m875m060P992l416
1303A34m384Q777k604o680O699r38o449Q336O61q863O546L385q921L152M172o295
1319c272M084M756q522J610O330p759p15P202o012m10Q616n641m456P167l012
1334c4m129P373l038m364Q670j545q206O432J811o725N326K311p589M322L318
1349C933q057K549N189o801L011N955q264n29P350n957k686P025l607j268P088
1364D931m615m506P700k327n792P151q19n646O858N50p993M404L010n793L990
$$ y = [-1578, 3890, -4867, -1778, 7348, -1822, -3464, 5003, -2158, -4480, 5492, -93, -4472, 5561, 2265, -4852, 2412, 390, -4941, 4237, 2650, -5611, 2936, 4476, -6131, -325, 3092, -5266, 431, 5842, -3206, -1576, 4975, -3749, -2106, 4338, -3578, -2118, 7586, -601, -4127, 4493, -382, -4442, 3550, 134, -4250, 4527, 1923, -4757, 1942, 1004, -5445, 2891, 3552, -5311, 1235, 4620, -4301, -1149, 3023, -3272, 812, 5568, -2954, -1344, 4986, -2773, -3488, 3714, -2298, -2708, 5908, 267, -4189, 2978, -34, -4163, 3210, 172, -4192, 4478, 2933, -5273, 1159, 2970, -3755, 1571, 3882, -3707, 615, 3933, -4124, -1575, 3614, -3187, -176, 5779, -2485, -3014, 4336, -1621, -4307, 2718, -889, -2157, 4931, 316, -4190, 3510, 1183, -4609, 2542, 1723, -3923, 2935, 3485, -4508, -104, 2906, -2887, 1103]
1379A103K046p352M414M090q515J498O388n234K02O233o374j546P014m666l010
1394c709O466k487k321O365l801n141P214o80n943N296J070n713N165N54o689
1409d354M086L309n819K710L467o192K197M777o870m31O805m210p45M879m781
1424a172j344O553m819l304O714j677l647N604k362m759O160J27n575M250J499
1439B248m639L709J158o490L729M003o094J099M775m872Q73L707n815l84O474
1454C481l793k075N446l567k465N918k918l968N850J24m293L883n67m490N119
1469A685O91n735L878K636n338K366K538n703J877M354n013J95M573m048k80M035
1485B711m639r70O364l323k754M901j507l243M535j815l799N215L27m011L315
$$ y = [1103, 3149, -4203, 211, 4301, -4214, -2716, 3672, -1562, -1360, 4873, -1501, -3047, 3967, -699, -3709, 2757, 270, -2051, 4314, 513, -4628, 2586, 1906, -4037, 1259, 2329, -3384, 1781, 2335, -4354, -268, 3041, -2778, -68, 3399, -2793, -596, 4181, -2689, -3120, 3685, -525, -1270, 3609, -1172, -2516, 4037, -782, -4086, 2628, 951, -2696, 2908, 546, -4213, 1947, 2074, -3501, 749, 2248, -2391, 1318, 2476, -4014, -285, 3718, -2376, -1277, 3498, -1374, -501, 3206, -2609, -2993, 3481, -312, -2387, 3059, -508, -2973, 2945, 27, -3941, 1909, 2033, -2260, 1623, 1056, -3434, 1685, 2376, -3359, 519, 3155, -2183, 183, 2721, -2982, -1105, 3249, -1764, -1569, 3004, -1044, -1324, 2711, -1928, -2898, 3466, 143, -2611, 2290, 783, -2460, 2075, 260, -3539, 1676, 2003, -2008, 1307]
1500A307K13m353L746J564n975K985L878m735P71K807m297J214M181m883j34M653
1516B942l521p98L994l468j736N868k118l729L899n32l194L743j084l330M789
1531A725N96m970L185J129m375K801J857m539J946M128m279q9K715l623N98M109
1547B914m104j171M968k250k397L419j811j690M193j235l696L825j99k955L281
1562A092k63l677M415J370n144J892K214l426J247J989l888J810L590m382n20
1577a681L398k925k30L531k670j545M284j282k947K856p15j946M167j424l603
1592b732M160M15m076K427J409l504K459J870m115O99K701k966N25K331l419J085
1608g31L639l586j392L820j779j711L089j424j248L650j560k398K631k90k202
$$ y = [1307, 1520, -2833, 913, 2477, -3498, -513, 3365, -1370, -599, 2208, -2089, -875, 3306, -1577, -1711, 2942, -579, -1377, 2617, -851, -2587, 3281, 1163, -2566, 1333, 801, -2393, 1350, 266, -3064, 1725, 2321, -2649, 536, 1665, -2710, 91, 1948, -2591, -645, 3483, -796, -885, 1830, -1793, -1195, 2914, -1190, -2361, 2607, 357, -2040, 1379, -432, -2122, 2071, 836, -2860, 965, 766, -2189, 1092, 829, -2848, 1567, 2937, -2207, -315, 1899, -1527, -280, 1709, -2179, -369, 3221, -1161, -1681, 1717, -1208, -1438, 2093, -577, -2122, 2162, 880, -2067, 789, 74, -1872, 2295, 871, -2732, 1428, 1843, -2233, 194, 1603, -1901, 558, 2428, -1687, -988, 1713, -1253, -728, 1603, -1816, -731, 2908, -678, -2070, 1750, -29, -1740, 1349, -75, -1323, 2327, 767, -1631, 1000, 710, -1492]
1623a492L027n05l465L170J371l882J512J468k712J557J457l445J121K862l034
1638i90l6L090k565k89L187k739j441K975j085j170K248j352j678L844j619k954
1654b574L192O89l008K196P31k863J967J472l568J266J845k530J015J881l136
1669a425K67L163k267j012K415j345r40K857j744j543L291j370k062K947q40k212
1685a820L057j39l378K173J463k335J323P06k677K184J243l450O44K333k095L9
1701g29K314k249j60K413j966r88K412j039j011K591j838j567L340l76k598J867
1717D16L98k035J701M13k472J701J131k229R96J299k523Q57K024k846l6K286j220
1734a39n71K037j940k17K298j763j221K803q51j673J912m88j664K345j78j991
$$ y = [-1492, 1535, 1030, -2435, 735, 2106, -1776, -264, 1204, -1508, 49, 1506, -1939, -818, 2044, -990, -1026, 2064, -501, -790, 2397, -342, -1783, 1192, 107, -1063, 1185, -167, -1845, 1999, 380, -2574, 618, 1307, -1701, 495, 1226, -1637, 330, 1802, -1766, -500, 1345, -1185, -170, 1711, -1425, -1158, 2005, -262, -1274, 1141, -204, -1144, 1713, -31, -1574, 1717, 347, -1715, 1232, 392, -1820, 1237, 1098, -2280, -107, 1356, -979, 344, 1050, -1627, 557, 1800, -1650, -1006, 1327, -768, -729, 1585, -664, -824, 1589, -377, -1365, 1047, 8, -1003, 1588, -250, -1817, 1523, 1147, -1451, 416, 814, -1221, 480, 893, -1579, 122, 1253, -976, 20, 1319, -1204, -347, 1677, -1169, -1205, 1081, -139, -710, 1327, -613, -830, 1468, -295, -1516, 1287, 436, -1237, 675, 187, -1477, 868, 690, -1301]
1750a301J284O66j633J535M60k644J640J805k483L7J815j779L08J312j750M0K107
1767A419j628o80K390j499j342K721j195j859K747l00j592J280qj587K010J84
1783A061k936K015J150k003O87J322k341P64J843k080j58J843j373k40J466j961
1799i41J2K157j135j184J967q37j121J638m51j176J707J24j574J191K29j725J461
1816C42M64j850J019J333j837P9J330j884P57J249j615j64J910j790N2J814j596
1833c87l75K121j030j367J762p48p18J356m86j055J461K45j865J378P34k147J098
1850b3J125j902N77J293j630Q9J224j308m2J720j656MJ487j221m72J793j020p44
1868g06J677r20j035J571j96j148J304k99j336J320O13j720N96Q61j090M36P19
$$ y = [-1301, -17, 649, -984, 551, 1011, -1633, 7, 1812, -671, -634, 1181, -598, -290, 1022, -728, -688, 1419, -209, -889, 1501, 2, -1340, 1381, 186, -1673, 1074, 774, -818, 462, 454, -1133, 877, 1061, -1875, 140, 1290, -713, -26, 1296, -1045, -281, 1562, -518, -676, 1167, -206, -446, 1020, -941, -929, 1228, 93, -1091, 876, 39, -1082, 556, 105, -1071, 636, 760, -814, 377, 606, -1119, 342, 806, -1044, -25, 1308, -529, -450, 880, -1004, -247, 1002, -613, -777, 1133, -657, -605, 1209, -387, -762, 1359, 329, -1038, 724, -24, -742, 614, 128, -927, 534, 779, -1086, 292, 1026, -1121, -23, 1102, -800, -223, 1070, -560, -471, 753, -555, -597, 1123, -533, -529, 958, -263, -735, 1058, 38, -706, 971, 51, -984, 587, 391, -757, 547, 248, -1088, 232, 845, -875, -279, 582, -508, -72, 647]
1885F47j308P71R99j671l8J504j235j06J078p54p37J647o35q12J002l45o26J618
1903I99o17j229J291K45j229P07M63j237O30Q67j531N27J052j313L74M97q57K00
1921a61J075r63o42J414q91l34J141r31l02J269o06r84J372k20q50J104R7j445
1939h57J290M47j623O52N28j143J247k2j185M20J178j395n2J193j022J02J099
1956H57j104k97J115p29n08Q77k16n50J230l77j031Q52K40p65P82k22n91P13L75
1975F51j132M9J214j260N45O14j354L29J117r25k11P87n24O6N48p16k61J083n98
1994B2o17R19l76n45R35Jj239J244j22p24P05j99p19O49P41j051k3J025q39l4
2014b47O34q14L31O69n97n55Q53k78j08M87l62o37J290o51l10O66k47m59O39L30
$$ y = [647, -661, 110, 1109, -562, -600, 904, -331, -437, 641, -113, -850, 797, 162, -650, 352, 7, -619, 999, 382, -847, 444, 689, -540, 167, 630, -607, 23, 890, -641, -114, 938, -375, -1, 496, -361, -161, 914, -49, -691, 723, -168, -502, 639, -292, -594, 675, 69, -915, 457, 237, -613, 491, 588, -857, 433, 880, -743, -91, 437, -706, 541, 519, -666, -246, 932, -463, -515, 678, -344, -242, 857, -247, -544, 571, -158, -666, 211, -5, -555, 675, 298, -733, 119, 359, -406, 376, 154, -437, 276, 651, -481, -432, 782, -478, 67, 681, -673, -344, 773, -152, -363, 424, -100, -34, 514, -202, -463, 620, 22, -595, 324, -52, -597, 338, 339, -900, 344, 222, -502, 203, 4, -715, -66, 675, -376, -399, 626, -213, -247, 387, -427, -96, 573, -24, -579, 274, -4, -112, 375, 13, -624, 666, 15, -295, 371, 124, -335, 304, 634]
2034F34j169N14K93o07L42L79p00L31L33o34n9Q02n22l04P38q77J30R73r14l39
2054f56J019l57m73O91p3l81Q29k13r18O67K27o95O11O2o41L83L64p00Q2O43p04
2075b33L0O20o42k47Q80m64k59O46m28KR52r25l77J084l68o14Q08k94n87Q40m82
2096e8n29M91L48l74J77N71j065RP14o84L34K03l06L27Q9l82l96Q39l22m51Q67
2117D02j88k57M67l54m25N26K0n69P44l05m93N09K3l64J15O96o47j76K98j08j47
2138b33P04o54nO04l47l29O95l73j88L86Pq19Q13k43l63L31J9m48P42m0m62M46
2160B43K80p32Q3J44l38M98K45o52K39K8j73R4M18o27OM87k37k56M47l10n07R01
2182B81k12m85P98k40m71M29M2l54K73L23p28L48J94l63PN17o18J86L79o49m1
$$ y = [634, -535, -21, 272, -335, 7, 386, -314, 17, 350, -284, -343, 459, -63, -367, 371, -506, -376, 597, -317, -656, 363, 6, -467, 224, 151, -230, 599, 386, -532, 135, 362, -333, 278, 340, -301, 82, 446, -254, -172, 471, -233, -203, 417, -225, -472, 408, -56, -315, 331, -97, -95, 857, -68, -445, 639, 271, -343, 465, 171, -416, 424, -58, -587, -96, 252, -122, 55, 626, -439, -430, 284, -400, -66, 137, -169, 158, 247, -135, -531, 308, -14, -465, 402, 214, -43, 424, 70, -355, 171, 191, -378, 366, 61, -432, 77, 100, -264, -149, 547, -100, -276, 22, -86, -233, 471, -183, -188, 416, 69, -260, 435, 62, -126, 260, 267, -552, 261, 18, -345, -14, 5, -443, 299, 259, -203, 243, 523, -209, -126, 18, -320, 178, 423, -229, 10, 38, -135, -41, 377, -250, -244, 243, 6, -250, 197, -113, -620, 281, 69, -416, 382, 142, -329, 100, 142, -212, 61, 384, -344, 4, 198, -165, -158, 359, -259, -73, 306, -343, -384]
2203c84M76k09n1J37k8j55M28k4m02L97k14m96Q50k59l49M96J52o09L70N1n74
2224c97M88K1k52J78Q7n9L9j24q6R1K45k24J9lk30L1M80m09k8K45K0n78N42k0
2248G6k02L5M8j06L23J03k83m9J64l6P3K18o63L64Q3j93k19N16l73r7P75k69n80
2271b92O05m52J36J7M3j46R2K51k29r4L13l89q5M71l52K43m3l01J68l7J08QK29
2294B64k55p6K26L4m52J21L17o02N98o6m25J68K95j82K27J71o01J45K24k1l51
2315b41L04PK2K84m84k03M38j19O8p4l0j85M00Kl85L66j27k03K77l5Q6j12k3q2
2339d9J64J96n58K56R1l0J07M21p89QM19m11r4M07r4p4K15k10k50L08l90K11J79
2362C3qn6K60p0k25R9k9p4j2J53j21l21M95k46p7P22o46R3L5m03L10K56l66J40
$$ y = [-384, 92, -117, -168, -31, -59, -214, 214, 190, -212, 185, -29, -525, 325, 66, -283, 213, 365, -244, 126, 177, -397, 91, 112, -140, 38, 125, 66, 105, -19, -105, -14, 231, 7, 26, 23, -207, -176, 304, -105, -133, 112, 132, -446, 96, 76, -126, -91, -43, -149, 174, 277, -6, -55, 109, 73, 146, 364, -299, 65, 148, -45, -264, 252, -121, -218, 557, 288, -292, 313, -139, -3, 14, 57, -89, 3, 254, 25, -69, 244, -145, -230, 241, -111, 132, 89, -212, -44, -81, 27, 35, 264, 9, -67, 159, 193, -259, -138, 179, -423, 175, 109, -316, -148, 147, -35, 192, 363, -238, -93, 131, 110, -241, 63, 70, 92, 376, -108, -311, 127, 8, 76, 2, -28, -213, 187, 189, -196, 170, 43, -160, 117, 82, 168, 56, 33, -49, 115, 311, -247, 9, 100, 70, 177, 598, -191, -183, 236, -175, -269, 138, 44, -30, 185, -25, -275, 33, -357, -146, 33, 25, -31, 229, 159, -66, 33, 4, -70, -82, 71, -50, -371, 124, -122, -199, 523, -123, -30, 5, -398, -88, 168, -198, -58]
2386e8J56j01o8J17J61m55K37j09l0K42N9l89J64M4k11J27L44l16R9K77o92O7
2408c35O12j76l95Q65l65n41M04O4l30K86O2l15J95J63k17J15K3l50K22J52j97
2429e8L36j50j12j59M42o07K72J41j75o3J94N9l46L02j45J56J96k78j33L62k76
$$ y = [-58, 98, -3, -71, 46, 207, -248, -11, -120, -150, 92, 151, -238, -74, -30, -241, -114, 230, -86, 13, 290, -402, -335, 277, 101, -294, 571, 206, -335, 69, 133, -197, 89, 151, -164, 31, 194, -23, 92, 115, -235, -13, 139, -58, 278, 128, 16, -143, 299, -308, -36, 105, -70, -133, 61, 120, -226, 76, -69, 87, 283, 5, -128, 234, -42]
$$ [...]
8191e2
##END NTUPLES=NMR FID
##END=
